<86>Aug  7 05:52:32 userdel[3725926]: delete user 'rooter'
<86>Aug  7 05:52:32 userdel[3725926]: removed group 'rooter' owned by 'rooter'
<86>Aug  7 05:52:32 userdel[3725926]: removed shadow group 'rooter' owned by 'rooter'
<86>Aug  7 05:52:32 groupadd[3725942]: group added to /etc/group: name=rooter, GID=705
<86>Aug  7 05:52:32 groupadd[3725942]: group added to /etc/gshadow: name=rooter
<86>Aug  7 05:52:32 groupadd[3725942]: new group: name=rooter, GID=705
<86>Aug  7 05:52:32 useradd[3725955]: new user: name=rooter, UID=705, GID=705, home=/root, shell=/bin/bash
<86>Aug  7 05:52:32 userdel[3725974]: delete user 'builder'
<86>Aug  7 05:52:32 userdel[3725974]: removed group 'builder' owned by 'builder'
<86>Aug  7 05:52:32 userdel[3725974]: removed shadow group 'builder' owned by 'builder'
<86>Aug  7 05:52:32 groupadd[3725990]: group added to /etc/group: name=builder, GID=706
<86>Aug  7 05:52:32 groupadd[3725990]: group added to /etc/gshadow: name=builder
<86>Aug  7 05:52:32 groupadd[3725990]: new group: name=builder, GID=706
<86>Aug  7 05:52:32 useradd[3726004]: new user: name=builder, UID=706, GID=706, home=/usr/src, shell=/bin/bash
<13>Aug  7 05:52:34 rpmi: rpm-macros-ninja-build-1.11.0-alt1 sisyphus+300838.100.1.1 1653750961 installed
<13>Aug  7 05:52:34 rpmi: rpm-macros-cmake-3.23.2-alt1.1 sisyphus+304559.100.1.1 1659180107 installed
<13>Aug  7 05:52:35 rpmi: libexpat-2.4.7-alt1 sisyphus+296417.100.1.1 1646812525 installed
<13>Aug  7 05:52:35 rpmi: libidn2-2.3.2-alt1 sisyphus+281238.100.1.2 1627476321 installed
<13>Aug  7 05:52:35 rpmi: zlib-devel-1.2.12-alt2 sisyphus+301913.100.1.1 1655062066 installed
<13>Aug  7 05:52:35 rpmi: mpdecimal-2.5.1-alt1 sisyphus+291245.40.54.1 1643293433 installed
<13>Aug  7 05:52:35 rpmi: libgdbm-1.8.3-alt10 sisyphus+278100.1600.1.1 1626058413 installed
<13>Aug  7 05:52:35 rpmi: libelf-devel-0.187-alt1 sisyphus+299028.100.1.1 1650946639 installed
<13>Aug  7 05:52:35 rpmi: gcc-c++-common-1.4.27-alt1 sisyphus+278099.1300.1.1 1626028636 installed
<13>Aug  7 05:52:36 rpmi: libstdc++12-devel-12.1.1-alt1 sisyphus+300988.100.1.1 1654028265 installed
<13>Aug  7 05:52:37 rpmi: gcc12-c++-12.1.1-alt1 sisyphus+300988.100.1.1 1654028265 installed
<13>Aug  7 05:52:37 rpmi: cmake-modules-3.23.2-alt1.1 sisyphus+304559.100.1.1 1659180107 installed
<13>Aug  7 05:52:37 rpmi: libuv-1.44.2-alt1 sisyphus+303845.100.1.1 1658053885 installed
<13>Aug  7 05:52:37 rpmi: librhash-1.3.5-alt3 sisyphus+286141.40.2.1 1632982456 installed
<13>Aug  7 05:52:37 rpmi: libjsoncpp24-1.9.4-alt2 sisyphus+286441.100.1.1 1633444232 installed
<13>Aug  7 05:52:37 rpmi: publicsuffix-list-dafsa-20220703-alt1 sisyphus+303337.100.1.1 1657290300 installed
<13>Aug  7 05:52:37 rpmi: libpsl-0.21.1-alt2 sisyphus+279461.100.1.1 1626547547 installed
<13>Aug  7 05:52:37 rpmi: libnghttp2-1.48.0-alt1 sisyphus+302653.100.1.1 1656172244 installed
<13>Aug  7 05:52:37 rpmi: openldap-common-2.4.59-alt1 sisyphus+282933.100.1.1 1629124747 installed
<13>Aug  7 05:52:37 rpmi: libverto-0.3.2-alt1_1 sisyphus+279289.100.1.3 1626493868 installed
<13>Aug  7 05:52:37 rpmi: liblmdb-0.9.23-alt1 sisyphus+275369.100.1.2 1624493869 installed
<13>Aug  7 05:52:37 rpmi: libkeyutils-1.6.3-alt1 sisyphus+266061.100.1.1 1612919566 installed
<13>Aug  7 05:52:37 rpmi: libcom_err-1.46.4.0.5.4cda-alt1 sisyphus+283826.100.1.1 1629975345 installed
<13>Aug  7 05:52:37 rpmi: libbrotlicommon-1.0.9-alt2 sisyphus+278430.100.1.2 1626213212 installed
<13>Aug  7 05:52:37 rpmi: libbrotlidec-1.0.9-alt2 sisyphus+278430.100.1.2 1626213212 installed
<13>Aug  7 05:52:37 rpmi: libp11-kit-0.24.1-alt1 sisyphus+293720.100.1.1 1642535264 installed
<13>Aug  7 05:52:37 rpmi: libtasn1-4.18.0-alt2 sisyphus+301112.100.1.1 1654185763 installed
<13>Aug  7 05:52:37 rpmi: glibc-devel-static-6:2.35.0.6.491f2e-alt1 sisyphus+295115.100.1.1 1644420165 installed
<13>Aug  7 05:52:37 rpmi: zlib-devel-static-1.2.12-alt2 sisyphus+301913.100.1.1 1655062066 installed
<13>Aug  7 05:52:37 rpmi: bc-1:1.07.1-alt1 sisyphus+278100.400.1.1 1626056612 installed
<13>Aug  7 05:52:37 rpmi: rpm-macros-alternatives-0.5.2-alt1 sisyphus+300869.100.1.1 1653844113 installed
<13>Aug  7 05:52:37 rpmi: alternatives-0.5.2-alt1 sisyphus+300869.100.1.1 1653844113 installed
<13>Aug  7 05:52:37 rpmi: ca-certificates-2022.07.22-alt1 sisyphus+304126.100.1.2 1658509204 installed
<13>Aug  7 05:52:37 rpmi: ca-trust-0.1.3-alt1 sisyphus+299449.100.1.1 1651660001 installed
<13>Aug  7 05:52:37 rpmi: p11-kit-trust-0.24.1-alt1 sisyphus+293720.100.1.1 1642535264 installed
<13>Aug  7 05:52:38 rpmi: libcrypto1.1-1.1.1q-alt1 sisyphus+303203.100.1.1 1657026987 installed
<13>Aug  7 05:52:38 rpmi: libssl1.1-1.1.1q-alt1 sisyphus+303203.100.1.1 1657026987 installed
<86>Aug  7 05:52:38 groupadd[3729669]: group added to /etc/group: name=_keytab, GID=499
<86>Aug  7 05:52:38 groupadd[3729669]: group added to /etc/gshadow: name=_keytab
<86>Aug  7 05:52:38 groupadd[3729669]: new group: name=_keytab, GID=499
<13>Aug  7 05:52:38 rpmi: libkrb5-1.19.3-alt1 sisyphus+296671.100.1.1 1647339827 installed
<86>Aug  7 05:52:38 groupadd[3729697]: group added to /etc/group: name=sasl, GID=498
<86>Aug  7 05:52:38 groupadd[3729697]: group added to /etc/gshadow: name=sasl
<86>Aug  7 05:52:38 groupadd[3729697]: new group: name=sasl, GID=498
<13>Aug  7 05:52:38 rpmi: libsasl2-3-2.1.27-alt2.2 sisyphus+282040.40.2.1 1628929840 installed
<13>Aug  7 05:52:38 rpmi: libldap-2.4.59-alt1 sisyphus+282933.100.1.1 1629124747 installed
<13>Aug  7 05:52:38 rpmi: libcurl-7.83.1-alt1 sisyphus+299767.100.1.1 1652258369 installed
<13>Aug  7 05:52:38 rpmi: python3-3.10.6-alt1 sisyphus+304753.100.1.1 1659607050 installed
<13>Aug  7 05:52:39 rpmi: python3-base-3.10.6-alt1 sisyphus+304753.100.1.1 1659607050 installed
<13>Aug  7 05:52:39 rpmi: libarchive13-3.6.0-alt1 sisyphus+296421.100.1.1 1646814091 installed
<13>Aug  7 05:52:39 rpmi: cmake-3.23.2-alt1.1 sisyphus+304559.100.1.1 1659180107 installed
<13>Aug  7 05:52:39 rpmi: libcurl-devel-7.83.1-alt1 sisyphus+299767.100.1.1 1652258369 installed
<13>Aug  7 05:52:39 rpmi: binutils-devel-1:2.38-alt1 sisyphus+302378.600.6.1 1659369765 installed
<13>Aug  7 05:52:39 rpmi: gcc-c++-12-alt1 sisyphus+300988.300.1.1 1654033053 installed
<13>Aug  7 05:52:39 rpmi: libdw-devel-0.187-alt1 sisyphus+299028.100.1.1 1650946639 installed
<13>Aug  7 05:52:39 rpmi: ninja-build-1.11.0-alt1 sisyphus+300838.100.1.1 1653750961 installed
Building target platforms: x86_64
Building for target x86_64
Wrote: /usr/src/in/nosrpm/kcov-38-alt3.nosrc.rpm (w1.gzdio)
Installing kcov-38-alt3.src.rpm
Building target platforms: x86_64
Building for target x86_64
Executing(%prep): /bin/sh -e /usr/src/tmp/rpm-tmp.49194
+ umask 022
+ /bin/mkdir -p /usr/src/RPM/BUILD
+ cd /usr/src/RPM/BUILD
+ cd /usr/src/RPM/BUILD
+ rm -rf kcov-38
+ echo 'Source #0 (kcov-38.tar):'
Source #0 (kcov-38.tar):
+ /bin/tar -xf /usr/src/RPM/SOURCES/kcov-38.tar
+ cd kcov-38
+ /bin/chmod -c -Rf u+rwX,go-w .
+ echo 'Patch #0 (kcov-38-alt-drop-fork-32-test.patch):'
Patch #0 (kcov-38-alt-drop-fork-32-test.patch):
+ /usr/bin/patch -p1
patching file tests/CMakeLists.txt
patching file tests/tools/compiled.py
+ rm -r external/
+ exit 0
Executing(%build): /bin/sh -e /usr/src/tmp/rpm-tmp.49194
+ umask 022
+ /bin/mkdir -p /usr/src/RPM/BUILD
+ cd /usr/src/RPM/BUILD
+ cd kcov-38
+ mkdir -p BUILD
+ cmake -DCMAKE_SKIP_INSTALL_RPATH:BOOL=yes '-DCMAKE_C_FLAGS:STRING=-pipe -frecord-gcc-switches -Wall -g -O2 -flto=auto' '-DCMAKE_CXX_FLAGS:STRING=-pipe -frecord-gcc-switches -Wall -g -O2 -flto=auto' '-DCMAKE_Fortran_FLAGS:STRING=-pipe -frecord-gcc-switches -Wall -g -O2 -flto=auto' -DCMAKE_INSTALL_PREFIX=/usr -DINCLUDE_INSTALL_DIR:PATH=/usr/include -DLIB_INSTALL_DIR:PATH=/usr/lib64 -DSYSCONF_INSTALL_DIR:PATH=/etc -DSHARE_INSTALL_PREFIX:PATH=/usr/share -DLIB_DESTINATION=lib64 -DLIB_SUFFIX=64 -S . -B BUILD -G Ninja -DKCOV_INSTALL_DOCDIR:STRING=/usr/share/doc/kcov-38
CMake Deprecation Warning at CMakeLists.txt:1 (cmake_minimum_required):
  Compatibility with CMake < 2.8.12 will be removed from a future version of
  CMake.

  Update the VERSION argument <min> value or use a ...<max> suffix to tell
  CMake that the project does not need compatibility with older versions.


-- The C compiler identification is GNU 12.1.1
-- The CXX compiler identification is GNU 12.1.1
-- Detecting C compiler ABI info
-- Detecting C compiler ABI info - done
-- Check for working C compiler: /usr/bin/cc - skipped
-- Detecting C compile features
-- Detecting C compile features - done
-- Detecting CXX compiler ABI info
-- Detecting CXX compiler ABI info - done
-- Check for working CXX compiler: /usr/bin/c++ - skipped
-- Detecting CXX compile features
-- Detecting CXX compile features - done
-- Looking for pthread.h
-- Looking for pthread.h - found
-- Performing Test CMAKE_HAVE_LIBC_PTHREAD
-- Performing Test CMAKE_HAVE_LIBC_PTHREAD - Success
-- Found Threads: TRUE  
CMake Warning (dev) at /usr/share/cmake/Modules/FindPackageHandleStandardArgs.cmake:438 (message):
  The package name passed to `find_package_handle_standard_args` (LIBBFD)
  does not match the name of the calling package (Bfd).  This can lead to
  problems in calling code that expects `find_package` result variables
  (e.g., `_FOUND`) to follow a certain pattern.
Call Stack (most recent call first):
  cmake/FindBfd.cmake:79 (find_package_handle_standard_args)
  src/CMakeLists.txt:2 (find_package)
This warning is for project developers.  Use -Wno-dev to suppress it.

-- Found LIBBFD: /usr/lib64/libbfd.so  
-- Target architectures: x86_64
-- Found ZLIB: /usr/lib64/libz.so (found version "1.2.12") 
-- Found CURL: /usr/lib64/libcurl.so (found version "7.83.1")  
-- Found DL: /usr/lib64/libdl.a
-- Found M: /usr/lib64/libm.so
-- Found LibElf: /usr/lib64/libelf.so  
Package liblzma was not found in the pkg-config search path.
Perhaps you should add the directory containing `liblzma.pc'
to the PKG_CONFIG_PATH environment variable
Package 'liblzma', required by 'libdw', not found
Package liblzma was not found in the pkg-config search path.
Perhaps you should add the directory containing `liblzma.pc'
to the PKG_CONFIG_PATH environment variable
Package 'liblzma', required by 'libdw', not found
Package liblzma was not found in the pkg-config search path.
Perhaps you should add the directory containing `liblzma.pc'
to the PKG_CONFIG_PATH environment variable
Package 'liblzma', required by 'libdw', not found
Package liblzma was not found in the pkg-config search path.
Perhaps you should add the directory containing `liblzma.pc'
to the PKG_CONFIG_PATH environment variable
Package 'liblzma', required by 'libdw', not found
CMake Warning (dev) at /usr/share/cmake/Modules/FindPackageHandleStandardArgs.cmake:438 (message):
  The package name passed to `find_package_handle_standard_args` (ElfUtils)
  does not match the name of the calling package (Elfutils).  This can lead
  to problems in calling code that expects `find_package` result variables
  (e.g., `_FOUND`) to follow a certain pattern.
Call Stack (most recent call first):
  cmake/FindElfutils.cmake:70 (find_package_handle_standard_args)
  src/CMakeLists.txt:134 (find_package)
This warning is for project developers.  Use -Wno-dev to suppress it.

-- Found ElfUtils: /usr/lib64/libdw.so  
-- Configuring done
-- Generating done
CMake Warning:
  Manually-specified variables were not used by the project:

    CMAKE_Fortran_FLAGS
    INCLUDE_INSTALL_DIR
    LIB_DESTINATION
    LIB_INSTALL_DIR
    LIB_SUFFIX
    SHARE_INSTALL_PREFIX
    SYSCONF_INSTALL_DIR


-- Build files have been written to: /usr/src/RPM/BUILD/kcov-38/BUILD
+ /usr/bin/ninja -j8 -C BUILD
ninja: Entering directory `BUILD'
[1/73] Generating version.c
[2/73] Building C object src/CMakeFiles/kcov_sowrapper.dir/solib-parser/phdr_data.c.o
[3/73] Building C object src/CMakeFiles/kcov_sowrapper.dir/solib-parser/lib.c.o
[4/73] Building C object src/CMakeFiles/bash_execve_redirector.dir/engines/bash-execve-redirector.c.o
[5/73] Linking C shared library src/libbash_execve_redirector.so
[6/73] Linking C shared library src/libkcov_sowrapper.so
[7/73] Building CXX object src/CMakeFiles/kcov-system-daemon.dir/dummy-solib-handler.cc.o
[8/73] Building CXX object src/CMakeFiles/kcov_system_lib.dir/engines/system-mode-binary-lib.cc.o
[9/73] Building CXX object src/CMakeFiles/kcov_system_lib.dir/system-mode/registration.cc.o
[10/73] Building CXX object src/CMakeFiles/kcov-system-daemon.dir/engine-factory.cc.o
[11/73] Building CXX object src/CMakeFiles/kcov-system-daemon.dir/engines/system-mode-file-format.cc.o
[12/73] Building CXX object src/CMakeFiles/kcov-system-daemon.dir/engines/ptrace_linux.cc.o
[13/73] Building CXX object src/CMakeFiles/kcov_system_lib.dir/utils.cc.o
[14/73] Building CXX object src/CMakeFiles/kcov-system-daemon.dir/filter.cc.o
[15/73] Building CXX object src/CMakeFiles/kcov-system-daemon.dir/parser-manager.cc.o
[16/73] Building CXX object src/CMakeFiles/kcov-system-daemon.dir/engines/ptrace.cc.o
[17/73] Building C object src/CMakeFiles/kcov-system-daemon.dir/version.c.o
[18/73] Building CXX object src/CMakeFiles/kcov-system-daemon.dir/system-mode/file-data.cc.o
[19/73] Building CXX object src/CMakeFiles/kcov-system-daemon.dir/gcov.cc.o
[20/73] Building CXX object src/CMakeFiles/kcov-system-daemon.dir/main-system-daemon.cc.o
[21/73] Building CXX object src/CMakeFiles/kcov-system-daemon.dir/configuration.cc.o
[22/73] Building CXX object src/CMakeFiles/kcov-system-daemon.dir/system-mode/registration.cc.o
[23/73] Linking CXX shared library src/libkcov_system_lib.so
[24/73] Generating python-helper.cc
[25/73] Generating bash-redirector-library.cc
[26/73] Generating bash-helper.cc
[27/73] Generating library.cc
[28/73] Generating html-data-files.cc
[29/73] Building CXX object src/CMakeFiles/kcov-system-daemon.dir/utils.cc.o
[30/73] Generating kcov-system-library.cc
[31/73] Building CXX object src/CMakeFiles/kcov.dir/engines/system-mode-file-format.cc.o
[32/73] Building CXX object src/CMakeFiles/kcov.dir/collector.cc.o
[33/73] Building CXX object src/CMakeFiles/kcov.dir/engine-factory.cc.o
[34/73] Building CXX object src/CMakeFiles/kcov.dir/capabilities.cc.o
[35/73] Building CXX object src/CMakeFiles/kcov.dir/filter.cc.o
[36/73] Building CXX object src/CMakeFiles/kcov.dir/gcov.cc.o
[37/73] Building CXX object src/CMakeFiles/kcov.dir/main.cc.o
[38/73] Building CXX object src/CMakeFiles/kcov.dir/engines/system-mode-engine.cc.o
[39/73] Building CXX object src/CMakeFiles/kcov.dir/engines/python-engine.cc.o
[40/73] Building CXX object src/CMakeFiles/kcov.dir/parser-manager.cc.o
[41/73] Building CXX object src/CMakeFiles/kcov.dir/engines/bash-engine.cc.o
[42/73] Building CXX object src/CMakeFiles/kcov.dir/output-handler.cc.o
[43/73] Building CXX object src/CMakeFiles/kcov.dir/source-file-cache.cc.o
[44/73] Building CXX object src/CMakeFiles/kcov.dir/configuration.cc.o
[45/73] Building CXX object src/CMakeFiles/kcov.dir/utils.cc.o
[46/73] Building CXX object src/CMakeFiles/kcov.dir/writers/json-writer.cc.o
[47/73] Building CXX object src/CMakeFiles/kcov.dir/parsers/bfd-disassembler.cc.o
[48/73] Building CXX object src/CMakeFiles/kcov.dir/merge-file-parser.cc.o
[49/73] Building CXX object src/CMakeFiles/kcov.dir/writers/cobertura-writer.cc.o
[50/73] Building CXX object src/CMakeFiles/kcov.dir/reporter.cc.o
[51/73] Building CXX object src/CMakeFiles/kcov.dir/writers/coveralls-writer.cc.o
[52/73] Building CXX object src/CMakeFiles/kcov.dir/writers/sonarqube-xml-writer.cc.o
[53/73] Building CXX object src/CMakeFiles/kcov.dir/writers/html-writer.cc.o
[54/73] Building CXX object src/CMakeFiles/kcov.dir/writers/writer-base.cc.o
[55/73] Building CXX object src/CMakeFiles/kcov.dir/engines/ptrace_linux.cc.o
[56/73] Building CXX object src/CMakeFiles/kcov.dir/engines/kernel-engine.cc.o
[57/73] Building CXX object src/CMakeFiles/kcov.dir/parsers/elf.cc.o
[58/73] Building C object src/CMakeFiles/kcov.dir/solib-parser/phdr_data.c.o
[59/73] Building CXX object src/CMakeFiles/kcov.dir/parsers/dwarf.cc.o
[60/73] Building CXX object src/CMakeFiles/kcov.dir/bash-redirector-library.cc.o
[61/73] Building CXX object src/CMakeFiles/kcov.dir/python-helper.cc.o
[62/73] Building CXX object src/CMakeFiles/kcov.dir/bash-helper.cc.o
[63/73] Building CXX object src/CMakeFiles/kcov.dir/library.cc.o
[64/73] Building CXX object src/CMakeFiles/kcov.dir/engines/ptrace.cc.o
[65/73] Building CXX object src/CMakeFiles/kcov.dir/solib-handler.cc.o
[66/73] Building CXX object src/CMakeFiles/kcov.dir/engines/clang-coverage-engine.cc.o
[67/73] Building C object src/CMakeFiles/kcov.dir/version.c.o
[68/73] Building CXX object src/CMakeFiles/kcov.dir/parsers/elf-parser.cc.o
[69/73] Linking CXX executable src/kcov-system-daemon
[70/73] Building CXX object src/CMakeFiles/kcov.dir/system-mode/file-data.cc.o
[71/73] Building CXX object src/CMakeFiles/kcov.dir/html-data-files.cc.o
[72/73] Building CXX object src/CMakeFiles/kcov.dir/kcov-system-library.cc.o
[73/73] Linking CXX executable src/kcov
+ cmake -S tests -B build-tests -G Ninja
CMake Deprecation Warning at CMakeLists.txt:1 (cmake_minimum_required):
  Compatibility with CMake < 2.8.12 will be removed from a future version of
  CMake.

  Update the VERSION argument <min> value or use a ...<max> suffix to tell
  CMake that the project does not need compatibility with older versions.


-- The C compiler identification is GNU 12.1.1
-- The CXX compiler identification is GNU 12.1.1
-- Detecting C compiler ABI info
-- Detecting C compiler ABI info - done
-- Check for working C compiler: /usr/bin/cc - skipped
-- Detecting C compile features
-- Detecting C compile features - done
-- Detecting CXX compiler ABI info
-- Detecting CXX compiler ABI info - done
-- Check for working CXX compiler: /usr/bin/c++ - skipped
-- Detecting CXX compile features
-- Detecting CXX compile features - done
-- The ASM compiler identification is GNU
-- Found assembler: /usr/bin/cc
-- Looking for pthread.h
-- Looking for pthread.h - found
-- Performing Test CMAKE_HAVE_LIBC_PTHREAD
-- Performing Test CMAKE_HAVE_LIBC_PTHREAD - Success
-- Found Threads: TRUE  
-- Found ZLIB: /usr/lib64/libz.so (found version "1.2.12") 
-- Found DL: /usr/lib64/libdl.a
-- Found M: /usr/lib64/libm.so
-- Configuring done
-- Generating done
-- Build files have been written to: /usr/src/RPM/BUILD/kcov-38/build-tests
+ /usr/bin/ninja -j8 -C build-tests
ninja: Entering directory `build-tests'
[1/56] Building ASM object CMakeFiles/shared_library.dir/shared-library/big-symbol.S.o
[2/56] Building C object CMakeFiles/shared_library.dir/shared-library/solib.c.o
[3/56] Building CXX object CMakeFiles/main-tests.dir/main.cc.o
[4/56] Building C object CMakeFiles/main-tests.dir/subdir2/file2.c.o
[5/56] Building C object CMakeFiles/main-tests.dir/subdir/file.c.o
[6/56] Linking C shared library libshared_library.so
[7/56] Building C object CMakeFiles/vfork.dir/fork/vfork.c.o
[8/56] Building C object CMakeFiles/shared_library_test.dir/shared-library/main.c.o
[9/56] Building C object CMakeFiles/fork_no_wait.dir/fork/fork-no-wait.c.o
[10/56] Building C object CMakeFiles/fork.dir/fork/fork.c.o
[11/56] Linking C executable vfork
[12/56] Building C object CMakeFiles/signals.dir/signals/test-signals.c.o
[13/56] Building C object CMakeFiles/argv_dependent.dir/argv-dependent.c.o
[14/56] Linking CXX executable main-tests
[15/56] Building C object CMakeFiles/test_popen.dir/popen/test-popen.c.o
[16/56] Linking C executable shared_library_test
[17/56] Linking C executable fork_no_wait
[18/56] Linking C executable fork
[19/56] Linking C executable argv_dependent
[20/56] Linking C executable signals
[21/56] Building C object CMakeFiles/multi_2.dir/merge-tests/file.c.o
[22/56] Linking C executable test_popen
[23/56] Building C object CMakeFiles/multi_2.dir/merge-tests/main_2.c.o
[24/56] Building C object CMakeFiles/multi_1.dir/merge-tests/file.c.o
[25/56] Building CXX object CMakeFiles/test_daemon.dir/daemon/test-daemon.cc.o
[26/56] Building C object CMakeFiles/multi_1.dir/merge-tests/main_1.c.o
[27/56] Linking C executable multi_2
[28/56] Building CXX object CMakeFiles/dlopen.dir/dlopen/dlopen.cc.o
[29/56] Linking C executable multi_1
[30/56] Building C object CMakeFiles/s.dir/short-file.c.o
[31/56] Building CXX object CMakeFiles/dlopen.dir/dlopen/dlopen-main.cc.o
[32/56] Building C object CMakeFiles/fork+exec.dir/fork/fork+exec.c.o
[33/56] Linking CXX executable test_daemon
[34/56] Linking C executable s
[35/56] Linking C executable fork+exec
[36/56] Building CXX object CMakeFiles/setpgid-kill.dir/setpgid-kill/setpgid-kill-main.cc.o
[37/56] Building CXX object CMakeFiles/global-constructors.dir/global-constructors/test-global-ctors.cc.o
[38/56] Linking CXX executable dlopen
[39/56] Building C object CMakeFiles/thread-test.dir/threads/thread-main.c.o
[40/56] Building C object CMakeFiles/pie.dir/pie.c.o
[41/56] Building C object CMakeFiles/pie-test.dir/argv-dependent.c.o
[42/56] Building CXX object CMakeFiles/recursive-ptrace.dir/recursive-ptrace/main.cc.o
[43/56] Linking C executable thread-test
[44/56] Generating multi-fork-generated.c
[45/56] Linking C executable pie
[46/56] Linking C executable pie-test
[47/56] Linking CXX executable recursive-ptrace
[48/56] cd /usr/src/RPM/BUILD/kcov-38/build-tests && /usr/bin/cc -nostdlib /usr/src/RPM/BUILD/kcov-38/tests/assembly/illegal-insn.S -o /usr/src/RPM/BUILD/kcov-38/build-tests/illegal-insn
[49/56] cd /usr/src/RPM/BUILD/kcov-38/build-tests && /usr/bin/strip -o tests-stripped main-tests
[50/56] Linking CXX executable global-constructors
[51/56] Building CXX object CMakeFiles/issue31.dir/daemon/test-issue31.cc.o
[52/56] Linking CXX executable issue31
[53/56] Building CXX object CMakeFiles/setpgid-kill.dir/usr/src/RPM/BUILD/kcov-38/src/utils.cc.o
[54/56] Linking CXX executable setpgid-kill
[55/56] Building C object CMakeFiles/multi_fork.dir/multi-fork/test-multi-fork.c.o
[56/56] Linking C executable multi_fork
+ cmake -S tools -B build-tools -G Ninja
CMake Deprecation Warning at CMakeLists.txt:1 (cmake_minimum_required):
  Compatibility with CMake < 2.8.12 will be removed from a future version of
  CMake.

  Update the VERSION argument <min> value or use a ...<max> suffix to tell
  CMake that the project does not need compatibility with older versions.


-- The C compiler identification is GNU 12.1.1
-- The CXX compiler identification is GNU 12.1.1
-- Detecting C compiler ABI info
-- Detecting C compiler ABI info - done
-- Check for working C compiler: /usr/bin/cc - skipped
-- Detecting C compile features
-- Detecting C compile features - done
-- Detecting CXX compiler ABI info
-- Detecting CXX compiler ABI info - done
-- Check for working CXX compiler: /usr/bin/c++ - skipped
-- Detecting CXX compile features
-- Detecting CXX compile features - done
-- Found LibElf: /usr/lib64/libelf.so  
Package liblzma was not found in the pkg-config search path.
Perhaps you should add the directory containing `liblzma.pc'
to the PKG_CONFIG_PATH environment variable
Package 'liblzma', required by 'libdw', not found
Package liblzma was not found in the pkg-config search path.
Perhaps you should add the directory containing `liblzma.pc'
to the PKG_CONFIG_PATH environment variable
Package 'liblzma', required by 'libdw', not found
Package liblzma was not found in the pkg-config search path.
Perhaps you should add the directory containing `liblzma.pc'
to the PKG_CONFIG_PATH environment variable
Package 'liblzma', required by 'libdw', not found
Package liblzma was not found in the pkg-config search path.
Perhaps you should add the directory containing `liblzma.pc'
to the PKG_CONFIG_PATH environment variable
Package 'liblzma', required by 'libdw', not found
CMake Warning (dev) at /usr/share/cmake/Modules/FindPackageHandleStandardArgs.cmake:438 (message):
  The package name passed to `find_package_handle_standard_args` (ElfUtils)
  does not match the name of the calling package (Elfutils).  This can lead
  to problems in calling code that expects `find_package` result variables
  (e.g., `_FOUND`) to follow a certain pattern.
Call Stack (most recent call first):
  /usr/src/RPM/BUILD/kcov-38/cmake/FindElfutils.cmake:70 (find_package_handle_standard_args)
  CMakeLists.txt:14 (find_package)
This warning is for project developers.  Use -Wno-dev to suppress it.

-- Found ElfUtils: /usr/lib64/libdw.so  
-- Found PkgConfig: /usr/bin/pkg-config (found version "0.29.2") 
-- Looking for pthread.h
-- Looking for pthread.h - found
-- Performing Test CMAKE_HAVE_LIBC_PTHREAD
-- Performing Test CMAKE_HAVE_LIBC_PTHREAD - Success
-- Found Threads: TRUE  
-- Found ZLIB: /usr/lib64/libz.so (found version "1.2.12") 
-- Found DL: /usr/lib64/libdl.a
-- Found M: /usr/lib64/libm.so
-- Configuring done
-- Generating done
-- Build files have been written to: /usr/src/RPM/BUILD/kcov-38/build-tools
+ /usr/bin/ninja -j8 -C build-tools
ninja: Entering directory `build-tools'
[1/12] Building CXX object CMakeFiles/line2addr.dir/usr/src/RPM/BUILD/kcov-38/src/parsers/dummy-disassembler.cc.o
[2/12] Building CXX object CMakeFiles/line2addr.dir/usr/src/RPM/BUILD/kcov-38/src/filter.cc.o
[3/12] Building CXX object CMakeFiles/line2addr.dir/usr/src/RPM/BUILD/kcov-38/src/parsers/dwarf.cc.o
[4/12] Building CXX object CMakeFiles/line2addr.dir/usr/src/RPM/BUILD/kcov-38/src/parsers/elf.cc.o
[5/12] Building CXX object CMakeFiles/line2addr.dir/usr/src/RPM/BUILD/kcov-38/src/capabilities.cc.o
[6/12] Building CXX object CMakeFiles/line2addr.dir/usr/src/RPM/BUILD/kcov-38/src/parser-manager.cc.o
[7/12] Building CXX object CMakeFiles/line2addr.dir/line2addr.cc.o
[8/12] Building CXX object CMakeFiles/line2addr.dir/usr/src/RPM/BUILD/kcov-38/src/gcov.cc.o
[9/12] Building CXX object CMakeFiles/line2addr.dir/usr/src/RPM/BUILD/kcov-38/src/parsers/elf-parser.cc.o
[10/12] Building CXX object CMakeFiles/line2addr.dir/usr/src/RPM/BUILD/kcov-38/src/configuration.cc.o
[11/12] Building CXX object CMakeFiles/line2addr.dir/usr/src/RPM/BUILD/kcov-38/src/utils.cc.o
[12/12] Linking CXX executable line2addr
+ exit 0
Executing(%install): /bin/sh -e /usr/src/tmp/rpm-tmp.21594
+ umask 022
+ /bin/mkdir -p /usr/src/RPM/BUILD
+ cd /usr/src/RPM/BUILD
+ /bin/chmod -Rf u+rwX -- /usr/src/tmp/kcov-buildroot
+ :
+ /bin/rm -rf -- /usr/src/tmp/kcov-buildroot
+ PATH=/usr/libexec/rpm-build:/usr/src/bin:/bin:/usr/bin:/usr/X11R6/bin:/usr/games
+ cd kcov-38
+ DESTDIR=/usr/src/tmp/kcov-buildroot
+ /usr/bin/ninja -j8 install -C BUILD
ninja: Entering directory `BUILD'
[0/1] Install the project...
-- Install configuration: "Release"
-- Installing: /usr/src/tmp/kcov-buildroot/usr/share/doc/kcov-38/ChangeLog
-- Installing: /usr/src/tmp/kcov-buildroot/usr/share/doc/kcov-38/COPYING
-- Installing: /usr/src/tmp/kcov-buildroot/usr/share/doc/kcov-38/COPYING.externals
-- Installing: /usr/src/tmp/kcov-buildroot/usr/bin/kcov
-- Installing: /usr/src/tmp/kcov-buildroot/usr/bin/kcov-system-daemon
-- Installing: /usr/src/tmp/kcov-buildroot/usr/share/man/man1/kcov.1
+ /usr/lib/rpm/brp-alt
Cleaning files in /usr/src/tmp/kcov-buildroot (auto)
Verifying and fixing files in /usr/src/tmp/kcov-buildroot (binconfig,pkgconfig,libtool,desktop,gnuconfig)
Checking contents of files in /usr/src/tmp/kcov-buildroot/ (default)
Compressing files in /usr/src/tmp/kcov-buildroot (auto)
Verifying ELF objects in /usr/src/tmp/kcov-buildroot (arch=normal,fhs=normal,lfs=relaxed,lint=relaxed,rpath=normal,stack=normal,textrel=normal,unresolved=normal)
Executing(%check): /bin/sh -e /usr/src/tmp/rpm-tmp.45999
+ umask 022
+ /bin/mkdir -p /usr/src/RPM/BUILD
+ cd /usr/src/RPM/BUILD
+ cd kcov-38
++ pwd
++ pwd
+ tests/tools/run-tests BUILD/src/kcov /tmp /usr/src/RPM/BUILD/kcov-38/build-tests /usr/src/RPM/BUILD/kcov-38 -v
runTest (basic.LookupBinaryInPath) ... expected failure
runTest (compiled.Pie) ... FAIL
runTest (basic.TooFewArguments) ... ok
runTest (basic.WrongArguments) ... ok
runTest (accumulate.accumulate_data) ... FAIL
runTest (compiled.address_sanitizer_coverage) ... expected failure
runTest (compiled.attach_process_with_threads) ... ERROR
runTest (compiled.attach_process_with_threads_creates_threads) ... ERROR
runTest (bash.bash_accumulate_changed_data) ... ok
runTest (bash.bash_accumulate_data) ... ok
runTest (bash.bash_can_find_non_executed_scripts) ... ok
runTest (bash.bash_can_find_non_executed_scripts_manually) ... ok
runTest (bash.bash_can_ignore_function_with_spaces) ... ok
runTest (bash.bash_can_ignore_non_executed_scripts) ... ok
runTest (bash.bash_coverage) ... ok
runTest (bash.bash_coverage_debug_trap) ... ok
runTest (bash.bash_coverage_tricky) ... ok
runTest (bash.bash_dollar_var_replacement) ... ok
runTest (bash.bash_done_eof) ... ok
runTest (bash.bash_eof_backtick) ... ok
runTest (bash.bash_exit_status) ... ok
runTest (bash.bash_handle_all_output) ... ok
runTest (bash.bash_heredoc_backslashes) ... ok
runTest (bash.bash_heredoc_special_cases_issue_44) ... ok
runTest (bash.bash_honor_signal) ... ok
runTest (bash.bash_ignore_uncovered) ... ok
runTest (bash.bash_issue_116_arithmetic_and_heredoc_issue_117_comment_within_string) ... ok
runTest (bash.bash_merge_data_issue_38) ... ok
runTest (bash.bash_multiline_backslashes) ... ok
runTest (bash.bash_multiline_quotes) ... ok
runTest (bash.bash_no_executed_lines) ... ok
runTest (bash.bash_non_empty_braces) ... ok
runTest (bash_linux_only.bash_sh_shebang) ... ok
runTest (bash.bash_short_file) ... ok
runTest (bash.bash_stderr_redirection) ... ok
runTest (bash.bash_subshell) ... ok
runTest (compiled.collect_and_report_only) ... FAIL
runTest (compiled.collect_no_source) ... expected failure
runTest (compiled.daemon_no_wait_for_last_child) ... expected failure
runTest (compiled.daemon_wait_for_last_child) ... ok
runTest (compiled.debuglink) ... FAIL
runTest (compiled.dlopen) ... expected failure
runTest (compiled.dlopen_in_ignored_source_file) ... expected failure
runTest (accumulate.dont_accumulate_data_with_clean) ... FAIL
runTest (compiled.fork_64) ... FAIL
runTest (compiled.fork_no_wait) ... ok
runTest (compiled.global_ctors) ... ok
runTest (compiled.illegal_insn) ... ok
runTest (filter.include_exclude_pattern) ... ok
runTest (filter.include_path) ... ok
runTest (filter.include_path_and_exclude_pattern) ... ok
runTest (compiled.main_test) ... ok
runTest (compiled.main_test_lldb_raw_breakpoints) ... FAIL
runTest (compiled.main_test_verify) ... FAIL
runTest (accumulate.merge_basic) ... ERROR
runTest (accumulate.merge_coveralls) ... FAIL
runTest (accumulate.merge_merged_output) ... FAIL
runTest (accumulate.merge_multiple_output_directories) ... FAIL
runTest (compiled.merge_same_file_in_multiple_binaries) ... FAIL
runTest (compiled.pie_accumulate) ... ok
runTest (compiled.pie_argv_basic) ... ok
runTest (compiled.popen_test) ... ok
runTest (python.python3_coverage) ... ok
runTest (python.python_accumulate_data) ... FAIL
runTest (python.python_can_set_illegal_parser) ... ok
runTest (python.python_can_set_legal_parser) ... ok
runTest (python.python_exit_status) ... ok
runTest (python.python_short_file) ... FAIL
runTest (python.python_tricky_single_dict_assignment) ... expected failure
runTest (python.python_tricky_single_line_string_assignment) ... FAIL
runTest (python.python_unittest) ... FAIL
runTest (compiled.setpgid_kill) ... ok
runTest (compiled.shared_library) ... ok
runTest (compiled.shared_library_accumulate) ... FAIL
runTest (compiled.shared_library_filter_out) ... ok
runTest (compiled.shared_library_skip) ... FAIL
runTest (compiled.short_filename) ... expected failure
runTest (compiled.signals) ... ok
runTest (compiled.signals_crash) ... ok
runTest (compiled.signals_self) ... FAIL
runTest (system_mode.system_mode_can_instrument_binary) ... ok
runTest (system_mode.system_mode_can_record_and_report_binary) ... ERROR
runTest (system_mode.system_mode_can_start_and_stop_daemon) ... ok
runTest (compiled.vfork) ... ok

======================================================================
ERROR: runTest (compiled.attach_process_with_threads)
----------------------------------------------------------------------
Traceback (most recent call last):
  File "/usr/src/RPM/BUILD/kcov-38/tests/tools/compiled.py", line 298, in runTest
    assert parse_cobertura.hitsPerLine(dom, "test-issue31.cc", 28) >= 1
TypeError: '>=' not supported between instances of 'NoneType' and 'int'

======================================================================
ERROR: runTest (compiled.attach_process_with_threads_creates_threads)
----------------------------------------------------------------------
Traceback (most recent call last):
  File "/usr/src/RPM/BUILD/kcov-38/tests/tools/compiled.py", line 308, in runTest
    assert parse_cobertura.hitsPerLine(dom, "thread-main.c", 21) >= 1
TypeError: '>=' not supported between instances of 'NoneType' and 'int'

======================================================================
ERROR: runTest (accumulate.merge_basic)
----------------------------------------------------------------------
Traceback (most recent call last):
  File "/usr/src/RPM/BUILD/kcov-38/tests/tools/accumulate.py", line 43, in runTest
    dom = parse_cobertura.parseFile(testbase.outbase + "/kcov/kcov-merged/cobertura.xml")
  File "/usr/src/RPM/BUILD/kcov-38/tests/tools/parse_cobertura.py", line 46, in parseFile
    dom = xml.dom.minidom.parseString(readFile(filename))
  File "/usr/src/RPM/BUILD/kcov-38/tests/tools/parse_cobertura.py", line 9, in readFile
    f = open(name,'r')
FileNotFoundError: [Errno 2] No such file or directory: '/tmp/kcov/kcov-merged/cobertura.xml'

======================================================================
ERROR: runTest (system_mode.system_mode_can_record_and_report_binary)
----------------------------------------------------------------------
Traceback (most recent call last):
  File "/usr/src/RPM/BUILD/kcov-38/tests/tools/system_mode.py", line 65, in runTest
    dom = parse_cobertura.parseFile(testbase.outbase + "/kcov-report/main-tests/cobertura.xml")
  File "/usr/src/RPM/BUILD/kcov-38/tests/tools/parse_cobertura.py", line 46, in parseFile
    dom = xml.dom.minidom.parseString(readFile(filename))
  File "/usr/src/RPM/BUILD/kcov-38/tests/tools/parse_cobertura.py", line 9, in readFile
    f = open(name,'r')
FileNotFoundError: [Errno 2] No such file or directory: '/tmp/kcov-report/main-tests/cobertura.xml'

======================================================================
FAIL: runTest (compiled.Pie)
----------------------------------------------------------------------
Traceback (most recent call last):
  File "/usr/src/RPM/BUILD/kcov-38/tests/tools/compiled.py", line 158, in runTest
    assert parse_cobertura.hitsPerLine(dom, "pie.c", 5) == 1
AssertionError

======================================================================
FAIL: runTest (accumulate.accumulate_data)
----------------------------------------------------------------------
Traceback (most recent call last):
  File "/usr/src/RPM/BUILD/kcov-38/tests/tools/accumulate.py", line 11, in runTest
    assert parse_cobertura.hitsPerLine(dom, "main", 16) == 1
AssertionError

======================================================================
FAIL: runTest (compiled.collect_and_report_only)
----------------------------------------------------------------------
Traceback (most recent call last):
  File "/usr/src/RPM/BUILD/kcov-38/tests/tools/compiled.py", line 282, in runTest
    assert parse_cobertura.hitsPerLine(dom, "main.cc", 9) == 1
AssertionError

======================================================================
FAIL: runTest (compiled.debuglink)
----------------------------------------------------------------------
Traceback (most recent call last):
  File "/usr/src/RPM/BUILD/kcov-38/tests/tools/compiled.py", line 358, in runTest
    assert parse_cobertura.hitsPerLine(dom, "main.cc", 9) == 1
AssertionError

======================================================================
FAIL: runTest (accumulate.dont_accumulate_data_with_clean)
----------------------------------------------------------------------
Traceback (most recent call last):
  File "/usr/src/RPM/BUILD/kcov-38/tests/tools/accumulate.py", line 27, in runTest
    assert parse_cobertura.hitsPerLine(dom, "main", 16) == 1
AssertionError

======================================================================
FAIL: runTest (compiled.fork_64)
----------------------------------------------------------------------
Traceback (most recent call last):
  File "/usr/src/RPM/BUILD/kcov-38/tests/tools/compiled.py", line 45, in runTest
    self.doTest("fork")
  File "/usr/src/RPM/BUILD/kcov-38/tests/tools/compiled.py", line 37, in doTest
    assert parse_cobertura.hitsPerLine(dom, "fork.c", 26) >= 1
AssertionError

======================================================================
FAIL: runTest (compiled.main_test_lldb_raw_breakpoints)
----------------------------------------------------------------------
Traceback (most recent call last):
  File "/usr/src/RPM/BUILD/kcov-38/tests/tools/compiled.py", line 131, in runTest
    self.doTest("--configure=lldb-use-raw-breakpoint-writes=1")
  File "/usr/src/RPM/BUILD/kcov-38/tests/tools/compiled.py", line 113, in doTest
    assert parse_cobertura.hitsPerLine(dom, "main.cc", 9) == 1
AssertionError

======================================================================
FAIL: runTest (compiled.main_test_verify)
----------------------------------------------------------------------
Traceback (most recent call last):
  File "/usr/src/RPM/BUILD/kcov-38/tests/tools/compiled.py", line 127, in runTest
    self.doTest("--verify")
  File "/usr/src/RPM/BUILD/kcov-38/tests/tools/compiled.py", line 113, in doTest
    assert parse_cobertura.hitsPerLine(dom, "main.cc", 9) == 1
AssertionError

======================================================================
FAIL: runTest (accumulate.merge_coveralls)
----------------------------------------------------------------------
Traceback (most recent call last):
  File "/usr/src/RPM/BUILD/kcov-38/tests/tools/accumulate.py", line 78, in runTest
    assert rv == 0
AssertionError

======================================================================
FAIL: runTest (accumulate.merge_merged_output)
----------------------------------------------------------------------
Traceback (most recent call last):
  File "/usr/src/RPM/BUILD/kcov-38/tests/tools/accumulate.py", line 67, in runTest
    assert parse_cobertura.hitsPerLine(dom, "main", 10) == 1
AssertionError

======================================================================
FAIL: runTest (accumulate.merge_multiple_output_directories)
----------------------------------------------------------------------
Traceback (most recent call last):
  File "/usr/src/RPM/BUILD/kcov-38/tests/tools/accumulate.py", line 54, in runTest
    assert parse_cobertura.hitsPerLine(dom, "main", 10) == 1
AssertionError

======================================================================
FAIL: runTest (compiled.merge_same_file_in_multiple_binaries)
----------------------------------------------------------------------
Traceback (most recent call last):
  File "/usr/src/RPM/BUILD/kcov-38/tests/tools/compiled.py", line 321, in runTest
    assert parse_cobertura.hitsPerLine(dom, "main_2.c", 9) == 1
AssertionError

======================================================================
FAIL: runTest (python.python_accumulate_data)
----------------------------------------------------------------------
Traceback (most recent call last):
  File "/usr/src/RPM/BUILD/kcov-38/tests/tools/python.py", line 75, in runTest
    assert parse_cobertura.hitsPerLine(dom, "main", 16) == 0
AssertionError

======================================================================
FAIL: runTest (python.python_short_file)
----------------------------------------------------------------------
Traceback (most recent call last):
  File "/usr/src/RPM/BUILD/kcov-38/tests/tools/python.py", line 41, in runTest
    assert parse_cobertura.hitsPerLine(dom, "short-test.py", 6) == 1
AssertionError

======================================================================
FAIL: runTest (python.python_tricky_single_line_string_assignment)
----------------------------------------------------------------------
Traceback (most recent call last):
  File "/usr/src/RPM/BUILD/kcov-38/tests/tools/python.py", line 94, in runTest
    assert parse_cobertura.hitsPerLine(dom, "second.py", 34) == 2
AssertionError

======================================================================
FAIL: runTest (python.python_unittest)
----------------------------------------------------------------------
Traceback (most recent call last):
  File "/usr/src/RPM/BUILD/kcov-38/tests/tools/python.py", line 33, in runTest
    assert parse_cobertura.hitsPerLine(dom, "testdriver", 14) == 1
AssertionError

======================================================================
FAIL: runTest (compiled.shared_library_accumulate)
----------------------------------------------------------------------
Traceback (most recent call last):
  File "/usr/src/RPM/BUILD/kcov-38/tests/tools/compiled.py", line 100, in runTest
    assert parse_cobertura.hitsPerLine(dom, "main.c", 9) == 1
AssertionError

======================================================================
FAIL: runTest (compiled.shared_library_skip)
----------------------------------------------------------------------
Traceback (most recent call last):
  File "/usr/src/RPM/BUILD/kcov-38/tests/tools/compiled.py", line 76, in runTest
    assert parse_cobertura.hitsPerLine(dom, "main.c", 9) == 1
AssertionError

======================================================================
FAIL: runTest (compiled.signals_self)
----------------------------------------------------------------------
Traceback (most recent call last):
  File "/usr/src/RPM/BUILD/kcov-38/tests/tools/compiled.py", line 253, in runTest
    self.doTest()
  File "/usr/src/RPM/BUILD/kcov-38/tests/tools/compiled.py", line 225, in doTest
    assert parse_cobertura.hitsPerLine(dom, "test-signals.c", 14) == 1
AssertionError

----------------------------------------------------------------------
Ran 84 tests in 102.366s

FAILED (failures=19, errors=4, expected failures=8)
Clang-only
x86_64
+ :
+ exit 0
Processing files: kcov-38-alt3
Finding Provides (using /usr/lib/rpm/find-provides)
Executing: /bin/sh -e /usr/src/tmp/rpm-tmp.yDTxLF
find-provides: running scripts (alternatives,debuginfo,lib,pam,perl,pkgconfig,python,python3,shell)
Finding Requires (using /usr/lib/rpm/find-requires)
Executing: /bin/sh -e /usr/src/tmp/rpm-tmp.wlARdf
find-requires: running scripts (cpp,debuginfo,files,lib,pam,perl,pkgconfig,pkgconfiglib,python,python3,rpmlib,shebang,shell,static,symlinks,systemd-services)
Requires: /lib64/ld-linux-x86-64.so.2, libc.so.6(GLIBC_2.11)(64bit), libc.so.6(GLIBC_2.14)(64bit), libc.so.6(GLIBC_2.15)(64bit), libc.so.6(GLIBC_2.2.5)(64bit), libc.so.6(GLIBC_2.3)(64bit), libc.so.6(GLIBC_2.3.2)(64bit), libc.so.6(GLIBC_2.3.4)(64bit), libc.so.6(GLIBC_2.33)(64bit), libc.so.6(GLIBC_2.34)(64bit), libc.so.6(GLIBC_2.4)(64bit), libc.so.6(GLIBC_2.6)(64bit), libc.so.6(GLIBC_2.7)(64bit), libc.so.6(GLIBC_2.8)(64bit), libcurl.so.4()(64bit) >= set:khyWzuBCbXlRpg2R2P390, libdw.so.1()(64bit) >= set:lhSDBiikr6DXPR3vmQ2eW8SGXkYamiY4WtC9, libdw.so.1(ELFUTILS_0.122)(64bit), libdw.so.1(ELFUTILS_0.127)(64bit), libelf.so.1()(64bit) >= set:kfYe1e3O4XaTj9o71uWqNZ14JnfWfV44Bg6uRLguk, libelf.so.1(ELFUTILS_1.0)(64bit), libelf.so.1(ELFUTILS_1.5)(64bit), libgcc_s.so.1(GCC_3.0)(64bit), libgcc_s.so.1(GCC_3.3.1)(64bit), libstdc++.so.6(CXXABI_1.3)(64bit), libstdc++.so.6(CXXABI_1.3.5)(64bit), libstdc++.so.6(GLIBCXX_3.4)(64bit), libstdc++.so.6(GLIBCXX_3.4.11)(64bit), libstdc++.so.6(GLIBCXX_3.4.15)(64bit), libstdc++.so.6(GLIBCXX_3.4.18)(64bit), libstdc++.so.6(GLIBCXX_3.4.20)(64bit), libstdc++.so.6(GLIBCXX_3.4.21)(64bit), libstdc++.so.6(GLIBCXX_3.4.29)(64bit), libstdc++.so.6(GLIBCXX_3.4.9)(64bit), libz.so.1()(64bit) >= set:khA48jieD52BZ9ROZmGZA0, libz.so.1(ZLIB_1.2.0)(64bit), rtld(GNU_HASH)
Requires(rpmlib): rpmlib(SetVersions)
Finding debuginfo files (using /usr/lib/rpm/find-debuginfo-files)
Executing: /bin/sh -e /usr/src/tmp/rpm-tmp.EPUBzz
Creating kcov-debuginfo package
Processing files: kcov-debuginfo-38-alt3
Finding Provides (using /usr/lib/rpm/find-provides)
Executing: /bin/sh -e /usr/src/tmp/rpm-tmp.gxzZXc
find-provides: running scripts (debuginfo)
Finding Requires (using /usr/lib/rpm/find-requires)
Executing: /bin/sh -e /usr/src/tmp/rpm-tmp.zp7TzI
find-requires: running scripts (debuginfo)
Requires: kcov = 38-alt3, /usr/lib/debug/lib64/ld-linux-x86-64.so.2.debug, debug64(libc.so.6), debug64(libcurl.so.4), debug64(libdw.so.1), debug64(libelf.so.1), debug64(libgcc_s.so.1), debug64(libstdc++.so.6), debug64(libz.so.1)
Adding to kcov-debuginfo a strict dependency on kcov
Wrote: /usr/src/RPM/RPMS/x86_64/kcov-38-alt3.x86_64.rpm (w2.lzdio)
Wrote: /usr/src/RPM/RPMS/x86_64/kcov-debuginfo-38-alt3.x86_64.rpm (w2T8.xzdio)
92.18user 34.67system 2:18.43elapsed 91%CPU (0avgtext+0avgdata 181432maxresident)k
0inputs+0outputs (0major+4630514minor)pagefaults 0swaps
101.13user 39.03system 2:31.05elapsed 92%CPU (0avgtext+0avgdata 181432maxresident)k
11144inputs+0outputs (46235major+4998553minor)pagefaults 0swaps
--- kcov-38-alt3.x86_64.rpm.repo	2021-06-15 10:40:43.000000000 +0000
+++ kcov-38-alt3.x86_64.rpm.hasher	2022-08-07 05:55:01.805662281 +0000
@@ -13,3 +13,6 @@
 Requires: libc.so.6(GLIBC_2.3)(64bit)  
+Requires: libc.so.6(GLIBC_2.3.2)(64bit)  
 Requires: libc.so.6(GLIBC_2.3.4)(64bit)  
+Requires: libc.so.6(GLIBC_2.33)(64bit)  
+Requires: libc.so.6(GLIBC_2.34)(64bit)  
 Requires: libc.so.6(GLIBC_2.4)(64bit)  
@@ -20,3 +23,2 @@
 Requires: rpmlib(SetVersions)  
-Requires: libdl.so.2(GLIBC_2.2.5)(64bit)  
 Requires: libdw.so.1()(64bit) >= set:lhSDBiikr6DXPR3vmQ2eW8SGXkYamiY4WtC9
@@ -28,4 +30,3 @@
 Requires: libgcc_s.so.1(GCC_3.0)(64bit)  
-Requires: libpthread.so.0(GLIBC_2.2.5)(64bit)  
-Requires: libpthread.so.0(GLIBC_2.3.2)(64bit)  
+Requires: libgcc_s.so.1(GCC_3.3.1)(64bit)  
 Requires: libstdc++.so.6(CXXABI_1.3)(64bit)  
@@ -38,2 +39,3 @@
 Requires: libstdc++.so.6(GLIBCXX_3.4.21)(64bit)  
+Requires: libstdc++.so.6(GLIBCXX_3.4.29)(64bit)  
 Requires: libstdc++.so.6(GLIBCXX_3.4.9)(64bit)  
@@ -42,7 +44,6 @@
 Requires: rtld(GNU_HASH)  
-Requires: rtld(GNU_UNIQUE)  
 Requires: rpmlib(PayloadIsLzma)  
 Provides: kcov = 38-alt3:sisyphus+274580.100.1.1
-File: /usr/bin/kcov	100755	root:root	360009a83f5ccc2936fc1a13427600c1	
-File: /usr/bin/kcov-system-daemon	100755	root:root	81c175a107fbc4aa703d7a1a035f5e3c	
+File: /usr/bin/kcov	100755	root:root	700d36e55f0fb2281bdb87a85bb2d20b	
+File: /usr/bin/kcov-system-daemon	100755	root:root	49bbe8cc298018b2db3504dcfa666245	
 File: /usr/share/doc/kcov-38	40755	root:root		
@@ -52,2 +53,2 @@
 File: /usr/share/man/man1/kcov.1.xz	100644	root:root	4e2ee324aa05c9e813a43f14b5855525	
-RPMIdentity: 60ed8aa10adc6f612105a49892d4b2b5e2ab4288c0621dbf27a851a2e43e1903bded90198b35fad95e9ff61bc69885195f940630b4839491ac9cfa90449f1015
+RPMIdentity: 5e82c24f096fa9fcf33ce8377252a7c58be62a85e0bfdf4938fa792e48dc3f8f2e5e1a594454ed4ab22d2759861efb3709b3c83450ac37f23ab08344771883cf
--- kcov-debuginfo-38-alt3.x86_64.rpm.repo	2021-06-15 10:40:43.000000000 +0000
+++ kcov-debuginfo-38-alt3.x86_64.rpm.hasher	2022-08-07 05:55:01.995662672 +0000
@@ -1,7 +1,7 @@
-/usr/lib/debug/.build-id/13	40755	root:root	
-/usr/lib/debug/.build-id/13/339fd3682f0c308f8ab750429b4eaa3ffab271	120777	root:root	../../../../bin/kcov
-/usr/lib/debug/.build-id/13/339fd3682f0c308f8ab750429b4eaa3ffab271.debug	120777	root:root	../../usr/bin/kcov.debug
-/usr/lib/debug/.build-id/36	40755	root:root	
-/usr/lib/debug/.build-id/36/4cac17b32f33c0d45e8f701ecfeb94b332afd4	120777	root:root	../../../../bin/kcov-system-daemon
-/usr/lib/debug/.build-id/36/4cac17b32f33c0d45e8f701ecfeb94b332afd4.debug	120777	root:root	../../usr/bin/kcov-system-daemon.debug
+/usr/lib/debug/.build-id/1f	40755	root:root	
+/usr/lib/debug/.build-id/1f/10ea7d913dccc6815d83e3cc009ae146d77177	120777	root:root	../../../../bin/kcov-system-daemon
+/usr/lib/debug/.build-id/1f/10ea7d913dccc6815d83e3cc009ae146d77177.debug	120777	root:root	../../usr/bin/kcov-system-daemon.debug
+/usr/lib/debug/.build-id/41	40755	root:root	
+/usr/lib/debug/.build-id/41/68c35aa80cd32e306da451f620558970d67a17	120777	root:root	../../../../bin/kcov
+/usr/lib/debug/.build-id/41/68c35aa80cd32e306da451f620558970d67a17.debug	120777	root:root	../../usr/bin/kcov.debug
 /usr/lib/debug/usr/bin/kcov-system-daemon.debug	100644	root:root	
@@ -99,3 +99,2 @@
 Requires: debug64(libcurl.so.4)  
-Requires: debug64(libdl.so.2)  
 Requires: debug64(libdw.so.1)  
@@ -103,3 +102,2 @@
 Requires: debug64(libgcc_s.so.1)  
-Requires: debug64(libpthread.so.0)  
 Requires: debug64(libstdc++.so.6)  
@@ -109,10 +107,10 @@
 Provides: kcov-debuginfo = 38-alt3:sisyphus+274580.100.1.1
-File: /usr/lib/debug/.build-id/13	40755	root:root		
-File: /usr/lib/debug/.build-id/13/339fd3682f0c308f8ab750429b4eaa3ffab271	120777	root:root		../../../../bin/kcov
-File: /usr/lib/debug/.build-id/13/339fd3682f0c308f8ab750429b4eaa3ffab271.debug	120777	root:root		../../usr/bin/kcov.debug
-File: /usr/lib/debug/.build-id/36	40755	root:root		
-File: /usr/lib/debug/.build-id/36/4cac17b32f33c0d45e8f701ecfeb94b332afd4	120777	root:root		../../../../bin/kcov-system-daemon
-File: /usr/lib/debug/.build-id/36/4cac17b32f33c0d45e8f701ecfeb94b332afd4.debug	120777	root:root		../../usr/bin/kcov-system-daemon.debug
-File: /usr/lib/debug/usr/bin/kcov-system-daemon.debug	100644	root:root	d18386b6cc54f6855aba0fd1f9b030ad	
-File: /usr/lib/debug/usr/bin/kcov.debug	100644	root:root	a7c4d0c911887f200a979cea8a62e063	
+File: /usr/lib/debug/.build-id/1f	40755	root:root		
+File: /usr/lib/debug/.build-id/1f/10ea7d913dccc6815d83e3cc009ae146d77177	120777	root:root		../../../../bin/kcov-system-daemon
+File: /usr/lib/debug/.build-id/1f/10ea7d913dccc6815d83e3cc009ae146d77177.debug	120777	root:root		../../usr/bin/kcov-system-daemon.debug
+File: /usr/lib/debug/.build-id/41	40755	root:root		
+File: /usr/lib/debug/.build-id/41/68c35aa80cd32e306da451f620558970d67a17	120777	root:root		../../../../bin/kcov
+File: /usr/lib/debug/.build-id/41/68c35aa80cd32e306da451f620558970d67a17.debug	120777	root:root		../../usr/bin/kcov.debug
+File: /usr/lib/debug/usr/bin/kcov-system-daemon.debug	100644	root:root	7830503906b74d20880bf7967986aba5	
+File: /usr/lib/debug/usr/bin/kcov.debug	100644	root:root	cfa860b081c743dfa87090bb82d4085e	
 File: /usr/src/debug/kcov-38	40755	root:root		
@@ -121,6 +119,6 @@
 File: /usr/src/debug/kcov-38/BUILD/src/bash-helper.cc	100644	root:root	9f8bdb776ebf0d6422416773eecda0d1	
-File: /usr/src/debug/kcov-38/BUILD/src/bash-redirector-library.cc	100644	root:root	2c8e8ad0ae36ec13c3d86eb04f3c4a2c	
+File: /usr/src/debug/kcov-38/BUILD/src/bash-redirector-library.cc	100644	root:root	96110208171b344cfbfd0508dc3545b6	
 File: /usr/src/debug/kcov-38/BUILD/src/html-data-files.cc	100644	root:root	6e30d5a448081be0600407b69305bdc1	
-File: /usr/src/debug/kcov-38/BUILD/src/kcov-system-library.cc	100644	root:root	8a63cadb1173f1dc4e2e50e13cb364c7	
-File: /usr/src/debug/kcov-38/BUILD/src/library.cc	100644	root:root	fac44eb48e5223d3828776a3a7ec0a29	
+File: /usr/src/debug/kcov-38/BUILD/src/kcov-system-library.cc	100644	root:root	237407c44a896f30ff1136521d4f598c	
+File: /usr/src/debug/kcov-38/BUILD/src/library.cc	100644	root:root	56d5f7a220fd7d15bbb076d0ad443543	
 File: /usr/src/debug/kcov-38/BUILD/src/python-helper.cc	100644	root:root	75def288a8ccb145849105578e137b55	
@@ -205,2 +203,2 @@
 File: /usr/src/debug/kcov-38/src/writers/writer-base.hh	100644	root:root	73f44de9ae18204b792ff988dd56e92a	
-RPMIdentity: cbc5230edb08dff13e0e3493d97abdbeb2249dd4baf0ccd1632b53142b48c5be7284602f5057b8b8596a5166347ebd1e6a84c04ac21b995fb159d50c78abc98a
+RPMIdentity: 637fe4d6646c070c43aae0f6ea38cfb6e6d47448cd4010b2f8e6e70b677c1f194ebceeba233d0ed0822b73c33f3eeac9ad165f5ed3d60108b9a9c0ca16f0e68b