<86>May  3 00:53:59 userdel[87933]: delete user 'rooter'
<86>May  3 00:53:59 userdel[87933]: removed group 'rooter' owned by 'rooter'
<86>May  3 00:53:59 groupadd[87950]: group added to /etc/group: name=rooter, GID=942
<86>May  3 00:53:59 groupadd[87950]: group added to /etc/gshadow: name=rooter
<86>May  3 00:53:59 groupadd[87950]: new group: name=rooter, GID=942
<86>May  3 00:53:59 useradd[87964]: new user: name=rooter, UID=942, GID=942, home=/root, shell=/bin/bash
<86>May  3 00:53:59 userdel[87998]: delete user 'builder'
<86>May  3 00:53:59 userdel[87998]: removed group 'builder' owned by 'builder'
<86>May  3 00:53:59 userdel[87998]: removed shadow group 'builder' owned by 'builder'
<86>May  3 00:53:59 groupadd[88025]: group added to /etc/group: name=builder, GID=943
<86>May  3 00:53:59 groupadd[88025]: group added to /etc/gshadow: name=builder
<86>May  3 00:53:59 groupadd[88025]: new group: name=builder, GID=943
<86>May  3 00:53:59 useradd[88040]: new user: name=builder, UID=943, GID=943, home=/usr/src, shell=/bin/bash
warning: Macro %kernel_srcdir not found
<13>May  3 00:54:00 rpmi: rpmquery-strictdep-1-alt1 sisyphus+227992.440.11.1 1556321045 installed
<13>May  3 00:54:00 rpmi: pciids-20220419-alt1 sisyphus+298718.100.1.1 1650379180 installed
<13>May  3 00:54:00 rpmi: chrooted-0.3.12-alt1 sisyphus+278157.200.2.1 1626055811 installed
<13>May  3 00:54:00 rpmi: chrooted-resolv-0.3.1-alt2 sisyphus+276781.100.1.1 1625232499 installed
<13>May  3 00:54:00 rpmi: libpci-3.7.0-alt1 sisyphus+278385.100.1.1 1626094187 installed
<13>May  3 00:54:00 rpmi: pciutils-3.7.0-alt1 sisyphus+278385.100.1.1 1626094187 installed
<13>May  3 00:54:00 rpmi: libdevmapper-1.02.179-alt2 sisyphus+287340.100.1.1 1634383919 installed
<13>May  3 00:54:01 rpmi: mount-2.37.3-alt2 sisyphus+294073.100.1.1 1643117174 installed
<13>May  3 00:54:01 rpmi: losetup-2.37.3-alt2 sisyphus+294073.100.1.1 1643117174 installed
<13>May  3 00:54:01 rpmi: lsblk-2.37.3-alt2 sisyphus+294073.100.1.1 1643117174 installed
<13>May  3 00:54:01 rpmi: libp11-kit-0.24.1-alt1 sisyphus+293720.100.1.1 1642535264 installed
<13>May  3 00:54:01 rpmi: libtasn1-4.18.0-alt1 sisyphus+294217.100.3.1 1643755522 installed
<13>May  3 00:54:01 rpmi: rpm-macros-alternatives-0.5.1-alt1 sisyphus+278157.100.2.1 1626055790 installed
<13>May  3 00:54:01 rpmi: alternatives-0.5.1-alt1 sisyphus+278157.100.2.1 1626055790 installed
<13>May  3 00:54:01 rpmi: ca-certificates-2022.04.01-alt1 sisyphus+297635.100.1.1 1648830809 installed
<13>May  3 00:54:01 rpmi: ca-trust-0.1.2-alt1 sisyphus+233348.100.1.1 1561653823 installed
<13>May  3 00:54:01 rpmi: p11-kit-trust-0.24.1-alt1 sisyphus+293720.100.1.1 1642535264 installed
<13>May  3 00:54:01 rpmi: libcrypto1.1-1.1.1n-alt2 sisyphus+297394.100.2.1 1648745095 installed
<13>May  3 00:54:01 rpmi: libkmod-29-alt1 sisyphus+288763.100.1.1 1635886490 installed
<13>May  3 00:54:01 rpmi: kmod-29-alt1 sisyphus+288763.100.1.1 1635886490 installed
<13>May  3 00:54:01 rpmi: dmsetup-1.02.179-alt2 sisyphus+287340.100.1.1 1634383919 installed
<86>May  3 00:54:01 groupadd[101677]: group added to /etc/group: name=tape, GID=499
<86>May  3 00:54:01 groupadd[101677]: group added to /etc/gshadow: name=tape
<86>May  3 00:54:01 groupadd[101677]: new group: name=tape, GID=499
<86>May  3 00:54:01 groupadd[101686]: group added to /etc/group: name=dialout, GID=498
<86>May  3 00:54:01 groupadd[101686]: group added to /etc/gshadow: name=dialout
<86>May  3 00:54:01 groupadd[101686]: new group: name=dialout, GID=498
<86>May  3 00:54:01 groupadd[101691]: group added to /etc/group: name=input, GID=497
<86>May  3 00:54:01 groupadd[101691]: group added to /etc/gshadow: name=input
<86>May  3 00:54:01 groupadd[101691]: new group: name=input, GID=497
<86>May  3 00:54:01 groupadd[101698]: group added to /etc/group: name=video, GID=496
<86>May  3 00:54:01 groupadd[101698]: group added to /etc/gshadow: name=video
<86>May  3 00:54:01 groupadd[101698]: new group: name=video, GID=496
<86>May  3 00:54:01 groupadd[101704]: group added to /etc/group: name=render, GID=495
<86>May  3 00:54:01 groupadd[101704]: group added to /etc/gshadow: name=render
<86>May  3 00:54:01 groupadd[101704]: new group: name=render, GID=495
<13>May  3 00:54:01 rpmi: udev-1:249.12-alt1 sisyphus+299384.100.2.1 1651525414 installed
<13>May  3 00:54:01 rpmi: make-initrd-2.26.0-alt3 sisyphus+297430.100.1.1 1648491278 installed
<13>May  3 00:54:01 rpmi: rpm-build-kernel-0.116-alt2 sisyphus+290931.300.2.1 1638175103 installed
egrep: warning: egrep is obsolescent; using grep -E
Building target platforms: x86_64
Building for target x86_64
Wrote: /usr/src/in/nosrpm/scst-3.4.0-alt1.nosrc.rpm (w1.gzdio)
Installing scst-3.4.0-alt1.src.rpm
Building target platforms: x86_64
Building for target x86_64
Executing(%prep): /bin/sh -e /usr/src/tmp/rpm-tmp.14518
+ umask 022
+ /bin/mkdir -p /usr/src/RPM/BUILD
+ cd /usr/src/RPM/BUILD
+ cd /usr/src/RPM/BUILD
+ rm -rf scst-3.4.0
+ echo 'Source #0 (scst-3.4.0.tar.bz2):'
Source #0 (scst-3.4.0.tar.bz2):
+ /bin/bzip2 -dc /usr/src/RPM/SOURCES/scst-3.4.0.tar.bz2
+ /bin/tar -xf -
+ cd scst-3.4.0
+ /bin/chmod -c -Rf u+rwX,go-w .
+ tar -cJf scst-3.4.0.tar.xz scst/src scst/README scst/README.dlm scst/README.drbd
+ exit 0
Executing(%install): /bin/sh -e /usr/src/tmp/rpm-tmp.25897
+ umask 022
+ /bin/mkdir -p /usr/src/RPM/BUILD
+ cd /usr/src/RPM/BUILD
+ /bin/chmod -Rf u+rwX -- /usr/src/tmp/scst-buildroot
+ :
+ /bin/rm -rf -- /usr/src/tmp/scst-buildroot
+ PATH=/usr/libexec/rpm-build:/usr/src/bin:/bin:/usr/bin:/usr/X11R6/bin:/usr/games
+ cd scst-3.4.0
+ install -pD -m0644 scst-3.4.0.tar.xz /usr/src/tmp/scst-buildroot/usr/src/kernel/sources/scst-3.4.0.tar.xz
+ mkdir -p /usr/src/tmp/scst-buildroot/usr/include/scst
+ install -m0644 scst/include/backport.h scst/include/scst.h scst/include/scst_const.h scst/include/scst_debug.h scst/include/scst_event.h scst/include/scst_sgv.h scst/include/scst_user.h /usr/src/tmp/scst-buildroot/usr/include/scst/
+ /usr/lib/rpm/brp-alt
Cleaning files in /usr/src/tmp/scst-buildroot (auto)
Verifying and fixing files in /usr/src/tmp/scst-buildroot (binconfig,pkgconfig,libtool,desktop,gnuconfig)
Checking contents of files in /usr/src/tmp/scst-buildroot/ (default)
Compressing files in /usr/src/tmp/scst-buildroot (auto)
Verifying ELF objects in /usr/src/tmp/scst-buildroot (arch=normal,fhs=normal,lfs=relaxed,lint=relaxed,rpath=normal,stack=normal,textrel=normal,unresolved=normal)
Processing files: scst-devel-3.4.0-alt1
Executing(%doc): /bin/sh -e /usr/src/tmp/rpm-tmp.25897
+ umask 022
+ /bin/mkdir -p /usr/src/RPM/BUILD
+ cd /usr/src/RPM/BUILD
+ cd scst-3.4.0
+ DOCDIR=/usr/src/tmp/scst-buildroot/usr/share/doc/scst-devel-3.4.0
+ export DOCDIR
+ rm -rf /usr/src/tmp/scst-buildroot/usr/share/doc/scst-devel-3.4.0
+ /bin/mkdir -p /usr/src/tmp/scst-buildroot/usr/share/doc/scst-devel-3.4.0
+ cp -prL scst/README scst/README.dlm scst/README.drbd /usr/src/tmp/scst-buildroot/usr/share/doc/scst-devel-3.4.0
+ chmod -R go-w /usr/src/tmp/scst-buildroot/usr/share/doc/scst-devel-3.4.0
+ chmod -R a+rX /usr/src/tmp/scst-buildroot/usr/share/doc/scst-devel-3.4.0
+ exit 0
Finding Provides (using /usr/lib/rpm/find-provides)
Executing: /bin/sh -e /usr/src/tmp/rpm-tmp.rwhS0M
find-provides: running scripts (alternatives,debuginfo,lib,pam,perl,pkgconfig,python,python3,shell)
Finding Requires (using /usr/lib/rpm/find-requires)
Executing: /bin/sh -e /usr/src/tmp/rpm-tmp.M53mC8
find-requires: running scripts (cpp,debuginfo,files,kernel,lib,pam,perl,pkgconfig,pkgconfiglib,python,python3,rpmlib,shebang,shell,static,symlinks,systemd-services)
/usr/src/tmp/scst-buildroot/usr/include/scst/scst.h:38:10: fatal error: linux/blkdev.h: No such file or directory
   38 | #include <linux/blkdev.h>
      |          ^~~~~~~~~~~~~~~~
compilation terminated.
cpp.req: /usr/src/tmp/scst-buildroot/usr/include/scst/scst.h: cpp failed, trying c++ mode
x86_64-alt-linux-cpp: fatal error: cannot execute 'cc1plus': execvp: No such file or directory
compilation terminated.
cpp.req: WARNING: /usr/src/tmp/scst-buildroot/usr/include/scst/scst.h: cpp failed
/usr/src/tmp/scst-buildroot/usr/include/scst/backport.h:24:10: fatal error: linux/bio.h: No such file or directory
   24 | #include <linux/bio.h>
      |          ^~~~~~~~~~~~~
compilation terminated.
cpp.req: WARNING: /usr/src/tmp/scst-buildroot/usr/include/scst/backport.h: cpp failed
In file included from /usr/src/tmp/scst-buildroot/usr/include/scst/scst_user.h:28:
/usr/src/tmp/scst-buildroot/usr/include/scst/scst_const.h:38:10: fatal error: scst_itf_ver.h: No such file or directory
   38 | #include "scst_itf_ver.h"
      |          ^~~~~~~~~~~~~~~~
compilation terminated.
cpp.req: WARNING: /usr/src/tmp/scst-buildroot/usr/include/scst/scst_user.h: cpp failed
/usr/src/tmp/scst-buildroot/usr/include/scst/scst_const.h:38:10: fatal error: scst_itf_ver.h: No such file or directory
   38 | #include "scst_itf_ver.h"
      |          ^~~~~~~~~~~~~~~~
compilation terminated.
cpp.req: WARNING: /usr/src/tmp/scst-buildroot/usr/include/scst/scst_const.h: cpp failed
/usr/src/tmp/scst-buildroot/usr/include/scst/scst_debug.h:24:41: error: missing binary operator before token "("
   24 | #if LINUX_VERSION_CODE <= KERNEL_VERSION(2, 6, 32)
      |                                         ^
/usr/src/tmp/scst-buildroot/usr/include/scst/scst_debug.h:27:10: fatal error: generated/autoconf.h: No such file or directory
   27 | #include <generated/autoconf.h> /* for CONFIG_* */
      |          ^~~~~~~~~~~~~~~~~~~~~~
compilation terminated.
cpp.req: WARNING: /usr/src/tmp/scst-buildroot/usr/include/scst/scst_debug.h: cpp failed
In file included from /usr/src/tmp/scst-buildroot/usr/include/scst/scst_event.h:19:
/usr/src/tmp/scst-buildroot/usr/include/scst/scst_const.h:38:10: fatal error: scst_itf_ver.h: No such file or directory
   38 | #include "scst_itf_ver.h"
      |          ^~~~~~~~~~~~~~~~
compilation terminated.
cpp.req: WARNING: /usr/src/tmp/scst-buildroot/usr/include/scst/scst_event.h: cpp failed
Finding debuginfo files (using /usr/lib/rpm/find-debuginfo-files)
Executing: /bin/sh -e /usr/src/tmp/rpm-tmp.N0WWFt
Processing files: kernel-source-scst-3.4.0-alt1
Finding Provides (using /usr/lib/rpm/find-provides)
Executing: /bin/sh -e /usr/src/tmp/rpm-tmp.PaDwL5
find-provides: running scripts (alternatives,debuginfo,lib,pam,perl,pkgconfig,python,python3,shell)
Finding Requires (using /usr/lib/rpm/find-requires)
Executing: /bin/sh -e /usr/src/tmp/rpm-tmp.A7gvqn
find-requires: running scripts (cpp,debuginfo,files,kernel,lib,pam,perl,pkgconfig,pkgconfiglib,python,python3,rpmlib,shebang,shell,static,symlinks,systemd-services)
Provides: kernel-src-scst = 3.4.0-alt1
Wrote: /usr/src/RPM/RPMS/x86_64/scst-devel-3.4.0-alt1.x86_64.rpm (w2.lzdio)
Wrote: /usr/src/RPM/RPMS/noarch/kernel-source-scst-3.4.0-alt1.noarch.rpm (w2.lzdio)
1.22user 0.35system 0:06.25elapsed 25%CPU (0avgtext+0avgdata 38628maxresident)k
0inputs+0outputs (0major+125655minor)pagefaults 0swaps
4.51user 3.45system 0:11.74elapsed 67%CPU (0avgtext+0avgdata 103948maxresident)k
0inputs+0outputs (30692major+458046minor)pagefaults 0swaps
--- kernel-source-scst-3.4.0-alt1.noarch.rpm.repo	2020-12-08 12:45:48.000000000 +0000
+++ kernel-source-scst-3.4.0-alt1.noarch.rpm.hasher	2022-05-03 00:54:09.509663076 +0000
@@ -8,3 +8,3 @@
 File: /usr/src/kernel/sources	40755	root:root		
-File: /usr/src/kernel/sources/scst-3.4.0.tar.xz	100644	root:root	5d29d6fed02c09960893a655c5e9dda9	
-RPMIdentity: 706419717a77c66e0421461d94798a23ee819d862e4c6ed6e408d374c55a8d65cf7d5c5fd443806481245e6cc637e51e804234b51fff6988e4915ab29e4dcd78
+File: /usr/src/kernel/sources/scst-3.4.0.tar.xz	100644	root:root	7546477a2e30e3ec18e9b6648e714202	
+RPMIdentity: 2fc0db4e6795d6995e62ed5e3a615ad559640a266b115bf708827dff3bbe2af7da197fc729dcfd9c0fd90b8ff3bb7b011d183aae06070c44579cab826b382129