<86>Apr 14 00:48:30 userdel[349099]: delete user 'rooter'
<86>Apr 14 00:48:30 userdel[349099]: removed group 'rooter' owned by 'rooter'
<86>Apr 14 00:48:30 userdel[349099]: removed shadow group 'rooter' owned by 'rooter'
<86>Apr 14 00:48:30 groupadd[349124]: group added to /etc/group: name=rooter, GID=990
<86>Apr 14 00:48:30 groupadd[349124]: group added to /etc/gshadow: name=rooter
<86>Apr 14 00:48:30 groupadd[349124]: new group: name=rooter, GID=990
<86>Apr 14 00:48:30 useradd[349147]: new user: name=rooter, UID=990, GID=990, home=/root, shell=/bin/bash
<86>Apr 14 00:48:30 userdel[349188]: delete user 'builder'
<86>Apr 14 00:48:30 userdel[349188]: removed group 'builder' owned by 'builder'
<86>Apr 14 00:48:30 userdel[349188]: removed shadow group 'builder' owned by 'builder'
<86>Apr 14 00:48:30 groupadd[349210]: group added to /etc/group: name=builder, GID=991
<86>Apr 14 00:48:30 groupadd[349210]: group added to /etc/gshadow: name=builder
<86>Apr 14 00:48:30 groupadd[349210]: new group: name=builder, GID=991
<86>Apr 14 00:48:30 useradd[349229]: new user: name=builder, UID=991, GID=991, home=/usr/src, shell=/bin/bash
warning: user igor does not exist - using root
warning: group igor does not exist - using root
warning: user igor does not exist - using root
warning: group igor does not exist - using root
warning: user igor does not exist - using root
warning: group igor does not exist - using root
<13>Apr 14 00:48:31 rpmi: rpm-macros-generic-compat-0.04-alt1 1527350580 installed
<13>Apr 14 00:48:31 rpmi: rpm-macros-mageia-compat-0.060-alt1 sisyphus+260827.100.1.1 1604345558 installed
<13>Apr 14 00:48:33 rpmi: libuv-1.44.1-alt1 sisyphus+297750.100.1.1 1648981565 installed
<13>Apr 14 00:48:33 rpmi: libjsoncpp24-1.9.4-alt2 sisyphus+286441.100.1.1 1633444232 installed
<13>Apr 14 00:48:33 rpmi: libexpat-2.4.7-alt1 sisyphus+296417.100.1.1 1646812525 installed
<13>Apr 14 00:48:33 rpmi: libidn2-2.3.2-alt1 sisyphus+281238.100.1.2 1627476321 installed
<13>Apr 14 00:48:33 rpmi: llvm13.0-filesystem-13.0.1-alt1 sisyphus+297141.260.5.1 1649699658 installed
<13>Apr 14 00:48:33 rpmi: llvm13.0-gold-13.0.1-alt1 sisyphus+297141.260.5.1 1649699658 installed
<13>Apr 14 00:48:34 rpmi: llvm13.0-libs-13.0.1-alt1 sisyphus+297141.260.5.1 1649699658 installed
<13>Apr 14 00:48:35 rpmi: clang13.0-libs-support-13.0.1-alt1 sisyphus+297141.260.5.1 1649699658 installed
<13>Apr 14 00:48:37 rpmi: clang13.0-libs-13.0.1-alt1 sisyphus+297141.260.5.1 1649699658 installed
<13>Apr 14 00:48:37 rpmi: perl-Term-Cap-1.17-alt1 1445018869 installed
<13>Apr 14 00:48:37 rpmi: perl-Term-ANSIColor-5.01-alt1 sisyphus+244783.100.1.2 1579747505 installed
<13>Apr 14 00:48:37 rpmi: perl-Pod-Escapes-1.07-alt1 1418767892 installed
<13>Apr 14 00:48:37 rpmi: perl-Filter-1.60-alt1 sisyphus+279723.100.1.1 1626648797 installed
<13>Apr 14 00:48:37 rpmi: perl-Encode-3.17-alt1 sisyphus+298022.100.1.1 1649332148 installed
<13>Apr 14 00:48:37 rpmi: perl-Pod-Simple-3.43-alt1 sisyphus+276561.100.1.1 1625127752 installed
<13>Apr 14 00:48:37 rpmi: perl-Pod-Usage-2.01-alt1 sisyphus+277175.100.1.1 1625408247 installed
<13>Apr 14 00:48:37 rpmi: perl-podlators-4.14-alt1 sisyphus+277178.100.1.2 1625426264 installed
<13>Apr 14 00:48:37 rpmi: libgdbm-1.8.3-alt10 sisyphus+278100.1600.1.1 1626058413 installed
<13>Apr 14 00:48:37 rpmi: libgdbm-devel-1.8.3-alt10 sisyphus+278100.1600.1.1 1626058413 installed
<13>Apr 14 00:48:37 rpmi: gcc-c++-common-1.4.27-alt1 sisyphus+278099.1300.1.1 1626028636 installed
<13>Apr 14 00:48:37 rpmi: libstdc++11-devel-11.2.1-alt2 sisyphus+291192.100.1.1 1638461683 installed
<13>Apr 14 00:48:37 rpmi: gcc11-c++-11.2.1-alt2 sisyphus+291192.100.1.1 1638461683 installed
<13>Apr 14 00:48:37 rpmi: rpm-macros-cmake-3.23.0-alt1 sisyphus+297804.40.3.2 1649156618 installed
<13>Apr 14 00:48:37 rpmi: cmake-modules-3.23.0-alt1 sisyphus+297804.40.3.2 1649156618 installed
<13>Apr 14 00:48:37 rpmi: librhash-1.3.5-alt3 sisyphus+286141.40.2.1 1632982456 installed
<13>Apr 14 00:48:37 rpmi: publicsuffix-list-dafsa-20220406-alt1 sisyphus+297986.100.1.1 1649274774 installed
<13>Apr 14 00:48:37 rpmi: libpsl-0.21.1-alt2 sisyphus+279461.100.1.1 1626547547 installed
<13>Apr 14 00:48:37 rpmi: libnghttp2-1.47.0-alt1 sisyphus+297351.100.1.1 1648403625 installed
<13>Apr 14 00:48:37 rpmi: openldap-common-2.4.59-alt1 sisyphus+282933.100.1.1 1629124747 installed
<13>Apr 14 00:48:37 rpmi: libverto-0.3.2-alt1_1 sisyphus+279289.100.1.3 1626493868 installed
<13>Apr 14 00:48:37 rpmi: liblmdb-0.9.23-alt1 sisyphus+275369.100.1.2 1624493869 installed
<13>Apr 14 00:48:37 rpmi: libkeyutils-1.6.3-alt1 sisyphus+266061.100.1.1 1612919566 installed
<13>Apr 14 00:48:37 rpmi: libcom_err-1.46.4.0.5.4cda-alt1 sisyphus+283826.100.1.1 1629975345 installed
<13>Apr 14 00:48:37 rpmi: libbrotlicommon-1.0.9-alt2 sisyphus+278430.100.1.2 1626213212 installed
<13>Apr 14 00:48:37 rpmi: libbrotlidec-1.0.9-alt2 sisyphus+278430.100.1.2 1626213212 installed
<13>Apr 14 00:48:37 rpmi: libp11-kit-0.24.1-alt1 sisyphus+293720.100.1.1 1642535264 installed
<13>Apr 14 00:48:37 rpmi: libtasn1-4.18.0-alt1 sisyphus+294217.100.3.1 1643755522 installed
<13>Apr 14 00:48:37 rpmi: rpm-macros-alternatives-0.5.1-alt1 sisyphus+278157.100.2.1 1626055790 installed
<13>Apr 14 00:48:37 rpmi: alternatives-0.5.1-alt1 sisyphus+278157.100.2.1 1626055790 installed
<13>Apr 14 00:48:37 rpmi: ca-certificates-2022.04.01-alt1 sisyphus+297635.100.1.1 1648830809 installed
<13>Apr 14 00:48:37 rpmi: ca-trust-0.1.2-alt1 sisyphus+233348.100.1.1 1561653823 installed
<13>Apr 14 00:48:37 rpmi: p11-kit-trust-0.24.1-alt1 sisyphus+293720.100.1.1 1642535264 installed
<13>Apr 14 00:48:37 rpmi: libcrypto1.1-1.1.1n-alt2 sisyphus+297394.100.2.1 1648745095 installed
<13>Apr 14 00:48:38 rpmi: libssl1.1-1.1.1n-alt2 sisyphus+297394.100.2.1 1648745095 installed
<86>Apr 14 00:48:38 groupadd[383047]: group added to /etc/group: name=_keytab, GID=499
<86>Apr 14 00:48:38 groupadd[383047]: group added to /etc/gshadow: name=_keytab
<86>Apr 14 00:48:38 groupadd[383047]: new group: name=_keytab, GID=499
<13>Apr 14 00:48:38 rpmi: libkrb5-1.19.3-alt1 sisyphus+296671.100.1.1 1647339827 installed
<86>Apr 14 00:48:38 groupadd[383278]: group added to /etc/group: name=sasl, GID=498
<86>Apr 14 00:48:38 groupadd[383278]: group added to /etc/gshadow: name=sasl
<86>Apr 14 00:48:38 groupadd[383278]: new group: name=sasl, GID=498
<13>Apr 14 00:48:38 rpmi: libsasl2-3-2.1.27-alt2.2 sisyphus+282040.40.2.1 1628929840 installed
<13>Apr 14 00:48:38 rpmi: libldap-2.4.59-alt1 sisyphus+282933.100.1.1 1629124747 installed
<13>Apr 14 00:48:38 rpmi: libcurl-7.82.0-alt1 sisyphus+296416.100.1.1 1646807738 installed
<13>Apr 14 00:48:38 rpmi: libarchive13-3.6.0-alt1 sisyphus+296421.100.1.1 1646814091 installed
<13>Apr 14 00:48:38 rpmi: cmake-3.23.0-alt1 sisyphus+297804.40.3.2 1649156618 installed
<13>Apr 14 00:48:38 rpmi: llvm-common-13.0.0-alt1 sisyphus+297141.400.5.1 1649699996 installed
<13>Apr 14 00:48:38 rpmi: clang13.0-13.0.1-alt1 sisyphus+297141.260.5.1 1649699658 installed
<13>Apr 14 00:48:38 rpmi: clang-13.0.0-alt1 sisyphus+297141.400.5.1 1649699996 installed
<13>Apr 14 00:48:38 rpmi: ctest-3.23.0-alt1 sisyphus+297804.40.3.2 1649156618 installed
<13>Apr 14 00:48:38 rpmi: gcc-c++-11-alt1 sisyphus+285602.400.1.1 1632238564 installed
<13>Apr 14 00:48:38 rpmi: perl-devel-1:5.34.0-alt1 sisyphus+279621.700.1.1 1626629811 installed
Building target platforms: x86_64
Building for target x86_64
Wrote: /usr/src/in/nosrpm/libcerf-1.17-alt1_1.nosrc.rpm (w1.gzdio)
Installing libcerf-1.17-alt1_1.src.rpm
Building target platforms: x86_64
Building for target x86_64
Executing(%prep): /bin/sh -e /usr/src/tmp/rpm-tmp.23912
+ umask 022
+ /bin/mkdir -p /usr/src/RPM/BUILD
+ cd /usr/src/RPM/BUILD
+ cd /usr/src/RPM/BUILD
+ rm -rf libcerf-v1.17
+ echo 'Source #0 (libcerf-v1.17.tar.gz):'
Source #0 (libcerf-v1.17.tar.gz):
+ /bin/gzip -dc /usr/src/RPM/SOURCES/libcerf-v1.17.tar.gz
+ /bin/tar -xf -
+ cd libcerf-v1.17
+ /bin/chmod -c -Rf u+rwX,go-w .
+ sed -i -e 's|lib/pkgconfig/|lib64/pkgconfig/|' CMakeLists.txt
+ sed -i -e 's|DESTINATION lib|DESTINATION lib64|' lib/CMakeLists.txt
+ sed -i -e 's|${prefix}/lib|@LIB_INSTALL_DIR@|' libcerf.pc.in
+ sed -i -e 's|@destination@|@CMAKE_INSTALL_PREFIX@|' libcerf.pc.in
+ rm -rf fortran/__MACOSX
+ exit 0
Executing(%build): /bin/sh -e /usr/src/tmp/rpm-tmp.23912
+ umask 022
+ /bin/mkdir -p /usr/src/RPM/BUILD
+ cd /usr/src/RPM/BUILD
+ cd libcerf-v1.17
+ export CC=clang
+ CC=clang
+ cmake -S . -B build -DCMAKE_SKIP_INSTALL_RPATH:BOOL=yes '-DCMAKE_C_FLAGS:STRING=-pipe -Wall -g -O2 ' '-DCMAKE_CXX_FLAGS:STRING=-pipe -Wall -g -O2 ' '-DCMAKE_Fortran_FLAGS:STRING=-pipe -Wall -g -O2 ' -DCMAKE_INSTALL_PREFIX:PATH=/usr -DCMAKE_INSTALL_LIBDIR:PATH=/usr/lib64 -DCMAKE_INSTALL_LIBEXECDIR:PATH=/usr/lib -DCMAKE_INSTALL_SYSCONFDIR:PATH=/etc -DINCLUDE_INSTALL_DIR:PATH=/usr/include -DLIB_INSTALL_DIR:PATH=/usr/lib64 -DSYSCONF_INSTALL_DIR:PATH=/etc -DSHARE_INSTALL_PREFIX:PATH=/usr/share -DLIB_DESTINATION=lib64 -DLIB_SUFFIX=64 -DBUILD_SHARED_LIBS:BOOL=ON -DBUILD_STATIC_LIBS:BOOL=OFF
Build C library libcerf
-- The C compiler identification is Clang 13.0.1
-- Detecting C compiler ABI info
-- Detecting C compiler ABI info - done
-- Check for working C compiler: /usr/bin/clang - skipped
-- Detecting C compile features
-- Detecting C compile features - done
Problem opening /proc/meminfo
-- libcerf/lib: build library cerf, CERF_CPP=OFF, shared=ON
-- Configuring done
-- Generating done
CMake Warning:
  Manually-specified variables were not used by the project:

    BUILD_STATIC_LIBS
    CMAKE_Fortran_FLAGS
    INCLUDE_INSTALL_DIR
    LIB_DESTINATION
    LIB_SUFFIX
    SHARE_INSTALL_PREFIX
    SYSCONF_INSTALL_DIR


-- Build files have been written to: /usr/src/RPM/BUILD/libcerf-v1.17/build
+ make -j16 -C build
make[2]: Entering directory '/usr/src/RPM/BUILD/libcerf-v1.17/build'
[ 12%] Generating dawson.html
make[2]: Leaving directory '/usr/src/RPM/BUILD/libcerf-v1.17/build'
make[2]: Entering directory '/usr/src/RPM/BUILD/libcerf-v1.17/build'
[ 27%] Generating cerfi.html
make[2]: Leaving directory '/usr/src/RPM/BUILD/libcerf-v1.17/build'
make[2]: Entering directory '/usr/src/RPM/BUILD/libcerf-v1.17/build'
[ 20%] Generating erfcx.html
make[2]: Leaving directory '/usr/src/RPM/BUILD/libcerf-v1.17/build'
make[2]: Entering directory '/usr/src/RPM/BUILD/libcerf-v1.17/build'
[  4%] Generating cerf.html
make[2]: Leaving directory '/usr/src/RPM/BUILD/libcerf-v1.17/build'
make[2]: Entering directory '/usr/src/RPM/BUILD/libcerf-v1.17/build'
[ 25%] Generating erfi.html
make[2]: Leaving directory '/usr/src/RPM/BUILD/libcerf-v1.17/build'
make[2]: Entering directory '/usr/src/RPM/BUILD/libcerf-v1.17/build'
[ 14%] Generating cdawson.html
make[2]: Leaving directory '/usr/src/RPM/BUILD/libcerf-v1.17/build'
make[2]: Entering directory '/usr/src/RPM/BUILD/libcerf-v1.17/build'
[  8%] Generating cerfc.html
make[2]: Leaving directory '/usr/src/RPM/BUILD/libcerf-v1.17/build'
make[2]: Entering directory '/usr/src/RPM/BUILD/libcerf-v1.17/build'
[ 29%] Generating voigt.html
make[2]: Leaving directory '/usr/src/RPM/BUILD/libcerf-v1.17/build'
make[2]: Entering directory '/usr/src/RPM/BUILD/libcerf-v1.17/build'
[ 22%] Generating cerfcx.html
make[2]: Leaving directory '/usr/src/RPM/BUILD/libcerf-v1.17/build'
make[2]: Entering directory '/usr/src/RPM/BUILD/libcerf-v1.17/build'
[ 31%] Generating cerf.3
make[2]: Leaving directory '/usr/src/RPM/BUILD/libcerf-v1.17/build'
make[2]: Entering directory '/usr/src/RPM/BUILD/libcerf-v1.17/build'
[ 16%] Building C object lib/CMakeFiles/cerf.dir/w_of_z.c.o
PLEASE submit a bug report to https://bugs.llvm.org/ and include the crash backtrace, preprocessed source, and associated run script.
Stack dump:
0.	Program arguments: clang -Dcerf_EXPORTS -pipe -Wall -g -O2 -fPIC -O2 -Wno-sign-compare -fno-omit-frame-pointer -pedantic -Wall -std=gnu99 -MD -MT lib/CMakeFiles/cerf.dir/w_of_z.c.o -MF CMakeFiles/cerf.dir/w_of_z.c.o.d -o CMakeFiles/cerf.dir/w_of_z.c.o -c /usr/src/RPM/BUILD/libcerf-v1.17/lib/w_of_z.c
1.	<eof> parser at end of file
2.	Optimizer
Stack dump without symbol names (ensure you have llvm-symbolizer in your PATH or set the environment var `LLVM_SYMBOLIZER_PATH` to point to it):
/usr/lib64/libLLVM-13.so(_ZN4llvm3sys15PrintStackTraceERNS_11raw_ostreamEi+0x32)[0x7f049e76e362]
/usr/lib64/libLLVM-13.so(_ZN4llvm3sys17RunSignalHandlersEv+0x34)[0x7f049e754c64]
/usr/lib64/libLLVM-13.so(+0x9e1b28)[0x7f049e6c5b28]
/lib64/libc.so.6(+0x42fb0)[0x7f049d87bfb0]
/usr/lib64/libLLVM-13.so(+0x13ebeab)[0x7f049f0cfeab]
/usr/lib64/libLLVM-13.so(_ZN4llvm15PromoteMemToRegENS_8ArrayRefIPNS_10AllocaInstEEERNS_13DominatorTreeEPNS_15AssumptionCacheE+0x93e)[0x7f049f0d1b1e]
/usr/lib64/libLLVM-13.so(_ZN4llvm4SROA7runImplERNS_8FunctionERNS_13DominatorTreeERNS_15AssumptionCacheE+0x14f)[0x7f049f3fc47f]
/usr/lib64/libLLVM-13.so(+0x2d6d7c3)[0x7f04a0a517c3]
/usr/lib64/libLLVM-13.so(_ZN4llvm11PassManagerINS_8FunctionENS_15AnalysisManagerIS1_JEEEJEE3runERS1_RS3_+0x20e)[0x7f049e8c14fe]
/usr/lib64/libLLVM-13.so(+0x2286662)[0x7f049ff6a662]
/usr/lib64/libLLVM-13.so(_ZN4llvm27ModuleToFunctionPassAdaptor3runERNS_6ModuleERNS_15AnalysisManagerIS1_JEEE+0x19d)[0x7f049e8c18ad]
/usr/lib64/libLLVM-13.so(+0x2286612)[0x7f049ff6a612]
/usr/lib64/libLLVM-13.so(_ZN4llvm11PassManagerINS_6ModuleENS_15AnalysisManagerIS1_JEEEJEE3runERS1_RS3_+0x429)[0x7f049e8c10f9]
/usr/lib64/libclang-cpp.so.13(+0x15954bc)[0x7f04a4ce44bc]
/usr/lib64/libclang-cpp.so.13(_ZN5clang17EmitBackendOutputERNS_17DiagnosticsEngineERKNS_19HeaderSearchOptionsERKNS_14CodeGenOptionsERKNS_13TargetOptionsERKNS_11LangOptionsEN4llvm9StringRefEPNSE_6ModuleENS_13BackendActionESt10unique_ptrINSE_17raw_pwrite_streamESt14default_deleteISK_EE+0x446)[0x7f04a4ce70b6]
/usr/lib64/libclang-cpp.so.13(+0x183e110)[0x7f04a4f8d110]
/usr/lib64/libclang-cpp.so.13(_ZN5clang8ParseASTERNS_4SemaEbb+0x299)[0x7f04a413a149]
/usr/lib64/libclang-cpp.so.13(_ZN5clang14FrontendAction7ExecuteEv+0xc1)[0x7f04a5532b41]
/usr/lib64/libclang-cpp.so.13(_ZN5clang16CompilerInstance13ExecuteActionERNS_14FrontendActionE+0x167)[0x7f04a54d6787]
/usr/lib64/libclang-cpp.so.13(_ZN5clang25ExecuteCompilerInvocationEPNS_16CompilerInstanceE+0x46b)[0x7f04a557966b]
clang(_Z8cc1_mainN4llvm8ArrayRefIPKcEES2_Pv+0x843)[0x55aa2118a4c3]
clang(+0x1bc05)[0x55aa21190c05]
/usr/lib64/libclang-cpp.so.13(+0x1b09525)[0x7f04a5258525]
/usr/lib64/libLLVM-13.so(_ZN4llvm20CrashRecoveryContext9RunSafelyENS_12function_refIFvvEEE+0x23)[0x7f049e6b01f3]
/usr/lib64/libclang-cpp.so.13(+0x1b1059e)[0x7f04a525f59e]
/usr/lib64/libclang-cpp.so.13(_ZNK5clang6driver11Compilation14ExecuteCommandERKNS0_7CommandERPS3_+0x93)[0x7f04a5276753]
/usr/lib64/libclang-cpp.so.13(_ZNK5clang6driver11Compilation11ExecuteJobsERKNS0_7JobListERN4llvm15SmallVectorImplISt4pairIiPKNS0_7CommandEEEE+0x7d)[0x7f04a5276b3d]
/usr/lib64/libclang-cpp.so.13(_ZN5clang6driver6Driver18ExecuteCompilationERNS0_11CompilationERN4llvm15SmallVectorImplISt4pairIiPKNS0_7CommandEEEE+0xea)[0x7f04a5277b2a]
clang(main+0x1f50)[0x55aa21184eb0]
/lib64/libc.so.6(+0x2e20c)[0x7f049d86720c]
/lib64/libc.so.6(__libc_start_main+0x7c)[0x7f049d8672bc]
clang(_start+0x21)[0x55aa21185561]
clang: error: clang frontend command failed with exit code 139 (use -v to see invocation)
ALT Linux Team clang version 13.0.1
Target: x86_64-unknown-linux-gnu
Thread model: posix
InstalledDir: /usr/bin
clang: note: diagnostic msg: 
********************

PLEASE ATTACH THE FOLLOWING FILES TO THE BUG REPORT:
Preprocessed source(s) and associated run script(s) are located at:
clang: note: diagnostic msg: /usr/src/tmp/w_of_z-0d9ebd.c
clang: note: diagnostic msg: /usr/src/tmp/w_of_z-0d9ebd.sh
clang: note: diagnostic msg: 

********************
make[2]: *** [lib/CMakeFiles/cerf.dir/build.make:118: lib/CMakeFiles/cerf.dir/w_of_z.c.o] Error 139
make[2]: Leaving directory '/usr/src/RPM/BUILD/libcerf-v1.17/build'
make[2]: *** Waiting for unfinished jobs....
make[2]: Entering directory '/usr/src/RPM/BUILD/libcerf-v1.17/build'
[ 33%] Generating voigt_hwhm.html
make[2]: Leaving directory '/usr/src/RPM/BUILD/libcerf-v1.17/build'
make[2]: Entering directory '/usr/src/RPM/BUILD/libcerf-v1.17/build'
[ 18%] Building C object lib/CMakeFiles/cerf.dir/width.c.o
PLEASE submit a bug report to https://bugs.llvm.org/ and include the crash backtrace, preprocessed source, and associated run script.
Stack dump:
0.	Program arguments: clang -Dcerf_EXPORTS -pipe -Wall -g -O2 -fPIC -O2 -Wno-sign-compare -fno-omit-frame-pointer -pedantic -Wall -std=gnu99 -MD -MT lib/CMakeFiles/cerf.dir/width.c.o -MF CMakeFiles/cerf.dir/width.c.o.d -o CMakeFiles/cerf.dir/width.c.o -c /usr/src/RPM/BUILD/libcerf-v1.17/lib/width.c
1.	<eof> parser at end of file
2.	Optimizer
Stack dump without symbol names (ensure you have llvm-symbolizer in your PATH or set the environment var `LLVM_SYMBOLIZER_PATH` to point to it):
/usr/lib64/libLLVM-13.so(_ZN4llvm3sys15PrintStackTraceERNS_11raw_ostreamEi+0x32)[0x7f344f7ad362]
/usr/lib64/libLLVM-13.so(_ZN4llvm3sys17RunSignalHandlersEv+0x34)[0x7f344f793c64]
/usr/lib64/libLLVM-13.so(+0x9e1b28)[0x7f344f704b28]
/lib64/libc.so.6(+0x42fb0)[0x7f344e8bafb0]
/usr/lib64/libLLVM-13.so(+0x13ebeab)[0x7f345010eeab]
/usr/lib64/libLLVM-13.so(_ZN4llvm15PromoteMemToRegENS_8ArrayRefIPNS_10AllocaInstEEERNS_13DominatorTreeEPNS_15AssumptionCacheE+0x93e)[0x7f3450110b1e]
/usr/lib64/libLLVM-13.so(_ZN4llvm4SROA7runImplERNS_8FunctionERNS_13DominatorTreeERNS_15AssumptionCacheE+0x14f)[0x7f345043b47f]
/usr/lib64/libLLVM-13.so(+0x2d6d7c3)[0x7f3451a907c3]
/usr/lib64/libLLVM-13.so(_ZN4llvm11PassManagerINS_8FunctionENS_15AnalysisManagerIS1_JEEEJEE3runERS1_RS3_+0x20e)[0x7f344f9004fe]
/usr/lib64/libLLVM-13.so(+0x2286662)[0x7f3450fa9662]
/usr/lib64/libLLVM-13.so(_ZN4llvm27ModuleToFunctionPassAdaptor3runERNS_6ModuleERNS_15AnalysisManagerIS1_JEEE+0x19d)[0x7f344f9008ad]
/usr/lib64/libLLVM-13.so(+0x2286612)[0x7f3450fa9612]
/usr/lib64/libLLVM-13.so(_ZN4llvm11PassManagerINS_6ModuleENS_15AnalysisManagerIS1_JEEEJEE3runERS1_RS3_+0x429)[0x7f344f9000f9]
/usr/lib64/libclang-cpp.so.13(+0x15954bc)[0x7f3455d234bc]
/usr/lib64/libclang-cpp.so.13(_ZN5clang17EmitBackendOutputERNS_17DiagnosticsEngineERKNS_19HeaderSearchOptionsERKNS_14CodeGenOptionsERKNS_13TargetOptionsERKNS_11LangOptionsEN4llvm9StringRefEPNSE_6ModuleENS_13BackendActionESt10unique_ptrINSE_17raw_pwrite_streamESt14default_deleteISK_EE+0x446)[0x7f3455d260b6]
/usr/lib64/libclang-cpp.so.13(+0x183e110)[0x7f3455fcc110]
/usr/lib64/libclang-cpp.so.13(_ZN5clang8ParseASTERNS_4SemaEbb+0x299)[0x7f3455179149]
/usr/lib64/libclang-cpp.so.13(_ZN5clang14FrontendAction7ExecuteEv+0xc1)[0x7f3456571b41]
/usr/lib64/libclang-cpp.so.13(_ZN5clang16CompilerInstance13ExecuteActionERNS_14FrontendActionE+0x167)[0x7f3456515787]
/usr/lib64/libclang-cpp.so.13(_ZN5clang25ExecuteCompilerInvocationEPNS_16CompilerInstanceE+0x46b)[0x7f34565b866b]
clang(_Z8cc1_mainN4llvm8ArrayRefIPKcEES2_Pv+0x843)[0x563f357094c3]
clang(+0x1bc05)[0x563f3570fc05]
/usr/lib64/libclang-cpp.so.13(+0x1b09525)[0x7f3456297525]
/usr/lib64/libLLVM-13.so(_ZN4llvm20CrashRecoveryContext9RunSafelyENS_12function_refIFvvEEE+0x23)[0x7f344f6ef1f3]
/usr/lib64/libclang-cpp.so.13(+0x1b1059e)[0x7f345629e59e]
/usr/lib64/libclang-cpp.so.13(_ZNK5clang6driver11Compilation14ExecuteCommandERKNS0_7CommandERPS3_+0x93)[0x7f34562b5753]
/usr/lib64/libclang-cpp.so.13(_ZNK5clang6driver11Compilation11ExecuteJobsERKNS0_7JobListERN4llvm15SmallVectorImplISt4pairIiPKNS0_7CommandEEEE+0x7d)[0x7f34562b5b3d]
/usr/lib64/libclang-cpp.so.13(_ZN5clang6driver6Driver18ExecuteCompilationERNS0_11CompilationERN4llvm15SmallVectorImplISt4pairIiPKNS0_7CommandEEEE+0xea)[0x7f34562b6b2a]
clang(main+0x1f50)[0x563f35703eb0]
/lib64/libc.so.6(+0x2e20c)[0x7f344e8a620c]
/lib64/libc.so.6(__libc_start_main+0x7c)[0x7f344e8a62bc]
clang(_start+0x21)[0x563f35704561]
clang: error: clang frontend command failed with exit code 139 (use -v to see invocation)
ALT Linux Team clang version 13.0.1
Target: x86_64-unknown-linux-gnu
Thread model: posix
InstalledDir: /usr/bin
clang: note: diagnostic msg: 
********************

PLEASE ATTACH THE FOLLOWING FILES TO THE BUG REPORT:
Preprocessed source(s) and associated run script(s) are located at:
clang: note: diagnostic msg: /usr/src/tmp/width-59fae8.c
clang: note: diagnostic msg: /usr/src/tmp/width-59fae8.sh
clang: note: diagnostic msg: 

********************
make[2]: *** [lib/CMakeFiles/cerf.dir/build.make:132: lib/CMakeFiles/cerf.dir/width.c.o] Error 139
make[2]: Leaving directory '/usr/src/RPM/BUILD/libcerf-v1.17/build'
make[2]: Entering directory '/usr/src/RPM/BUILD/libcerf-v1.17/build'
[  8%] Building C object lib/CMakeFiles/cerf.dir/err_fcts.c.o
PLEASE submit a bug report to https://bugs.llvm.org/ and include the crash backtrace, preprocessed source, and associated run script.
Stack dump:
0.	Program arguments: clang -Dcerf_EXPORTS -pipe -Wall -g -O2 -fPIC -O2 -Wno-sign-compare -fno-omit-frame-pointer -pedantic -Wall -std=gnu99 -MD -MT lib/CMakeFiles/cerf.dir/err_fcts.c.o -MF CMakeFiles/cerf.dir/err_fcts.c.o.d -o CMakeFiles/cerf.dir/err_fcts.c.o -c /usr/src/RPM/BUILD/libcerf-v1.17/lib/err_fcts.c
1.	<eof> parser at end of file
2.	Optimizer
Stack dump without symbol names (ensure you have llvm-symbolizer in your PATH or set the environment var `LLVM_SYMBOLIZER_PATH` to point to it):
/usr/lib64/libLLVM-13.so(_ZN4llvm3sys15PrintStackTraceERNS_11raw_ostreamEi+0x32)[0x7fbbe8429362]
/usr/lib64/libLLVM-13.so(_ZN4llvm3sys17RunSignalHandlersEv+0x34)[0x7fbbe840fc64]
/usr/lib64/libLLVM-13.so(+0x9e1b28)[0x7fbbe8380b28]
/lib64/libc.so.6(+0x42fb0)[0x7fbbe7536fb0]
/usr/lib64/libLLVM-13.so(+0x13ebeab)[0x7fbbe8d8aeab]
/usr/lib64/libLLVM-13.so(_ZN4llvm15PromoteMemToRegENS_8ArrayRefIPNS_10AllocaInstEEERNS_13DominatorTreeEPNS_15AssumptionCacheE+0x93e)[0x7fbbe8d8cb1e]
/usr/lib64/libLLVM-13.so(_ZN4llvm4SROA7runImplERNS_8FunctionERNS_13DominatorTreeERNS_15AssumptionCacheE+0x14f)[0x7fbbe90b747f]
/usr/lib64/libLLVM-13.so(+0x2d6d7c3)[0x7fbbea70c7c3]
/usr/lib64/libLLVM-13.so(_ZN4llvm11PassManagerINS_8FunctionENS_15AnalysisManagerIS1_JEEEJEE3runERS1_RS3_+0x20e)[0x7fbbe857c4fe]
/usr/lib64/libLLVM-13.so(+0x2286662)[0x7fbbe9c25662]
/usr/lib64/libLLVM-13.so(_ZN4llvm27ModuleToFunctionPassAdaptor3runERNS_6ModuleERNS_15AnalysisManagerIS1_JEEE+0x19d)[0x7fbbe857c8ad]
/usr/lib64/libLLVM-13.so(+0x2286612)[0x7fbbe9c25612]
/usr/lib64/libLLVM-13.so(_ZN4llvm11PassManagerINS_6ModuleENS_15AnalysisManagerIS1_JEEEJEE3runERS1_RS3_+0x429)[0x7fbbe857c0f9]
/usr/lib64/libclang-cpp.so.13(+0x15954bc)[0x7fbbee99f4bc]
/usr/lib64/libclang-cpp.so.13(_ZN5clang17EmitBackendOutputERNS_17DiagnosticsEngineERKNS_19HeaderSearchOptionsERKNS_14CodeGenOptionsERKNS_13TargetOptionsERKNS_11LangOptionsEN4llvm9StringRefEPNSE_6ModuleENS_13BackendActionESt10unique_ptrINSE_17raw_pwrite_streamESt14default_deleteISK_EE+0x446)[0x7fbbee9a20b6]
/usr/lib64/libclang-cpp.so.13(+0x183e110)[0x7fbbeec48110]
/usr/lib64/libclang-cpp.so.13(_ZN5clang8ParseASTERNS_4SemaEbb+0x299)[0x7fbbeddf5149]
/usr/lib64/libclang-cpp.so.13(_ZN5clang14FrontendAction7ExecuteEv+0xc1)[0x7fbbef1edb41]
/usr/lib64/libclang-cpp.so.13(_ZN5clang16CompilerInstance13ExecuteActionERNS_14FrontendActionE+0x167)[0x7fbbef191787]
/usr/lib64/libclang-cpp.so.13(_ZN5clang25ExecuteCompilerInvocationEPNS_16CompilerInstanceE+0x46b)[0x7fbbef23466b]
clang(_Z8cc1_mainN4llvm8ArrayRefIPKcEES2_Pv+0x843)[0x55b47f44e4c3]
clang(+0x1bc05)[0x55b47f454c05]
/usr/lib64/libclang-cpp.so.13(+0x1b09525)[0x7fbbeef13525]
/usr/lib64/libLLVM-13.so(_ZN4llvm20CrashRecoveryContext9RunSafelyENS_12function_refIFvvEEE+0x23)[0x7fbbe836b1f3]
/usr/lib64/libclang-cpp.so.13(+0x1b1059e)[0x7fbbeef1a59e]
/usr/lib64/libclang-cpp.so.13(_ZNK5clang6driver11Compilation14ExecuteCommandERKNS0_7CommandERPS3_+0x93)[0x7fbbeef31753]
/usr/lib64/libclang-cpp.so.13(_ZNK5clang6driver11Compilation11ExecuteJobsERKNS0_7JobListERN4llvm15SmallVectorImplISt4pairIiPKNS0_7CommandEEEE+0x7d)[0x7fbbeef31b3d]
/usr/lib64/libclang-cpp.so.13(_ZN5clang6driver6Driver18ExecuteCompilationERNS0_11CompilationERN4llvm15SmallVectorImplISt4pairIiPKNS0_7CommandEEEE+0xea)[0x7fbbeef32b2a]
clang(main+0x1f50)[0x55b47f448eb0]
/lib64/libc.so.6(+0x2e20c)[0x7fbbe752220c]
/lib64/libc.so.6(__libc_start_main+0x7c)[0x7fbbe75222bc]
clang(_start+0x21)[0x55b47f449561]
clang: error: clang frontend command failed with exit code 139 (use -v to see invocation)
ALT Linux Team clang version 13.0.1
Target: x86_64-unknown-linux-gnu
Thread model: posix
InstalledDir: /usr/bin
clang: note: diagnostic msg: 
********************

PLEASE ATTACH THE FOLLOWING FILES TO THE BUG REPORT:
Preprocessed source(s) and associated run script(s) are located at:
clang: note: diagnostic msg: /usr/src/tmp/err_fcts-dd07bd.c
clang: note: diagnostic msg: /usr/src/tmp/err_fcts-dd07bd.sh
clang: note: diagnostic msg: 

********************
make[2]: *** [lib/CMakeFiles/cerf.dir/build.make:90: lib/CMakeFiles/cerf.dir/err_fcts.c.o] Error 139
make[2]: Leaving directory '/usr/src/RPM/BUILD/libcerf-v1.17/build'
make[2]: Entering directory '/usr/src/RPM/BUILD/libcerf-v1.17/build'
[  4%] Building C object lib/CMakeFiles/cerf.dir/erfcx.c.o
PLEASE submit a bug report to https://bugs.llvm.org/ and include the crash backtrace, preprocessed source, and associated run script.
Stack dump:
0.	Program arguments: clang -Dcerf_EXPORTS -pipe -Wall -g -O2 -fPIC -O2 -Wno-sign-compare -fno-omit-frame-pointer -pedantic -Wall -std=gnu99 -MD -MT lib/CMakeFiles/cerf.dir/erfcx.c.o -MF CMakeFiles/cerf.dir/erfcx.c.o.d -o CMakeFiles/cerf.dir/erfcx.c.o -c /usr/src/RPM/BUILD/libcerf-v1.17/lib/erfcx.c
1.	<eof> parser at end of file
2.	Optimizer
Stack dump without symbol names (ensure you have llvm-symbolizer in your PATH or set the environment var `LLVM_SYMBOLIZER_PATH` to point to it):
/usr/lib64/libLLVM-13.so(_ZN4llvm3sys15PrintStackTraceERNS_11raw_ostreamEi+0x32)[0x7f9215ac7362]
/usr/lib64/libLLVM-13.so(_ZN4llvm3sys17RunSignalHandlersEv+0x34)[0x7f9215aadc64]
/usr/lib64/libLLVM-13.so(+0x9e1b28)[0x7f9215a1eb28]
/lib64/libc.so.6(+0x42fb0)[0x7f9214bd4fb0]
/usr/lib64/libLLVM-13.so(+0x13ebeab)[0x7f9216428eab]
/usr/lib64/libLLVM-13.so(_ZN4llvm15PromoteMemToRegENS_8ArrayRefIPNS_10AllocaInstEEERNS_13DominatorTreeEPNS_15AssumptionCacheE+0x93e)[0x7f921642ab1e]
/usr/lib64/libLLVM-13.so(_ZN4llvm4SROA7runImplERNS_8FunctionERNS_13DominatorTreeERNS_15AssumptionCacheE+0x14f)[0x7f921675547f]
/usr/lib64/libLLVM-13.so(+0x2d6d7c3)[0x7f9217daa7c3]
/usr/lib64/libLLVM-13.so(_ZN4llvm11PassManagerINS_8FunctionENS_15AnalysisManagerIS1_JEEEJEE3runERS1_RS3_+0x20e)[0x7f9215c1a4fe]
/usr/lib64/libLLVM-13.so(+0x2286662)[0x7f92172c3662]
/usr/lib64/libLLVM-13.so(_ZN4llvm27ModuleToFunctionPassAdaptor3runERNS_6ModuleERNS_15AnalysisManagerIS1_JEEE+0x19d)[0x7f9215c1a8ad]
/usr/lib64/libLLVM-13.so(+0x2286612)[0x7f92172c3612]
/usr/lib64/libLLVM-13.so(_ZN4llvm11PassManagerINS_6ModuleENS_15AnalysisManagerIS1_JEEEJEE3runERS1_RS3_+0x429)[0x7f9215c1a0f9]
/usr/lib64/libclang-cpp.so.13(+0x15954bc)[0x7f921c03d4bc]
/usr/lib64/libclang-cpp.so.13(_ZN5clang17EmitBackendOutputERNS_17DiagnosticsEngineERKNS_19HeaderSearchOptionsERKNS_14CodeGenOptionsERKNS_13TargetOptionsERKNS_11LangOptionsEN4llvm9StringRefEPNSE_6ModuleENS_13BackendActionESt10unique_ptrINSE_17raw_pwrite_streamESt14default_deleteISK_EE+0x446)[0x7f921c0400b6]
/usr/lib64/libclang-cpp.so.13(+0x183e110)[0x7f921c2e6110]
/usr/lib64/libclang-cpp.so.13(_ZN5clang8ParseASTERNS_4SemaEbb+0x299)[0x7f921b493149]
/usr/lib64/libclang-cpp.so.13(_ZN5clang14FrontendAction7ExecuteEv+0xc1)[0x7f921c88bb41]
/usr/lib64/libclang-cpp.so.13(_ZN5clang16CompilerInstance13ExecuteActionERNS_14FrontendActionE+0x167)[0x7f921c82f787]
/usr/lib64/libclang-cpp.so.13(_ZN5clang25ExecuteCompilerInvocationEPNS_16CompilerInstanceE+0x46b)[0x7f921c8d266b]
clang(_Z8cc1_mainN4llvm8ArrayRefIPKcEES2_Pv+0x843)[0x559dd29c44c3]
clang(+0x1bc05)[0x559dd29cac05]
/usr/lib64/libclang-cpp.so.13(+0x1b09525)[0x7f921c5b1525]
/usr/lib64/libLLVM-13.so(_ZN4llvm20CrashRecoveryContext9RunSafelyENS_12function_refIFvvEEE+0x23)[0x7f9215a091f3]
/usr/lib64/libclang-cpp.so.13(+0x1b1059e)[0x7f921c5b859e]
/usr/lib64/libclang-cpp.so.13(_ZNK5clang6driver11Compilation14ExecuteCommandERKNS0_7CommandERPS3_+0x93)[0x7f921c5cf753]
/usr/lib64/libclang-cpp.so.13(_ZNK5clang6driver11Compilation11ExecuteJobsERKNS0_7JobListERN4llvm15SmallVectorImplISt4pairIiPKNS0_7CommandEEEE+0x7d)[0x7f921c5cfb3d]
/usr/lib64/libclang-cpp.so.13(_ZN5clang6driver6Driver18ExecuteCompilationERNS0_11CompilationERN4llvm15SmallVectorImplISt4pairIiPKNS0_7CommandEEEE+0xea)[0x7f921c5d0b2a]
clang(main+0x1f50)[0x559dd29beeb0]
/lib64/libc.so.6(+0x2e20c)[0x7f9214bc020c]
/lib64/libc.so.6(__libc_start_main+0x7c)[0x7f9214bc02bc]
clang(_start+0x21)[0x559dd29bf561]
clang: error: clang frontend command failed with exit code 139 (use -v to see invocation)
ALT Linux Team clang version 13.0.1
Target: x86_64-unknown-linux-gnu
Thread model: posix
InstalledDir: /usr/bin
clang: note: diagnostic msg: 
********************

PLEASE ATTACH THE FOLLOWING FILES TO THE BUG REPORT:
Preprocessed source(s) and associated run script(s) are located at:
clang: note: diagnostic msg: /usr/src/tmp/erfcx-3fecf3.c
clang: note: diagnostic msg: /usr/src/tmp/erfcx-3fecf3.sh
clang: note: diagnostic msg: 

********************
make[2]: *** [lib/CMakeFiles/cerf.dir/build.make:76: lib/CMakeFiles/cerf.dir/erfcx.c.o] Error 139
make[2]: Leaving directory '/usr/src/RPM/BUILD/libcerf-v1.17/build'
make[2]: Entering directory '/usr/src/RPM/BUILD/libcerf-v1.17/build'
[ 12%] Building C object lib/CMakeFiles/cerf.dir/im_w_of_x.c.o
PLEASE submit a bug report to https://bugs.llvm.org/ and include the crash backtrace, preprocessed source, and associated run script.
Stack dump:
0.	Program arguments: clang -Dcerf_EXPORTS -pipe -Wall -g -O2 -fPIC -O2 -Wno-sign-compare -fno-omit-frame-pointer -pedantic -Wall -std=gnu99 -MD -MT lib/CMakeFiles/cerf.dir/im_w_of_x.c.o -MF CMakeFiles/cerf.dir/im_w_of_x.c.o.d -o CMakeFiles/cerf.dir/im_w_of_x.c.o -c /usr/src/RPM/BUILD/libcerf-v1.17/lib/im_w_of_x.c
1.	<eof> parser at end of file
2.	Optimizer
Stack dump without symbol names (ensure you have llvm-symbolizer in your PATH or set the environment var `LLVM_SYMBOLIZER_PATH` to point to it):
/usr/lib64/libLLVM-13.so(_ZN4llvm3sys15PrintStackTraceERNS_11raw_ostreamEi+0x32)[0x7f9c4d658362]
/usr/lib64/libLLVM-13.so(_ZN4llvm3sys17RunSignalHandlersEv+0x34)[0x7f9c4d63ec64]
/usr/lib64/libLLVM-13.so(+0x9e1b28)[0x7f9c4d5afb28]
/lib64/libc.so.6(+0x42fb0)[0x7f9c4c765fb0]
/usr/lib64/libLLVM-13.so(+0x13ebeab)[0x7f9c4dfb9eab]
/usr/lib64/libLLVM-13.so(_ZN4llvm15PromoteMemToRegENS_8ArrayRefIPNS_10AllocaInstEEERNS_13DominatorTreeEPNS_15AssumptionCacheE+0x93e)[0x7f9c4dfbbb1e]
/usr/lib64/libLLVM-13.so(_ZN4llvm4SROA7runImplERNS_8FunctionERNS_13DominatorTreeERNS_15AssumptionCacheE+0x14f)[0x7f9c4e2e647f]
/usr/lib64/libLLVM-13.so(+0x2d6d7c3)[0x7f9c4f93b7c3]
/usr/lib64/libLLVM-13.so(_ZN4llvm11PassManagerINS_8FunctionENS_15AnalysisManagerIS1_JEEEJEE3runERS1_RS3_+0x20e)[0x7f9c4d7ab4fe]
/usr/lib64/libLLVM-13.so(+0x2286662)[0x7f9c4ee54662]
/usr/lib64/libLLVM-13.so(_ZN4llvm27ModuleToFunctionPassAdaptor3runERNS_6ModuleERNS_15AnalysisManagerIS1_JEEE+0x19d)[0x7f9c4d7ab8ad]
/usr/lib64/libLLVM-13.so(+0x2286612)[0x7f9c4ee54612]
/usr/lib64/libLLVM-13.so(_ZN4llvm11PassManagerINS_6ModuleENS_15AnalysisManagerIS1_JEEEJEE3runERS1_RS3_+0x429)[0x7f9c4d7ab0f9]
/usr/lib64/libclang-cpp.so.13(+0x15954bc)[0x7f9c53bce4bc]
/usr/lib64/libclang-cpp.so.13(_ZN5clang17EmitBackendOutputERNS_17DiagnosticsEngineERKNS_19HeaderSearchOptionsERKNS_14CodeGenOptionsERKNS_13TargetOptionsERKNS_11LangOptionsEN4llvm9StringRefEPNSE_6ModuleENS_13BackendActionESt10unique_ptrINSE_17raw_pwrite_streamESt14default_deleteISK_EE+0x446)[0x7f9c53bd10b6]
/usr/lib64/libclang-cpp.so.13(+0x183e110)[0x7f9c53e77110]
/usr/lib64/libclang-cpp.so.13(_ZN5clang8ParseASTERNS_4SemaEbb+0x299)[0x7f9c53024149]
/usr/lib64/libclang-cpp.so.13(_ZN5clang14FrontendAction7ExecuteEv+0xc1)[0x7f9c5441cb41]
/usr/lib64/libclang-cpp.so.13(_ZN5clang16CompilerInstance13ExecuteActionERNS_14FrontendActionE+0x167)[0x7f9c543c0787]
/usr/lib64/libclang-cpp.so.13(_ZN5clang25ExecuteCompilerInvocationEPNS_16CompilerInstanceE+0x46b)[0x7f9c5446366b]
clang(_Z8cc1_mainN4llvm8ArrayRefIPKcEES2_Pv+0x843)[0x564bcce684c3]
clang(+0x1bc05)[0x564bcce6ec05]
/usr/lib64/libclang-cpp.so.13(+0x1b09525)[0x7f9c54142525]
/usr/lib64/libLLVM-13.so(_ZN4llvm20CrashRecoveryContext9RunSafelyENS_12function_refIFvvEEE+0x23)[0x7f9c4d59a1f3]
/usr/lib64/libclang-cpp.so.13(+0x1b1059e)[0x7f9c5414959e]
/usr/lib64/libclang-cpp.so.13(_ZNK5clang6driver11Compilation14ExecuteCommandERKNS0_7CommandERPS3_+0x93)[0x7f9c54160753]
/usr/lib64/libclang-cpp.so.13(_ZNK5clang6driver11Compilation11ExecuteJobsERKNS0_7JobListERN4llvm15SmallVectorImplISt4pairIiPKNS0_7CommandEEEE+0x7d)[0x7f9c54160b3d]
/usr/lib64/libclang-cpp.so.13(_ZN5clang6driver6Driver18ExecuteCompilationERNS0_11CompilationERN4llvm15SmallVectorImplISt4pairIiPKNS0_7CommandEEEE+0xea)[0x7f9c54161b2a]
clang(main+0x1f50)[0x564bcce62eb0]
/lib64/libc.so.6(+0x2e20c)[0x7f9c4c75120c]
/lib64/libc.so.6(__libc_start_main+0x7c)[0x7f9c4c7512bc]
clang(_start+0x21)[0x564bcce63561]
clang: error: clang frontend command failed with exit code 139 (use -v to see invocation)
ALT Linux Team clang version 13.0.1
Target: x86_64-unknown-linux-gnu
Thread model: posix
InstalledDir: /usr/bin
clang: note: diagnostic msg: 
********************

PLEASE ATTACH THE FOLLOWING FILES TO THE BUG REPORT:
Preprocessed source(s) and associated run script(s) are located at:
clang: note: diagnostic msg: /usr/src/tmp/im_w_of_x-9185ad.c
clang: note: diagnostic msg: /usr/src/tmp/im_w_of_x-9185ad.sh
clang: note: diagnostic msg: 

********************
make[2]: *** [lib/CMakeFiles/cerf.dir/build.make:104: lib/CMakeFiles/cerf.dir/im_w_of_x.c.o] Error 139
make[2]: Leaving directory '/usr/src/RPM/BUILD/libcerf-v1.17/build'
make[1]: *** [CMakeFiles/Makefile2:924: lib/CMakeFiles/cerf.dir/all] Error 2
make[1]: *** Waiting for unfinished jobs....
make[2]: Entering directory '/usr/src/RPM/BUILD/libcerf-v1.17/build'
[ 45%] Generating cdawson.3
make[2]: Leaving directory '/usr/src/RPM/BUILD/libcerf-v1.17/build'
make[2]: Entering directory '/usr/src/RPM/BUILD/libcerf-v1.17/build'
[ 41%] Generating dawson.3
make[2]: Leaving directory '/usr/src/RPM/BUILD/libcerf-v1.17/build'
make[2]: Entering directory '/usr/src/RPM/BUILD/libcerf-v1.17/build'
[ 47%] Generating cerfcx.3
make[2]: Leaving directory '/usr/src/RPM/BUILD/libcerf-v1.17/build'
make[2]: Entering directory '/usr/src/RPM/BUILD/libcerf-v1.17/build'
[ 41%] Generating im_w_of_z.html
make[2]: Leaving directory '/usr/src/RPM/BUILD/libcerf-v1.17/build'
make[2]: Entering directory '/usr/src/RPM/BUILD/libcerf-v1.17/build'
[ 41%] Generating w_of_z.html
make[2]: Leaving directory '/usr/src/RPM/BUILD/libcerf-v1.17/build'
make[2]: Entering directory '/usr/src/RPM/BUILD/libcerf-v1.17/build'
[ 45%] Generating erfcx.3
make[2]: Leaving directory '/usr/src/RPM/BUILD/libcerf-v1.17/build'
make[1]: Entering directory '/usr/src/RPM/BUILD/libcerf-v1.17/build'
[ 60%] Built target html
make[1]: Leaving directory '/usr/src/RPM/BUILD/libcerf-v1.17/build'
make[2]: Entering directory '/usr/src/RPM/BUILD/libcerf-v1.17/build'
[ 41%] Generating cerfc.3
make[2]: Leaving directory '/usr/src/RPM/BUILD/libcerf-v1.17/build'
make[2]: Entering directory '/usr/src/RPM/BUILD/libcerf-v1.17/build'
[ 56%] Generating voigt_hwhm.3
make[2]: Leaving directory '/usr/src/RPM/BUILD/libcerf-v1.17/build'
make[2]: Entering directory '/usr/src/RPM/BUILD/libcerf-v1.17/build'
[ 52%] Generating cerfi.3
make[2]: Leaving directory '/usr/src/RPM/BUILD/libcerf-v1.17/build'
make[2]: Entering directory '/usr/src/RPM/BUILD/libcerf-v1.17/build'
[ 54%] Generating voigt.3
make[2]: Leaving directory '/usr/src/RPM/BUILD/libcerf-v1.17/build'
make[2]: Entering directory '/usr/src/RPM/BUILD/libcerf-v1.17/build'
[ 58%] Generating w_of_z.3
make[2]: Leaving directory '/usr/src/RPM/BUILD/libcerf-v1.17/build'
make[2]: Entering directory '/usr/src/RPM/BUILD/libcerf-v1.17/build'
[ 50%] Generating erfi.3
make[2]: Leaving directory '/usr/src/RPM/BUILD/libcerf-v1.17/build'
make[2]: Entering directory '/usr/src/RPM/BUILD/libcerf-v1.17/build'
[ 60%] Generating im_w_of_z.3
make[2]: Leaving directory '/usr/src/RPM/BUILD/libcerf-v1.17/build'
make[1]: Entering directory '/usr/src/RPM/BUILD/libcerf-v1.17/build'
[ 60%] Built target man
make[1]: Leaving directory '/usr/src/RPM/BUILD/libcerf-v1.17/build'
make: *** [Makefile:166: all] Error 2
error: Bad exit status from /usr/src/tmp/rpm-tmp.23912 (%build)


RPM build errors:
    Bad exit status from /usr/src/tmp/rpm-tmp.23912 (%build)
Command exited with non-zero status 1
1.95user 0.50system 0:00.39elapsed 617%CPU (0avgtext+0avgdata 80924maxresident)k
0inputs+0outputs (0major+151783minor)pagefaults 0swaps
hsh-rebuild: rebuild of `libcerf-1.17-alt1_1.src.rpm' failed.
Command exited with non-zero status 1
10.14user 3.65system 0:11.00elapsed 125%CPU (0avgtext+0avgdata 103772maxresident)k
992inputs+0outputs (45372major+463445minor)pagefaults 0swaps