<86>Jan 21 01:03:06 userdel[3294967]: delete user 'rooter'
<86>Jan 21 01:03:06 groupadd[3295088]: group added to /etc/group: name=rooter, GID=960
<86>Jan 21 01:03:06 groupadd[3295088]: group added to /etc/gshadow: name=rooter
<86>Jan 21 01:03:06 groupadd[3295088]: new group: name=rooter, GID=960
<86>Jan 21 01:03:06 useradd[3295159]: new user: name=rooter, UID=960, GID=960, home=/root, shell=/bin/bash
<86>Jan 21 01:03:06 userdel[3295350]: delete user 'builder'
<86>Jan 21 01:03:06 userdel[3295350]: removed group 'builder' owned by 'builder'
<86>Jan 21 01:03:06 userdel[3295350]: removed shadow group 'builder' owned by 'builder'
<86>Jan 21 01:03:06 groupadd[3295624]: group added to /etc/group: name=builder, GID=961
<86>Jan 21 01:03:06 groupadd[3295624]: group added to /etc/gshadow: name=builder
<86>Jan 21 01:03:06 groupadd[3295624]: new group: name=builder, GID=961
<86>Jan 21 01:03:06 useradd[3295690]: new user: name=builder, UID=961, GID=961, home=/usr/src, shell=/bin/bash
/usr/src/in/srpm/pete-2.1.0-alt2.src.rpm: bad symbols in the license tag: /
<13>Jan 21 01:03:10 rpmi: gcc-c++-common-1.4.27-alt1 sisyphus+278099.1300.1.1 1626028636 installed
<13>Jan 21 01:03:11 rpmi: libstdc++11-devel-11.2.1-alt2 sisyphus+291192.100.1.1 1638461683 installed
<13>Jan 21 01:03:11 rpmi: gcc11-c++-11.2.1-alt2 sisyphus+291192.100.1.1 1638461683 installed
<13>Jan 21 01:03:11 rpmi: gcc-c++-11-alt1 sisyphus+285602.400.1.1 1632238564 installed
Building target platforms: x86_64
Building for target x86_64
Wrote: /usr/src/in/nosrpm/pete-2.1.0-alt2.nosrc.rpm (w1.gzdio)
Installing pete-2.1.0-alt2.src.rpm
Building target platforms: x86_64
Building for target x86_64
Executing(%prep): /bin/sh -e /usr/src/tmp/rpm-tmp.63532
+ umask 022
+ /bin/mkdir -p /usr/src/RPM/BUILD
+ cd /usr/src/RPM/BUILD
+ cd /usr/src/RPM/BUILD
+ rm -rf pete-2.1.0
+ echo 'Source #0 (pete-2.1.0.tar.gz):'
Source #0 (pete-2.1.0.tar.gz):
+ /bin/gzip -dc /usr/src/RPM/SOURCES/pete-2.1.0.tar.gz
+ /bin/tar -xf -
+ cd pete-2.1.0
+ /bin/chmod -c -Rf u+rwX,go-w .
+ exit 0
Executing(%build): /bin/sh -e /usr/src/tmp/rpm-tmp.63532
+ umask 022
+ /bin/mkdir -p /usr/src/RPM/BUILD
+ cd /usr/src/RPM/BUILD
+ cd pete-2.1.0
+ export PETEARCH=LINUXEGCS
+ PETEARCH=LINUXEGCS
+ make -j16
make: Entering directory '/usr/src/RPM/BUILD/pete-2.1.0'
make -Csrc/Tools
make[1]: Entering directory '/usr/src/RPM/BUILD/pete-2.1.0/src/Tools'
make[1]: warning: jobserver unavailable: using -j1.  Add '+' to parent make rule.
make[1]: Leaving directory '/usr/src/RPM/BUILD/pete-2.1.0/src/Tools'
make[1]: Entering directory '/usr/src/RPM/BUILD/pete-2.1.0/src/Tools'
g++ -o MakeOperators -I/usr/src/RPM/BUILD/pete-2.1.0/src -ftemplate-depth-40 -fpermissive MakeOperators.cpp \
Options.cpp PAssert.cpp PeteOps.cpp Join.cpp
In file included from MakeOperators.cpp:35:
/usr/src/RPM/BUILD/pete-2.1.0/src/Tools/PrintOperators.h: In instantiation of 'void UnaryBoolOp::print(OSTR&, const OPDEF&) const [with OSTR = std::basic_ostream<char>; OPDEF = OperatorDescriptor]':
/usr/src/RPM/BUILD/pete-2.1.0/src/Tools/PrintList.h:68:20:   required from 'void printList(OSTR&, const PROTOTYPE&, const LIST1&) [with OSTR = std::basic_ostream<char>; PROTOTYPE = UnaryBoolOp; LIST1 = std::vector<OperatorDescriptor>]'
MakeOperators.cpp:322:14:   required from here
/usr/src/RPM/BUILD/pete-2.1.0/src/Tools/PrintOperators.h:160:32: warning: 'joinWithComma' was not declared in this scope, and no declarations were found by argument-dependent lookup at the point of instantiation [-fpermissive]
  160 |     string args = joinWithComma("class T", opdef.argDef());
      |                   ~~~~~~~~~~~~~^~~~~~~~~~~~~~~~~~~~~~~~~~~
In file included from /usr/src/RPM/BUILD/pete-2.1.0/src/Tools/PrintFunctions.h:71,
                 from MakeOperators.cpp:36:
/usr/src/RPM/BUILD/pete-2.1.0/src/Tools/Join.h:47:15: note: 'std::string joinWithComma(const string&, const string&, const string&)' declared here, later in the translation unit
   47 | extern string joinWithComma(const string& a,const string& b,
      |               ^~~~~~~~~~~~~
In file included from MakeOperators.cpp:35:
/usr/src/RPM/BUILD/pete-2.1.0/src/Tools/PrintOperators.h: In instantiation of 'void BinaryBoolOp::print(OSTR&, const OPDEF&) const [with OSTR = std::basic_ostream<char>; OPDEF = OperatorDescriptor]':
/usr/src/RPM/BUILD/pete-2.1.0/src/Tools/PrintList.h:68:20:   required from 'void printList(OSTR&, const PROTOTYPE&, const LIST1&) [with OSTR = std::basic_ostream<char>; PROTOTYPE = BinaryBoolOp; LIST1 = std::vector<OperatorDescriptor>]'
MakeOperators.cpp:326:14:   required from here
/usr/src/RPM/BUILD/pete-2.1.0/src/Tools/PrintOperators.h:290:32: warning: 'joinWithComma' was not declared in this scope, and no declarations were found by argument-dependent lookup at the point of instantiation [-fpermissive]
  290 |     string args = joinWithComma("class T1, class T2",
      |                   ~~~~~~~~~~~~~^~~~~~~~~~~~~~~~~~~~~~
  291 |                                      opdef.argDef());
      |                                      ~~~~~~~~~~~~~~~
In file included from /usr/src/RPM/BUILD/pete-2.1.0/src/Tools/PrintFunctions.h:71,
                 from MakeOperators.cpp:36:
/usr/src/RPM/BUILD/pete-2.1.0/src/Tools/Join.h:47:15: note: 'std::string joinWithComma(const string&, const string&, const string&)' declared here, later in the translation unit
   47 | extern string joinWithComma(const string& a,const string& b,
      |               ^~~~~~~~~~~~~
In file included from MakeOperators.cpp:35:
/usr/src/RPM/BUILD/pete-2.1.0/src/Tools/PrintOperators.h: In instantiation of 'void BinaryLeftOp::print(OSTR&, const OPDEF&) const [with OSTR = std::basic_ostream<char>; OPDEF = OperatorDescriptor]':
/usr/src/RPM/BUILD/pete-2.1.0/src/Tools/PrintList.h:68:20:   required from 'void printList(OSTR&, const PROTOTYPE&, const LIST1&) [with OSTR = std::basic_ostream<char>; PROTOTYPE = BinaryLeftOp; LIST1 = std::vector<OperatorDescriptor>]'
MakeOperators.cpp:327:14:   required from here
/usr/src/RPM/BUILD/pete-2.1.0/src/Tools/PrintOperators.h:322:32: warning: 'joinWithComma' was not declared in this scope, and no declarations were found by argument-dependent lookup at the point of instantiation [-fpermissive]
  322 |     string args = joinWithComma("class T1, class T2",
      |                   ~~~~~~~~~~~~~^~~~~~~~~~~~~~~~~~~~~~
  323 |                                      opdef.argDef());
      |                                      ~~~~~~~~~~~~~~~
In file included from /usr/src/RPM/BUILD/pete-2.1.0/src/Tools/PrintFunctions.h:71,
                 from MakeOperators.cpp:36:
/usr/src/RPM/BUILD/pete-2.1.0/src/Tools/Join.h:47:15: note: 'std::string joinWithComma(const string&, const string&, const string&)' declared here, later in the translation unit
   47 | extern string joinWithComma(const string& a,const string& b,
      |               ^~~~~~~~~~~~~
In file included from MakeOperators.cpp:35:
/usr/src/RPM/BUILD/pete-2.1.0/src/Tools/PrintOperators.h: In instantiation of 'void BinaryAssignOp::print(OSTR&, const OPDEF&) const [with OSTR = std::basic_ostream<char>; OPDEF = OperatorDescriptor]':
/usr/src/RPM/BUILD/pete-2.1.0/src/Tools/PrintList.h:68:20:   required from 'void printList(OSTR&, const PROTOTYPE&, const LIST1&) [with OSTR = std::basic_ostream<char>; PROTOTYPE = BinaryAssignOp; LIST1 = std::vector<OperatorDescriptor>]'
MakeOperators.cpp:329:14:   required from here
/usr/src/RPM/BUILD/pete-2.1.0/src/Tools/PrintOperators.h:378:32: warning: 'joinWithComma' was not declared in this scope, and no declarations were found by argument-dependent lookup at the point of instantiation [-fpermissive]
  378 |     string args = joinWithComma("class T1, class T2",
      |                   ~~~~~~~~~~~~~^~~~~~~~~~~~~~~~~~~~~~
  379 |                                      opdef.argDef());
      |                                      ~~~~~~~~~~~~~~~
In file included from /usr/src/RPM/BUILD/pete-2.1.0/src/Tools/PrintFunctions.h:71,
                 from MakeOperators.cpp:36:
/usr/src/RPM/BUILD/pete-2.1.0/src/Tools/Join.h:47:15: note: 'std::string joinWithComma(const string&, const string&, const string&)' declared here, later in the translation unit
   47 | extern string joinWithComma(const string& a,const string& b,
      |               ^~~~~~~~~~~~~
In file included from MakeOperators.cpp:35:
/usr/src/RPM/BUILD/pete-2.1.0/src/Tools/PrintOperators.h: In instantiation of 'void BinaryAssignBoolOp::print(OSTR&, const OPDEF&) const [with OSTR = std::basic_ostream<char>; OPDEF = OperatorDescriptor]':
/usr/src/RPM/BUILD/pete-2.1.0/src/Tools/PrintList.h:68:20:   required from 'void printList(OSTR&, const PROTOTYPE&, const LIST1&) [with OSTR = std::basic_ostream<char>; PROTOTYPE = BinaryAssignBoolOp; LIST1 = std::vector<OperatorDescriptor>]'
MakeOperators.cpp:331:14:   required from here
/usr/src/RPM/BUILD/pete-2.1.0/src/Tools/PrintOperators.h:435:32: warning: 'joinWithComma' was not declared in this scope, and no declarations were found by argument-dependent lookup at the point of instantiation [-fpermissive]
  435 |     string args = joinWithComma("class T1, class T2",
      |                   ~~~~~~~~~~~~~^~~~~~~~~~~~~~~~~~~~~~
  436 |                                      opdef.argDef());
      |                                      ~~~~~~~~~~~~~~~
In file included from /usr/src/RPM/BUILD/pete-2.1.0/src/Tools/PrintFunctions.h:71,
                 from MakeOperators.cpp:36:
/usr/src/RPM/BUILD/pete-2.1.0/src/Tools/Join.h:47:15: note: 'std::string joinWithComma(const string&, const string&, const string&)' declared here, later in the translation unit
   47 | extern string joinWithComma(const string& a,const string& b,
      |               ^~~~~~~~~~~~~
make[1]: Leaving directory '/usr/src/RPM/BUILD/pete-2.1.0/src/Tools'
make: Leaving directory '/usr/src/RPM/BUILD/pete-2.1.0'
+ exit 0
Executing(%install): /bin/sh -e /usr/src/tmp/rpm-tmp.91623
+ umask 022
+ /bin/mkdir -p /usr/src/RPM/BUILD
+ cd /usr/src/RPM/BUILD
+ /bin/chmod -Rf u+rwX -- /usr/src/tmp/pete-buildroot
+ :
+ /bin/rm -rf -- /usr/src/tmp/pete-buildroot
+ PATH=/usr/libexec/rpm-build:/usr/src/bin:/bin:/usr/bin:/usr/X11R6/bin:/usr/games
+ cd pete-2.1.0
+ export PETEDIR=/usr/src/tmp/pete-buildroot
+ PETEDIR=/usr/src/tmp/pete-buildroot
+ export PETEARCH=LINUXEGCS
+ PETEARCH=LINUXEGCS
+ make install
make: Entering directory '/usr/src/RPM/BUILD/pete-2.1.0'
make -Csrc/Tools
make[1]: Entering directory '/usr/src/RPM/BUILD/pete-2.1.0/src/Tools'
make[1]: Nothing to be done for 'default'.
make[1]: Leaving directory '/usr/src/RPM/BUILD/pete-2.1.0/src/Tools'
if [ ! -d /usr/src/tmp/pete-buildroot ] ; then mkdir /usr/src/tmp/pete-buildroot ; fi
if [ ! -d /usr/src/tmp/pete-buildroot/src ] ; then mkdir /usr/src/tmp/pete-buildroot/src ; fi
if [ ! -d /usr/src/tmp/pete-buildroot/src/PETE ] ; then mkdir /usr/src/tmp/pete-buildroot/src/PETE ; fi
cp src/PETE/*.h /usr/src/tmp/pete-buildroot/src/PETE
if [ ! -d /usr/src/tmp/pete-buildroot/src/Tools ] ; then mkdir /usr/src/tmp/pete-buildroot/src/Tools ; fi
if [ ! -d /usr/src/tmp/pete-buildroot/linux ] ; then mkdir /usr/src/tmp/pete-buildroot/linux ; fi
if [ ! -d /usr/src/tmp/pete-buildroot/linux/bin ] ; then mkdir /usr/src/tmp/pete-buildroot/linux/bin ; fi
cp src/Tools/MakeOperators /usr/src/tmp/pete-buildroot/linux/bin
cp -r html /usr/src/tmp/pete-buildroot
make: Leaving directory '/usr/src/RPM/BUILD/pete-2.1.0'
+ install -d /usr/src/tmp/pete-buildroot/usr/bin
+ install -d /usr/src/tmp/pete-buildroot/usr/include/pete
+ install -d /usr/src/tmp/pete-buildroot/usr/share/doc/pete
+ mv /usr/src/tmp/pete-buildroot/linux/bin/MakeOperators /usr/src/tmp/pete-buildroot/usr/bin/
+ mv /usr/src/tmp/pete-buildroot/src/PETE/Combiners.h /usr/src/tmp/pete-buildroot/src/PETE/CreateLeaf.h /usr/src/tmp/pete-buildroot/src/PETE/ForEach.h /usr/src/tmp/pete-buildroot/src/PETE/Functors.h /usr/src/tmp/pete-buildroot/src/PETE/OperatorTags.h /usr/src/tmp/pete-buildroot/src/PETE/PETE.h /usr/src/tmp/pete-buildroot/src/PETE/Scalar.h /usr/src/tmp/pete-buildroot/src/PETE/TreeNodes.h /usr/src/tmp/pete-buildroot/src/PETE/TypeComputations.h /usr/src/tmp/pete-buildroot/usr/include/pete/
+ mv /usr/src/tmp/pete-buildroot/html/PETETutorials.pdf /usr/src/tmp/pete-buildroot/html/PeteOps.html /usr/src/tmp/pete-buildroot/html/background.html /usr/src/tmp/pete-buildroot/html/banner.gif /usr/src/tmp/pete-buildroot/html/builtin.html /usr/src/tmp/pete-buildroot/html/index.html /usr/src/tmp/pete-buildroot/html/introduction.html /usr/src/tmp/pete-buildroot/html/legal.html /usr/src/tmp/pete-buildroot/html/makeoperators.html /usr/src/tmp/pete-buildroot/html/stl.html /usr/src/tmp/pete-buildroot/html/tree.gif /usr/src/tmp/pete-buildroot/html/tut-1.html /usr/src/tmp/pete-buildroot/html/tut-2.html /usr/src/tmp/pete-buildroot/html/tut-3.html /usr/src/tmp/pete-buildroot/usr/share/doc/pete/
+ /usr/lib/rpm/brp-alt
Cleaning files in /usr/src/tmp/pete-buildroot (auto)
Verifying and fixing files in /usr/src/tmp/pete-buildroot (binconfig,pkgconfig,libtool,desktop,gnuconfig)
Checking contents of files in /usr/src/tmp/pete-buildroot/ (default)
Compressing files in /usr/src/tmp/pete-buildroot (auto)
056-debuginfo.brp: WARNING: debuginfo without debug sources.
Verifying ELF objects in /usr/src/tmp/pete-buildroot (arch=normal,fhs=normal,lfs=relaxed,lint=relaxed,rpath=normal,stack=normal,textrel=normal,unresolved=normal)
Processing files: pete-2.1.0-alt2
Executing(%doc): /bin/sh -e /usr/src/tmp/rpm-tmp.35330
+ umask 022
+ /bin/mkdir -p /usr/src/RPM/BUILD
+ cd /usr/src/RPM/BUILD
+ cd pete-2.1.0
+ DOCDIR=/usr/src/tmp/pete-buildroot/usr/share/doc/pete-2.1.0
+ export DOCDIR
+ rm -rf /usr/src/tmp/pete-buildroot/usr/share/doc/pete-2.1.0
+ /bin/mkdir -p /usr/src/tmp/pete-buildroot/usr/share/doc/pete-2.1.0
+ cp -prL CREDITS LICENSE README /usr/src/tmp/pete-buildroot/usr/share/doc/pete-2.1.0
+ chmod -R go-w /usr/src/tmp/pete-buildroot/usr/share/doc/pete-2.1.0
+ chmod -R a+rX /usr/src/tmp/pete-buildroot/usr/share/doc/pete-2.1.0
+ exit 0
Finding Provides (using /usr/lib/rpm/find-provides)
Executing: /bin/sh -e /usr/src/tmp/rpm-tmp.rIffva
find-provides: running scripts (debuginfo,lib,pam,perl,pkgconfig,python,python3,shell)
Finding Requires (using /usr/lib/rpm/find-requires)
Executing: /bin/sh -e /usr/src/tmp/rpm-tmp.bCeKNF
find-requires: running scripts (cpp,debuginfo,files,lib,pam,perl,pkgconfig,pkgconfiglib,python,python3,rpmlib,shebang,shell,static,symlinks,systemd-services)
Requires: /lib64/ld-linux-x86-64.so.2, libc.so.6(GLIBC_2.2.5)(64bit), libc.so.6(GLIBC_2.34)(64bit), libc.so.6(GLIBC_2.4)(64bit), libgcc_s.so.1(GCC_3.0)(64bit), libstdc++.so.6(CXXABI_1.3)(64bit), libstdc++.so.6(CXXABI_1.3.9)(64bit), libstdc++.so.6(GLIBCXX_3.4)(64bit), libstdc++.so.6(GLIBCXX_3.4.21)(64bit), libstdc++.so.6(GLIBCXX_3.4.29)(64bit), rtld(GNU_HASH)
Finding debuginfo files (using /usr/lib/rpm/find-debuginfo-files)
Executing: /bin/sh -e /usr/src/tmp/rpm-tmp.HlxsGT
Creating pete-debuginfo package
Processing files: libpete-devel-2.1.0-alt2
Finding Provides (using /usr/lib/rpm/find-provides)
Executing: /bin/sh -e /usr/src/tmp/rpm-tmp.0Mmvu8
find-provides: running scripts (debuginfo,lib,pam,perl,pkgconfig,python,python3,shell)
Finding Requires (using /usr/lib/rpm/find-requires)
Executing: /bin/sh -e /usr/src/tmp/rpm-tmp.X6SGk5
find-requires: running scripts (cpp,debuginfo,files,lib,pam,perl,pkgconfig,pkgconfiglib,python,python3,rpmlib,shebang,shell,static,symlinks,systemd-services)
/usr/src/tmp/pete-buildroot/usr/include/pete/PETE.h:63:10: fatal error: PETE/Scalar.h: No such file or directory
   63 | #include "PETE/Scalar.h"
      |          ^~~~~~~~~~~~~~~
compilation terminated.
cpp.req: /usr/src/tmp/pete-buildroot/usr/include/pete/PETE.h: cpp failed, trying c++ mode
/usr/src/tmp/pete-buildroot/usr/include/pete/PETE.h:63:10: fatal error: PETE/Scalar.h: No such file or directory
   63 | #include "PETE/Scalar.h"
      |          ^~~~~~~~~~~~~~~
compilation terminated.
cpp.req: WARNING: /usr/src/tmp/pete-buildroot/usr/include/pete/PETE.h: cpp failed
/usr/src/tmp/pete-buildroot/usr/include/pete/Functors.h:42:10: fatal error: iterator: No such file or directory
   42 | #include <iterator>
      |          ^~~~~~~~~~
compilation terminated.
cpp.req: /usr/src/tmp/pete-buildroot/usr/include/pete/Functors.h: cpp failed, trying c++ mode
Requires: pete = 2.1.0-alt2
Finding debuginfo files (using /usr/lib/rpm/find-debuginfo-files)
Executing: /bin/sh -e /usr/src/tmp/rpm-tmp.uNRQrH
Processing files: libpete-devel-doc-2.1.0-alt2
Finding Provides (using /usr/lib/rpm/find-provides)
Executing: /bin/sh -e /usr/src/tmp/rpm-tmp.GkD3FZ
find-provides: running scripts (debuginfo,lib,pam,perl,pkgconfig,python,python3,shell)
Finding Requires (using /usr/lib/rpm/find-requires)
Executing: /bin/sh -e /usr/src/tmp/rpm-tmp.qbkipZ
find-requires: running scripts (cpp,debuginfo,files,lib,pam,perl,pkgconfig,pkgconfiglib,python,python3,rpmlib,shebang,shell,static,symlinks,systemd-services)
Processing files: pete-debuginfo-2.1.0-alt2
Finding Provides (using /usr/lib/rpm/find-provides)
Executing: /bin/sh -e /usr/src/tmp/rpm-tmp.SlJaJC
find-provides: running scripts (debuginfo)
Finding Requires (using /usr/lib/rpm/find-requires)
Executing: /bin/sh -e /usr/src/tmp/rpm-tmp.yvhGyT
find-requires: running scripts (debuginfo)
Requires: pete = 2.1.0-alt2, /usr/lib/debug/lib64/ld-linux-x86-64.so.2.debug, debug64(libc.so.6), debug64(libgcc_s.so.1), debug64(libstdc++.so.6)
Wrote: /usr/src/RPM/RPMS/x86_64/pete-2.1.0-alt2.x86_64.rpm (w2.lzdio)
Wrote: /usr/src/RPM/RPMS/x86_64/libpete-devel-2.1.0-alt2.x86_64.rpm (w2.lzdio)
Wrote: /usr/src/RPM/RPMS/noarch/libpete-devel-doc-2.1.0-alt2.noarch.rpm (w2.lzdio)
Wrote: /usr/src/RPM/RPMS/x86_64/pete-debuginfo-2.1.0-alt2.x86_64.rpm (w2.lzdio)
4.02user 2.19system 0:17.44elapsed 35%CPU (0avgtext+0avgdata 139308maxresident)k
0inputs+0outputs (0major+349460minor)pagefaults 0swaps
/.out/libpete-devel-doc-2.1.0-alt2.noarch.rpm: bad symbols in the license tag: /
/.out/pete-2.1.0-alt2.x86_64.rpm: bad symbols in the license tag: /
/.out/libpete-devel-2.1.0-alt2.x86_64.rpm: bad symbols in the license tag: /
/.out/pete-debuginfo-2.1.0-alt2.x86_64.rpm: bad symbols in the license tag: /
9.52user 9.04system 0:33.64elapsed 55%CPU (0avgtext+0avgdata 139308maxresident)k
0inputs+0outputs (30626major+663792minor)pagefaults 0swaps
--- libpete-devel-2.1.0-alt2.x86_64.rpm.repo	2012-10-02 05:40:16.000000000 +0000
+++ libpete-devel-2.1.0-alt2.x86_64.rpm.hasher	2022-01-21 01:03:35.245201029 +0000
@@ -23,2 +23,2 @@
 File: /usr/include/pete/TypeComputations.h	100644	root:root	eb9d91b5aecdf800e3ea7c10d9c9ac66	
-RPMIdentity: ecfee09c115070ee154737e6485b6ce3d3ccf0f6b29d3accbc9378be2a4c21fd7f9819102aa2a78df201c273b77e19288f7f4857974869f8155b063743dd3540
+RPMIdentity: aaf086cd87867f28743878968772b4bad72a2c399baa5fcb08842a286594af5339107da48b9011362c3459dee05d973514e7fe609dc8952494f9334bb4af7306
--- libpete-devel-doc-2.1.0-alt2.noarch.rpm.repo	2012-10-02 05:40:15.000000000 +0000
+++ libpete-devel-doc-2.1.0-alt2.noarch.rpm.hasher	2022-01-21 01:03:35.433203750 +0000
@@ -32,2 +32,2 @@
 File: /usr/share/doc/pete/tut-3.html	100644	root:root	df20441f5595c74d8ad90374c9403440	
-RPMIdentity: 675a12a65b11c779b828f6b7b36103354d7357f7f2879612bf8337ff1ad66f63c41f0269365a8dc7fe16f3cb9cae37710811d13ae6c2a2795e2ab00d9614d0b1
+RPMIdentity: c5cb1f4fdf6d39a9ec5f51dd1d854a8c5154b6ad96ed879cf4496c2d3dda390d1de4503b8c32f860f3c217dbd4bb51273a532840742c7744e83184d704856b3a
--- pete-2.1.0-alt2.x86_64.rpm.repo	2012-10-02 05:40:16.000000000 +0000
+++ pete-2.1.0-alt2.x86_64.rpm.hasher	2022-01-21 01:03:35.675207252 +0000
@@ -7,2 +7,3 @@
 Requires: libc.so.6(GLIBC_2.2.5)(64bit)  
+Requires: libc.so.6(GLIBC_2.34)(64bit)  
 Requires: libc.so.6(GLIBC_2.4)(64bit)  
@@ -10,3 +11,6 @@
 Requires: libstdc++.so.6(CXXABI_1.3)(64bit)  
+Requires: libstdc++.so.6(CXXABI_1.3.9)(64bit)  
 Requires: libstdc++.so.6(GLIBCXX_3.4)(64bit)  
+Requires: libstdc++.so.6(GLIBCXX_3.4.21)(64bit)  
+Requires: libstdc++.so.6(GLIBCXX_3.4.29)(64bit)  
 Requires: rtld(GNU_HASH)  
@@ -14,3 +18,3 @@
 Provides: pete = 2.1.0-alt2
-File: /usr/bin/MakeOperators	100755	root:root	1944cbc1b343a554b0a97f01079739dd	
+File: /usr/bin/MakeOperators	100755	root:root	d8d2d2768b4b28757862a2127173e1b6	
 File: /usr/share/doc/pete-2.1.0	40755	root:root		
@@ -19,2 +23,2 @@
 File: /usr/share/doc/pete-2.1.0/README	100644	root:root	b9a873f08c7db4a870dfc5b0fe8b10fc	
-RPMIdentity: e3d830e14f80a766f51bcd17187e173d515bb52cab6f9aeb91bb340b05419be5a24905d5ba03025949ee920f4e694f9cd63a5c8d9a9a0d877632acd1e920278f
+RPMIdentity: 948d3e5415733e8e42368e90decb60247469d90f83305e1a0df72b127ddef225717eea58a5158d0058b1ed3d02c478dd4fec5b8addca0aab8c0f4199f1619998
--- pete-debuginfo-2.1.0-alt2.x86_64.rpm.repo	2012-10-02 05:40:16.000000000 +0000
+++ pete-debuginfo-2.1.0-alt2.x86_64.rpm.hasher	2022-01-21 01:03:35.886210306 +0000
@@ -1,4 +1,4 @@
-/usr/lib/debug/.build-id/46	40755	root:root	
-/usr/lib/debug/.build-id/46/b70fa047e7f7d263877368a22273b090d4f7d5	120777	root:root	../../../../bin/MakeOperators
-/usr/lib/debug/.build-id/46/b70fa047e7f7d263877368a22273b090d4f7d5.debug	120777	root:root	../../usr/bin/MakeOperators.debug
+/usr/lib/debug/.build-id/45	40755	root:root	
+/usr/lib/debug/.build-id/45/87fe2424b2e184199c70d95346d8b66c53e7b1	120777	root:root	../../../../bin/MakeOperators
+/usr/lib/debug/.build-id/45/87fe2424b2e184199c70d95346d8b66c53e7b1.debug	120777	root:root	../../usr/bin/MakeOperators.debug
 /usr/lib/debug/usr/bin/MakeOperators.debug	100644	root:root	
@@ -11,6 +11,6 @@
 Provides: pete-debuginfo = 2.1.0-alt2
-File: /usr/lib/debug/.build-id/46	40755	root:root		
-File: /usr/lib/debug/.build-id/46/b70fa047e7f7d263877368a22273b090d4f7d5	120777	root:root		../../../../bin/MakeOperators
-File: /usr/lib/debug/.build-id/46/b70fa047e7f7d263877368a22273b090d4f7d5.debug	120777	root:root		../../usr/bin/MakeOperators.debug
-File: /usr/lib/debug/usr/bin/MakeOperators.debug	100644	root:root	9cacc175366425548d5d332b6a3c2969	
-RPMIdentity: f62d41ad26549ab60b1c6c5e9bd4b7a591b78144bedb2aea11aaad34aa34531be037fab78f6c226e53a8e945555a6fdcbaa77b2912a96a4bd188b6910fb2e238
+File: /usr/lib/debug/.build-id/45	40755	root:root		
+File: /usr/lib/debug/.build-id/45/87fe2424b2e184199c70d95346d8b66c53e7b1	120777	root:root		../../../../bin/MakeOperators
+File: /usr/lib/debug/.build-id/45/87fe2424b2e184199c70d95346d8b66c53e7b1.debug	120777	root:root		../../usr/bin/MakeOperators.debug
+File: /usr/lib/debug/usr/bin/MakeOperators.debug	100644	root:root	71e3bebf97f88257ccacc9f760c32a1c	
+RPMIdentity: 4ea3d94e6db46711d473d9ef9cb858dc848d92cadbf0397a3ba71be4fd9da660db7764ab9a65bd5d7e7eb99f3982d37893a37b00db2853cb45b3cf42b68032e6