<86>Dec  1 02:23:53 userdel[2153840]: delete user 'rooter'
<86>Dec  1 02:23:53 userdel[2153840]: removed group 'rooter' owned by 'rooter'
<86>Dec  1 02:23:53 userdel[2153840]: removed shadow group 'rooter' owned by 'rooter'
<86>Dec  1 02:23:53 groupadd[2153850]: group added to /etc/group: name=rooter, GID=963
<86>Dec  1 02:23:53 groupadd[2153850]: group added to /etc/gshadow: name=rooter
<86>Dec  1 02:23:53 groupadd[2153850]: new group: name=rooter, GID=963
<86>Dec  1 02:23:53 useradd[2153859]: new user: name=rooter, UID=963, GID=963, home=/root, shell=/bin/bash
<86>Dec  1 02:23:53 userdel[2153870]: delete user 'builder'
<86>Dec  1 02:23:53 userdel[2153870]: removed group 'builder' owned by 'builder'
<86>Dec  1 02:23:53 userdel[2153870]: removed shadow group 'builder' owned by 'builder'
<86>Dec  1 02:23:53 groupadd[2153883]: group added to /etc/group: name=builder, GID=964
<86>Dec  1 02:23:53 groupadd[2153883]: group added to /etc/gshadow: name=builder
<86>Dec  1 02:23:53 groupadd[2153883]: new group: name=builder, GID=964
<86>Dec  1 02:23:53 useradd[2153890]: new user: name=builder, UID=964, GID=964, home=/usr/src, shell=/bin/bash
warning: Macro %cmake not found
warning: Macro %cmake_build not found
warning: Macro %cmake_install not found
warning: Macro %_cmake__builddir not found
<13>Dec  1 02:23:54 rpmi: libidn2-2.3.2-alt1 sisyphus+281238.100.1.2 1627476321 installed
<13>Dec  1 02:23:54 rpmi: libp11-kit-0.23.15-alt2 sisyphus+287552.300.2.1 1634541413 installed
<13>Dec  1 02:23:54 rpmi: libtasn1-4.17.0-alt2 sisyphus+285706.100.1.1 1632328563 installed
<13>Dec  1 02:23:54 rpmi: libnettle8-3.7.3-alt1 sisyphus+276723.100.1.2 1625211788 installed
<13>Dec  1 02:23:54 rpmi: libhogweed6-3.7.3-alt1 sisyphus+276723.100.1.2 1625211788 installed
<13>Dec  1 02:23:54 rpmi: libgnutls30-3.6.16-alt1 sisyphus+273086.100.1.1 1622478144 installed
<13>Dec  1 02:23:54 rpmi: libgmp-devel-6.2.1-alt4 sisyphus+288362.20.3.1 1635767885 installed
<13>Dec  1 02:23:54 rpmi: libgtest-1.11.0-alt1.2 sisyphus+277726.100.1.1 1625776384 installed
<13>Dec  1 02:23:54 rpmi: libgmock-1.11.0-alt1.2 sisyphus+277726.100.1.1 1625776384 installed
<13>Dec  1 02:23:54 rpmi: libgtest-devel-1.11.0-alt1.2 sisyphus+277726.100.1.1 1625776384 installed
<13>Dec  1 02:23:54 rpmi: libgmock-devel-1.11.0-alt1.2 sisyphus+277726.100.1.1 1625776384 installed
<13>Dec  1 02:23:54 rpmi: gcc-c++-common-1.4.27-alt1 sisyphus+278099.1300.1.1 1626028636 installed
<13>Dec  1 02:23:55 rpmi: libstdc++11-devel-11.2.1-alt1 sisyphus+285602.200.1.1 1632233545 installed
<13>Dec  1 02:23:55 rpmi: gcc11-c++-11.2.1-alt1 sisyphus+285602.200.1.1 1632233545 installed
<13>Dec  1 02:23:55 rpmi: rpm-macros-cmake-3.21.2-alt1 sisyphus+283870.20.4.1 1630084213 installed
<13>Dec  1 02:23:55 rpmi: cmake-modules-3.21.2-alt1 sisyphus+283870.20.4.1 1630084213 installed
<13>Dec  1 02:23:55 rpmi: libuv-1.42.0-alt1 sisyphus+282690.100.1.1 1628973281 installed
<13>Dec  1 02:23:55 rpmi: librhash-1.3.5-alt3 sisyphus+286141.40.2.1 1632982456 installed
<13>Dec  1 02:23:55 rpmi: libjsoncpp19-1.8.4-alt6 sisyphus+286188.300.3.1 1633010116 installed
<13>Dec  1 02:23:55 rpmi: libexpat-2.2.10-alt1 sisyphus+276608.100.1.2 1625153355 installed
<13>Dec  1 02:23:55 rpmi: publicsuffix-list-dafsa-20210929-alt1 sisyphus+286161.100.1.1 1632988273 installed
<13>Dec  1 02:23:55 rpmi: libpsl-0.21.1-alt2 sisyphus+279461.100.1.1 1626547547 installed
<13>Dec  1 02:23:55 rpmi: libnghttp2-1.41.0-alt2 sisyphus+286786.100.1.1 1633940948 installed
<13>Dec  1 02:23:55 rpmi: openldap-common-2.4.59-alt1 sisyphus+282933.100.1.1 1629124747 installed
<13>Dec  1 02:23:55 rpmi: libverto-0.3.2-alt1_1 sisyphus+279289.100.1.3 1626493868 installed
<13>Dec  1 02:23:55 rpmi: liblmdb-0.9.23-alt1 sisyphus+275369.100.1.2 1624493869 installed
<13>Dec  1 02:23:55 rpmi: libkeyutils-1.6.3-alt1 sisyphus+266061.100.1.1 1612919566 installed
<13>Dec  1 02:23:55 rpmi: libcom_err-1.46.4.0.5.4cda-alt1 sisyphus+283826.100.1.1 1629975345 installed
<13>Dec  1 02:23:55 rpmi: libbrotlicommon-1.0.9-alt2 sisyphus+278430.100.1.2 1626213212 installed
<13>Dec  1 02:23:55 rpmi: libbrotlidec-1.0.9-alt2 sisyphus+278430.100.1.2 1626213212 installed
<13>Dec  1 02:23:55 rpmi: rpm-macros-alternatives-0.5.1-alt1 sisyphus+278157.100.2.1 1626055790 installed
<13>Dec  1 02:23:55 rpmi: alternatives-0.5.1-alt1 sisyphus+278157.100.2.1 1626055790 installed
<13>Dec  1 02:23:55 rpmi: ca-certificates-2021.10.06-alt1 sisyphus+286526.200.1.1 1633528578 installed
<13>Dec  1 02:23:55 rpmi: ca-trust-0.1.2-alt1 sisyphus+233348.100.1.1 1561653823 installed
<13>Dec  1 02:23:55 rpmi: p11-kit-trust-0.23.15-alt2 sisyphus+287552.300.2.1 1634541413 installed
<13>Dec  1 02:23:55 rpmi: libcrypto1.1-1.1.1l-alt2 sisyphus+287339.100.1.1 1634383589 installed
<13>Dec  1 02:23:55 rpmi: libssl1.1-1.1.1l-alt2 sisyphus+287339.100.1.1 1634383589 installed
<86>Dec  1 02:23:55 groupadd[2158927]: group added to /etc/group: name=_keytab, GID=499
<86>Dec  1 02:23:55 groupadd[2158927]: group added to /etc/gshadow: name=_keytab
<86>Dec  1 02:23:55 groupadd[2158927]: new group: name=_keytab, GID=499
<13>Dec  1 02:23:55 rpmi: libkrb5-1.19.2-alt2 sisyphus+281652.100.1.1 1627900207 installed
<86>Dec  1 02:23:55 groupadd[2158985]: group added to /etc/group: name=sasl, GID=498
<86>Dec  1 02:23:55 groupadd[2158985]: group added to /etc/gshadow: name=sasl
<86>Dec  1 02:23:55 groupadd[2158985]: new group: name=sasl, GID=498
<13>Dec  1 02:23:55 rpmi: libsasl2-3-2.1.27-alt2.2 sisyphus+282040.40.2.1 1628929840 installed
<13>Dec  1 02:23:55 rpmi: libldap-2.4.59-alt1 sisyphus+282933.100.1.1 1629124747 installed
<13>Dec  1 02:23:55 rpmi: libcurl-7.80.0-alt1 sisyphus+290333.100.1.1 1637428403 installed
<13>Dec  1 02:23:55 rpmi: libarchive13-3.5.1-alt1 sisyphus+279480.100.1.1 1626549356 installed
<13>Dec  1 02:23:56 rpmi: cmake-3.21.2-alt1 sisyphus+283870.20.4.1 1630084213 installed
<13>Dec  1 02:23:56 rpmi: gcc-c++-11-alt1 sisyphus+285602.400.1.1 1632238564 installed
<13>Dec  1 02:23:56 rpmi: libnettle-devel-3.7.3-alt1 sisyphus+276723.100.1.2 1625211788 installed
<13>Dec  1 02:23:56 rpmi: libgnutls-devel-3.6.16-alt1 sisyphus+273086.100.1.1 1622478144 installed
<13>Dec  1 02:23:56 rpmi: libtasn1-devel-4.17.0-alt2 sisyphus+285706.100.1.1 1632328563 installed
<13>Dec  1 02:23:56 rpmi: libp11-kit-devel-0.23.15-alt2 sisyphus+287552.300.2.1 1634541413 installed
<13>Dec  1 02:23:56 rpmi: libidn2-devel-2.3.2-alt1 sisyphus+281238.100.1.2 1627476321 installed
Building target platforms: x86_64
Building for target x86_64
Wrote: /usr/src/in/nosrpm/srt-1.4.4-alt1.nosrc.rpm (w1.gzdio)
Installing srt-1.4.4-alt1.src.rpm
Building target platforms: x86_64
Building for target x86_64
Executing(%prep): /bin/sh -e /usr/src/tmp/rpm-tmp.55207
+ umask 022
+ /bin/mkdir -p /usr/src/RPM/BUILD
+ cd /usr/src/RPM/BUILD
+ cd /usr/src/RPM/BUILD
+ rm -rf srt-1.4.4
+ echo 'Source #0 (srt-1.4.4.tar):'
Source #0 (srt-1.4.4.tar):
+ /bin/tar -xf /usr/src/RPM/SOURCES/srt-1.4.4.tar
+ cd srt-1.4.4
+ /bin/chmod -c -Rf u+rwX,go-w .
+ exit 0
Executing(%build): /bin/sh -e /usr/src/tmp/rpm-tmp.55207
+ umask 022
+ /bin/mkdir -p /usr/src/RPM/BUILD
+ cd /usr/src/RPM/BUILD
+ cd srt-1.4.4
+ sed -Ei 's,(^TEST_F.*\, )(.*),\1DISABLED_\2,' test/test_ipv6.cpp test/test_muxer.cpp
+ mkdir -p x86_64-alt-linux
+ cmake -DCMAKE_SKIP_INSTALL_RPATH:BOOL=yes '-DCMAKE_C_FLAGS:STRING=-pipe -frecord-gcc-switches -Wall -g -O2 -flto=auto' '-DCMAKE_CXX_FLAGS:STRING=-pipe -frecord-gcc-switches -Wall -g -O2 -flto=auto' '-DCMAKE_Fortran_FLAGS:STRING=-pipe -frecord-gcc-switches -Wall -g -O2 -flto=auto' -DCMAKE_INSTALL_PREFIX=/usr -DINCLUDE_INSTALL_DIR:PATH=/usr/include -DLIB_INSTALL_DIR:PATH=/usr/lib64 -DSYSCONF_INSTALL_DIR:PATH=/etc -DSHARE_INSTALL_PREFIX:PATH=/usr/share -DLIB_DESTINATION=lib64 -DLIB_SUFFIX=64 -S . -B x86_64-alt-linux -DENABLE_STATIC=OFF -DENABLE_UNITTESTS=ON -DENABLE_TESTING=ON -DENABLE_GETNAMEINFO=ON -DUSE_ENCLIB=gnutls
-- The C compiler identification is GNU 11.2.1
-- The CXX compiler identification is GNU 11.2.1
-- Detecting C compiler ABI info
-- Detecting C compiler ABI info - done
-- Check for working C compiler: /usr/bin/cc - skipped
-- Detecting C compile features
-- Detecting C compile features - done
-- Detecting CXX compiler ABI info
-- Detecting CXX compiler ABI info - done
-- Check for working CXX compiler: /usr/bin/c++ - skipped
-- Detecting CXX compile features
-- Detecting CXX compile features - done
-- Found PkgConfig: /usr/bin/pkg-config (found version "0.29.2") 
-- Looking for pthread.h
-- Looking for pthread.h - found
-- Performing Test CMAKE_HAVE_LIBC_PTHREAD
-- Performing Test CMAKE_HAVE_LIBC_PTHREAD - Success
-- Found Threads: TRUE  
-- BUILD TYPE: Release
-- Performing Test HAVE_CLOCK_GETTIME_IN
-- Performing Test HAVE_CLOCK_GETTIME_IN - Success
-- CLOCK_MONOTONIC: available, no extra libs needed
-- LOGGING: ENABLED
-- USE_BUSY_WAITING: OFF (default)
-- No WITH_COMPILER_PREFIX - using C++ compiler /usr/bin/c++
-- Looking for inet_pton
-- Looking for inet_pton - found
-- Checking for pthread_(g/s)etname_np in 'pthread_np.h':
-- Looking for pthread_getname_np
-- Looking for pthread_getname_np - not found
-- Looking for pthread_setname_np
-- Looking for pthread_setname_np - not found
-- Checking for pthread_(g/s)etname_np in 'pthread.h':
-- Looking for pthread_getname_np
-- Looking for pthread_getname_np - found
-- Looking for pthread_setname_np
-- Looking for pthread_setname_np - found
-- Checking for module 'gnutls nettle'
--   Found gnutls nettle, version 3.6.16;3.7.3
-- ENCRYPTION: ENABLED, using: gnutls nettle
-- SSL libraries: gnutls;nettle
-- COMPILER: GNU (/usr/bin/c++) - GNU compat
-- NOTE: GNU 11.2.1 - assuming default C++11.
-- Looking for __atomic_fetch_add_8 in atomic
-- Looking for __atomic_fetch_add_8 in atomic - found
-- Performing Test HAVE_LIBATOMIC_COMPILES
-- Performing Test HAVE_LIBATOMIC_COMPILES - Success
-- Performing Test HAVE_LIBATOMIC_COMPILES_STATIC
-- Performing Test HAVE_LIBATOMIC_COMPILES_STATIC - Failed
-- Performing Test HAVE_GCCATOMIC_INTRINSICS
-- Performing Test HAVE_GCCATOMIC_INTRINSICS - Success
-- Performing Test HAVE_CXX_ATOMIC
-- Performing Test HAVE_CXX_ATOMIC - Success
-- Performing Test HAVE_CXX_ATOMIC_STATIC
-- Performing Test HAVE_CXX_ATOMIC_STATIC - Failed
-- STDCXX_SYNC: OFF
-- MONOTONIC_CLOCK: ON
-- DETECTED SYSTEM: LINUX;  LINUX=1
-- APP: srt_virtual: using default C++ standard
-- ADDING TRANSITIVE LINK DEP to:srt_shared :  
-- INSTALL DIRS: bin=bin lib=lib64 shlib=lib64 include=include
-- APPS: ENABLED, std=
-- APP: srtsupport_virtual: using default C++ standard
-- APP: srt-live-transmit: using default C++ standard
-- APP: srt-file-transmit: using default C++ standard
-- APP: srt-tunnel: using default C++ standard
-- DEVEL APPS (testing): ENABLED
-- APP: utility-test: using default C++ standard
-- APP: uriparser-test: using default C++ standard
-- APP: srt-test-live: using default C++ standard
-- APP: srt-test-file: using default C++ standard
-- APP: srt-test-relay: using default C++ standard
-- APP: srt-test-multiplex: using default C++ standard
-- VERSION > 3.10 -- using NEW POLICY for in_list operator
-- Found GTest: /usr/lib64/cmake/GTest/GTestConfig.cmake (found suitable version "1.11.0", minimum required is "1.8")  
-- APP: test-srt: using default C++ standard
-- Configuring done
-- Generating done
CMake Warning:
  Manually-specified variables were not used by the project:

    CMAKE_Fortran_FLAGS
    INCLUDE_INSTALL_DIR
    LIB_DESTINATION
    LIB_INSTALL_DIR
    LIB_SUFFIX
    SHARE_INSTALL_PREFIX
    SYSCONF_INSTALL_DIR


-- Build files have been written to: /usr/src/RPM/BUILD/srt-1.4.4/x86_64-alt-linux
+ cmake --build x86_64-alt-linux --verbose --parallel 16
gmake: Entering directory '/usr/src/RPM/BUILD/srt-1.4.4/x86_64-alt-linux'
/usr/bin/cmake -S/usr/src/RPM/BUILD/srt-1.4.4 -B/usr/src/RPM/BUILD/srt-1.4.4/x86_64-alt-linux --check-build-system CMakeFiles/Makefile.cmake 0
gmake: Leaving directory '/usr/src/RPM/BUILD/srt-1.4.4/x86_64-alt-linux'
gmake: Entering directory '/usr/src/RPM/BUILD/srt-1.4.4/x86_64-alt-linux'
/usr/bin/cmake -E cmake_progress_start /usr/src/RPM/BUILD/srt-1.4.4/x86_64-alt-linux/CMakeFiles /usr/src/RPM/BUILD/srt-1.4.4/x86_64-alt-linux//CMakeFiles/progress.marks
gmake: Leaving directory '/usr/src/RPM/BUILD/srt-1.4.4/x86_64-alt-linux'
/usr/bin/gmake  -f CMakeFiles/Makefile2 all
/usr/bin/gmake  -f CMakeFiles/srt_virtual.dir/build.make CMakeFiles/srt_virtual.dir/depend
/usr/bin/gmake  -f CMakeFiles/srtsupport_virtual.dir/build.make CMakeFiles/srtsupport_virtual.dir/depend
/usr/bin/gmake  -f CMakeFiles/utility-test.dir/build.make CMakeFiles/utility-test.dir/depend
/usr/bin/gmake  -f CMakeFiles/uriparser-test.dir/build.make CMakeFiles/uriparser-test.dir/depend
gmake[2]: Entering directory '/usr/src/RPM/BUILD/srt-1.4.4/x86_64-alt-linux'
cd /usr/src/RPM/BUILD/srt-1.4.4/x86_64-alt-linux && /usr/bin/cmake -E cmake_depends "Unix Makefiles" /usr/src/RPM/BUILD/srt-1.4.4 /usr/src/RPM/BUILD/srt-1.4.4 /usr/src/RPM/BUILD/srt-1.4.4/x86_64-alt-linux /usr/src/RPM/BUILD/srt-1.4.4/x86_64-alt-linux /usr/src/RPM/BUILD/srt-1.4.4/x86_64-alt-linux/CMakeFiles/utility-test.dir/DependInfo.cmake --color=
gmake[2]: Leaving directory '/usr/src/RPM/BUILD/srt-1.4.4/x86_64-alt-linux'
/usr/bin/gmake  -f CMakeFiles/utility-test.dir/build.make CMakeFiles/utility-test.dir/build
gmake[2]: Entering directory '/usr/src/RPM/BUILD/srt-1.4.4/x86_64-alt-linux'
cd /usr/src/RPM/BUILD/srt-1.4.4/x86_64-alt-linux && /usr/bin/cmake -E cmake_depends "Unix Makefiles" /usr/src/RPM/BUILD/srt-1.4.4 /usr/src/RPM/BUILD/srt-1.4.4 /usr/src/RPM/BUILD/srt-1.4.4/x86_64-alt-linux /usr/src/RPM/BUILD/srt-1.4.4/x86_64-alt-linux /usr/src/RPM/BUILD/srt-1.4.4/x86_64-alt-linux/CMakeFiles/uriparser-test.dir/DependInfo.cmake --color=
gmake[2]: Leaving directory '/usr/src/RPM/BUILD/srt-1.4.4/x86_64-alt-linux'
/usr/bin/gmake  -f CMakeFiles/uriparser-test.dir/build.make CMakeFiles/uriparser-test.dir/build
gmake[2]: Entering directory '/usr/src/RPM/BUILD/srt-1.4.4/x86_64-alt-linux'
cd /usr/src/RPM/BUILD/srt-1.4.4/x86_64-alt-linux && /usr/bin/cmake -E cmake_depends "Unix Makefiles" /usr/src/RPM/BUILD/srt-1.4.4 /usr/src/RPM/BUILD/srt-1.4.4 /usr/src/RPM/BUILD/srt-1.4.4/x86_64-alt-linux /usr/src/RPM/BUILD/srt-1.4.4/x86_64-alt-linux /usr/src/RPM/BUILD/srt-1.4.4/x86_64-alt-linux/CMakeFiles/srt_virtual.dir/DependInfo.cmake --color=
gmake[2]: Leaving directory '/usr/src/RPM/BUILD/srt-1.4.4/x86_64-alt-linux'
gmake[2]: Entering directory '/usr/src/RPM/BUILD/srt-1.4.4/x86_64-alt-linux'
cd /usr/src/RPM/BUILD/srt-1.4.4/x86_64-alt-linux && /usr/bin/cmake -E cmake_depends "Unix Makefiles" /usr/src/RPM/BUILD/srt-1.4.4 /usr/src/RPM/BUILD/srt-1.4.4 /usr/src/RPM/BUILD/srt-1.4.4/x86_64-alt-linux /usr/src/RPM/BUILD/srt-1.4.4/x86_64-alt-linux /usr/src/RPM/BUILD/srt-1.4.4/x86_64-alt-linux/CMakeFiles/srtsupport_virtual.dir/DependInfo.cmake --color=
gmake[2]: Leaving directory '/usr/src/RPM/BUILD/srt-1.4.4/x86_64-alt-linux'
/usr/bin/gmake  -f CMakeFiles/srt_virtual.dir/build.make CMakeFiles/srt_virtual.dir/build
/usr/bin/gmake  -f CMakeFiles/srtsupport_virtual.dir/build.make CMakeFiles/srtsupport_virtual.dir/build
gmake[2]: Entering directory '/usr/src/RPM/BUILD/srt-1.4.4/x86_64-alt-linux'
[ 11%] Building CXX object CMakeFiles/srtsupport_virtual.dir/apps/verbose.cpp.o
/usr/bin/c++ -DENABLE_MONOTONIC_CLOCK=1 -DENABLE_SOCK_CLOEXEC=1 -DHAI_ENABLE_SRT=1 -DHAI_PATCH=1 -DHAVE_INET_PTON=1 -DHAVE_PTHREAD_GETNAME_NP=1 -DHAVE_PTHREAD_SETNAME_NP=1 -DLINUX=1 -DSRT_ENABLE_APP_READER -DSRT_ENABLE_BINDTODEVICE -DSRT_ENABLE_CLOSE_SYNCH -DSRT_ENABLE_ENCRYPTION -DSRT_VERSION=\"1.4.4\" -DUSE_GNUTLS=1 -D_GNU_SOURCE -I/usr/src/RPM/BUILD/srt-1.4.4/common -I/usr/src/RPM/BUILD/srt-1.4.4/srtcore -I/usr/src/RPM/BUILD/srt-1.4.4/haicrypt -I/usr/src/RPM/BUILD/srt-1.4.4/x86_64-alt-linux -pipe -frecord-gcc-switches -Wall -g -O2 -flto=auto   -DENABLE_LOGGING=1 -DENABLE_GETNAMEINFO=1 -Wall -Wextra -O2 -DNDEBUG -fPIC -MD -MT CMakeFiles/srtsupport_virtual.dir/apps/verbose.cpp.o -MF CMakeFiles/srtsupport_virtual.dir/apps/verbose.cpp.o.d -o CMakeFiles/srtsupport_virtual.dir/apps/verbose.cpp.o -c /usr/src/RPM/BUILD/srt-1.4.4/apps/verbose.cpp
gmake[2]: Leaving directory '/usr/src/RPM/BUILD/srt-1.4.4/x86_64-alt-linux'
gmake[2]: Entering directory '/usr/src/RPM/BUILD/srt-1.4.4/x86_64-alt-linux'
[  5%] Building CXX object CMakeFiles/srtsupport_virtual.dir/apps/logsupport_appdefs.cpp.o
/usr/bin/c++ -DENABLE_MONOTONIC_CLOCK=1 -DENABLE_SOCK_CLOEXEC=1 -DHAI_ENABLE_SRT=1 -DHAI_PATCH=1 -DHAVE_INET_PTON=1 -DHAVE_PTHREAD_GETNAME_NP=1 -DHAVE_PTHREAD_SETNAME_NP=1 -DLINUX=1 -DSRT_ENABLE_APP_READER -DSRT_ENABLE_BINDTODEVICE -DSRT_ENABLE_CLOSE_SYNCH -DSRT_ENABLE_ENCRYPTION -DSRT_VERSION=\"1.4.4\" -DUSE_GNUTLS=1 -D_GNU_SOURCE -I/usr/src/RPM/BUILD/srt-1.4.4/common -I/usr/src/RPM/BUILD/srt-1.4.4/srtcore -I/usr/src/RPM/BUILD/srt-1.4.4/haicrypt -I/usr/src/RPM/BUILD/srt-1.4.4/x86_64-alt-linux -pipe -frecord-gcc-switches -Wall -g -O2 -flto=auto   -DENABLE_LOGGING=1 -DENABLE_GETNAMEINFO=1 -Wall -Wextra -O2 -DNDEBUG -fPIC -MD -MT CMakeFiles/srtsupport_virtual.dir/apps/logsupport_appdefs.cpp.o -MF CMakeFiles/srtsupport_virtual.dir/apps/logsupport_appdefs.cpp.o.d -o CMakeFiles/srtsupport_virtual.dir/apps/logsupport_appdefs.cpp.o -c /usr/src/RPM/BUILD/srt-1.4.4/apps/logsupport_appdefs.cpp
gmake[2]: Leaving directory '/usr/src/RPM/BUILD/srt-1.4.4/x86_64-alt-linux'
gmake[2]: Entering directory '/usr/src/RPM/BUILD/srt-1.4.4/x86_64-alt-linux'
[  1%] Building CXX object CMakeFiles/utility-test.dir/testing/utility-test.cpp.o
/usr/bin/c++ -DENABLE_MONOTONIC_CLOCK=1 -DENABLE_SOCK_CLOEXEC=1 -DHAI_ENABLE_SRT=1 -DHAI_PATCH=1 -DHAVE_INET_PTON=1 -DHAVE_PTHREAD_GETNAME_NP=1 -DHAVE_PTHREAD_SETNAME_NP=1 -DLINUX=1 -DSRT_ENABLE_APP_READER -DSRT_ENABLE_BINDTODEVICE -DSRT_ENABLE_CLOSE_SYNCH -DSRT_ENABLE_ENCRYPTION -DSRT_VERSION=\"1.4.4\" -DUSE_GNUTLS=1 -D_GNU_SOURCE -I/usr/src/RPM/BUILD/srt-1.4.4/common -I/usr/src/RPM/BUILD/srt-1.4.4/srtcore -I/usr/src/RPM/BUILD/srt-1.4.4/haicrypt -I/usr/src/RPM/BUILD/srt-1.4.4/x86_64-alt-linux -I/usr/src/RPM/BUILD/srt-1.4.4/apps -pipe -frecord-gcc-switches -Wall -g -O2 -flto=auto   -DENABLE_LOGGING=1 -DENABLE_GETNAMEINFO=1 -Wall -Wextra -O2 -DNDEBUG -fPIE -MD -MT CMakeFiles/utility-test.dir/testing/utility-test.cpp.o -MF CMakeFiles/utility-test.dir/testing/utility-test.cpp.o.d -o CMakeFiles/utility-test.dir/testing/utility-test.cpp.o -c /usr/src/RPM/BUILD/srt-1.4.4/testing/utility-test.cpp
gmake[2]: Leaving directory '/usr/src/RPM/BUILD/srt-1.4.4/x86_64-alt-linux'
gmake[2]: Entering directory '/usr/src/RPM/BUILD/srt-1.4.4/x86_64-alt-linux'
[  7%] Building CXX object CMakeFiles/srt_virtual.dir/srtcore/cache.cpp.o
/usr/bin/c++ -DENABLE_MONOTONIC_CLOCK=1 -DENABLE_SOCK_CLOEXEC=1 -DHAI_ENABLE_SRT=1 -DHAI_PATCH=1 -DHAVE_INET_PTON=1 -DHAVE_PTHREAD_GETNAME_NP=1 -DHAVE_PTHREAD_SETNAME_NP=1 -DLINUX=1 -DSRT_DYNAMIC -DSRT_ENABLE_APP_READER -DSRT_ENABLE_BINDTODEVICE -DSRT_ENABLE_CLOSE_SYNCH -DSRT_ENABLE_ENCRYPTION -DSRT_EXPORTS -DSRT_VERSION=\"1.4.4\" -DUSE_GNUTLS=1 -D_GNU_SOURCE -I/usr/src/RPM/BUILD/srt-1.4.4/common -I/usr/src/RPM/BUILD/srt-1.4.4/srtcore -I/usr/src/RPM/BUILD/srt-1.4.4/haicrypt -I/usr/src/RPM/BUILD/srt-1.4.4/x86_64-alt-linux -I/usr/include/p11-kit-1 -pipe -frecord-gcc-switches -Wall -g -O2 -flto=auto   -DENABLE_LOGGING=1 -DENABLE_GETNAMEINFO=1 -Wall -Wextra -O2 -DNDEBUG -fPIC -MD -MT CMakeFiles/srt_virtual.dir/srtcore/cache.cpp.o -MF CMakeFiles/srt_virtual.dir/srtcore/cache.cpp.o.d -o CMakeFiles/srt_virtual.dir/srtcore/cache.cpp.o -c /usr/src/RPM/BUILD/srt-1.4.4/srtcore/cache.cpp
gmake[2]: Leaving directory '/usr/src/RPM/BUILD/srt-1.4.4/x86_64-alt-linux'
gmake[2]: Entering directory '/usr/src/RPM/BUILD/srt-1.4.4/x86_64-alt-linux'
[  6%] Building CXX object CMakeFiles/srtsupport_virtual.dir/apps/socketoptions.cpp.o
/usr/bin/c++ -DENABLE_MONOTONIC_CLOCK=1 -DENABLE_SOCK_CLOEXEC=1 -DHAI_ENABLE_SRT=1 -DHAI_PATCH=1 -DHAVE_INET_PTON=1 -DHAVE_PTHREAD_GETNAME_NP=1 -DHAVE_PTHREAD_SETNAME_NP=1 -DLINUX=1 -DSRT_ENABLE_APP_READER -DSRT_ENABLE_BINDTODEVICE -DSRT_ENABLE_CLOSE_SYNCH -DSRT_ENABLE_ENCRYPTION -DSRT_VERSION=\"1.4.4\" -DUSE_GNUTLS=1 -D_GNU_SOURCE -I/usr/src/RPM/BUILD/srt-1.4.4/common -I/usr/src/RPM/BUILD/srt-1.4.4/srtcore -I/usr/src/RPM/BUILD/srt-1.4.4/haicrypt -I/usr/src/RPM/BUILD/srt-1.4.4/x86_64-alt-linux -pipe -frecord-gcc-switches -Wall -g -O2 -flto=auto   -DENABLE_LOGGING=1 -DENABLE_GETNAMEINFO=1 -Wall -Wextra -O2 -DNDEBUG -fPIC -MD -MT CMakeFiles/srtsupport_virtual.dir/apps/socketoptions.cpp.o -MF CMakeFiles/srtsupport_virtual.dir/apps/socketoptions.cpp.o.d -o CMakeFiles/srtsupport_virtual.dir/apps/socketoptions.cpp.o -c /usr/src/RPM/BUILD/srt-1.4.4/apps/socketoptions.cpp
gmake[2]: Leaving directory '/usr/src/RPM/BUILD/srt-1.4.4/x86_64-alt-linux'
gmake[2]: Entering directory '/usr/src/RPM/BUILD/srt-1.4.4/x86_64-alt-linux'
[  8%] Building CXX object CMakeFiles/srtsupport_virtual.dir/apps/uriparser.cpp.o
/usr/bin/c++ -DENABLE_MONOTONIC_CLOCK=1 -DENABLE_SOCK_CLOEXEC=1 -DHAI_ENABLE_SRT=1 -DHAI_PATCH=1 -DHAVE_INET_PTON=1 -DHAVE_PTHREAD_GETNAME_NP=1 -DHAVE_PTHREAD_SETNAME_NP=1 -DLINUX=1 -DSRT_ENABLE_APP_READER -DSRT_ENABLE_BINDTODEVICE -DSRT_ENABLE_CLOSE_SYNCH -DSRT_ENABLE_ENCRYPTION -DSRT_VERSION=\"1.4.4\" -DUSE_GNUTLS=1 -D_GNU_SOURCE -I/usr/src/RPM/BUILD/srt-1.4.4/common -I/usr/src/RPM/BUILD/srt-1.4.4/srtcore -I/usr/src/RPM/BUILD/srt-1.4.4/haicrypt -I/usr/src/RPM/BUILD/srt-1.4.4/x86_64-alt-linux -pipe -frecord-gcc-switches -Wall -g -O2 -flto=auto   -DENABLE_LOGGING=1 -DENABLE_GETNAMEINFO=1 -Wall -Wextra -O2 -DNDEBUG -fPIC -MD -MT CMakeFiles/srtsupport_virtual.dir/apps/uriparser.cpp.o -MF CMakeFiles/srtsupport_virtual.dir/apps/uriparser.cpp.o.d -o CMakeFiles/srtsupport_virtual.dir/apps/uriparser.cpp.o -c /usr/src/RPM/BUILD/srt-1.4.4/apps/uriparser.cpp
gmake[2]: Leaving directory '/usr/src/RPM/BUILD/srt-1.4.4/x86_64-alt-linux'
gmake[2]: Entering directory '/usr/src/RPM/BUILD/srt-1.4.4/x86_64-alt-linux'
[  2%] Building CXX object CMakeFiles/uriparser-test.dir/apps/uriparser.cpp.o
/usr/bin/c++ -DENABLE_MONOTONIC_CLOCK=1 -DENABLE_SOCK_CLOEXEC=1 -DHAI_ENABLE_SRT=1 -DHAI_PATCH=1 -DHAVE_INET_PTON=1 -DHAVE_PTHREAD_GETNAME_NP=1 -DHAVE_PTHREAD_SETNAME_NP=1 -DLINUX=1 -DSRT_ENABLE_APP_READER -DSRT_ENABLE_BINDTODEVICE -DSRT_ENABLE_CLOSE_SYNCH -DSRT_ENABLE_ENCRYPTION -DSRT_VERSION=\"1.4.4\" -DUSE_GNUTLS=1 -D_GNU_SOURCE -I/usr/src/RPM/BUILD/srt-1.4.4/common -I/usr/src/RPM/BUILD/srt-1.4.4/srtcore -I/usr/src/RPM/BUILD/srt-1.4.4/haicrypt -I/usr/src/RPM/BUILD/srt-1.4.4/x86_64-alt-linux -I/usr/src/RPM/BUILD/srt-1.4.4/apps -pipe -frecord-gcc-switches -Wall -g -O2 -flto=auto   -DENABLE_LOGGING=1 -DENABLE_GETNAMEINFO=1 -Wall -Wextra -O2 -DNDEBUG -fPIE -DTEST -MD -MT CMakeFiles/uriparser-test.dir/apps/uriparser.cpp.o -MF CMakeFiles/uriparser-test.dir/apps/uriparser.cpp.o.d -o CMakeFiles/uriparser-test.dir/apps/uriparser.cpp.o -c /usr/src/RPM/BUILD/srt-1.4.4/apps/uriparser.cpp
gmake[2]: Leaving directory '/usr/src/RPM/BUILD/srt-1.4.4/x86_64-alt-linux'
gmake[2]: Entering directory '/usr/src/RPM/BUILD/srt-1.4.4/x86_64-alt-linux'
[ 10%] Building CXX object CMakeFiles/srt_virtual.dir/srtcore/channel.cpp.o
/usr/bin/c++ -DENABLE_MONOTONIC_CLOCK=1 -DENABLE_SOCK_CLOEXEC=1 -DHAI_ENABLE_SRT=1 -DHAI_PATCH=1 -DHAVE_INET_PTON=1 -DHAVE_PTHREAD_GETNAME_NP=1 -DHAVE_PTHREAD_SETNAME_NP=1 -DLINUX=1 -DSRT_DYNAMIC -DSRT_ENABLE_APP_READER -DSRT_ENABLE_BINDTODEVICE -DSRT_ENABLE_CLOSE_SYNCH -DSRT_ENABLE_ENCRYPTION -DSRT_EXPORTS -DSRT_VERSION=\"1.4.4\" -DUSE_GNUTLS=1 -D_GNU_SOURCE -I/usr/src/RPM/BUILD/srt-1.4.4/common -I/usr/src/RPM/BUILD/srt-1.4.4/srtcore -I/usr/src/RPM/BUILD/srt-1.4.4/haicrypt -I/usr/src/RPM/BUILD/srt-1.4.4/x86_64-alt-linux -I/usr/include/p11-kit-1 -pipe -frecord-gcc-switches -Wall -g -O2 -flto=auto   -DENABLE_LOGGING=1 -DENABLE_GETNAMEINFO=1 -Wall -Wextra -O2 -DNDEBUG -fPIC -MD -MT CMakeFiles/srt_virtual.dir/srtcore/channel.cpp.o -MF CMakeFiles/srt_virtual.dir/srtcore/channel.cpp.o.d -o CMakeFiles/srt_virtual.dir/srtcore/channel.cpp.o -c /usr/src/RPM/BUILD/srt-1.4.4/srtcore/channel.cpp
gmake[2]: Leaving directory '/usr/src/RPM/BUILD/srt-1.4.4/x86_64-alt-linux'
gmake[2]: Entering directory '/usr/src/RPM/BUILD/srt-1.4.4/x86_64-alt-linux'
[ 16%] Linking CXX executable utility-test
/usr/bin/cmake -E cmake_link_script CMakeFiles/utility-test.dir/link.txt --verbose=1
/usr/bin/c++ -pipe -frecord-gcc-switches -Wall -g -O2 -flto=auto   -DENABLE_LOGGING=1 -DENABLE_GETNAMEINFO=1 -Wall -Wextra -O2 -DNDEBUG -rdynamic CMakeFiles/utility-test.dir/testing/utility-test.cpp.o -o utility-test 
gmake[2]: Leaving directory '/usr/src/RPM/BUILD/srt-1.4.4/x86_64-alt-linux'
gmake[1]: Entering directory '/usr/src/RPM/BUILD/srt-1.4.4/x86_64-alt-linux'
[ 21%] Built target utility-test
gmake[1]: Leaving directory '/usr/src/RPM/BUILD/srt-1.4.4/x86_64-alt-linux'
gmake[2]: Entering directory '/usr/src/RPM/BUILD/srt-1.4.4/x86_64-alt-linux'
[ 12%] Building CXX object CMakeFiles/srt_virtual.dir/srtcore/common.cpp.o
/usr/bin/c++ -DENABLE_MONOTONIC_CLOCK=1 -DENABLE_SOCK_CLOEXEC=1 -DHAI_ENABLE_SRT=1 -DHAI_PATCH=1 -DHAVE_INET_PTON=1 -DHAVE_PTHREAD_GETNAME_NP=1 -DHAVE_PTHREAD_SETNAME_NP=1 -DLINUX=1 -DSRT_DYNAMIC -DSRT_ENABLE_APP_READER -DSRT_ENABLE_BINDTODEVICE -DSRT_ENABLE_CLOSE_SYNCH -DSRT_ENABLE_ENCRYPTION -DSRT_EXPORTS -DSRT_VERSION=\"1.4.4\" -DUSE_GNUTLS=1 -D_GNU_SOURCE -I/usr/src/RPM/BUILD/srt-1.4.4/common -I/usr/src/RPM/BUILD/srt-1.4.4/srtcore -I/usr/src/RPM/BUILD/srt-1.4.4/haicrypt -I/usr/src/RPM/BUILD/srt-1.4.4/x86_64-alt-linux -I/usr/include/p11-kit-1 -pipe -frecord-gcc-switches -Wall -g -O2 -flto=auto   -DENABLE_LOGGING=1 -DENABLE_GETNAMEINFO=1 -Wall -Wextra -O2 -DNDEBUG -fPIC -MD -MT CMakeFiles/srt_virtual.dir/srtcore/common.cpp.o -MF CMakeFiles/srt_virtual.dir/srtcore/common.cpp.o.d -o CMakeFiles/srt_virtual.dir/srtcore/common.cpp.o -c /usr/src/RPM/BUILD/srt-1.4.4/srtcore/common.cpp
gmake[2]: Leaving directory '/usr/src/RPM/BUILD/srt-1.4.4/x86_64-alt-linux'
gmake[2]: Entering directory '/usr/src/RPM/BUILD/srt-1.4.4/x86_64-alt-linux'
[ 22%] Building CXX object CMakeFiles/srt_virtual.dir/srtcore/md5.cpp.o
/usr/bin/c++ -DENABLE_MONOTONIC_CLOCK=1 -DENABLE_SOCK_CLOEXEC=1 -DHAI_ENABLE_SRT=1 -DHAI_PATCH=1 -DHAVE_INET_PTON=1 -DHAVE_PTHREAD_GETNAME_NP=1 -DHAVE_PTHREAD_SETNAME_NP=1 -DLINUX=1 -DSRT_DYNAMIC -DSRT_ENABLE_APP_READER -DSRT_ENABLE_BINDTODEVICE -DSRT_ENABLE_CLOSE_SYNCH -DSRT_ENABLE_ENCRYPTION -DSRT_EXPORTS -DSRT_VERSION=\"1.4.4\" -DUSE_GNUTLS=1 -D_GNU_SOURCE -I/usr/src/RPM/BUILD/srt-1.4.4/common -I/usr/src/RPM/BUILD/srt-1.4.4/srtcore -I/usr/src/RPM/BUILD/srt-1.4.4/haicrypt -I/usr/src/RPM/BUILD/srt-1.4.4/x86_64-alt-linux -I/usr/include/p11-kit-1 -pipe -frecord-gcc-switches -Wall -g -O2 -flto=auto   -DENABLE_LOGGING=1 -DENABLE_GETNAMEINFO=1 -Wall -Wextra -O2 -DNDEBUG -fPIC -MD -MT CMakeFiles/srt_virtual.dir/srtcore/md5.cpp.o -MF CMakeFiles/srt_virtual.dir/srtcore/md5.cpp.o.d -o CMakeFiles/srt_virtual.dir/srtcore/md5.cpp.o -c /usr/src/RPM/BUILD/srt-1.4.4/srtcore/md5.cpp
gmake[2]: Leaving directory '/usr/src/RPM/BUILD/srt-1.4.4/x86_64-alt-linux'
gmake[2]: Entering directory '/usr/src/RPM/BUILD/srt-1.4.4/x86_64-alt-linux'
[  4%] Building CXX object CMakeFiles/srtsupport_virtual.dir/apps/logsupport.cpp.o
/usr/bin/c++ -DENABLE_MONOTONIC_CLOCK=1 -DENABLE_SOCK_CLOEXEC=1 -DHAI_ENABLE_SRT=1 -DHAI_PATCH=1 -DHAVE_INET_PTON=1 -DHAVE_PTHREAD_GETNAME_NP=1 -DHAVE_PTHREAD_SETNAME_NP=1 -DLINUX=1 -DSRT_ENABLE_APP_READER -DSRT_ENABLE_BINDTODEVICE -DSRT_ENABLE_CLOSE_SYNCH -DSRT_ENABLE_ENCRYPTION -DSRT_VERSION=\"1.4.4\" -DUSE_GNUTLS=1 -D_GNU_SOURCE -I/usr/src/RPM/BUILD/srt-1.4.4/common -I/usr/src/RPM/BUILD/srt-1.4.4/srtcore -I/usr/src/RPM/BUILD/srt-1.4.4/haicrypt -I/usr/src/RPM/BUILD/srt-1.4.4/x86_64-alt-linux -pipe -frecord-gcc-switches -Wall -g -O2 -flto=auto   -DENABLE_LOGGING=1 -DENABLE_GETNAMEINFO=1 -Wall -Wextra -O2 -DNDEBUG -fPIC -MD -MT CMakeFiles/srtsupport_virtual.dir/apps/logsupport.cpp.o -MF CMakeFiles/srtsupport_virtual.dir/apps/logsupport.cpp.o.d -o CMakeFiles/srtsupport_virtual.dir/apps/logsupport.cpp.o -c /usr/src/RPM/BUILD/srt-1.4.4/apps/logsupport.cpp
gmake[2]: Leaving directory '/usr/src/RPM/BUILD/srt-1.4.4/x86_64-alt-linux'
gmake[2]: Entering directory '/usr/src/RPM/BUILD/srt-1.4.4/x86_64-alt-linux'
[  5%] Building CXX object CMakeFiles/srt_virtual.dir/srtcore/buffer.cpp.o
/usr/bin/c++ -DENABLE_MONOTONIC_CLOCK=1 -DENABLE_SOCK_CLOEXEC=1 -DHAI_ENABLE_SRT=1 -DHAI_PATCH=1 -DHAVE_INET_PTON=1 -DHAVE_PTHREAD_GETNAME_NP=1 -DHAVE_PTHREAD_SETNAME_NP=1 -DLINUX=1 -DSRT_DYNAMIC -DSRT_ENABLE_APP_READER -DSRT_ENABLE_BINDTODEVICE -DSRT_ENABLE_CLOSE_SYNCH -DSRT_ENABLE_ENCRYPTION -DSRT_EXPORTS -DSRT_VERSION=\"1.4.4\" -DUSE_GNUTLS=1 -D_GNU_SOURCE -I/usr/src/RPM/BUILD/srt-1.4.4/common -I/usr/src/RPM/BUILD/srt-1.4.4/srtcore -I/usr/src/RPM/BUILD/srt-1.4.4/haicrypt -I/usr/src/RPM/BUILD/srt-1.4.4/x86_64-alt-linux -I/usr/include/p11-kit-1 -pipe -frecord-gcc-switches -Wall -g -O2 -flto=auto   -DENABLE_LOGGING=1 -DENABLE_GETNAMEINFO=1 -Wall -Wextra -O2 -DNDEBUG -fPIC -MD -MT CMakeFiles/srt_virtual.dir/srtcore/buffer.cpp.o -MF CMakeFiles/srt_virtual.dir/srtcore/buffer.cpp.o.d -o CMakeFiles/srt_virtual.dir/srtcore/buffer.cpp.o -c /usr/src/RPM/BUILD/srt-1.4.4/srtcore/buffer.cpp
gmake[2]: Leaving directory '/usr/src/RPM/BUILD/srt-1.4.4/x86_64-alt-linux'
gmake[2]: Entering directory '/usr/src/RPM/BUILD/srt-1.4.4/x86_64-alt-linux'
[ 14%] Building CXX object CMakeFiles/srt_virtual.dir/srtcore/crypto.cpp.o
/usr/bin/c++ -DENABLE_MONOTONIC_CLOCK=1 -DENABLE_SOCK_CLOEXEC=1 -DHAI_ENABLE_SRT=1 -DHAI_PATCH=1 -DHAVE_INET_PTON=1 -DHAVE_PTHREAD_GETNAME_NP=1 -DHAVE_PTHREAD_SETNAME_NP=1 -DLINUX=1 -DSRT_DYNAMIC -DSRT_ENABLE_APP_READER -DSRT_ENABLE_BINDTODEVICE -DSRT_ENABLE_CLOSE_SYNCH -DSRT_ENABLE_ENCRYPTION -DSRT_EXPORTS -DSRT_VERSION=\"1.4.4\" -DUSE_GNUTLS=1 -D_GNU_SOURCE -I/usr/src/RPM/BUILD/srt-1.4.4/common -I/usr/src/RPM/BUILD/srt-1.4.4/srtcore -I/usr/src/RPM/BUILD/srt-1.4.4/haicrypt -I/usr/src/RPM/BUILD/srt-1.4.4/x86_64-alt-linux -I/usr/include/p11-kit-1 -pipe -frecord-gcc-switches -Wall -g -O2 -flto=auto   -DENABLE_LOGGING=1 -DENABLE_GETNAMEINFO=1 -Wall -Wextra -O2 -DNDEBUG -fPIC -MD -MT CMakeFiles/srt_virtual.dir/srtcore/crypto.cpp.o -MF CMakeFiles/srt_virtual.dir/srtcore/crypto.cpp.o.d -o CMakeFiles/srt_virtual.dir/srtcore/crypto.cpp.o -c /usr/src/RPM/BUILD/srt-1.4.4/srtcore/crypto.cpp
gmake[2]: Leaving directory '/usr/src/RPM/BUILD/srt-1.4.4/x86_64-alt-linux'
gmake[2]: Entering directory '/usr/src/RPM/BUILD/srt-1.4.4/x86_64-alt-linux'
[  3%] Building CXX object CMakeFiles/srtsupport_virtual.dir/apps/apputil.cpp.o
/usr/bin/c++ -DENABLE_MONOTONIC_CLOCK=1 -DENABLE_SOCK_CLOEXEC=1 -DHAI_ENABLE_SRT=1 -DHAI_PATCH=1 -DHAVE_INET_PTON=1 -DHAVE_PTHREAD_GETNAME_NP=1 -DHAVE_PTHREAD_SETNAME_NP=1 -DLINUX=1 -DSRT_ENABLE_APP_READER -DSRT_ENABLE_BINDTODEVICE -DSRT_ENABLE_CLOSE_SYNCH -DSRT_ENABLE_ENCRYPTION -DSRT_VERSION=\"1.4.4\" -DUSE_GNUTLS=1 -D_GNU_SOURCE -I/usr/src/RPM/BUILD/srt-1.4.4/common -I/usr/src/RPM/BUILD/srt-1.4.4/srtcore -I/usr/src/RPM/BUILD/srt-1.4.4/haicrypt -I/usr/src/RPM/BUILD/srt-1.4.4/x86_64-alt-linux -pipe -frecord-gcc-switches -Wall -g -O2 -flto=auto   -DENABLE_LOGGING=1 -DENABLE_GETNAMEINFO=1 -Wall -Wextra -O2 -DNDEBUG -fPIC -MD -MT CMakeFiles/srtsupport_virtual.dir/apps/apputil.cpp.o -MF CMakeFiles/srtsupport_virtual.dir/apps/apputil.cpp.o.d -o CMakeFiles/srtsupport_virtual.dir/apps/apputil.cpp.o -c /usr/src/RPM/BUILD/srt-1.4.4/apps/apputil.cpp
gmake[2]: Leaving directory '/usr/src/RPM/BUILD/srt-1.4.4/x86_64-alt-linux'
gmake[2]: Entering directory '/usr/src/RPM/BUILD/srt-1.4.4/x86_64-alt-linux'
[  9%] Building CXX object CMakeFiles/srtsupport_virtual.dir/apps/transmitmedia.cpp.o
/usr/bin/c++ -DENABLE_MONOTONIC_CLOCK=1 -DENABLE_SOCK_CLOEXEC=1 -DHAI_ENABLE_SRT=1 -DHAI_PATCH=1 -DHAVE_INET_PTON=1 -DHAVE_PTHREAD_GETNAME_NP=1 -DHAVE_PTHREAD_SETNAME_NP=1 -DLINUX=1 -DSRT_ENABLE_APP_READER -DSRT_ENABLE_BINDTODEVICE -DSRT_ENABLE_CLOSE_SYNCH -DSRT_ENABLE_ENCRYPTION -DSRT_VERSION=\"1.4.4\" -DUSE_GNUTLS=1 -D_GNU_SOURCE -I/usr/src/RPM/BUILD/srt-1.4.4/common -I/usr/src/RPM/BUILD/srt-1.4.4/srtcore -I/usr/src/RPM/BUILD/srt-1.4.4/haicrypt -I/usr/src/RPM/BUILD/srt-1.4.4/x86_64-alt-linux -pipe -frecord-gcc-switches -Wall -g -O2 -flto=auto   -DENABLE_LOGGING=1 -DENABLE_GETNAMEINFO=1 -Wall -Wextra -O2 -DNDEBUG -fPIC -MD -MT CMakeFiles/srtsupport_virtual.dir/apps/transmitmedia.cpp.o -MF CMakeFiles/srtsupport_virtual.dir/apps/transmitmedia.cpp.o.d -o CMakeFiles/srtsupport_virtual.dir/apps/transmitmedia.cpp.o -c /usr/src/RPM/BUILD/srt-1.4.4/apps/transmitmedia.cpp
gmake[2]: Leaving directory '/usr/src/RPM/BUILD/srt-1.4.4/x86_64-alt-linux'
gmake[1]: Entering directory '/usr/src/RPM/BUILD/srt-1.4.4/x86_64-alt-linux'
[ 27%] Built target srtsupport_virtual
gmake[1]: Leaving directory '/usr/src/RPM/BUILD/srt-1.4.4/x86_64-alt-linux'
gmake[2]: Entering directory '/usr/src/RPM/BUILD/srt-1.4.4/x86_64-alt-linux'
[ 28%] Building C object CMakeFiles/srt_virtual.dir/srtcore/srt_compat.c.o
/usr/bin/cc -DENABLE_MONOTONIC_CLOCK=1 -DENABLE_SOCK_CLOEXEC=1 -DHAI_ENABLE_SRT=1 -DHAI_PATCH=1 -DHAVE_INET_PTON=1 -DHAVE_PTHREAD_GETNAME_NP=1 -DHAVE_PTHREAD_SETNAME_NP=1 -DLINUX=1 -DSRT_DYNAMIC -DSRT_ENABLE_APP_READER -DSRT_ENABLE_BINDTODEVICE -DSRT_ENABLE_CLOSE_SYNCH -DSRT_ENABLE_ENCRYPTION -DSRT_EXPORTS -DSRT_VERSION=\"1.4.4\" -DUSE_GNUTLS=1 -D_GNU_SOURCE -I/usr/src/RPM/BUILD/srt-1.4.4/common -I/usr/src/RPM/BUILD/srt-1.4.4/srtcore -I/usr/src/RPM/BUILD/srt-1.4.4/haicrypt -I/usr/src/RPM/BUILD/srt-1.4.4/x86_64-alt-linux -I/usr/include/p11-kit-1 -pipe -frecord-gcc-switches -Wall -g -O2 -flto=auto   -DENABLE_LOGGING=1 -DENABLE_GETNAMEINFO=1 -Wall -Wextra -O2 -DNDEBUG -fPIC -MD -MT CMakeFiles/srt_virtual.dir/srtcore/srt_compat.c.o -MF CMakeFiles/srt_virtual.dir/srtcore/srt_compat.c.o.d -o CMakeFiles/srt_virtual.dir/srtcore/srt_compat.c.o -c /usr/src/RPM/BUILD/srt-1.4.4/srtcore/srt_compat.c
gmake[2]: Leaving directory '/usr/src/RPM/BUILD/srt-1.4.4/x86_64-alt-linux'
gmake[2]: Entering directory '/usr/src/RPM/BUILD/srt-1.4.4/x86_64-alt-linux'
[ 29%] Building CXX object CMakeFiles/srt_virtual.dir/srtcore/strerror_defs.cpp.o
/usr/bin/c++ -DENABLE_MONOTONIC_CLOCK=1 -DENABLE_SOCK_CLOEXEC=1 -DHAI_ENABLE_SRT=1 -DHAI_PATCH=1 -DHAVE_INET_PTON=1 -DHAVE_PTHREAD_GETNAME_NP=1 -DHAVE_PTHREAD_SETNAME_NP=1 -DLINUX=1 -DSRT_DYNAMIC -DSRT_ENABLE_APP_READER -DSRT_ENABLE_BINDTODEVICE -DSRT_ENABLE_CLOSE_SYNCH -DSRT_ENABLE_ENCRYPTION -DSRT_EXPORTS -DSRT_VERSION=\"1.4.4\" -DUSE_GNUTLS=1 -D_GNU_SOURCE -I/usr/src/RPM/BUILD/srt-1.4.4/common -I/usr/src/RPM/BUILD/srt-1.4.4/srtcore -I/usr/src/RPM/BUILD/srt-1.4.4/haicrypt -I/usr/src/RPM/BUILD/srt-1.4.4/x86_64-alt-linux -I/usr/include/p11-kit-1 -pipe -frecord-gcc-switches -Wall -g -O2 -flto=auto   -DENABLE_LOGGING=1 -DENABLE_GETNAMEINFO=1 -Wall -Wextra -O2 -DNDEBUG -fPIC -MD -MT CMakeFiles/srt_virtual.dir/srtcore/strerror_defs.cpp.o -MF CMakeFiles/srt_virtual.dir/srtcore/strerror_defs.cpp.o.d -o CMakeFiles/srt_virtual.dir/srtcore/strerror_defs.cpp.o -c /usr/src/RPM/BUILD/srt-1.4.4/srtcore/strerror_defs.cpp
gmake[2]: Leaving directory '/usr/src/RPM/BUILD/srt-1.4.4/x86_64-alt-linux'
gmake[2]: Entering directory '/usr/src/RPM/BUILD/srt-1.4.4/x86_64-alt-linux'
[ 19%] Building CXX object CMakeFiles/srt_virtual.dir/srtcore/logger_default.cpp.o
/usr/bin/c++ -DENABLE_MONOTONIC_CLOCK=1 -DENABLE_SOCK_CLOEXEC=1 -DHAI_ENABLE_SRT=1 -DHAI_PATCH=1 -DHAVE_INET_PTON=1 -DHAVE_PTHREAD_GETNAME_NP=1 -DHAVE_PTHREAD_SETNAME_NP=1 -DLINUX=1 -DSRT_DYNAMIC -DSRT_ENABLE_APP_READER -DSRT_ENABLE_BINDTODEVICE -DSRT_ENABLE_CLOSE_SYNCH -DSRT_ENABLE_ENCRYPTION -DSRT_EXPORTS -DSRT_VERSION=\"1.4.4\" -DUSE_GNUTLS=1 -D_GNU_SOURCE -I/usr/src/RPM/BUILD/srt-1.4.4/common -I/usr/src/RPM/BUILD/srt-1.4.4/srtcore -I/usr/src/RPM/BUILD/srt-1.4.4/haicrypt -I/usr/src/RPM/BUILD/srt-1.4.4/x86_64-alt-linux -I/usr/include/p11-kit-1 -pipe -frecord-gcc-switches -Wall -g -O2 -flto=auto   -DENABLE_LOGGING=1 -DENABLE_GETNAMEINFO=1 -Wall -Wextra -O2 -DNDEBUG -fPIC -MD -MT CMakeFiles/srt_virtual.dir/srtcore/logger_default.cpp.o -MF CMakeFiles/srt_virtual.dir/srtcore/logger_default.cpp.o.d -o CMakeFiles/srt_virtual.dir/srtcore/logger_default.cpp.o -c /usr/src/RPM/BUILD/srt-1.4.4/srtcore/logger_default.cpp
gmake[2]: Leaving directory '/usr/src/RPM/BUILD/srt-1.4.4/x86_64-alt-linux'
gmake[2]: Entering directory '/usr/src/RPM/BUILD/srt-1.4.4/x86_64-alt-linux'
[ 15%] Building CXX object CMakeFiles/srt_virtual.dir/srtcore/epoll.cpp.o
/usr/bin/c++ -DENABLE_MONOTONIC_CLOCK=1 -DENABLE_SOCK_CLOEXEC=1 -DHAI_ENABLE_SRT=1 -DHAI_PATCH=1 -DHAVE_INET_PTON=1 -DHAVE_PTHREAD_GETNAME_NP=1 -DHAVE_PTHREAD_SETNAME_NP=1 -DLINUX=1 -DSRT_DYNAMIC -DSRT_ENABLE_APP_READER -DSRT_ENABLE_BINDTODEVICE -DSRT_ENABLE_CLOSE_SYNCH -DSRT_ENABLE_ENCRYPTION -DSRT_EXPORTS -DSRT_VERSION=\"1.4.4\" -DUSE_GNUTLS=1 -D_GNU_SOURCE -I/usr/src/RPM/BUILD/srt-1.4.4/common -I/usr/src/RPM/BUILD/srt-1.4.4/srtcore -I/usr/src/RPM/BUILD/srt-1.4.4/haicrypt -I/usr/src/RPM/BUILD/srt-1.4.4/x86_64-alt-linux -I/usr/include/p11-kit-1 -pipe -frecord-gcc-switches -Wall -g -O2 -flto=auto   -DENABLE_LOGGING=1 -DENABLE_GETNAMEINFO=1 -Wall -Wextra -O2 -DNDEBUG -fPIC -MD -MT CMakeFiles/srt_virtual.dir/srtcore/epoll.cpp.o -MF CMakeFiles/srt_virtual.dir/srtcore/epoll.cpp.o.d -o CMakeFiles/srt_virtual.dir/srtcore/epoll.cpp.o -c /usr/src/RPM/BUILD/srt-1.4.4/srtcore/epoll.cpp
gmake[2]: Leaving directory '/usr/src/RPM/BUILD/srt-1.4.4/x86_64-alt-linux'
gmake[2]: Entering directory '/usr/src/RPM/BUILD/srt-1.4.4/x86_64-alt-linux'
[ 21%] Building CXX object CMakeFiles/srt_virtual.dir/srtcore/logger_defs.cpp.o
/usr/bin/c++ -DENABLE_MONOTONIC_CLOCK=1 -DENABLE_SOCK_CLOEXEC=1 -DHAI_ENABLE_SRT=1 -DHAI_PATCH=1 -DHAVE_INET_PTON=1 -DHAVE_PTHREAD_GETNAME_NP=1 -DHAVE_PTHREAD_SETNAME_NP=1 -DLINUX=1 -DSRT_DYNAMIC -DSRT_ENABLE_APP_READER -DSRT_ENABLE_BINDTODEVICE -DSRT_ENABLE_CLOSE_SYNCH -DSRT_ENABLE_ENCRYPTION -DSRT_EXPORTS -DSRT_VERSION=\"1.4.4\" -DUSE_GNUTLS=1 -D_GNU_SOURCE -I/usr/src/RPM/BUILD/srt-1.4.4/common -I/usr/src/RPM/BUILD/srt-1.4.4/srtcore -I/usr/src/RPM/BUILD/srt-1.4.4/haicrypt -I/usr/src/RPM/BUILD/srt-1.4.4/x86_64-alt-linux -I/usr/include/p11-kit-1 -pipe -frecord-gcc-switches -Wall -g -O2 -flto=auto   -DENABLE_LOGGING=1 -DENABLE_GETNAMEINFO=1 -Wall -Wextra -O2 -DNDEBUG -fPIC -MD -MT CMakeFiles/srt_virtual.dir/srtcore/logger_defs.cpp.o -MF CMakeFiles/srt_virtual.dir/srtcore/logger_defs.cpp.o.d -o CMakeFiles/srt_virtual.dir/srtcore/logger_defs.cpp.o -c /usr/src/RPM/BUILD/srt-1.4.4/srtcore/logger_defs.cpp
gmake[2]: Leaving directory '/usr/src/RPM/BUILD/srt-1.4.4/x86_64-alt-linux'
gmake[2]: Entering directory '/usr/src/RPM/BUILD/srt-1.4.4/x86_64-alt-linux'
[ 18%] Building CXX object CMakeFiles/srt_virtual.dir/srtcore/list.cpp.o
/usr/bin/c++ -DENABLE_MONOTONIC_CLOCK=1 -DENABLE_SOCK_CLOEXEC=1 -DHAI_ENABLE_SRT=1 -DHAI_PATCH=1 -DHAVE_INET_PTON=1 -DHAVE_PTHREAD_GETNAME_NP=1 -DHAVE_PTHREAD_SETNAME_NP=1 -DLINUX=1 -DSRT_DYNAMIC -DSRT_ENABLE_APP_READER -DSRT_ENABLE_BINDTODEVICE -DSRT_ENABLE_CLOSE_SYNCH -DSRT_ENABLE_ENCRYPTION -DSRT_EXPORTS -DSRT_VERSION=\"1.4.4\" -DUSE_GNUTLS=1 -D_GNU_SOURCE -I/usr/src/RPM/BUILD/srt-1.4.4/common -I/usr/src/RPM/BUILD/srt-1.4.4/srtcore -I/usr/src/RPM/BUILD/srt-1.4.4/haicrypt -I/usr/src/RPM/BUILD/srt-1.4.4/x86_64-alt-linux -I/usr/include/p11-kit-1 -pipe -frecord-gcc-switches -Wall -g -O2 -flto=auto   -DENABLE_LOGGING=1 -DENABLE_GETNAMEINFO=1 -Wall -Wextra -O2 -DNDEBUG -fPIC -MD -MT CMakeFiles/srt_virtual.dir/srtcore/list.cpp.o -MF CMakeFiles/srt_virtual.dir/srtcore/list.cpp.o.d -o CMakeFiles/srt_virtual.dir/srtcore/list.cpp.o -c /usr/src/RPM/BUILD/srt-1.4.4/srtcore/list.cpp
gmake[2]: Leaving directory '/usr/src/RPM/BUILD/srt-1.4.4/x86_64-alt-linux'
gmake[2]: Entering directory '/usr/src/RPM/BUILD/srt-1.4.4/x86_64-alt-linux'
[ 33%] Building C object CMakeFiles/srt_virtual.dir/haicrypt/cryspr.c.o
/usr/bin/cc -DENABLE_MONOTONIC_CLOCK=1 -DENABLE_SOCK_CLOEXEC=1 -DHAI_ENABLE_SRT=1 -DHAI_PATCH=1 -DHAVE_INET_PTON=1 -DHAVE_PTHREAD_GETNAME_NP=1 -DHAVE_PTHREAD_SETNAME_NP=1 -DLINUX=1 -DSRT_DYNAMIC -DSRT_ENABLE_APP_READER -DSRT_ENABLE_BINDTODEVICE -DSRT_ENABLE_CLOSE_SYNCH -DSRT_ENABLE_ENCRYPTION -DSRT_EXPORTS -DSRT_VERSION=\"1.4.4\" -DUSE_GNUTLS=1 -D_GNU_SOURCE -I/usr/src/RPM/BUILD/srt-1.4.4/common -I/usr/src/RPM/BUILD/srt-1.4.4/srtcore -I/usr/src/RPM/BUILD/srt-1.4.4/haicrypt -I/usr/src/RPM/BUILD/srt-1.4.4/x86_64-alt-linux -I/usr/include/p11-kit-1 -pipe -frecord-gcc-switches -Wall -g -O2 -flto=auto   -DENABLE_LOGGING=1 -DENABLE_GETNAMEINFO=1 -Wall -Wextra -O2 -DNDEBUG -fPIC -MD -MT CMakeFiles/srt_virtual.dir/haicrypt/cryspr.c.o -MF CMakeFiles/srt_virtual.dir/haicrypt/cryspr.c.o.d -o CMakeFiles/srt_virtual.dir/haicrypt/cryspr.c.o -c /usr/src/RPM/BUILD/srt-1.4.4/haicrypt/cryspr.c
gmake[2]: Leaving directory '/usr/src/RPM/BUILD/srt-1.4.4/x86_64-alt-linux'
gmake[2]: Entering directory '/usr/src/RPM/BUILD/srt-1.4.4/x86_64-alt-linux'
[ 34%] Building C object CMakeFiles/srt_virtual.dir/haicrypt/cryspr-gnutls.c.o
/usr/bin/cc -DENABLE_MONOTONIC_CLOCK=1 -DENABLE_SOCK_CLOEXEC=1 -DHAI_ENABLE_SRT=1 -DHAI_PATCH=1 -DHAVE_INET_PTON=1 -DHAVE_PTHREAD_GETNAME_NP=1 -DHAVE_PTHREAD_SETNAME_NP=1 -DLINUX=1 -DSRT_DYNAMIC -DSRT_ENABLE_APP_READER -DSRT_ENABLE_BINDTODEVICE -DSRT_ENABLE_CLOSE_SYNCH -DSRT_ENABLE_ENCRYPTION -DSRT_EXPORTS -DSRT_VERSION=\"1.4.4\" -DUSE_GNUTLS=1 -D_GNU_SOURCE -I/usr/src/RPM/BUILD/srt-1.4.4/common -I/usr/src/RPM/BUILD/srt-1.4.4/srtcore -I/usr/src/RPM/BUILD/srt-1.4.4/haicrypt -I/usr/src/RPM/BUILD/srt-1.4.4/x86_64-alt-linux -I/usr/include/p11-kit-1 -pipe -frecord-gcc-switches -Wall -g -O2 -flto=auto   -DENABLE_LOGGING=1 -DENABLE_GETNAMEINFO=1 -Wall -Wextra -O2 -DNDEBUG -fPIC -MD -MT CMakeFiles/srt_virtual.dir/haicrypt/cryspr-gnutls.c.o -MF CMakeFiles/srt_virtual.dir/haicrypt/cryspr-gnutls.c.o.d -o CMakeFiles/srt_virtual.dir/haicrypt/cryspr-gnutls.c.o -c /usr/src/RPM/BUILD/srt-1.4.4/haicrypt/cryspr-gnutls.c
/usr/src/RPM/BUILD/srt-1.4.4/haicrypt/cryspr-gnutls.c: In function 'crysprGnuTLS_AES_SetKey':
/usr/src/RPM/BUILD/srt-1.4.4/haicrypt/cryspr-gnutls.c:46:9: warning: 'nettle_aes_set_encrypt_key' is deprecated [-Wdeprecated-declarations]
   46 |         aes_set_encrypt_key (aes_key, kstr_len, kstr);
      |         ^~~~~~~~~~~~~~~~~~~
In file included from /usr/src/RPM/BUILD/srt-1.4.4/haicrypt/cryspr-gnutls.h:26,
                 from /usr/src/RPM/BUILD/srt-1.4.4/haicrypt/cryspr-config.h:12,
                 from /usr/src/RPM/BUILD/srt-1.4.4/haicrypt/cryspr.h:39,
                 from /usr/src/RPM/BUILD/srt-1.4.4/haicrypt/hcrypt.h:52,
                 from /usr/src/RPM/BUILD/srt-1.4.4/haicrypt/cryspr-gnutls.c:20:
/usr/include/nettle/aes.h:158:1: note: declared here
  158 | aes_set_encrypt_key(struct aes_ctx *ctx,
      | ^~~~~~~~~~~~~~~~~~~
/usr/src/RPM/BUILD/srt-1.4.4/haicrypt/cryspr-gnutls.c:52:9: warning: 'nettle_aes_set_decrypt_key' is deprecated [-Wdeprecated-declarations]
   52 |         aes_set_decrypt_key (aes_key, kstr_len, kstr);
      |         ^~~~~~~~~~~~~~~~~~~
In file included from /usr/src/RPM/BUILD/srt-1.4.4/haicrypt/cryspr-gnutls.h:26,
                 from /usr/src/RPM/BUILD/srt-1.4.4/haicrypt/cryspr-config.h:12,
                 from /usr/src/RPM/BUILD/srt-1.4.4/haicrypt/cryspr.h:39,
                 from /usr/src/RPM/BUILD/srt-1.4.4/haicrypt/hcrypt.h:52,
                 from /usr/src/RPM/BUILD/srt-1.4.4/haicrypt/cryspr-gnutls.c:20:
/usr/include/nettle/aes.h:163:1: note: declared here
  163 | aes_set_decrypt_key(struct aes_ctx *ctx,
      | ^~~~~~~~~~~~~~~~~~~
/usr/src/RPM/BUILD/srt-1.4.4/haicrypt/cryspr-gnutls.c: In function 'crysprGnuTLS_AES_EcbCipher':
/usr/src/RPM/BUILD/srt-1.4.4/haicrypt/cryspr-gnutls.c:72:13: warning: 'nettle_aes_encrypt' is deprecated [-Wdeprecated-declarations]
   72 |             aes_encrypt(aes_key, CRYSPR_AESBLKSZ, &out_txt[(i*CRYSPR_AESBLKSZ)], &indata[(i*CRYSPR_AESBLKSZ)]);
      |             ^~~~~~~~~~~
In file included from /usr/src/RPM/BUILD/srt-1.4.4/haicrypt/cryspr-gnutls.h:26,
                 from /usr/src/RPM/BUILD/srt-1.4.4/haicrypt/cryspr-config.h:12,
                 from /usr/src/RPM/BUILD/srt-1.4.4/haicrypt/cryspr.h:39,
                 from /usr/src/RPM/BUILD/srt-1.4.4/haicrypt/hcrypt.h:52,
                 from /usr/src/RPM/BUILD/srt-1.4.4/haicrypt/cryspr-gnutls.c:20:
/usr/include/nettle/aes.h:173:1: note: declared here
  173 | aes_encrypt(const struct aes_ctx *ctx,
      | ^~~~~~~~~~~
/usr/src/RPM/BUILD/srt-1.4.4/haicrypt/cryspr-gnutls.c:80:13: warning: 'nettle_aes_encrypt' is deprecated [-Wdeprecated-declarations]
   80 |             aes_encrypt(aes_key, CRYSPR_AESBLKSZ, &out_txt[(nblk*CRYSPR_AESBLKSZ)], intxt);
      |             ^~~~~~~~~~~
In file included from /usr/src/RPM/BUILD/srt-1.4.4/haicrypt/cryspr-gnutls.h:26,
                 from /usr/src/RPM/BUILD/srt-1.4.4/haicrypt/cryspr-config.h:12,
                 from /usr/src/RPM/BUILD/srt-1.4.4/haicrypt/cryspr.h:39,
                 from /usr/src/RPM/BUILD/srt-1.4.4/haicrypt/hcrypt.h:52,
                 from /usr/src/RPM/BUILD/srt-1.4.4/haicrypt/cryspr-gnutls.c:20:
/usr/include/nettle/aes.h:173:1: note: declared here
  173 | aes_encrypt(const struct aes_ctx *ctx,
      | ^~~~~~~~~~~
/usr/src/RPM/BUILD/srt-1.4.4/haicrypt/cryspr-gnutls.c:86:13: warning: 'nettle_aes_decrypt' is deprecated [-Wdeprecated-declarations]
   86 |             aes_decrypt(aes_key, CRYSPR_AESBLKSZ, &out_txt[(i*CRYSPR_AESBLKSZ)], &indata[(i*CRYSPR_AESBLKSZ)]);
      |             ^~~~~~~~~~~
In file included from /usr/src/RPM/BUILD/srt-1.4.4/haicrypt/cryspr-gnutls.h:26,
                 from /usr/src/RPM/BUILD/srt-1.4.4/haicrypt/cryspr-config.h:12,
                 from /usr/src/RPM/BUILD/srt-1.4.4/haicrypt/cryspr.h:39,
                 from /usr/src/RPM/BUILD/srt-1.4.4/haicrypt/hcrypt.h:52,
                 from /usr/src/RPM/BUILD/srt-1.4.4/haicrypt/cryspr-gnutls.c:20:
/usr/include/nettle/aes.h:177:1: note: declared here
  177 | aes_decrypt(const struct aes_ctx *ctx,
      | ^~~~~~~~~~~
/usr/src/RPM/BUILD/srt-1.4.4/haicrypt/cryspr-gnutls.c: In function 'crysprGnuTLS_AES_CtrCipher':
/usr/src/RPM/BUILD/srt-1.4.4/haicrypt/cryspr-gnutls.c:108:16: warning: 'nettle_aes_encrypt' is deprecated [-Wdeprecated-declarations]
  108 |                (nettle_cipher_func*)aes_encrypt, /* nettle_cipher_func */
      |                ^
In file included from /usr/src/RPM/BUILD/srt-1.4.4/haicrypt/cryspr-gnutls.h:26,
                 from /usr/src/RPM/BUILD/srt-1.4.4/haicrypt/cryspr-config.h:12,
                 from /usr/src/RPM/BUILD/srt-1.4.4/haicrypt/cryspr.h:39,
                 from /usr/src/RPM/BUILD/srt-1.4.4/haicrypt/hcrypt.h:52,
                 from /usr/src/RPM/BUILD/srt-1.4.4/haicrypt/cryspr-gnutls.c:20:
/usr/include/nettle/aes.h:173:1: note: declared here
  173 | aes_encrypt(const struct aes_ctx *ctx,
      | ^~~~~~~~~~~
gmake[2]: Leaving directory '/usr/src/RPM/BUILD/srt-1.4.4/x86_64-alt-linux'
gmake[2]: Entering directory '/usr/src/RPM/BUILD/srt-1.4.4/x86_64-alt-linux'
[ 23%] Building CXX object CMakeFiles/srt_virtual.dir/srtcore/packet.cpp.o
/usr/bin/c++ -DENABLE_MONOTONIC_CLOCK=1 -DENABLE_SOCK_CLOEXEC=1 -DHAI_ENABLE_SRT=1 -DHAI_PATCH=1 -DHAVE_INET_PTON=1 -DHAVE_PTHREAD_GETNAME_NP=1 -DHAVE_PTHREAD_SETNAME_NP=1 -DLINUX=1 -DSRT_DYNAMIC -DSRT_ENABLE_APP_READER -DSRT_ENABLE_BINDTODEVICE -DSRT_ENABLE_CLOSE_SYNCH -DSRT_ENABLE_ENCRYPTION -DSRT_EXPORTS -DSRT_VERSION=\"1.4.4\" -DUSE_GNUTLS=1 -D_GNU_SOURCE -I/usr/src/RPM/BUILD/srt-1.4.4/common -I/usr/src/RPM/BUILD/srt-1.4.4/srtcore -I/usr/src/RPM/BUILD/srt-1.4.4/haicrypt -I/usr/src/RPM/BUILD/srt-1.4.4/x86_64-alt-linux -I/usr/include/p11-kit-1 -pipe -frecord-gcc-switches -Wall -g -O2 -flto=auto   -DENABLE_LOGGING=1 -DENABLE_GETNAMEINFO=1 -Wall -Wextra -O2 -DNDEBUG -fPIC -MD -MT CMakeFiles/srt_virtual.dir/srtcore/packet.cpp.o -MF CMakeFiles/srt_virtual.dir/srtcore/packet.cpp.o.d -o CMakeFiles/srt_virtual.dir/srtcore/packet.cpp.o -c /usr/src/RPM/BUILD/srt-1.4.4/srtcore/packet.cpp
gmake[2]: Leaving directory '/usr/src/RPM/BUILD/srt-1.4.4/x86_64-alt-linux'
gmake[2]: Entering directory '/usr/src/RPM/BUILD/srt-1.4.4/x86_64-alt-linux'
[ 36%] Building C object CMakeFiles/srt_virtual.dir/haicrypt/hcrypt_ctx_rx.c.o
/usr/bin/cc -DENABLE_MONOTONIC_CLOCK=1 -DENABLE_SOCK_CLOEXEC=1 -DHAI_ENABLE_SRT=1 -DHAI_PATCH=1 -DHAVE_INET_PTON=1 -DHAVE_PTHREAD_GETNAME_NP=1 -DHAVE_PTHREAD_SETNAME_NP=1 -DLINUX=1 -DSRT_DYNAMIC -DSRT_ENABLE_APP_READER -DSRT_ENABLE_BINDTODEVICE -DSRT_ENABLE_CLOSE_SYNCH -DSRT_ENABLE_ENCRYPTION -DSRT_EXPORTS -DSRT_VERSION=\"1.4.4\" -DUSE_GNUTLS=1 -D_GNU_SOURCE -I/usr/src/RPM/BUILD/srt-1.4.4/common -I/usr/src/RPM/BUILD/srt-1.4.4/srtcore -I/usr/src/RPM/BUILD/srt-1.4.4/haicrypt -I/usr/src/RPM/BUILD/srt-1.4.4/x86_64-alt-linux -I/usr/include/p11-kit-1 -pipe -frecord-gcc-switches -Wall -g -O2 -flto=auto   -DENABLE_LOGGING=1 -DENABLE_GETNAMEINFO=1 -Wall -Wextra -O2 -DNDEBUG -fPIC -MD -MT CMakeFiles/srt_virtual.dir/haicrypt/hcrypt_ctx_rx.c.o -MF CMakeFiles/srt_virtual.dir/haicrypt/hcrypt_ctx_rx.c.o.d -o CMakeFiles/srt_virtual.dir/haicrypt/hcrypt_ctx_rx.c.o -c /usr/src/RPM/BUILD/srt-1.4.4/haicrypt/hcrypt_ctx_rx.c
gmake[2]: Leaving directory '/usr/src/RPM/BUILD/srt-1.4.4/x86_64-alt-linux'
gmake[2]: Entering directory '/usr/src/RPM/BUILD/srt-1.4.4/x86_64-alt-linux'
[ 17%] Building CXX object CMakeFiles/srt_virtual.dir/srtcore/handshake.cpp.o
/usr/bin/c++ -DENABLE_MONOTONIC_CLOCK=1 -DENABLE_SOCK_CLOEXEC=1 -DHAI_ENABLE_SRT=1 -DHAI_PATCH=1 -DHAVE_INET_PTON=1 -DHAVE_PTHREAD_GETNAME_NP=1 -DHAVE_PTHREAD_SETNAME_NP=1 -DLINUX=1 -DSRT_DYNAMIC -DSRT_ENABLE_APP_READER -DSRT_ENABLE_BINDTODEVICE -DSRT_ENABLE_CLOSE_SYNCH -DSRT_ENABLE_ENCRYPTION -DSRT_EXPORTS -DSRT_VERSION=\"1.4.4\" -DUSE_GNUTLS=1 -D_GNU_SOURCE -I/usr/src/RPM/BUILD/srt-1.4.4/common -I/usr/src/RPM/BUILD/srt-1.4.4/srtcore -I/usr/src/RPM/BUILD/srt-1.4.4/haicrypt -I/usr/src/RPM/BUILD/srt-1.4.4/x86_64-alt-linux -I/usr/include/p11-kit-1 -pipe -frecord-gcc-switches -Wall -g -O2 -flto=auto   -DENABLE_LOGGING=1 -DENABLE_GETNAMEINFO=1 -Wall -Wextra -O2 -DNDEBUG -fPIC -MD -MT CMakeFiles/srt_virtual.dir/srtcore/handshake.cpp.o -MF CMakeFiles/srt_virtual.dir/srtcore/handshake.cpp.o.d -o CMakeFiles/srt_virtual.dir/srtcore/handshake.cpp.o -c /usr/src/RPM/BUILD/srt-1.4.4/srtcore/handshake.cpp
gmake[2]: Leaving directory '/usr/src/RPM/BUILD/srt-1.4.4/x86_64-alt-linux'
gmake[2]: Entering directory '/usr/src/RPM/BUILD/srt-1.4.4/x86_64-alt-linux'
[  6%] Building CXX object CMakeFiles/srt_virtual.dir/srtcore/api.cpp.o
/usr/bin/c++ -DENABLE_MONOTONIC_CLOCK=1 -DENABLE_SOCK_CLOEXEC=1 -DHAI_ENABLE_SRT=1 -DHAI_PATCH=1 -DHAVE_INET_PTON=1 -DHAVE_PTHREAD_GETNAME_NP=1 -DHAVE_PTHREAD_SETNAME_NP=1 -DLINUX=1 -DSRT_DYNAMIC -DSRT_ENABLE_APP_READER -DSRT_ENABLE_BINDTODEVICE -DSRT_ENABLE_CLOSE_SYNCH -DSRT_ENABLE_ENCRYPTION -DSRT_EXPORTS -DSRT_VERSION=\"1.4.4\" -DUSE_GNUTLS=1 -D_GNU_SOURCE -I/usr/src/RPM/BUILD/srt-1.4.4/common -I/usr/src/RPM/BUILD/srt-1.4.4/srtcore -I/usr/src/RPM/BUILD/srt-1.4.4/haicrypt -I/usr/src/RPM/BUILD/srt-1.4.4/x86_64-alt-linux -I/usr/include/p11-kit-1 -pipe -frecord-gcc-switches -Wall -g -O2 -flto=auto   -DENABLE_LOGGING=1 -DENABLE_GETNAMEINFO=1 -Wall -Wextra -O2 -DNDEBUG -fPIC -MD -MT CMakeFiles/srt_virtual.dir/srtcore/api.cpp.o -MF CMakeFiles/srt_virtual.dir/srtcore/api.cpp.o.d -o CMakeFiles/srt_virtual.dir/srtcore/api.cpp.o -c /usr/src/RPM/BUILD/srt-1.4.4/srtcore/api.cpp
gmake[2]: Leaving directory '/usr/src/RPM/BUILD/srt-1.4.4/x86_64-alt-linux'
gmake[2]: Entering directory '/usr/src/RPM/BUILD/srt-1.4.4/x86_64-alt-linux'
[ 20%] Linking CXX executable uriparser-test
/usr/bin/cmake -E cmake_link_script CMakeFiles/uriparser-test.dir/link.txt --verbose=1
/usr/bin/c++ -pipe -frecord-gcc-switches -Wall -g -O2 -flto=auto   -DENABLE_LOGGING=1 -DENABLE_GETNAMEINFO=1 -Wall -Wextra -O2 -DNDEBUG -rdynamic CMakeFiles/uriparser-test.dir/apps/uriparser.cpp.o -o uriparser-test 
gmake[2]: Leaving directory '/usr/src/RPM/BUILD/srt-1.4.4/x86_64-alt-linux'
gmake[2]: Entering directory '/usr/src/RPM/BUILD/srt-1.4.4/x86_64-alt-linux'
[ 35%] Building C object CMakeFiles/srt_virtual.dir/haicrypt/hcrypt.c.o
/usr/bin/cc -DENABLE_MONOTONIC_CLOCK=1 -DENABLE_SOCK_CLOEXEC=1 -DHAI_ENABLE_SRT=1 -DHAI_PATCH=1 -DHAVE_INET_PTON=1 -DHAVE_PTHREAD_GETNAME_NP=1 -DHAVE_PTHREAD_SETNAME_NP=1 -DLINUX=1 -DSRT_DYNAMIC -DSRT_ENABLE_APP_READER -DSRT_ENABLE_BINDTODEVICE -DSRT_ENABLE_CLOSE_SYNCH -DSRT_ENABLE_ENCRYPTION -DSRT_EXPORTS -DSRT_VERSION=\"1.4.4\" -DUSE_GNUTLS=1 -D_GNU_SOURCE -I/usr/src/RPM/BUILD/srt-1.4.4/common -I/usr/src/RPM/BUILD/srt-1.4.4/srtcore -I/usr/src/RPM/BUILD/srt-1.4.4/haicrypt -I/usr/src/RPM/BUILD/srt-1.4.4/x86_64-alt-linux -I/usr/include/p11-kit-1 -pipe -frecord-gcc-switches -Wall -g -O2 -flto=auto   -DENABLE_LOGGING=1 -DENABLE_GETNAMEINFO=1 -Wall -Wextra -O2 -DNDEBUG -fPIC -MD -MT CMakeFiles/srt_virtual.dir/haicrypt/hcrypt.c.o -MF CMakeFiles/srt_virtual.dir/haicrypt/hcrypt.c.o.d -o CMakeFiles/srt_virtual.dir/haicrypt/hcrypt.c.o -c /usr/src/RPM/BUILD/srt-1.4.4/haicrypt/hcrypt.c
gmake[2]: Leaving directory '/usr/src/RPM/BUILD/srt-1.4.4/x86_64-alt-linux'
gmake[1]: Entering directory '/usr/src/RPM/BUILD/srt-1.4.4/x86_64-alt-linux'
[ 39%] Built target uriparser-test
gmake[1]: Leaving directory '/usr/src/RPM/BUILD/srt-1.4.4/x86_64-alt-linux'
gmake[2]: Entering directory '/usr/src/RPM/BUILD/srt-1.4.4/x86_64-alt-linux'
[ 37%] Building C object CMakeFiles/srt_virtual.dir/haicrypt/hcrypt_ctx_tx.c.o
/usr/bin/cc -DENABLE_MONOTONIC_CLOCK=1 -DENABLE_SOCK_CLOEXEC=1 -DHAI_ENABLE_SRT=1 -DHAI_PATCH=1 -DHAVE_INET_PTON=1 -DHAVE_PTHREAD_GETNAME_NP=1 -DHAVE_PTHREAD_SETNAME_NP=1 -DLINUX=1 -DSRT_DYNAMIC -DSRT_ENABLE_APP_READER -DSRT_ENABLE_BINDTODEVICE -DSRT_ENABLE_CLOSE_SYNCH -DSRT_ENABLE_ENCRYPTION -DSRT_EXPORTS -DSRT_VERSION=\"1.4.4\" -DUSE_GNUTLS=1 -D_GNU_SOURCE -I/usr/src/RPM/BUILD/srt-1.4.4/common -I/usr/src/RPM/BUILD/srt-1.4.4/srtcore -I/usr/src/RPM/BUILD/srt-1.4.4/haicrypt -I/usr/src/RPM/BUILD/srt-1.4.4/x86_64-alt-linux -I/usr/include/p11-kit-1 -pipe -frecord-gcc-switches -Wall -g -O2 -flto=auto   -DENABLE_LOGGING=1 -DENABLE_GETNAMEINFO=1 -Wall -Wextra -O2 -DNDEBUG -fPIC -MD -MT CMakeFiles/srt_virtual.dir/haicrypt/hcrypt_ctx_tx.c.o -MF CMakeFiles/srt_virtual.dir/haicrypt/hcrypt_ctx_tx.c.o.d -o CMakeFiles/srt_virtual.dir/haicrypt/hcrypt_ctx_tx.c.o -c /usr/src/RPM/BUILD/srt-1.4.4/haicrypt/hcrypt_ctx_tx.c
gmake[2]: Leaving directory '/usr/src/RPM/BUILD/srt-1.4.4/x86_64-alt-linux'
gmake[2]: Entering directory '/usr/src/RPM/BUILD/srt-1.4.4/x86_64-alt-linux'
[ 38%] Building C object CMakeFiles/srt_virtual.dir/haicrypt/hcrypt_sa.c.o
/usr/bin/cc -DENABLE_MONOTONIC_CLOCK=1 -DENABLE_SOCK_CLOEXEC=1 -DHAI_ENABLE_SRT=1 -DHAI_PATCH=1 -DHAVE_INET_PTON=1 -DHAVE_PTHREAD_GETNAME_NP=1 -DHAVE_PTHREAD_SETNAME_NP=1 -DLINUX=1 -DSRT_DYNAMIC -DSRT_ENABLE_APP_READER -DSRT_ENABLE_BINDTODEVICE -DSRT_ENABLE_CLOSE_SYNCH -DSRT_ENABLE_ENCRYPTION -DSRT_EXPORTS -DSRT_VERSION=\"1.4.4\" -DUSE_GNUTLS=1 -D_GNU_SOURCE -I/usr/src/RPM/BUILD/srt-1.4.4/common -I/usr/src/RPM/BUILD/srt-1.4.4/srtcore -I/usr/src/RPM/BUILD/srt-1.4.4/haicrypt -I/usr/src/RPM/BUILD/srt-1.4.4/x86_64-alt-linux -I/usr/include/p11-kit-1 -pipe -frecord-gcc-switches -Wall -g -O2 -flto=auto   -DENABLE_LOGGING=1 -DENABLE_GETNAMEINFO=1 -Wall -Wextra -O2 -DNDEBUG -fPIC -MD -MT CMakeFiles/srt_virtual.dir/haicrypt/hcrypt_sa.c.o -MF CMakeFiles/srt_virtual.dir/haicrypt/hcrypt_sa.c.o.d -o CMakeFiles/srt_virtual.dir/haicrypt/hcrypt_sa.c.o -c /usr/src/RPM/BUILD/srt-1.4.4/haicrypt/hcrypt_sa.c
gmake[2]: Leaving directory '/usr/src/RPM/BUILD/srt-1.4.4/x86_64-alt-linux'
gmake[2]: Entering directory '/usr/src/RPM/BUILD/srt-1.4.4/x86_64-alt-linux'
[ 40%] Building C object CMakeFiles/srt_virtual.dir/haicrypt/hcrypt_xpt_srt.c.o
/usr/bin/cc -DENABLE_MONOTONIC_CLOCK=1 -DENABLE_SOCK_CLOEXEC=1 -DHAI_ENABLE_SRT=1 -DHAI_PATCH=1 -DHAVE_INET_PTON=1 -DHAVE_PTHREAD_GETNAME_NP=1 -DHAVE_PTHREAD_SETNAME_NP=1 -DLINUX=1 -DSRT_DYNAMIC -DSRT_ENABLE_APP_READER -DSRT_ENABLE_BINDTODEVICE -DSRT_ENABLE_CLOSE_SYNCH -DSRT_ENABLE_ENCRYPTION -DSRT_EXPORTS -DSRT_VERSION=\"1.4.4\" -DUSE_GNUTLS=1 -D_GNU_SOURCE -I/usr/src/RPM/BUILD/srt-1.4.4/common -I/usr/src/RPM/BUILD/srt-1.4.4/srtcore -I/usr/src/RPM/BUILD/srt-1.4.4/haicrypt -I/usr/src/RPM/BUILD/srt-1.4.4/x86_64-alt-linux -I/usr/include/p11-kit-1 -pipe -frecord-gcc-switches -Wall -g -O2 -flto=auto   -DENABLE_LOGGING=1 -DENABLE_GETNAMEINFO=1 -Wall -Wextra -O2 -DNDEBUG -fPIC -MD -MT CMakeFiles/srt_virtual.dir/haicrypt/hcrypt_xpt_srt.c.o -MF CMakeFiles/srt_virtual.dir/haicrypt/hcrypt_xpt_srt.c.o.d -o CMakeFiles/srt_virtual.dir/haicrypt/hcrypt_xpt_srt.c.o -c /usr/src/RPM/BUILD/srt-1.4.4/haicrypt/hcrypt_xpt_srt.c
gmake[2]: Leaving directory '/usr/src/RPM/BUILD/srt-1.4.4/x86_64-alt-linux'
gmake[2]: Entering directory '/usr/src/RPM/BUILD/srt-1.4.4/x86_64-alt-linux'
[ 37%] Building C object CMakeFiles/srt_virtual.dir/haicrypt/hcrypt_rx.c.o
/usr/bin/cc -DENABLE_MONOTONIC_CLOCK=1 -DENABLE_SOCK_CLOEXEC=1 -DHAI_ENABLE_SRT=1 -DHAI_PATCH=1 -DHAVE_INET_PTON=1 -DHAVE_PTHREAD_GETNAME_NP=1 -DHAVE_PTHREAD_SETNAME_NP=1 -DLINUX=1 -DSRT_DYNAMIC -DSRT_ENABLE_APP_READER -DSRT_ENABLE_BINDTODEVICE -DSRT_ENABLE_CLOSE_SYNCH -DSRT_ENABLE_ENCRYPTION -DSRT_EXPORTS -DSRT_VERSION=\"1.4.4\" -DUSE_GNUTLS=1 -D_GNU_SOURCE -I/usr/src/RPM/BUILD/srt-1.4.4/common -I/usr/src/RPM/BUILD/srt-1.4.4/srtcore -I/usr/src/RPM/BUILD/srt-1.4.4/haicrypt -I/usr/src/RPM/BUILD/srt-1.4.4/x86_64-alt-linux -I/usr/include/p11-kit-1 -pipe -frecord-gcc-switches -Wall -g -O2 -flto=auto   -DENABLE_LOGGING=1 -DENABLE_GETNAMEINFO=1 -Wall -Wextra -O2 -DNDEBUG -fPIC -MD -MT CMakeFiles/srt_virtual.dir/haicrypt/hcrypt_rx.c.o -MF CMakeFiles/srt_virtual.dir/haicrypt/hcrypt_rx.c.o.d -o CMakeFiles/srt_virtual.dir/haicrypt/hcrypt_rx.c.o -c /usr/src/RPM/BUILD/srt-1.4.4/haicrypt/hcrypt_rx.c
gmake[2]: Leaving directory '/usr/src/RPM/BUILD/srt-1.4.4/x86_64-alt-linux'
gmake[2]: Entering directory '/usr/src/RPM/BUILD/srt-1.4.4/x86_64-alt-linux'
[ 41%] Building CXX object CMakeFiles/srt_virtual.dir/haicrypt/haicrypt_log.cpp.o
/usr/bin/c++ -DENABLE_MONOTONIC_CLOCK=1 -DENABLE_SOCK_CLOEXEC=1 -DHAI_ENABLE_SRT=1 -DHAI_PATCH=1 -DHAVE_INET_PTON=1 -DHAVE_PTHREAD_GETNAME_NP=1 -DHAVE_PTHREAD_SETNAME_NP=1 -DLINUX=1 -DSRT_DYNAMIC -DSRT_ENABLE_APP_READER -DSRT_ENABLE_BINDTODEVICE -DSRT_ENABLE_CLOSE_SYNCH -DSRT_ENABLE_ENCRYPTION -DSRT_EXPORTS -DSRT_VERSION=\"1.4.4\" -DUSE_GNUTLS=1 -D_GNU_SOURCE -I/usr/src/RPM/BUILD/srt-1.4.4/common -I/usr/src/RPM/BUILD/srt-1.4.4/srtcore -I/usr/src/RPM/BUILD/srt-1.4.4/haicrypt -I/usr/src/RPM/BUILD/srt-1.4.4/x86_64-alt-linux -I/usr/include/p11-kit-1 -pipe -frecord-gcc-switches -Wall -g -O2 -flto=auto   -DENABLE_LOGGING=1 -DENABLE_GETNAMEINFO=1 -Wall -Wextra -O2 -DNDEBUG -fPIC -MD -MT CMakeFiles/srt_virtual.dir/haicrypt/haicrypt_log.cpp.o -MF CMakeFiles/srt_virtual.dir/haicrypt/haicrypt_log.cpp.o.d -o CMakeFiles/srt_virtual.dir/haicrypt/haicrypt_log.cpp.o -c /usr/src/RPM/BUILD/srt-1.4.4/haicrypt/haicrypt_log.cpp
gmake[2]: Leaving directory '/usr/src/RPM/BUILD/srt-1.4.4/x86_64-alt-linux'
gmake[2]: Entering directory '/usr/src/RPM/BUILD/srt-1.4.4/x86_64-alt-linux'
[ 39%] Building C object CMakeFiles/srt_virtual.dir/haicrypt/hcrypt_tx.c.o
/usr/bin/cc -DENABLE_MONOTONIC_CLOCK=1 -DENABLE_SOCK_CLOEXEC=1 -DHAI_ENABLE_SRT=1 -DHAI_PATCH=1 -DHAVE_INET_PTON=1 -DHAVE_PTHREAD_GETNAME_NP=1 -DHAVE_PTHREAD_SETNAME_NP=1 -DLINUX=1 -DSRT_DYNAMIC -DSRT_ENABLE_APP_READER -DSRT_ENABLE_BINDTODEVICE -DSRT_ENABLE_CLOSE_SYNCH -DSRT_ENABLE_ENCRYPTION -DSRT_EXPORTS -DSRT_VERSION=\"1.4.4\" -DUSE_GNUTLS=1 -D_GNU_SOURCE -I/usr/src/RPM/BUILD/srt-1.4.4/common -I/usr/src/RPM/BUILD/srt-1.4.4/srtcore -I/usr/src/RPM/BUILD/srt-1.4.4/haicrypt -I/usr/src/RPM/BUILD/srt-1.4.4/x86_64-alt-linux -I/usr/include/p11-kit-1 -pipe -frecord-gcc-switches -Wall -g -O2 -flto=auto   -DENABLE_LOGGING=1 -DENABLE_GETNAMEINFO=1 -Wall -Wextra -O2 -DNDEBUG -fPIC -MD -MT CMakeFiles/srt_virtual.dir/haicrypt/hcrypt_tx.c.o -MF CMakeFiles/srt_virtual.dir/haicrypt/hcrypt_tx.c.o.d -o CMakeFiles/srt_virtual.dir/haicrypt/hcrypt_tx.c.o -c /usr/src/RPM/BUILD/srt-1.4.4/haicrypt/hcrypt_tx.c
gmake[2]: Leaving directory '/usr/src/RPM/BUILD/srt-1.4.4/x86_64-alt-linux'
gmake[2]: Entering directory '/usr/src/RPM/BUILD/srt-1.4.4/x86_64-alt-linux'
[ 27%] Building CXX object CMakeFiles/srt_virtual.dir/srtcore/srt_c_api.cpp.o
/usr/bin/c++ -DENABLE_MONOTONIC_CLOCK=1 -DENABLE_SOCK_CLOEXEC=1 -DHAI_ENABLE_SRT=1 -DHAI_PATCH=1 -DHAVE_INET_PTON=1 -DHAVE_PTHREAD_GETNAME_NP=1 -DHAVE_PTHREAD_SETNAME_NP=1 -DLINUX=1 -DSRT_DYNAMIC -DSRT_ENABLE_APP_READER -DSRT_ENABLE_BINDTODEVICE -DSRT_ENABLE_CLOSE_SYNCH -DSRT_ENABLE_ENCRYPTION -DSRT_EXPORTS -DSRT_VERSION=\"1.4.4\" -DUSE_GNUTLS=1 -D_GNU_SOURCE -I/usr/src/RPM/BUILD/srt-1.4.4/common -I/usr/src/RPM/BUILD/srt-1.4.4/srtcore -I/usr/src/RPM/BUILD/srt-1.4.4/haicrypt -I/usr/src/RPM/BUILD/srt-1.4.4/x86_64-alt-linux -I/usr/include/p11-kit-1 -pipe -frecord-gcc-switches -Wall -g -O2 -flto=auto   -DENABLE_LOGGING=1 -DENABLE_GETNAMEINFO=1 -Wall -Wextra -O2 -DNDEBUG -fPIC -MD -MT CMakeFiles/srt_virtual.dir/srtcore/srt_c_api.cpp.o -MF CMakeFiles/srt_virtual.dir/srtcore/srt_c_api.cpp.o.d -o CMakeFiles/srt_virtual.dir/srtcore/srt_c_api.cpp.o -c /usr/src/RPM/BUILD/srt-1.4.4/srtcore/srt_c_api.cpp
gmake[2]: Leaving directory '/usr/src/RPM/BUILD/srt-1.4.4/x86_64-alt-linux'
gmake[2]: Entering directory '/usr/src/RPM/BUILD/srt-1.4.4/x86_64-alt-linux'
[ 26%] Building CXX object CMakeFiles/srt_virtual.dir/srtcore/socketconfig.cpp.o
/usr/bin/c++ -DENABLE_MONOTONIC_CLOCK=1 -DENABLE_SOCK_CLOEXEC=1 -DHAI_ENABLE_SRT=1 -DHAI_PATCH=1 -DHAVE_INET_PTON=1 -DHAVE_PTHREAD_GETNAME_NP=1 -DHAVE_PTHREAD_SETNAME_NP=1 -DLINUX=1 -DSRT_DYNAMIC -DSRT_ENABLE_APP_READER -DSRT_ENABLE_BINDTODEVICE -DSRT_ENABLE_CLOSE_SYNCH -DSRT_ENABLE_ENCRYPTION -DSRT_EXPORTS -DSRT_VERSION=\"1.4.4\" -DUSE_GNUTLS=1 -D_GNU_SOURCE -I/usr/src/RPM/BUILD/srt-1.4.4/common -I/usr/src/RPM/BUILD/srt-1.4.4/srtcore -I/usr/src/RPM/BUILD/srt-1.4.4/haicrypt -I/usr/src/RPM/BUILD/srt-1.4.4/x86_64-alt-linux -I/usr/include/p11-kit-1 -pipe -frecord-gcc-switches -Wall -g -O2 -flto=auto   -DENABLE_LOGGING=1 -DENABLE_GETNAMEINFO=1 -Wall -Wextra -O2 -DNDEBUG -fPIC -MD -MT CMakeFiles/srt_virtual.dir/srtcore/socketconfig.cpp.o -MF CMakeFiles/srt_virtual.dir/srtcore/socketconfig.cpp.o.d -o CMakeFiles/srt_virtual.dir/srtcore/socketconfig.cpp.o -c /usr/src/RPM/BUILD/srt-1.4.4/srtcore/socketconfig.cpp
gmake[2]: Leaving directory '/usr/src/RPM/BUILD/srt-1.4.4/x86_64-alt-linux'
gmake[2]: Entering directory '/usr/src/RPM/BUILD/srt-1.4.4/x86_64-alt-linux'
[ 25%] Building CXX object CMakeFiles/srt_virtual.dir/srtcore/congctl.cpp.o
/usr/bin/c++ -DENABLE_MONOTONIC_CLOCK=1 -DENABLE_SOCK_CLOEXEC=1 -DHAI_ENABLE_SRT=1 -DHAI_PATCH=1 -DHAVE_INET_PTON=1 -DHAVE_PTHREAD_GETNAME_NP=1 -DHAVE_PTHREAD_SETNAME_NP=1 -DLINUX=1 -DSRT_DYNAMIC -DSRT_ENABLE_APP_READER -DSRT_ENABLE_BINDTODEVICE -DSRT_ENABLE_CLOSE_SYNCH -DSRT_ENABLE_ENCRYPTION -DSRT_EXPORTS -DSRT_VERSION=\"1.4.4\" -DUSE_GNUTLS=1 -D_GNU_SOURCE -I/usr/src/RPM/BUILD/srt-1.4.4/common -I/usr/src/RPM/BUILD/srt-1.4.4/srtcore -I/usr/src/RPM/BUILD/srt-1.4.4/haicrypt -I/usr/src/RPM/BUILD/srt-1.4.4/x86_64-alt-linux -I/usr/include/p11-kit-1 -pipe -frecord-gcc-switches -Wall -g -O2 -flto=auto   -DENABLE_LOGGING=1 -DENABLE_GETNAMEINFO=1 -Wall -Wextra -O2 -DNDEBUG -fPIC -MD -MT CMakeFiles/srt_virtual.dir/srtcore/congctl.cpp.o -MF CMakeFiles/srt_virtual.dir/srtcore/congctl.cpp.o.d -o CMakeFiles/srt_virtual.dir/srtcore/congctl.cpp.o -c /usr/src/RPM/BUILD/srt-1.4.4/srtcore/congctl.cpp
gmake[2]: Leaving directory '/usr/src/RPM/BUILD/srt-1.4.4/x86_64-alt-linux'
gmake[2]: Entering directory '/usr/src/RPM/BUILD/srt-1.4.4/x86_64-alt-linux'
[ 15%] Building CXX object CMakeFiles/srt_virtual.dir/srtcore/fec.cpp.o
/usr/bin/c++ -DENABLE_MONOTONIC_CLOCK=1 -DENABLE_SOCK_CLOEXEC=1 -DHAI_ENABLE_SRT=1 -DHAI_PATCH=1 -DHAVE_INET_PTON=1 -DHAVE_PTHREAD_GETNAME_NP=1 -DHAVE_PTHREAD_SETNAME_NP=1 -DLINUX=1 -DSRT_DYNAMIC -DSRT_ENABLE_APP_READER -DSRT_ENABLE_BINDTODEVICE -DSRT_ENABLE_CLOSE_SYNCH -DSRT_ENABLE_ENCRYPTION -DSRT_EXPORTS -DSRT_VERSION=\"1.4.4\" -DUSE_GNUTLS=1 -D_GNU_SOURCE -I/usr/src/RPM/BUILD/srt-1.4.4/common -I/usr/src/RPM/BUILD/srt-1.4.4/srtcore -I/usr/src/RPM/BUILD/srt-1.4.4/haicrypt -I/usr/src/RPM/BUILD/srt-1.4.4/x86_64-alt-linux -I/usr/include/p11-kit-1 -pipe -frecord-gcc-switches -Wall -g -O2 -flto=auto   -DENABLE_LOGGING=1 -DENABLE_GETNAMEINFO=1 -Wall -Wextra -O2 -DNDEBUG -fPIC -MD -MT CMakeFiles/srt_virtual.dir/srtcore/fec.cpp.o -MF CMakeFiles/srt_virtual.dir/srtcore/fec.cpp.o.d -o CMakeFiles/srt_virtual.dir/srtcore/fec.cpp.o -c /usr/src/RPM/BUILD/srt-1.4.4/srtcore/fec.cpp
gmake[2]: Leaving directory '/usr/src/RPM/BUILD/srt-1.4.4/x86_64-alt-linux'
gmake[2]: Entering directory '/usr/src/RPM/BUILD/srt-1.4.4/x86_64-alt-linux'
[ 24%] Building CXX object CMakeFiles/srt_virtual.dir/srtcore/packetfilter.cpp.o
/usr/bin/c++ -DENABLE_MONOTONIC_CLOCK=1 -DENABLE_SOCK_CLOEXEC=1 -DHAI_ENABLE_SRT=1 -DHAI_PATCH=1 -DHAVE_INET_PTON=1 -DHAVE_PTHREAD_GETNAME_NP=1 -DHAVE_PTHREAD_SETNAME_NP=1 -DLINUX=1 -DSRT_DYNAMIC -DSRT_ENABLE_APP_READER -DSRT_ENABLE_BINDTODEVICE -DSRT_ENABLE_CLOSE_SYNCH -DSRT_ENABLE_ENCRYPTION -DSRT_EXPORTS -DSRT_VERSION=\"1.4.4\" -DUSE_GNUTLS=1 -D_GNU_SOURCE -I/usr/src/RPM/BUILD/srt-1.4.4/common -I/usr/src/RPM/BUILD/srt-1.4.4/srtcore -I/usr/src/RPM/BUILD/srt-1.4.4/haicrypt -I/usr/src/RPM/BUILD/srt-1.4.4/x86_64-alt-linux -I/usr/include/p11-kit-1 -pipe -frecord-gcc-switches -Wall -g -O2 -flto=auto   -DENABLE_LOGGING=1 -DENABLE_GETNAMEINFO=1 -Wall -Wextra -O2 -DNDEBUG -fPIC -MD -MT CMakeFiles/srt_virtual.dir/srtcore/packetfilter.cpp.o -MF CMakeFiles/srt_virtual.dir/srtcore/packetfilter.cpp.o.d -o CMakeFiles/srt_virtual.dir/srtcore/packetfilter.cpp.o -c /usr/src/RPM/BUILD/srt-1.4.4/srtcore/packetfilter.cpp
gmake[2]: Leaving directory '/usr/src/RPM/BUILD/srt-1.4.4/x86_64-alt-linux'
gmake[2]: Entering directory '/usr/src/RPM/BUILD/srt-1.4.4/x86_64-alt-linux'
[ 30%] Building CXX object CMakeFiles/srt_virtual.dir/srtcore/sync.cpp.o
/usr/bin/c++ -DENABLE_MONOTONIC_CLOCK=1 -DENABLE_SOCK_CLOEXEC=1 -DHAI_ENABLE_SRT=1 -DHAI_PATCH=1 -DHAVE_INET_PTON=1 -DHAVE_PTHREAD_GETNAME_NP=1 -DHAVE_PTHREAD_SETNAME_NP=1 -DLINUX=1 -DSRT_DYNAMIC -DSRT_ENABLE_APP_READER -DSRT_ENABLE_BINDTODEVICE -DSRT_ENABLE_CLOSE_SYNCH -DSRT_ENABLE_ENCRYPTION -DSRT_EXPORTS -DSRT_VERSION=\"1.4.4\" -DUSE_GNUTLS=1 -D_GNU_SOURCE -I/usr/src/RPM/BUILD/srt-1.4.4/common -I/usr/src/RPM/BUILD/srt-1.4.4/srtcore -I/usr/src/RPM/BUILD/srt-1.4.4/haicrypt -I/usr/src/RPM/BUILD/srt-1.4.4/x86_64-alt-linux -I/usr/include/p11-kit-1 -pipe -frecord-gcc-switches -Wall -g -O2 -flto=auto   -DENABLE_LOGGING=1 -DENABLE_GETNAMEINFO=1 -Wall -Wextra -O2 -DNDEBUG -fPIC -MD -MT CMakeFiles/srt_virtual.dir/srtcore/sync.cpp.o -MF CMakeFiles/srt_virtual.dir/srtcore/sync.cpp.o.d -o CMakeFiles/srt_virtual.dir/srtcore/sync.cpp.o -c /usr/src/RPM/BUILD/srt-1.4.4/srtcore/sync.cpp
gmake[2]: Leaving directory '/usr/src/RPM/BUILD/srt-1.4.4/x86_64-alt-linux'
gmake[2]: Entering directory '/usr/src/RPM/BUILD/srt-1.4.4/x86_64-alt-linux'
[ 31%] Building CXX object CMakeFiles/srt_virtual.dir/srtcore/tsbpd_time.cpp.o
/usr/bin/c++ -DENABLE_MONOTONIC_CLOCK=1 -DENABLE_SOCK_CLOEXEC=1 -DHAI_ENABLE_SRT=1 -DHAI_PATCH=1 -DHAVE_INET_PTON=1 -DHAVE_PTHREAD_GETNAME_NP=1 -DHAVE_PTHREAD_SETNAME_NP=1 -DLINUX=1 -DSRT_DYNAMIC -DSRT_ENABLE_APP_READER -DSRT_ENABLE_BINDTODEVICE -DSRT_ENABLE_CLOSE_SYNCH -DSRT_ENABLE_ENCRYPTION -DSRT_EXPORTS -DSRT_VERSION=\"1.4.4\" -DUSE_GNUTLS=1 -D_GNU_SOURCE -I/usr/src/RPM/BUILD/srt-1.4.4/common -I/usr/src/RPM/BUILD/srt-1.4.4/srtcore -I/usr/src/RPM/BUILD/srt-1.4.4/haicrypt -I/usr/src/RPM/BUILD/srt-1.4.4/x86_64-alt-linux -I/usr/include/p11-kit-1 -pipe -frecord-gcc-switches -Wall -g -O2 -flto=auto   -DENABLE_LOGGING=1 -DENABLE_GETNAMEINFO=1 -Wall -Wextra -O2 -DNDEBUG -fPIC -MD -MT CMakeFiles/srt_virtual.dir/srtcore/tsbpd_time.cpp.o -MF CMakeFiles/srt_virtual.dir/srtcore/tsbpd_time.cpp.o.d -o CMakeFiles/srt_virtual.dir/srtcore/tsbpd_time.cpp.o -c /usr/src/RPM/BUILD/srt-1.4.4/srtcore/tsbpd_time.cpp
gmake[2]: Leaving directory '/usr/src/RPM/BUILD/srt-1.4.4/x86_64-alt-linux'
gmake[2]: Entering directory '/usr/src/RPM/BUILD/srt-1.4.4/x86_64-alt-linux'
[ 31%] Building CXX object CMakeFiles/srt_virtual.dir/srtcore/window.cpp.o
/usr/bin/c++ -DENABLE_MONOTONIC_CLOCK=1 -DENABLE_SOCK_CLOEXEC=1 -DHAI_ENABLE_SRT=1 -DHAI_PATCH=1 -DHAVE_INET_PTON=1 -DHAVE_PTHREAD_GETNAME_NP=1 -DHAVE_PTHREAD_SETNAME_NP=1 -DLINUX=1 -DSRT_DYNAMIC -DSRT_ENABLE_APP_READER -DSRT_ENABLE_BINDTODEVICE -DSRT_ENABLE_CLOSE_SYNCH -DSRT_ENABLE_ENCRYPTION -DSRT_EXPORTS -DSRT_VERSION=\"1.4.4\" -DUSE_GNUTLS=1 -D_GNU_SOURCE -I/usr/src/RPM/BUILD/srt-1.4.4/common -I/usr/src/RPM/BUILD/srt-1.4.4/srtcore -I/usr/src/RPM/BUILD/srt-1.4.4/haicrypt -I/usr/src/RPM/BUILD/srt-1.4.4/x86_64-alt-linux -I/usr/include/p11-kit-1 -pipe -frecord-gcc-switches -Wall -g -O2 -flto=auto   -DENABLE_LOGGING=1 -DENABLE_GETNAMEINFO=1 -Wall -Wextra -O2 -DNDEBUG -fPIC -MD -MT CMakeFiles/srt_virtual.dir/srtcore/window.cpp.o -MF CMakeFiles/srt_virtual.dir/srtcore/window.cpp.o.d -o CMakeFiles/srt_virtual.dir/srtcore/window.cpp.o -c /usr/src/RPM/BUILD/srt-1.4.4/srtcore/window.cpp
gmake[2]: Leaving directory '/usr/src/RPM/BUILD/srt-1.4.4/x86_64-alt-linux'
gmake[2]: Entering directory '/usr/src/RPM/BUILD/srt-1.4.4/x86_64-alt-linux'
[ 32%] Building CXX object CMakeFiles/srt_virtual.dir/srtcore/sync_posix.cpp.o
/usr/bin/c++ -DENABLE_MONOTONIC_CLOCK=1 -DENABLE_SOCK_CLOEXEC=1 -DHAI_ENABLE_SRT=1 -DHAI_PATCH=1 -DHAVE_INET_PTON=1 -DHAVE_PTHREAD_GETNAME_NP=1 -DHAVE_PTHREAD_SETNAME_NP=1 -DLINUX=1 -DSRT_DYNAMIC -DSRT_ENABLE_APP_READER -DSRT_ENABLE_BINDTODEVICE -DSRT_ENABLE_CLOSE_SYNCH -DSRT_ENABLE_ENCRYPTION -DSRT_EXPORTS -DSRT_VERSION=\"1.4.4\" -DUSE_GNUTLS=1 -D_GNU_SOURCE -I/usr/src/RPM/BUILD/srt-1.4.4/common -I/usr/src/RPM/BUILD/srt-1.4.4/srtcore -I/usr/src/RPM/BUILD/srt-1.4.4/haicrypt -I/usr/src/RPM/BUILD/srt-1.4.4/x86_64-alt-linux -I/usr/include/p11-kit-1 -pipe -frecord-gcc-switches -Wall -g -O2 -flto=auto   -DENABLE_LOGGING=1 -DENABLE_GETNAMEINFO=1 -Wall -Wextra -O2 -DNDEBUG -fPIC -MD -MT CMakeFiles/srt_virtual.dir/srtcore/sync_posix.cpp.o -MF CMakeFiles/srt_virtual.dir/srtcore/sync_posix.cpp.o.d -o CMakeFiles/srt_virtual.dir/srtcore/sync_posix.cpp.o -c /usr/src/RPM/BUILD/srt-1.4.4/srtcore/sync_posix.cpp
gmake[2]: Leaving directory '/usr/src/RPM/BUILD/srt-1.4.4/x86_64-alt-linux'
gmake[2]: Entering directory '/usr/src/RPM/BUILD/srt-1.4.4/x86_64-alt-linux'
[ 24%] Building CXX object CMakeFiles/srt_virtual.dir/srtcore/queue.cpp.o
/usr/bin/c++ -DENABLE_MONOTONIC_CLOCK=1 -DENABLE_SOCK_CLOEXEC=1 -DHAI_ENABLE_SRT=1 -DHAI_PATCH=1 -DHAVE_INET_PTON=1 -DHAVE_PTHREAD_GETNAME_NP=1 -DHAVE_PTHREAD_SETNAME_NP=1 -DLINUX=1 -DSRT_DYNAMIC -DSRT_ENABLE_APP_READER -DSRT_ENABLE_BINDTODEVICE -DSRT_ENABLE_CLOSE_SYNCH -DSRT_ENABLE_ENCRYPTION -DSRT_EXPORTS -DSRT_VERSION=\"1.4.4\" -DUSE_GNUTLS=1 -D_GNU_SOURCE -I/usr/src/RPM/BUILD/srt-1.4.4/common -I/usr/src/RPM/BUILD/srt-1.4.4/srtcore -I/usr/src/RPM/BUILD/srt-1.4.4/haicrypt -I/usr/src/RPM/BUILD/srt-1.4.4/x86_64-alt-linux -I/usr/include/p11-kit-1 -pipe -frecord-gcc-switches -Wall -g -O2 -flto=auto   -DENABLE_LOGGING=1 -DENABLE_GETNAMEINFO=1 -Wall -Wextra -O2 -DNDEBUG -fPIC -MD -MT CMakeFiles/srt_virtual.dir/srtcore/queue.cpp.o -MF CMakeFiles/srt_virtual.dir/srtcore/queue.cpp.o.d -o CMakeFiles/srt_virtual.dir/srtcore/queue.cpp.o -c /usr/src/RPM/BUILD/srt-1.4.4/srtcore/queue.cpp
gmake[2]: Leaving directory '/usr/src/RPM/BUILD/srt-1.4.4/x86_64-alt-linux'
gmake[2]: Entering directory '/usr/src/RPM/BUILD/srt-1.4.4/x86_64-alt-linux'
[ 13%] Building CXX object CMakeFiles/srt_virtual.dir/srtcore/core.cpp.o
/usr/bin/c++ -DENABLE_MONOTONIC_CLOCK=1 -DENABLE_SOCK_CLOEXEC=1 -DHAI_ENABLE_SRT=1 -DHAI_PATCH=1 -DHAVE_INET_PTON=1 -DHAVE_PTHREAD_GETNAME_NP=1 -DHAVE_PTHREAD_SETNAME_NP=1 -DLINUX=1 -DSRT_DYNAMIC -DSRT_ENABLE_APP_READER -DSRT_ENABLE_BINDTODEVICE -DSRT_ENABLE_CLOSE_SYNCH -DSRT_ENABLE_ENCRYPTION -DSRT_EXPORTS -DSRT_VERSION=\"1.4.4\" -DUSE_GNUTLS=1 -D_GNU_SOURCE -I/usr/src/RPM/BUILD/srt-1.4.4/common -I/usr/src/RPM/BUILD/srt-1.4.4/srtcore -I/usr/src/RPM/BUILD/srt-1.4.4/haicrypt -I/usr/src/RPM/BUILD/srt-1.4.4/x86_64-alt-linux -I/usr/include/p11-kit-1 -pipe -frecord-gcc-switches -Wall -g -O2 -flto=auto   -DENABLE_LOGGING=1 -DENABLE_GETNAMEINFO=1 -Wall -Wextra -O2 -DNDEBUG -fPIC -MD -MT CMakeFiles/srt_virtual.dir/srtcore/core.cpp.o -MF CMakeFiles/srt_virtual.dir/srtcore/core.cpp.o.d -o CMakeFiles/srt_virtual.dir/srtcore/core.cpp.o -c /usr/src/RPM/BUILD/srt-1.4.4/srtcore/core.cpp
gmake[2]: Leaving directory '/usr/src/RPM/BUILD/srt-1.4.4/x86_64-alt-linux'
gmake[1]: Entering directory '/usr/src/RPM/BUILD/srt-1.4.4/x86_64-alt-linux'
[ 41%] Built target srt_virtual
gmake[1]: Leaving directory '/usr/src/RPM/BUILD/srt-1.4.4/x86_64-alt-linux'
/usr/bin/gmake  -f CMakeFiles/srt_shared.dir/build.make CMakeFiles/srt_shared.dir/depend
gmake[2]: Entering directory '/usr/src/RPM/BUILD/srt-1.4.4/x86_64-alt-linux'
cd /usr/src/RPM/BUILD/srt-1.4.4/x86_64-alt-linux && /usr/bin/cmake -E cmake_depends "Unix Makefiles" /usr/src/RPM/BUILD/srt-1.4.4 /usr/src/RPM/BUILD/srt-1.4.4 /usr/src/RPM/BUILD/srt-1.4.4/x86_64-alt-linux /usr/src/RPM/BUILD/srt-1.4.4/x86_64-alt-linux /usr/src/RPM/BUILD/srt-1.4.4/x86_64-alt-linux/CMakeFiles/srt_shared.dir/DependInfo.cmake --color=
gmake[2]: Leaving directory '/usr/src/RPM/BUILD/srt-1.4.4/x86_64-alt-linux'
/usr/bin/gmake  -f CMakeFiles/srt_shared.dir/build.make CMakeFiles/srt_shared.dir/build
gmake[2]: Entering directory '/usr/src/RPM/BUILD/srt-1.4.4/x86_64-alt-linux'
[ 42%] Building C object CMakeFiles/srt_shared.dir/cmake_object_lib_support.c.o
/usr/bin/cc -DENABLE_MONOTONIC_CLOCK=1 -DENABLE_SOCK_CLOEXEC=1 -DHAI_ENABLE_SRT=1 -DHAI_PATCH=1 -DHAVE_INET_PTON=1 -DHAVE_PTHREAD_GETNAME_NP=1 -DHAVE_PTHREAD_SETNAME_NP=1 -DLINUX=1 -DSRT_ENABLE_APP_READER -DSRT_ENABLE_BINDTODEVICE -DSRT_ENABLE_CLOSE_SYNCH -DSRT_ENABLE_ENCRYPTION -DSRT_VERSION=\"1.4.4\" -DUSE_GNUTLS=1 -D_GNU_SOURCE -Dsrt_shared_EXPORTS -I/usr/src/RPM/BUILD/srt-1.4.4/common -I/usr/src/RPM/BUILD/srt-1.4.4/srtcore -I/usr/src/RPM/BUILD/srt-1.4.4/haicrypt -I/usr/src/RPM/BUILD/srt-1.4.4/x86_64-alt-linux -pipe -frecord-gcc-switches -Wall -g -O2 -flto=auto   -DENABLE_LOGGING=1 -DENABLE_GETNAMEINFO=1 -Wall -Wextra -O2 -DNDEBUG -fPIC -MD -MT CMakeFiles/srt_shared.dir/cmake_object_lib_support.c.o -MF CMakeFiles/srt_shared.dir/cmake_object_lib_support.c.o.d -o CMakeFiles/srt_shared.dir/cmake_object_lib_support.c.o -c /usr/src/RPM/BUILD/srt-1.4.4/cmake_object_lib_support.c
gmake[2]: Leaving directory '/usr/src/RPM/BUILD/srt-1.4.4/x86_64-alt-linux'
gmake[2]: Entering directory '/usr/src/RPM/BUILD/srt-1.4.4/x86_64-alt-linux'
[ 43%] Linking CXX shared library libsrt.so
/usr/bin/cmake -E cmake_link_script CMakeFiles/srt_shared.dir/link.txt --verbose=1
/usr/bin/c++ -fPIC -pipe -frecord-gcc-switches -Wall -g -O2 -flto=auto   -DENABLE_LOGGING=1 -DENABLE_GETNAMEINFO=1 -Wall -Wextra -O2 -DNDEBUG -shared -Wl,-soname,libsrt.so.1.4 -o libsrt.so.1.4.4 CMakeFiles/srt_shared.dir/cmake_object_lib_support.c.o CMakeFiles/srt_virtual.dir/srtcore/api.cpp.o CMakeFiles/srt_virtual.dir/srtcore/buffer.cpp.o CMakeFiles/srt_virtual.dir/srtcore/cache.cpp.o CMakeFiles/srt_virtual.dir/srtcore/channel.cpp.o CMakeFiles/srt_virtual.dir/srtcore/common.cpp.o CMakeFiles/srt_virtual.dir/srtcore/core.cpp.o CMakeFiles/srt_virtual.dir/srtcore/crypto.cpp.o CMakeFiles/srt_virtual.dir/srtcore/epoll.cpp.o CMakeFiles/srt_virtual.dir/srtcore/fec.cpp.o CMakeFiles/srt_virtual.dir/srtcore/handshake.cpp.o CMakeFiles/srt_virtual.dir/srtcore/list.cpp.o CMakeFiles/srt_virtual.dir/srtcore/logger_default.cpp.o CMakeFiles/srt_virtual.dir/srtcore/logger_defs.cpp.o CMakeFiles/srt_virtual.dir/srtcore/md5.cpp.o CMakeFiles/srt_virtual.dir/srtcore/packet.cpp.o CMakeFiles/srt_virtual.dir/srtcore/packetfilter.cpp.o CMakeFiles/srt_virtual.dir/srtcore/queue.cpp.o CMakeFiles/srt_virtual.dir/srtcore/congctl.cpp.o CMakeFiles/srt_virtual.dir/srtcore/socketconfig.cpp.o CMakeFiles/srt_virtual.dir/srtcore/srt_c_api.cpp.o CMakeFiles/srt_virtual.dir/srtcore/srt_compat.c.o CMakeFiles/srt_virtual.dir/srtcore/strerror_defs.cpp.o CMakeFiles/srt_virtual.dir/srtcore/sync.cpp.o CMakeFiles/srt_virtual.dir/srtcore/tsbpd_time.cpp.o CMakeFiles/srt_virtual.dir/srtcore/window.cpp.o CMakeFiles/srt_virtual.dir/srtcore/sync_posix.cpp.o CMakeFiles/srt_virtual.dir/haicrypt/cryspr.c.o CMakeFiles/srt_virtual.dir/haicrypt/cryspr-gnutls.c.o CMakeFiles/srt_virtual.dir/haicrypt/hcrypt.c.o CMakeFiles/srt_virtual.dir/haicrypt/hcrypt_ctx_rx.c.o CMakeFiles/srt_virtual.dir/haicrypt/hcrypt_ctx_tx.c.o CMakeFiles/srt_virtual.dir/haicrypt/hcrypt_rx.c.o CMakeFiles/srt_virtual.dir/haicrypt/hcrypt_sa.c.o CMakeFiles/srt_virtual.dir/haicrypt/hcrypt_tx.c.o CMakeFiles/srt_virtual.dir/haicrypt/hcrypt_xpt_srt.c.o CMakeFiles/srt_virtual.dir/haicrypt/haicrypt_log.cpp.o  -lgnutls -lnettle 
/usr/bin/cmake -E cmake_symlink_library libsrt.so.1.4.4 libsrt.so.1.4 libsrt.so
gmake[2]: Leaving directory '/usr/src/RPM/BUILD/srt-1.4.4/x86_64-alt-linux'
gmake[1]: Entering directory '/usr/src/RPM/BUILD/srt-1.4.4/x86_64-alt-linux'
[ 43%] Built target srt_shared
gmake[1]: Leaving directory '/usr/src/RPM/BUILD/srt-1.4.4/x86_64-alt-linux'
/usr/bin/gmake  -f CMakeFiles/srt-test-multiplex.dir/build.make CMakeFiles/srt-test-multiplex.dir/depend
/usr/bin/gmake  -f CMakeFiles/srt-live-transmit.dir/build.make CMakeFiles/srt-live-transmit.dir/depend
/usr/bin/gmake  -f CMakeFiles/srt-file-transmit.dir/build.make CMakeFiles/srt-file-transmit.dir/depend
/usr/bin/gmake  -f CMakeFiles/test-srt.dir/build.make CMakeFiles/test-srt.dir/depend
/usr/bin/gmake  -f CMakeFiles/srt-tunnel.dir/build.make CMakeFiles/srt-tunnel.dir/depend
/usr/bin/gmake  -f CMakeFiles/srt-test-live.dir/build.make CMakeFiles/srt-test-live.dir/depend
/usr/bin/gmake  -f CMakeFiles/srt-test-file.dir/build.make CMakeFiles/srt-test-file.dir/depend
/usr/bin/gmake  -f CMakeFiles/srt-test-relay.dir/build.make CMakeFiles/srt-test-relay.dir/depend
gmake[2]: Entering directory '/usr/src/RPM/BUILD/srt-1.4.4/x86_64-alt-linux'
cd /usr/src/RPM/BUILD/srt-1.4.4/x86_64-alt-linux && /usr/bin/cmake -E cmake_depends "Unix Makefiles" /usr/src/RPM/BUILD/srt-1.4.4 /usr/src/RPM/BUILD/srt-1.4.4 /usr/src/RPM/BUILD/srt-1.4.4/x86_64-alt-linux /usr/src/RPM/BUILD/srt-1.4.4/x86_64-alt-linux /usr/src/RPM/BUILD/srt-1.4.4/x86_64-alt-linux/CMakeFiles/srt-test-multiplex.dir/DependInfo.cmake --color=
gmake[2]: Leaving directory '/usr/src/RPM/BUILD/srt-1.4.4/x86_64-alt-linux'
gmake[2]: Entering directory '/usr/src/RPM/BUILD/srt-1.4.4/x86_64-alt-linux'
cd /usr/src/RPM/BUILD/srt-1.4.4/x86_64-alt-linux && /usr/bin/cmake -E cmake_depends "Unix Makefiles" /usr/src/RPM/BUILD/srt-1.4.4 /usr/src/RPM/BUILD/srt-1.4.4 /usr/src/RPM/BUILD/srt-1.4.4/x86_64-alt-linux /usr/src/RPM/BUILD/srt-1.4.4/x86_64-alt-linux /usr/src/RPM/BUILD/srt-1.4.4/x86_64-alt-linux/CMakeFiles/srt-live-transmit.dir/DependInfo.cmake --color=
gmake[2]: Leaving directory '/usr/src/RPM/BUILD/srt-1.4.4/x86_64-alt-linux'
/usr/bin/gmake  -f CMakeFiles/srt-test-multiplex.dir/build.make CMakeFiles/srt-test-multiplex.dir/build
/usr/bin/gmake  -f CMakeFiles/srt-live-transmit.dir/build.make CMakeFiles/srt-live-transmit.dir/build
gmake[2]: Entering directory '/usr/src/RPM/BUILD/srt-1.4.4/x86_64-alt-linux'
cd /usr/src/RPM/BUILD/srt-1.4.4/x86_64-alt-linux && /usr/bin/cmake -E cmake_depends "Unix Makefiles" /usr/src/RPM/BUILD/srt-1.4.4 /usr/src/RPM/BUILD/srt-1.4.4 /usr/src/RPM/BUILD/srt-1.4.4/x86_64-alt-linux /usr/src/RPM/BUILD/srt-1.4.4/x86_64-alt-linux /usr/src/RPM/BUILD/srt-1.4.4/x86_64-alt-linux/CMakeFiles/test-srt.dir/DependInfo.cmake --color=
gmake[2]: Leaving directory '/usr/src/RPM/BUILD/srt-1.4.4/x86_64-alt-linux'
/usr/bin/gmake  -f CMakeFiles/test-srt.dir/build.make CMakeFiles/test-srt.dir/build
gmake[2]: Entering directory '/usr/src/RPM/BUILD/srt-1.4.4/x86_64-alt-linux'
cd /usr/src/RPM/BUILD/srt-1.4.4/x86_64-alt-linux && /usr/bin/cmake -E cmake_depends "Unix Makefiles" /usr/src/RPM/BUILD/srt-1.4.4 /usr/src/RPM/BUILD/srt-1.4.4 /usr/src/RPM/BUILD/srt-1.4.4/x86_64-alt-linux /usr/src/RPM/BUILD/srt-1.4.4/x86_64-alt-linux /usr/src/RPM/BUILD/srt-1.4.4/x86_64-alt-linux/CMakeFiles/srt-tunnel.dir/DependInfo.cmake --color=
gmake[2]: Leaving directory '/usr/src/RPM/BUILD/srt-1.4.4/x86_64-alt-linux'
gmake[2]: Entering directory '/usr/src/RPM/BUILD/srt-1.4.4/x86_64-alt-linux'
cd /usr/src/RPM/BUILD/srt-1.4.4/x86_64-alt-linux && /usr/bin/cmake -E cmake_depends "Unix Makefiles" /usr/src/RPM/BUILD/srt-1.4.4 /usr/src/RPM/BUILD/srt-1.4.4 /usr/src/RPM/BUILD/srt-1.4.4/x86_64-alt-linux /usr/src/RPM/BUILD/srt-1.4.4/x86_64-alt-linux /usr/src/RPM/BUILD/srt-1.4.4/x86_64-alt-linux/CMakeFiles/srt-test-live.dir/DependInfo.cmake --color=
gmake[2]: Leaving directory '/usr/src/RPM/BUILD/srt-1.4.4/x86_64-alt-linux'
gmake[2]: Entering directory '/usr/src/RPM/BUILD/srt-1.4.4/x86_64-alt-linux'
cd /usr/src/RPM/BUILD/srt-1.4.4/x86_64-alt-linux && /usr/bin/cmake -E cmake_depends "Unix Makefiles" /usr/src/RPM/BUILD/srt-1.4.4 /usr/src/RPM/BUILD/srt-1.4.4 /usr/src/RPM/BUILD/srt-1.4.4/x86_64-alt-linux /usr/src/RPM/BUILD/srt-1.4.4/x86_64-alt-linux /usr/src/RPM/BUILD/srt-1.4.4/x86_64-alt-linux/CMakeFiles/srt-test-file.dir/DependInfo.cmake --color=
gmake[2]: Leaving directory '/usr/src/RPM/BUILD/srt-1.4.4/x86_64-alt-linux'
gmake[2]: Entering directory '/usr/src/RPM/BUILD/srt-1.4.4/x86_64-alt-linux'
cd /usr/src/RPM/BUILD/srt-1.4.4/x86_64-alt-linux && /usr/bin/cmake -E cmake_depends "Unix Makefiles" /usr/src/RPM/BUILD/srt-1.4.4 /usr/src/RPM/BUILD/srt-1.4.4 /usr/src/RPM/BUILD/srt-1.4.4/x86_64-alt-linux /usr/src/RPM/BUILD/srt-1.4.4/x86_64-alt-linux /usr/src/RPM/BUILD/srt-1.4.4/x86_64-alt-linux/CMakeFiles/srt-file-transmit.dir/DependInfo.cmake --color=
gmake[2]: Leaving directory '/usr/src/RPM/BUILD/srt-1.4.4/x86_64-alt-linux'
/usr/bin/gmake  -f CMakeFiles/srt-tunnel.dir/build.make CMakeFiles/srt-tunnel.dir/build
/usr/bin/gmake  -f CMakeFiles/srt-test-live.dir/build.make CMakeFiles/srt-test-live.dir/build
/usr/bin/gmake  -f CMakeFiles/srt-file-transmit.dir/build.make CMakeFiles/srt-file-transmit.dir/build
/usr/bin/gmake  -f CMakeFiles/srt-test-file.dir/build.make CMakeFiles/srt-test-file.dir/build
gmake[2]: Entering directory '/usr/src/RPM/BUILD/srt-1.4.4/x86_64-alt-linux'
cd /usr/src/RPM/BUILD/srt-1.4.4/x86_64-alt-linux && /usr/bin/cmake -E cmake_depends "Unix Makefiles" /usr/src/RPM/BUILD/srt-1.4.4 /usr/src/RPM/BUILD/srt-1.4.4 /usr/src/RPM/BUILD/srt-1.4.4/x86_64-alt-linux /usr/src/RPM/BUILD/srt-1.4.4/x86_64-alt-linux /usr/src/RPM/BUILD/srt-1.4.4/x86_64-alt-linux/CMakeFiles/srt-test-relay.dir/DependInfo.cmake --color=
gmake[2]: Leaving directory '/usr/src/RPM/BUILD/srt-1.4.4/x86_64-alt-linux'
/usr/bin/gmake  -f CMakeFiles/srt-test-relay.dir/build.make CMakeFiles/srt-test-relay.dir/build
gmake[2]: Entering directory '/usr/src/RPM/BUILD/srt-1.4.4/x86_64-alt-linux'
[ 48%] Building CXX object CMakeFiles/srt-test-multiplex.dir/apps/verbose.cpp.o
/usr/bin/c++ -DENABLE_MONOTONIC_CLOCK=1 -DENABLE_SOCK_CLOEXEC=1 -DHAI_ENABLE_SRT=1 -DHAI_PATCH=1 -DHAVE_INET_PTON=1 -DHAVE_PTHREAD_GETNAME_NP=1 -DHAVE_PTHREAD_SETNAME_NP=1 -DLINUX=1 -DSRT_ENABLE_APP_READER -DSRT_ENABLE_BINDTODEVICE -DSRT_ENABLE_CLOSE_SYNCH -DSRT_ENABLE_ENCRYPTION -DSRT_VERSION=\"1.4.4\" -DUSE_GNUTLS=1 -D_GNU_SOURCE -I/usr/src/RPM/BUILD/srt-1.4.4/common -I/usr/src/RPM/BUILD/srt-1.4.4/srtcore -I/usr/src/RPM/BUILD/srt-1.4.4/haicrypt -I/usr/src/RPM/BUILD/srt-1.4.4/x86_64-alt-linux -I/usr/src/RPM/BUILD/srt-1.4.4/apps -pipe -frecord-gcc-switches -Wall -g -O2 -flto=auto   -DENABLE_LOGGING=1 -DENABLE_GETNAMEINFO=1 -Wall -Wextra -O2 -DNDEBUG -fPIE -MD -MT CMakeFiles/srt-test-multiplex.dir/apps/verbose.cpp.o -MF CMakeFiles/srt-test-multiplex.dir/apps/verbose.cpp.o.d -o CMakeFiles/srt-test-multiplex.dir/apps/verbose.cpp.o -c /usr/src/RPM/BUILD/srt-1.4.4/apps/verbose.cpp
gmake[2]: Leaving directory '/usr/src/RPM/BUILD/srt-1.4.4/x86_64-alt-linux'
gmake[2]: Entering directory '/usr/src/RPM/BUILD/srt-1.4.4/x86_64-alt-linux'
[ 57%] Building CXX object CMakeFiles/srt-test-multiplex.dir/apps/logsupport_appdefs.cpp.o
/usr/bin/c++ -DENABLE_MONOTONIC_CLOCK=1 -DENABLE_SOCK_CLOEXEC=1 -DHAI_ENABLE_SRT=1 -DHAI_PATCH=1 -DHAVE_INET_PTON=1 -DHAVE_PTHREAD_GETNAME_NP=1 -DHAVE_PTHREAD_SETNAME_NP=1 -DLINUX=1 -DSRT_ENABLE_APP_READER -DSRT_ENABLE_BINDTODEVICE -DSRT_ENABLE_CLOSE_SYNCH -DSRT_ENABLE_ENCRYPTION -DSRT_VERSION=\"1.4.4\" -DUSE_GNUTLS=1 -D_GNU_SOURCE -I/usr/src/RPM/BUILD/srt-1.4.4/common -I/usr/src/RPM/BUILD/srt-1.4.4/srtcore -I/usr/src/RPM/BUILD/srt-1.4.4/haicrypt -I/usr/src/RPM/BUILD/srt-1.4.4/x86_64-alt-linux -I/usr/src/RPM/BUILD/srt-1.4.4/apps -pipe -frecord-gcc-switches -Wall -g -O2 -flto=auto   -DENABLE_LOGGING=1 -DENABLE_GETNAMEINFO=1 -Wall -Wextra -O2 -DNDEBUG -fPIE -MD -MT CMakeFiles/srt-test-multiplex.dir/apps/logsupport_appdefs.cpp.o -MF CMakeFiles/srt-test-multiplex.dir/apps/logsupport_appdefs.cpp.o.d -o CMakeFiles/srt-test-multiplex.dir/apps/logsupport_appdefs.cpp.o -c /usr/src/RPM/BUILD/srt-1.4.4/apps/logsupport_appdefs.cpp
gmake[2]: Leaving directory '/usr/src/RPM/BUILD/srt-1.4.4/x86_64-alt-linux'
gmake[2]: Entering directory '/usr/src/RPM/BUILD/srt-1.4.4/x86_64-alt-linux'
[ 51%] Building CXX object CMakeFiles/test-srt.dir/test/test_bonding.cpp.o
/usr/bin/c++ -DENABLE_MONOTONIC_CLOCK=1 -DENABLE_SOCK_CLOEXEC=1 -DGTEST_LINKED_AS_SHARED_LIBRARY=1 -DHAI_ENABLE_SRT=1 -DHAI_PATCH=1 -DHAVE_INET_PTON=1 -DHAVE_PTHREAD_GETNAME_NP=1 -DHAVE_PTHREAD_SETNAME_NP=1 -DLINUX=1 -DSRT_ENABLE_APP_READER -DSRT_ENABLE_BINDTODEVICE -DSRT_ENABLE_CLOSE_SYNCH -DSRT_ENABLE_ENCRYPTION -DSRT_VERSION=\"1.4.4\" -DUSE_GNUTLS=1 -D_GNU_SOURCE -I/usr/src/RPM/BUILD/srt-1.4.4/common -I/usr/src/RPM/BUILD/srt-1.4.4/srtcore -I/usr/src/RPM/BUILD/srt-1.4.4/haicrypt -I/usr/src/RPM/BUILD/srt-1.4.4/x86_64-alt-linux -I/usr/src/RPM/BUILD/srt-1.4.4/apps -I/usr/include/p11-kit-1 -pipe -frecord-gcc-switches -Wall -g -O2 -flto=auto   -DENABLE_LOGGING=1 -DENABLE_GETNAMEINFO=1 -Wall -Wextra -O2 -DNDEBUG -fPIE -MD -MT CMakeFiles/test-srt.dir/test/test_bonding.cpp.o -MF CMakeFiles/test-srt.dir/test/test_bonding.cpp.o.d -o CMakeFiles/test-srt.dir/test/test_bonding.cpp.o -c /usr/src/RPM/BUILD/srt-1.4.4/test/test_bonding.cpp
gmake[2]: Leaving directory '/usr/src/RPM/BUILD/srt-1.4.4/x86_64-alt-linux'
gmake[2]: Entering directory '/usr/src/RPM/BUILD/srt-1.4.4/x86_64-alt-linux'
[ 48%] Building CXX object CMakeFiles/srt-test-multiplex.dir/apps/socketoptions.cpp.o
/usr/bin/c++ -DENABLE_MONOTONIC_CLOCK=1 -DENABLE_SOCK_CLOEXEC=1 -DHAI_ENABLE_SRT=1 -DHAI_PATCH=1 -DHAVE_INET_PTON=1 -DHAVE_PTHREAD_GETNAME_NP=1 -DHAVE_PTHREAD_SETNAME_NP=1 -DLINUX=1 -DSRT_ENABLE_APP_READER -DSRT_ENABLE_BINDTODEVICE -DSRT_ENABLE_CLOSE_SYNCH -DSRT_ENABLE_ENCRYPTION -DSRT_VERSION=\"1.4.4\" -DUSE_GNUTLS=1 -D_GNU_SOURCE -I/usr/src/RPM/BUILD/srt-1.4.4/common -I/usr/src/RPM/BUILD/srt-1.4.4/srtcore -I/usr/src/RPM/BUILD/srt-1.4.4/haicrypt -I/usr/src/RPM/BUILD/srt-1.4.4/x86_64-alt-linux -I/usr/src/RPM/BUILD/srt-1.4.4/apps -pipe -frecord-gcc-switches -Wall -g -O2 -flto=auto   -DENABLE_LOGGING=1 -DENABLE_GETNAMEINFO=1 -Wall -Wextra -O2 -DNDEBUG -fPIE -MD -MT CMakeFiles/srt-test-multiplex.dir/apps/socketoptions.cpp.o -MF CMakeFiles/srt-test-multiplex.dir/apps/socketoptions.cpp.o.d -o CMakeFiles/srt-test-multiplex.dir/apps/socketoptions.cpp.o -c /usr/src/RPM/BUILD/srt-1.4.4/apps/socketoptions.cpp
gmake[2]: Leaving directory '/usr/src/RPM/BUILD/srt-1.4.4/x86_64-alt-linux'
gmake[2]: Entering directory '/usr/src/RPM/BUILD/srt-1.4.4/x86_64-alt-linux'
[ 49%] Building CXX object CMakeFiles/srt-test-multiplex.dir/apps/uriparser.cpp.o
/usr/bin/c++ -DENABLE_MONOTONIC_CLOCK=1 -DENABLE_SOCK_CLOEXEC=1 -DHAI_ENABLE_SRT=1 -DHAI_PATCH=1 -DHAVE_INET_PTON=1 -DHAVE_PTHREAD_GETNAME_NP=1 -DHAVE_PTHREAD_SETNAME_NP=1 -DLINUX=1 -DSRT_ENABLE_APP_READER -DSRT_ENABLE_BINDTODEVICE -DSRT_ENABLE_CLOSE_SYNCH -DSRT_ENABLE_ENCRYPTION -DSRT_VERSION=\"1.4.4\" -DUSE_GNUTLS=1 -D_GNU_SOURCE -I/usr/src/RPM/BUILD/srt-1.4.4/common -I/usr/src/RPM/BUILD/srt-1.4.4/srtcore -I/usr/src/RPM/BUILD/srt-1.4.4/haicrypt -I/usr/src/RPM/BUILD/srt-1.4.4/x86_64-alt-linux -I/usr/src/RPM/BUILD/srt-1.4.4/apps -pipe -frecord-gcc-switches -Wall -g -O2 -flto=auto   -DENABLE_LOGGING=1 -DENABLE_GETNAMEINFO=1 -Wall -Wextra -O2 -DNDEBUG -fPIE -MD -MT CMakeFiles/srt-test-multiplex.dir/apps/uriparser.cpp.o -MF CMakeFiles/srt-test-multiplex.dir/apps/uriparser.cpp.o.d -o CMakeFiles/srt-test-multiplex.dir/apps/uriparser.cpp.o -c /usr/src/RPM/BUILD/srt-1.4.4/apps/uriparser.cpp
gmake[2]: Leaving directory '/usr/src/RPM/BUILD/srt-1.4.4/x86_64-alt-linux'
gmake[2]: Entering directory '/usr/src/RPM/BUILD/srt-1.4.4/x86_64-alt-linux'
[ 50%] Building CXX object CMakeFiles/srt-test-multiplex.dir/apps/logsupport.cpp.o
/usr/bin/c++ -DENABLE_MONOTONIC_CLOCK=1 -DENABLE_SOCK_CLOEXEC=1 -DHAI_ENABLE_SRT=1 -DHAI_PATCH=1 -DHAVE_INET_PTON=1 -DHAVE_PTHREAD_GETNAME_NP=1 -DHAVE_PTHREAD_SETNAME_NP=1 -DLINUX=1 -DSRT_ENABLE_APP_READER -DSRT_ENABLE_BINDTODEVICE -DSRT_ENABLE_CLOSE_SYNCH -DSRT_ENABLE_ENCRYPTION -DSRT_VERSION=\"1.4.4\" -DUSE_GNUTLS=1 -D_GNU_SOURCE -I/usr/src/RPM/BUILD/srt-1.4.4/common -I/usr/src/RPM/BUILD/srt-1.4.4/srtcore -I/usr/src/RPM/BUILD/srt-1.4.4/haicrypt -I/usr/src/RPM/BUILD/srt-1.4.4/x86_64-alt-linux -I/usr/src/RPM/BUILD/srt-1.4.4/apps -pipe -frecord-gcc-switches -Wall -g -O2 -flto=auto   -DENABLE_LOGGING=1 -DENABLE_GETNAMEINFO=1 -Wall -Wextra -O2 -DNDEBUG -fPIE -MD -MT CMakeFiles/srt-test-multiplex.dir/apps/logsupport.cpp.o -MF CMakeFiles/srt-test-multiplex.dir/apps/logsupport.cpp.o.d -o CMakeFiles/srt-test-multiplex.dir/apps/logsupport.cpp.o -c /usr/src/RPM/BUILD/srt-1.4.4/apps/logsupport.cpp
gmake[2]: Leaving directory '/usr/src/RPM/BUILD/srt-1.4.4/x86_64-alt-linux'
gmake[2]: Entering directory '/usr/src/RPM/BUILD/srt-1.4.4/x86_64-alt-linux'
[ 60%] Building CXX object CMakeFiles/srt-test-live.dir/apps/verbose.cpp.o
/usr/bin/c++ -DENABLE_MONOTONIC_CLOCK=1 -DENABLE_SOCK_CLOEXEC=1 -DHAI_ENABLE_SRT=1 -DHAI_PATCH=1 -DHAVE_INET_PTON=1 -DHAVE_PTHREAD_GETNAME_NP=1 -DHAVE_PTHREAD_SETNAME_NP=1 -DLINUX=1 -DSRT_ENABLE_APP_READER -DSRT_ENABLE_BINDTODEVICE -DSRT_ENABLE_CLOSE_SYNCH -DSRT_ENABLE_ENCRYPTION -DSRT_VERSION=\"1.4.4\" -DUSE_GNUTLS=1 -D_GNU_SOURCE -I/usr/src/RPM/BUILD/srt-1.4.4/common -I/usr/src/RPM/BUILD/srt-1.4.4/srtcore -I/usr/src/RPM/BUILD/srt-1.4.4/haicrypt -I/usr/src/RPM/BUILD/srt-1.4.4/x86_64-alt-linux -I/usr/src/RPM/BUILD/srt-1.4.4/apps -pipe -frecord-gcc-switches -Wall -g -O2 -flto=auto   -DENABLE_LOGGING=1 -DENABLE_GETNAMEINFO=1 -Wall -Wextra -O2 -DNDEBUG -fPIE -MD -MT CMakeFiles/srt-test-live.dir/apps/verbose.cpp.o -MF CMakeFiles/srt-test-live.dir/apps/verbose.cpp.o.d -o CMakeFiles/srt-test-live.dir/apps/verbose.cpp.o -c /usr/src/RPM/BUILD/srt-1.4.4/apps/verbose.cpp
gmake[2]: Leaving directory '/usr/src/RPM/BUILD/srt-1.4.4/x86_64-alt-linux'
gmake[2]: Entering directory '/usr/src/RPM/BUILD/srt-1.4.4/x86_64-alt-linux'
[ 46%] Building CXX object CMakeFiles/srt-test-multiplex.dir/apps/apputil.cpp.o
/usr/bin/c++ -DENABLE_MONOTONIC_CLOCK=1 -DENABLE_SOCK_CLOEXEC=1 -DHAI_ENABLE_SRT=1 -DHAI_PATCH=1 -DHAVE_INET_PTON=1 -DHAVE_PTHREAD_GETNAME_NP=1 -DHAVE_PTHREAD_SETNAME_NP=1 -DLINUX=1 -DSRT_ENABLE_APP_READER -DSRT_ENABLE_BINDTODEVICE -DSRT_ENABLE_CLOSE_SYNCH -DSRT_ENABLE_ENCRYPTION -DSRT_VERSION=\"1.4.4\" -DUSE_GNUTLS=1 -D_GNU_SOURCE -I/usr/src/RPM/BUILD/srt-1.4.4/common -I/usr/src/RPM/BUILD/srt-1.4.4/srtcore -I/usr/src/RPM/BUILD/srt-1.4.4/haicrypt -I/usr/src/RPM/BUILD/srt-1.4.4/x86_64-alt-linux -I/usr/src/RPM/BUILD/srt-1.4.4/apps -pipe -frecord-gcc-switches -Wall -g -O2 -flto=auto   -DENABLE_LOGGING=1 -DENABLE_GETNAMEINFO=1 -Wall -Wextra -O2 -DNDEBUG -fPIE -MD -MT CMakeFiles/srt-test-multiplex.dir/apps/apputil.cpp.o -MF CMakeFiles/srt-test-multiplex.dir/apps/apputil.cpp.o.d -o CMakeFiles/srt-test-multiplex.dir/apps/apputil.cpp.o -c /usr/src/RPM/BUILD/srt-1.4.4/apps/apputil.cpp
gmake[2]: Leaving directory '/usr/src/RPM/BUILD/srt-1.4.4/x86_64-alt-linux'
gmake[2]: Entering directory '/usr/src/RPM/BUILD/srt-1.4.4/x86_64-alt-linux'
[ 55%] Building CXX object CMakeFiles/srt-test-file.dir/testing/srt-test-file.cpp.o
/usr/bin/c++ -DENABLE_MONOTONIC_CLOCK=1 -DENABLE_SOCK_CLOEXEC=1 -DHAI_ENABLE_SRT=1 -DHAI_PATCH=1 -DHAVE_INET_PTON=1 -DHAVE_PTHREAD_GETNAME_NP=1 -DHAVE_PTHREAD_SETNAME_NP=1 -DLINUX=1 -DSRT_ENABLE_APP_READER -DSRT_ENABLE_BINDTODEVICE -DSRT_ENABLE_CLOSE_SYNCH -DSRT_ENABLE_ENCRYPTION -DSRT_VERSION=\"1.4.4\" -DUSE_GNUTLS=1 -D_GNU_SOURCE -I/usr/src/RPM/BUILD/srt-1.4.4/common -I/usr/src/RPM/BUILD/srt-1.4.4/srtcore -I/usr/src/RPM/BUILD/srt-1.4.4/haicrypt -I/usr/src/RPM/BUILD/srt-1.4.4/x86_64-alt-linux -I/usr/src/RPM/BUILD/srt-1.4.4/apps -pipe -frecord-gcc-switches -Wall -g -O2 -flto=auto   -DENABLE_LOGGING=1 -DENABLE_GETNAMEINFO=1 -Wall -Wextra -O2 -DNDEBUG -fPIE -MD -MT CMakeFiles/srt-test-file.dir/testing/srt-test-file.cpp.o -MF CMakeFiles/srt-test-file.dir/testing/srt-test-file.cpp.o.d -o CMakeFiles/srt-test-file.dir/testing/srt-test-file.cpp.o -c /usr/src/RPM/BUILD/srt-1.4.4/testing/srt-test-file.cpp
gmake[2]: Leaving directory '/usr/src/RPM/BUILD/srt-1.4.4/x86_64-alt-linux'
gmake[2]: Entering directory '/usr/src/RPM/BUILD/srt-1.4.4/x86_64-alt-linux'
[ 54%] Building CXX object CMakeFiles/srt-file-transmit.dir/apps/srt-file-transmit.cpp.o
/usr/bin/c++ -DENABLE_MONOTONIC_CLOCK=1 -DENABLE_SOCK_CLOEXEC=1 -DHAI_ENABLE_SRT=1 -DHAI_PATCH=1 -DHAVE_INET_PTON=1 -DHAVE_PTHREAD_GETNAME_NP=1 -DHAVE_PTHREAD_SETNAME_NP=1 -DLINUX=1 -DSRT_ENABLE_APP_READER -DSRT_ENABLE_BINDTODEVICE -DSRT_ENABLE_CLOSE_SYNCH -DSRT_ENABLE_ENCRYPTION -DSRT_VERSION=\"1.4.4\" -DUSE_GNUTLS=1 -D_GNU_SOURCE -I/usr/src/RPM/BUILD/srt-1.4.4/common -I/usr/src/RPM/BUILD/srt-1.4.4/srtcore -I/usr/src/RPM/BUILD/srt-1.4.4/haicrypt -I/usr/src/RPM/BUILD/srt-1.4.4/x86_64-alt-linux -I/usr/src/RPM/BUILD/srt-1.4.4/apps -pipe -frecord-gcc-switches -Wall -g -O2 -flto=auto   -DENABLE_LOGGING=1 -DENABLE_GETNAMEINFO=1 -Wall -Wextra -O2 -DNDEBUG -fPIE -MD -MT CMakeFiles/srt-file-transmit.dir/apps/srt-file-transmit.cpp.o -MF CMakeFiles/srt-file-transmit.dir/apps/srt-file-transmit.cpp.o.d -o CMakeFiles/srt-file-transmit.dir/apps/srt-file-transmit.cpp.o -c /usr/src/RPM/BUILD/srt-1.4.4/apps/srt-file-transmit.cpp
gmake[2]: Leaving directory '/usr/src/RPM/BUILD/srt-1.4.4/x86_64-alt-linux'
gmake[2]: Entering directory '/usr/src/RPM/BUILD/srt-1.4.4/x86_64-alt-linux'
[ 45%] Building CXX object CMakeFiles/srt-test-multiplex.dir/testing/srt-test-multiplex.cpp.o
/usr/bin/c++ -DENABLE_MONOTONIC_CLOCK=1 -DENABLE_SOCK_CLOEXEC=1 -DHAI_ENABLE_SRT=1 -DHAI_PATCH=1 -DHAVE_INET_PTON=1 -DHAVE_PTHREAD_GETNAME_NP=1 -DHAVE_PTHREAD_SETNAME_NP=1 -DLINUX=1 -DSRT_ENABLE_APP_READER -DSRT_ENABLE_BINDTODEVICE -DSRT_ENABLE_CLOSE_SYNCH -DSRT_ENABLE_ENCRYPTION -DSRT_VERSION=\"1.4.4\" -DUSE_GNUTLS=1 -D_GNU_SOURCE -I/usr/src/RPM/BUILD/srt-1.4.4/common -I/usr/src/RPM/BUILD/srt-1.4.4/srtcore -I/usr/src/RPM/BUILD/srt-1.4.4/haicrypt -I/usr/src/RPM/BUILD/srt-1.4.4/x86_64-alt-linux -I/usr/src/RPM/BUILD/srt-1.4.4/apps -pipe -frecord-gcc-switches -Wall -g -O2 -flto=auto   -DENABLE_LOGGING=1 -DENABLE_GETNAMEINFO=1 -Wall -Wextra -O2 -DNDEBUG -fPIE -MD -MT CMakeFiles/srt-test-multiplex.dir/testing/srt-test-multiplex.cpp.o -MF CMakeFiles/srt-test-multiplex.dir/testing/srt-test-multiplex.cpp.o.d -o CMakeFiles/srt-test-multiplex.dir/testing/srt-test-multiplex.cpp.o -c /usr/src/RPM/BUILD/srt-1.4.4/testing/srt-test-multiplex.cpp
gmake[2]: Leaving directory '/usr/src/RPM/BUILD/srt-1.4.4/x86_64-alt-linux'
gmake[2]: Entering directory '/usr/src/RPM/BUILD/srt-1.4.4/x86_64-alt-linux'
[ 44%] Building CXX object CMakeFiles/srt-live-transmit.dir/apps/srt-live-transmit.cpp.o
/usr/bin/c++ -DENABLE_MONOTONIC_CLOCK=1 -DENABLE_SOCK_CLOEXEC=1 -DHAI_ENABLE_SRT=1 -DHAI_PATCH=1 -DHAVE_INET_PTON=1 -DHAVE_PTHREAD_GETNAME_NP=1 -DHAVE_PTHREAD_SETNAME_NP=1 -DLINUX=1 -DSRT_ENABLE_APP_READER -DSRT_ENABLE_BINDTODEVICE -DSRT_ENABLE_CLOSE_SYNCH -DSRT_ENABLE_ENCRYPTION -DSRT_VERSION=\"1.4.4\" -DUSE_GNUTLS=1 -D_GNU_SOURCE -I/usr/src/RPM/BUILD/srt-1.4.4/common -I/usr/src/RPM/BUILD/srt-1.4.4/srtcore -I/usr/src/RPM/BUILD/srt-1.4.4/haicrypt -I/usr/src/RPM/BUILD/srt-1.4.4/x86_64-alt-linux -I/usr/src/RPM/BUILD/srt-1.4.4/apps -pipe -frecord-gcc-switches -Wall -g -O2 -flto=auto   -DENABLE_LOGGING=1 -DENABLE_GETNAMEINFO=1 -Wall -Wextra -O2 -DNDEBUG -fPIE -MD -MT CMakeFiles/srt-live-transmit.dir/apps/srt-live-transmit.cpp.o -MF CMakeFiles/srt-live-transmit.dir/apps/srt-live-transmit.cpp.o.d -o CMakeFiles/srt-live-transmit.dir/apps/srt-live-transmit.cpp.o -c /usr/src/RPM/BUILD/srt-1.4.4/apps/srt-live-transmit.cpp
gmake[2]: Leaving directory '/usr/src/RPM/BUILD/srt-1.4.4/x86_64-alt-linux'
gmake[2]: Entering directory '/usr/src/RPM/BUILD/srt-1.4.4/x86_64-alt-linux'
[ 52%] Building CXX object CMakeFiles/test-srt.dir/test/test_buffer.cpp.o
/usr/bin/c++ -DENABLE_MONOTONIC_CLOCK=1 -DENABLE_SOCK_CLOEXEC=1 -DGTEST_LINKED_AS_SHARED_LIBRARY=1 -DHAI_ENABLE_SRT=1 -DHAI_PATCH=1 -DHAVE_INET_PTON=1 -DHAVE_PTHREAD_GETNAME_NP=1 -DHAVE_PTHREAD_SETNAME_NP=1 -DLINUX=1 -DSRT_ENABLE_APP_READER -DSRT_ENABLE_BINDTODEVICE -DSRT_ENABLE_CLOSE_SYNCH -DSRT_ENABLE_ENCRYPTION -DSRT_VERSION=\"1.4.4\" -DUSE_GNUTLS=1 -D_GNU_SOURCE -I/usr/src/RPM/BUILD/srt-1.4.4/common -I/usr/src/RPM/BUILD/srt-1.4.4/srtcore -I/usr/src/RPM/BUILD/srt-1.4.4/haicrypt -I/usr/src/RPM/BUILD/srt-1.4.4/x86_64-alt-linux -I/usr/src/RPM/BUILD/srt-1.4.4/apps -I/usr/include/p11-kit-1 -pipe -frecord-gcc-switches -Wall -g -O2 -flto=auto   -DENABLE_LOGGING=1 -DENABLE_GETNAMEINFO=1 -Wall -Wextra -O2 -DNDEBUG -fPIE -MD -MT CMakeFiles/test-srt.dir/test/test_buffer.cpp.o -MF CMakeFiles/test-srt.dir/test/test_buffer.cpp.o.d -o CMakeFiles/test-srt.dir/test/test_buffer.cpp.o -c /usr/src/RPM/BUILD/srt-1.4.4/test/test_buffer.cpp
gmake[2]: Leaving directory '/usr/src/RPM/BUILD/srt-1.4.4/x86_64-alt-linux'
gmake[2]: Entering directory '/usr/src/RPM/BUILD/srt-1.4.4/x86_64-alt-linux'
[ 58%] Building CXX object CMakeFiles/srt-test-live.dir/apps/apputil.cpp.o
/usr/bin/c++ -DENABLE_MONOTONIC_CLOCK=1 -DENABLE_SOCK_CLOEXEC=1 -DHAI_ENABLE_SRT=1 -DHAI_PATCH=1 -DHAVE_INET_PTON=1 -DHAVE_PTHREAD_GETNAME_NP=1 -DHAVE_PTHREAD_SETNAME_NP=1 -DLINUX=1 -DSRT_ENABLE_APP_READER -DSRT_ENABLE_BINDTODEVICE -DSRT_ENABLE_CLOSE_SYNCH -DSRT_ENABLE_ENCRYPTION -DSRT_VERSION=\"1.4.4\" -DUSE_GNUTLS=1 -D_GNU_SOURCE -I/usr/src/RPM/BUILD/srt-1.4.4/common -I/usr/src/RPM/BUILD/srt-1.4.4/srtcore -I/usr/src/RPM/BUILD/srt-1.4.4/haicrypt -I/usr/src/RPM/BUILD/srt-1.4.4/x86_64-alt-linux -I/usr/src/RPM/BUILD/srt-1.4.4/apps -pipe -frecord-gcc-switches -Wall -g -O2 -flto=auto   -DENABLE_LOGGING=1 -DENABLE_GETNAMEINFO=1 -Wall -Wextra -O2 -DNDEBUG -fPIE -MD -MT CMakeFiles/srt-test-live.dir/apps/apputil.cpp.o -MF CMakeFiles/srt-test-live.dir/apps/apputil.cpp.o.d -o CMakeFiles/srt-test-live.dir/apps/apputil.cpp.o -c /usr/src/RPM/BUILD/srt-1.4.4/apps/apputil.cpp
gmake[2]: Leaving directory '/usr/src/RPM/BUILD/srt-1.4.4/x86_64-alt-linux'
gmake[2]: Entering directory '/usr/src/RPM/BUILD/srt-1.4.4/x86_64-alt-linux'
[ 53%] Building CXX object CMakeFiles/srt-tunnel.dir/apps/srt-tunnel.cpp.o
/usr/bin/c++ -DENABLE_MONOTONIC_CLOCK=1 -DENABLE_SOCK_CLOEXEC=1 -DHAI_ENABLE_SRT=1 -DHAI_PATCH=1 -DHAVE_INET_PTON=1 -DHAVE_PTHREAD_GETNAME_NP=1 -DHAVE_PTHREAD_SETNAME_NP=1 -DLINUX=1 -DSRT_ENABLE_APP_READER -DSRT_ENABLE_BINDTODEVICE -DSRT_ENABLE_CLOSE_SYNCH -DSRT_ENABLE_ENCRYPTION -DSRT_ENABLE_VERBOSE_LOCK -DSRT_VERSION=\"1.4.4\" -DUSE_GNUTLS=1 -D_GNU_SOURCE -I/usr/src/RPM/BUILD/srt-1.4.4/common -I/usr/src/RPM/BUILD/srt-1.4.4/srtcore -I/usr/src/RPM/BUILD/srt-1.4.4/haicrypt -I/usr/src/RPM/BUILD/srt-1.4.4/x86_64-alt-linux -I/usr/src/RPM/BUILD/srt-1.4.4/apps -pipe -frecord-gcc-switches -Wall -g -O2 -flto=auto   -DENABLE_LOGGING=1 -DENABLE_GETNAMEINFO=1 -Wall -Wextra -O2 -DNDEBUG -fPIE -MD -MT CMakeFiles/srt-tunnel.dir/apps/srt-tunnel.cpp.o -MF CMakeFiles/srt-tunnel.dir/apps/srt-tunnel.cpp.o.d -o CMakeFiles/srt-tunnel.dir/apps/srt-tunnel.cpp.o -c /usr/src/RPM/BUILD/srt-1.4.4/apps/srt-tunnel.cpp
gmake[2]: Leaving directory '/usr/src/RPM/BUILD/srt-1.4.4/x86_64-alt-linux'
gmake[2]: Entering directory '/usr/src/RPM/BUILD/srt-1.4.4/x86_64-alt-linux'
[ 54%] Building CXX object CMakeFiles/srt-test-live.dir/testing/srt-test-live.cpp.o
/usr/bin/c++ -DENABLE_MONOTONIC_CLOCK=1 -DENABLE_SOCK_CLOEXEC=1 -DHAI_ENABLE_SRT=1 -DHAI_PATCH=1 -DHAVE_INET_PTON=1 -DHAVE_PTHREAD_GETNAME_NP=1 -DHAVE_PTHREAD_SETNAME_NP=1 -DLINUX=1 -DSRT_ENABLE_APP_READER -DSRT_ENABLE_BINDTODEVICE -DSRT_ENABLE_CLOSE_SYNCH -DSRT_ENABLE_ENCRYPTION -DSRT_VERSION=\"1.4.4\" -DUSE_GNUTLS=1 -D_GNU_SOURCE -I/usr/src/RPM/BUILD/srt-1.4.4/common -I/usr/src/RPM/BUILD/srt-1.4.4/srtcore -I/usr/src/RPM/BUILD/srt-1.4.4/haicrypt -I/usr/src/RPM/BUILD/srt-1.4.4/x86_64-alt-linux -I/usr/src/RPM/BUILD/srt-1.4.4/apps -pipe -frecord-gcc-switches -Wall -g -O2 -flto=auto   -DENABLE_LOGGING=1 -DENABLE_GETNAMEINFO=1 -Wall -Wextra -O2 -DNDEBUG -fPIE -MD -MT CMakeFiles/srt-test-live.dir/testing/srt-test-live.cpp.o -MF CMakeFiles/srt-test-live.dir/testing/srt-test-live.cpp.o.d -o CMakeFiles/srt-test-live.dir/testing/srt-test-live.cpp.o -c /usr/src/RPM/BUILD/srt-1.4.4/testing/srt-test-live.cpp
gmake[2]: Leaving directory '/usr/src/RPM/BUILD/srt-1.4.4/x86_64-alt-linux'
gmake[2]: Entering directory '/usr/src/RPM/BUILD/srt-1.4.4/x86_64-alt-linux'
[ 63%] Building CXX object CMakeFiles/srt-test-live.dir/apps/uriparser.cpp.o
/usr/bin/c++ -DENABLE_MONOTONIC_CLOCK=1 -DENABLE_SOCK_CLOEXEC=1 -DHAI_ENABLE_SRT=1 -DHAI_PATCH=1 -DHAVE_INET_PTON=1 -DHAVE_PTHREAD_GETNAME_NP=1 -DHAVE_PTHREAD_SETNAME_NP=1 -DLINUX=1 -DSRT_ENABLE_APP_READER -DSRT_ENABLE_BINDTODEVICE -DSRT_ENABLE_CLOSE_SYNCH -DSRT_ENABLE_ENCRYPTION -DSRT_VERSION=\"1.4.4\" -DUSE_GNUTLS=1 -D_GNU_SOURCE -I/usr/src/RPM/BUILD/srt-1.4.4/common -I/usr/src/RPM/BUILD/srt-1.4.4/srtcore -I/usr/src/RPM/BUILD/srt-1.4.4/haicrypt -I/usr/src/RPM/BUILD/srt-1.4.4/x86_64-alt-linux -I/usr/src/RPM/BUILD/srt-1.4.4/apps -pipe -frecord-gcc-switches -Wall -g -O2 -flto=auto   -DENABLE_LOGGING=1 -DENABLE_GETNAMEINFO=1 -Wall -Wextra -O2 -DNDEBUG -fPIE -MD -MT CMakeFiles/srt-test-live.dir/apps/uriparser.cpp.o -MF CMakeFiles/srt-test-live.dir/apps/uriparser.cpp.o.d -o CMakeFiles/srt-test-live.dir/apps/uriparser.cpp.o -c /usr/src/RPM/BUILD/srt-1.4.4/apps/uriparser.cpp
gmake[2]: Leaving directory '/usr/src/RPM/BUILD/srt-1.4.4/x86_64-alt-linux'
gmake[2]: Entering directory '/usr/src/RPM/BUILD/srt-1.4.4/x86_64-alt-linux'
[ 61%] Building CXX object CMakeFiles/srt-test-live.dir/apps/socketoptions.cpp.o
/usr/bin/c++ -DENABLE_MONOTONIC_CLOCK=1 -DENABLE_SOCK_CLOEXEC=1 -DHAI_ENABLE_SRT=1 -DHAI_PATCH=1 -DHAVE_INET_PTON=1 -DHAVE_PTHREAD_GETNAME_NP=1 -DHAVE_PTHREAD_SETNAME_NP=1 -DLINUX=1 -DSRT_ENABLE_APP_READER -DSRT_ENABLE_BINDTODEVICE -DSRT_ENABLE_CLOSE_SYNCH -DSRT_ENABLE_ENCRYPTION -DSRT_VERSION=\"1.4.4\" -DUSE_GNUTLS=1 -D_GNU_SOURCE -I/usr/src/RPM/BUILD/srt-1.4.4/common -I/usr/src/RPM/BUILD/srt-1.4.4/srtcore -I/usr/src/RPM/BUILD/srt-1.4.4/haicrypt -I/usr/src/RPM/BUILD/srt-1.4.4/x86_64-alt-linux -I/usr/src/RPM/BUILD/srt-1.4.4/apps -pipe -frecord-gcc-switches -Wall -g -O2 -flto=auto   -DENABLE_LOGGING=1 -DENABLE_GETNAMEINFO=1 -Wall -Wextra -O2 -DNDEBUG -fPIE -MD -MT CMakeFiles/srt-test-live.dir/apps/socketoptions.cpp.o -MF CMakeFiles/srt-test-live.dir/apps/socketoptions.cpp.o.d -o CMakeFiles/srt-test-live.dir/apps/socketoptions.cpp.o -c /usr/src/RPM/BUILD/srt-1.4.4/apps/socketoptions.cpp
gmake[2]: Leaving directory '/usr/src/RPM/BUILD/srt-1.4.4/x86_64-alt-linux'
gmake[2]: Entering directory '/usr/src/RPM/BUILD/srt-1.4.4/x86_64-alt-linux'
[ 59%] Building CXX object CMakeFiles/test-srt.dir/test/test_common.cpp.o
/usr/bin/c++ -DENABLE_MONOTONIC_CLOCK=1 -DENABLE_SOCK_CLOEXEC=1 -DGTEST_LINKED_AS_SHARED_LIBRARY=1 -DHAI_ENABLE_SRT=1 -DHAI_PATCH=1 -DHAVE_INET_PTON=1 -DHAVE_PTHREAD_GETNAME_NP=1 -DHAVE_PTHREAD_SETNAME_NP=1 -DLINUX=1 -DSRT_ENABLE_APP_READER -DSRT_ENABLE_BINDTODEVICE -DSRT_ENABLE_CLOSE_SYNCH -DSRT_ENABLE_ENCRYPTION -DSRT_VERSION=\"1.4.4\" -DUSE_GNUTLS=1 -D_GNU_SOURCE -I/usr/src/RPM/BUILD/srt-1.4.4/common -I/usr/src/RPM/BUILD/srt-1.4.4/srtcore -I/usr/src/RPM/BUILD/srt-1.4.4/haicrypt -I/usr/src/RPM/BUILD/srt-1.4.4/x86_64-alt-linux -I/usr/src/RPM/BUILD/srt-1.4.4/apps -I/usr/include/p11-kit-1 -pipe -frecord-gcc-switches -Wall -g -O2 -flto=auto   -DENABLE_LOGGING=1 -DENABLE_GETNAMEINFO=1 -Wall -Wextra -O2 -DNDEBUG -fPIE -MD -MT CMakeFiles/test-srt.dir/test/test_common.cpp.o -MF CMakeFiles/test-srt.dir/test/test_common.cpp.o.d -o CMakeFiles/test-srt.dir/test/test_common.cpp.o -c /usr/src/RPM/BUILD/srt-1.4.4/test/test_common.cpp
gmake[2]: Leaving directory '/usr/src/RPM/BUILD/srt-1.4.4/x86_64-alt-linux'
gmake[2]: Entering directory '/usr/src/RPM/BUILD/srt-1.4.4/x86_64-alt-linux'
[ 46%] Building CXX object CMakeFiles/srt-test-multiplex.dir/testing/testmedia.cpp.o
/usr/bin/c++ -DENABLE_MONOTONIC_CLOCK=1 -DENABLE_SOCK_CLOEXEC=1 -DHAI_ENABLE_SRT=1 -DHAI_PATCH=1 -DHAVE_INET_PTON=1 -DHAVE_PTHREAD_GETNAME_NP=1 -DHAVE_PTHREAD_SETNAME_NP=1 -DLINUX=1 -DSRT_ENABLE_APP_READER -DSRT_ENABLE_BINDTODEVICE -DSRT_ENABLE_CLOSE_SYNCH -DSRT_ENABLE_ENCRYPTION -DSRT_VERSION=\"1.4.4\" -DUSE_GNUTLS=1 -D_GNU_SOURCE -I/usr/src/RPM/BUILD/srt-1.4.4/common -I/usr/src/RPM/BUILD/srt-1.4.4/srtcore -I/usr/src/RPM/BUILD/srt-1.4.4/haicrypt -I/usr/src/RPM/BUILD/srt-1.4.4/x86_64-alt-linux -I/usr/src/RPM/BUILD/srt-1.4.4/apps -pipe -frecord-gcc-switches -Wall -g -O2 -flto=auto   -DENABLE_LOGGING=1 -DENABLE_GETNAMEINFO=1 -Wall -Wextra -O2 -DNDEBUG -fPIE -MD -MT CMakeFiles/srt-test-multiplex.dir/testing/testmedia.cpp.o -MF CMakeFiles/srt-test-multiplex.dir/testing/testmedia.cpp.o.d -o CMakeFiles/srt-test-multiplex.dir/testing/testmedia.cpp.o -c /usr/src/RPM/BUILD/srt-1.4.4/testing/testmedia.cpp
gmake[2]: Leaving directory '/usr/src/RPM/BUILD/srt-1.4.4/x86_64-alt-linux'
gmake[2]: Entering directory '/usr/src/RPM/BUILD/srt-1.4.4/x86_64-alt-linux'
[ 56%] Building CXX object CMakeFiles/srt-test-relay.dir/testing/srt-test-relay.cpp.o
/usr/bin/c++ -DENABLE_MONOTONIC_CLOCK=1 -DENABLE_SOCK_CLOEXEC=1 -DHAI_ENABLE_SRT=1 -DHAI_PATCH=1 -DHAVE_INET_PTON=1 -DHAVE_PTHREAD_GETNAME_NP=1 -DHAVE_PTHREAD_SETNAME_NP=1 -DLINUX=1 -DSRT_ENABLE_APP_READER -DSRT_ENABLE_BINDTODEVICE -DSRT_ENABLE_CLOSE_SYNCH -DSRT_ENABLE_ENCRYPTION -DSRT_ENABLE_VERBOSE_LOCK -DSRT_VERSION=\"1.4.4\" -DUSE_GNUTLS=1 -D_GNU_SOURCE -I/usr/src/RPM/BUILD/srt-1.4.4/common -I/usr/src/RPM/BUILD/srt-1.4.4/srtcore -I/usr/src/RPM/BUILD/srt-1.4.4/haicrypt -I/usr/src/RPM/BUILD/srt-1.4.4/x86_64-alt-linux -I/usr/src/RPM/BUILD/srt-1.4.4/apps -pipe -frecord-gcc-switches -Wall -g -O2 -flto=auto   -DENABLE_LOGGING=1 -DENABLE_GETNAMEINFO=1 -Wall -Wextra -O2 -DNDEBUG -fPIE -MD -MT CMakeFiles/srt-test-relay.dir/testing/srt-test-relay.cpp.o -MF CMakeFiles/srt-test-relay.dir/testing/srt-test-relay.cpp.o.d -o CMakeFiles/srt-test-relay.dir/testing/srt-test-relay.cpp.o -c /usr/src/RPM/BUILD/srt-1.4.4/testing/srt-test-relay.cpp
gmake[2]: Leaving directory '/usr/src/RPM/BUILD/srt-1.4.4/x86_64-alt-linux'
gmake[2]: Entering directory '/usr/src/RPM/BUILD/srt-1.4.4/x86_64-alt-linux'
[ 64%] Building CXX object CMakeFiles/srt-test-live.dir/apps/logsupport.cpp.o
/usr/bin/c++ -DENABLE_MONOTONIC_CLOCK=1 -DENABLE_SOCK_CLOEXEC=1 -DHAI_ENABLE_SRT=1 -DHAI_PATCH=1 -DHAVE_INET_PTON=1 -DHAVE_PTHREAD_GETNAME_NP=1 -DHAVE_PTHREAD_SETNAME_NP=1 -DLINUX=1 -DSRT_ENABLE_APP_READER -DSRT_ENABLE_BINDTODEVICE -DSRT_ENABLE_CLOSE_SYNCH -DSRT_ENABLE_ENCRYPTION -DSRT_VERSION=\"1.4.4\" -DUSE_GNUTLS=1 -D_GNU_SOURCE -I/usr/src/RPM/BUILD/srt-1.4.4/common -I/usr/src/RPM/BUILD/srt-1.4.4/srtcore -I/usr/src/RPM/BUILD/srt-1.4.4/haicrypt -I/usr/src/RPM/BUILD/srt-1.4.4/x86_64-alt-linux -I/usr/src/RPM/BUILD/srt-1.4.4/apps -pipe -frecord-gcc-switches -Wall -g -O2 -flto=auto   -DENABLE_LOGGING=1 -DENABLE_GETNAMEINFO=1 -Wall -Wextra -O2 -DNDEBUG -fPIE -MD -MT CMakeFiles/srt-test-live.dir/apps/logsupport.cpp.o -MF CMakeFiles/srt-test-live.dir/apps/logsupport.cpp.o.d -o CMakeFiles/srt-test-live.dir/apps/logsupport.cpp.o -c /usr/src/RPM/BUILD/srt-1.4.4/apps/logsupport.cpp
gmake[2]: Leaving directory '/usr/src/RPM/BUILD/srt-1.4.4/x86_64-alt-linux'
gmake[2]: Entering directory '/usr/src/RPM/BUILD/srt-1.4.4/x86_64-alt-linux'
[ 69%] Building CXX object CMakeFiles/srt-test-live.dir/apps/logsupport_appdefs.cpp.o
/usr/bin/c++ -DENABLE_MONOTONIC_CLOCK=1 -DENABLE_SOCK_CLOEXEC=1 -DHAI_ENABLE_SRT=1 -DHAI_PATCH=1 -DHAVE_INET_PTON=1 -DHAVE_PTHREAD_GETNAME_NP=1 -DHAVE_PTHREAD_SETNAME_NP=1 -DLINUX=1 -DSRT_ENABLE_APP_READER -DSRT_ENABLE_BINDTODEVICE -DSRT_ENABLE_CLOSE_SYNCH -DSRT_ENABLE_ENCRYPTION -DSRT_VERSION=\"1.4.4\" -DUSE_GNUTLS=1 -D_GNU_SOURCE -I/usr/src/RPM/BUILD/srt-1.4.4/common -I/usr/src/RPM/BUILD/srt-1.4.4/srtcore -I/usr/src/RPM/BUILD/srt-1.4.4/haicrypt -I/usr/src/RPM/BUILD/srt-1.4.4/x86_64-alt-linux -I/usr/src/RPM/BUILD/srt-1.4.4/apps -pipe -frecord-gcc-switches -Wall -g -O2 -flto=auto   -DENABLE_LOGGING=1 -DENABLE_GETNAMEINFO=1 -Wall -Wextra -O2 -DNDEBUG -fPIE -MD -MT CMakeFiles/srt-test-live.dir/apps/logsupport_appdefs.cpp.o -MF CMakeFiles/srt-test-live.dir/apps/logsupport_appdefs.cpp.o.d -o CMakeFiles/srt-test-live.dir/apps/logsupport_appdefs.cpp.o -c /usr/src/RPM/BUILD/srt-1.4.4/apps/logsupport_appdefs.cpp
gmake[2]: Leaving directory '/usr/src/RPM/BUILD/srt-1.4.4/x86_64-alt-linux'
gmake[2]: Entering directory '/usr/src/RPM/BUILD/srt-1.4.4/x86_64-alt-linux'
[ 62%] Building CXX object CMakeFiles/test-srt.dir/test/test_connection_timeout.cpp.o
/usr/bin/c++ -DENABLE_MONOTONIC_CLOCK=1 -DENABLE_SOCK_CLOEXEC=1 -DGTEST_LINKED_AS_SHARED_LIBRARY=1 -DHAI_ENABLE_SRT=1 -DHAI_PATCH=1 -DHAVE_INET_PTON=1 -DHAVE_PTHREAD_GETNAME_NP=1 -DHAVE_PTHREAD_SETNAME_NP=1 -DLINUX=1 -DSRT_ENABLE_APP_READER -DSRT_ENABLE_BINDTODEVICE -DSRT_ENABLE_CLOSE_SYNCH -DSRT_ENABLE_ENCRYPTION -DSRT_VERSION=\"1.4.4\" -DUSE_GNUTLS=1 -D_GNU_SOURCE -I/usr/src/RPM/BUILD/srt-1.4.4/common -I/usr/src/RPM/BUILD/srt-1.4.4/srtcore -I/usr/src/RPM/BUILD/srt-1.4.4/haicrypt -I/usr/src/RPM/BUILD/srt-1.4.4/x86_64-alt-linux -I/usr/src/RPM/BUILD/srt-1.4.4/apps -I/usr/include/p11-kit-1 -pipe -frecord-gcc-switches -Wall -g -O2 -flto=auto   -DENABLE_LOGGING=1 -DENABLE_GETNAMEINFO=1 -Wall -Wextra -O2 -DNDEBUG -fPIE -MD -MT CMakeFiles/test-srt.dir/test/test_connection_timeout.cpp.o -MF CMakeFiles/test-srt.dir/test/test_connection_timeout.cpp.o.d -o CMakeFiles/test-srt.dir/test/test_connection_timeout.cpp.o -c /usr/src/RPM/BUILD/srt-1.4.4/test/test_connection_timeout.cpp
gmake[2]: Leaving directory '/usr/src/RPM/BUILD/srt-1.4.4/x86_64-alt-linux'
gmake[2]: Entering directory '/usr/src/RPM/BUILD/srt-1.4.4/x86_64-alt-linux'
[ 58%] Building CXX object CMakeFiles/srt-test-live.dir/testing/testmedia.cpp.o
/usr/bin/c++ -DENABLE_MONOTONIC_CLOCK=1 -DENABLE_SOCK_CLOEXEC=1 -DHAI_ENABLE_SRT=1 -DHAI_PATCH=1 -DHAVE_INET_PTON=1 -DHAVE_PTHREAD_GETNAME_NP=1 -DHAVE_PTHREAD_SETNAME_NP=1 -DLINUX=1 -DSRT_ENABLE_APP_READER -DSRT_ENABLE_BINDTODEVICE -DSRT_ENABLE_CLOSE_SYNCH -DSRT_ENABLE_ENCRYPTION -DSRT_VERSION=\"1.4.4\" -DUSE_GNUTLS=1 -D_GNU_SOURCE -I/usr/src/RPM/BUILD/srt-1.4.4/common -I/usr/src/RPM/BUILD/srt-1.4.4/srtcore -I/usr/src/RPM/BUILD/srt-1.4.4/haicrypt -I/usr/src/RPM/BUILD/srt-1.4.4/x86_64-alt-linux -I/usr/src/RPM/BUILD/srt-1.4.4/apps -pipe -frecord-gcc-switches -Wall -g -O2 -flto=auto   -DENABLE_LOGGING=1 -DENABLE_GETNAMEINFO=1 -Wall -Wextra -O2 -DNDEBUG -fPIE -MD -MT CMakeFiles/srt-test-live.dir/testing/testmedia.cpp.o -MF CMakeFiles/srt-test-live.dir/testing/testmedia.cpp.o.d -o CMakeFiles/srt-test-live.dir/testing/testmedia.cpp.o -c /usr/src/RPM/BUILD/srt-1.4.4/testing/testmedia.cpp
gmake[2]: Leaving directory '/usr/src/RPM/BUILD/srt-1.4.4/x86_64-alt-linux'
gmake[2]: Entering directory '/usr/src/RPM/BUILD/srt-1.4.4/x86_64-alt-linux'
[ 67%] Building CXX object CMakeFiles/srt-test-file.dir/apps/apputil.cpp.o
/usr/bin/c++ -DENABLE_MONOTONIC_CLOCK=1 -DENABLE_SOCK_CLOEXEC=1 -DHAI_ENABLE_SRT=1 -DHAI_PATCH=1 -DHAVE_INET_PTON=1 -DHAVE_PTHREAD_GETNAME_NP=1 -DHAVE_PTHREAD_SETNAME_NP=1 -DLINUX=1 -DSRT_ENABLE_APP_READER -DSRT_ENABLE_BINDTODEVICE -DSRT_ENABLE_CLOSE_SYNCH -DSRT_ENABLE_ENCRYPTION -DSRT_VERSION=\"1.4.4\" -DUSE_GNUTLS=1 -D_GNU_SOURCE -I/usr/src/RPM/BUILD/srt-1.4.4/common -I/usr/src/RPM/BUILD/srt-1.4.4/srtcore -I/usr/src/RPM/BUILD/srt-1.4.4/haicrypt -I/usr/src/RPM/BUILD/srt-1.4.4/x86_64-alt-linux -I/usr/src/RPM/BUILD/srt-1.4.4/apps -pipe -frecord-gcc-switches -Wall -g -O2 -flto=auto   -DENABLE_LOGGING=1 -DENABLE_GETNAMEINFO=1 -Wall -Wextra -O2 -DNDEBUG -fPIE -MD -MT CMakeFiles/srt-test-file.dir/apps/apputil.cpp.o -MF CMakeFiles/srt-test-file.dir/apps/apputil.cpp.o.d -o CMakeFiles/srt-test-file.dir/apps/apputil.cpp.o -c /usr/src/RPM/BUILD/srt-1.4.4/apps/apputil.cpp
gmake[2]: Leaving directory '/usr/src/RPM/BUILD/srt-1.4.4/x86_64-alt-linux'
gmake[2]: Entering directory '/usr/src/RPM/BUILD/srt-1.4.4/x86_64-alt-linux'
[ 74%] Building CXX object CMakeFiles/srt-test-file.dir/apps/verbose.cpp.o
/usr/bin/c++ -DENABLE_MONOTONIC_CLOCK=1 -DENABLE_SOCK_CLOEXEC=1 -DHAI_ENABLE_SRT=1 -DHAI_PATCH=1 -DHAVE_INET_PTON=1 -DHAVE_PTHREAD_GETNAME_NP=1 -DHAVE_PTHREAD_SETNAME_NP=1 -DLINUX=1 -DSRT_ENABLE_APP_READER -DSRT_ENABLE_BINDTODEVICE -DSRT_ENABLE_CLOSE_SYNCH -DSRT_ENABLE_ENCRYPTION -DSRT_VERSION=\"1.4.4\" -DUSE_GNUTLS=1 -D_GNU_SOURCE -I/usr/src/RPM/BUILD/srt-1.4.4/common -I/usr/src/RPM/BUILD/srt-1.4.4/srtcore -I/usr/src/RPM/BUILD/srt-1.4.4/haicrypt -I/usr/src/RPM/BUILD/srt-1.4.4/x86_64-alt-linux -I/usr/src/RPM/BUILD/srt-1.4.4/apps -pipe -frecord-gcc-switches -Wall -g -O2 -flto=auto   -DENABLE_LOGGING=1 -DENABLE_GETNAMEINFO=1 -Wall -Wextra -O2 -DNDEBUG -fPIE -MD -MT CMakeFiles/srt-test-file.dir/apps/verbose.cpp.o -MF CMakeFiles/srt-test-file.dir/apps/verbose.cpp.o.d -o CMakeFiles/srt-test-file.dir/apps/verbose.cpp.o -c /usr/src/RPM/BUILD/srt-1.4.4/apps/verbose.cpp
gmake[2]: Leaving directory '/usr/src/RPM/BUILD/srt-1.4.4/x86_64-alt-linux'
gmake[2]: Entering directory '/usr/src/RPM/BUILD/srt-1.4.4/x86_64-alt-linux'
[ 75%] Building CXX object CMakeFiles/srt-test-file.dir/apps/socketoptions.cpp.o
/usr/bin/c++ -DENABLE_MONOTONIC_CLOCK=1 -DENABLE_SOCK_CLOEXEC=1 -DHAI_ENABLE_SRT=1 -DHAI_PATCH=1 -DHAVE_INET_PTON=1 -DHAVE_PTHREAD_GETNAME_NP=1 -DHAVE_PTHREAD_SETNAME_NP=1 -DLINUX=1 -DSRT_ENABLE_APP_READER -DSRT_ENABLE_BINDTODEVICE -DSRT_ENABLE_CLOSE_SYNCH -DSRT_ENABLE_ENCRYPTION -DSRT_VERSION=\"1.4.4\" -DUSE_GNUTLS=1 -D_GNU_SOURCE -I/usr/src/RPM/BUILD/srt-1.4.4/common -I/usr/src/RPM/BUILD/srt-1.4.4/srtcore -I/usr/src/RPM/BUILD/srt-1.4.4/haicrypt -I/usr/src/RPM/BUILD/srt-1.4.4/x86_64-alt-linux -I/usr/src/RPM/BUILD/srt-1.4.4/apps -pipe -frecord-gcc-switches -Wall -g -O2 -flto=auto   -DENABLE_LOGGING=1 -DENABLE_GETNAMEINFO=1 -Wall -Wextra -O2 -DNDEBUG -fPIE -MD -MT CMakeFiles/srt-test-file.dir/apps/socketoptions.cpp.o -MF CMakeFiles/srt-test-file.dir/apps/socketoptions.cpp.o.d -o CMakeFiles/srt-test-file.dir/apps/socketoptions.cpp.o -c /usr/src/RPM/BUILD/srt-1.4.4/apps/socketoptions.cpp
gmake[2]: Leaving directory '/usr/src/RPM/BUILD/srt-1.4.4/x86_64-alt-linux'
gmake[2]: Entering directory '/usr/src/RPM/BUILD/srt-1.4.4/x86_64-alt-linux'
[ 68%] Building CXX object CMakeFiles/test-srt.dir/test/test_many_connections.cpp.o
/usr/bin/c++ -DENABLE_MONOTONIC_CLOCK=1 -DENABLE_SOCK_CLOEXEC=1 -DGTEST_LINKED_AS_SHARED_LIBRARY=1 -DHAI_ENABLE_SRT=1 -DHAI_PATCH=1 -DHAVE_INET_PTON=1 -DHAVE_PTHREAD_GETNAME_NP=1 -DHAVE_PTHREAD_SETNAME_NP=1 -DLINUX=1 -DSRT_ENABLE_APP_READER -DSRT_ENABLE_BINDTODEVICE -DSRT_ENABLE_CLOSE_SYNCH -DSRT_ENABLE_ENCRYPTION -DSRT_VERSION=\"1.4.4\" -DUSE_GNUTLS=1 -D_GNU_SOURCE -I/usr/src/RPM/BUILD/srt-1.4.4/common -I/usr/src/RPM/BUILD/srt-1.4.4/srtcore -I/usr/src/RPM/BUILD/srt-1.4.4/haicrypt -I/usr/src/RPM/BUILD/srt-1.4.4/x86_64-alt-linux -I/usr/src/RPM/BUILD/srt-1.4.4/apps -I/usr/include/p11-kit-1 -pipe -frecord-gcc-switches -Wall -g -O2 -flto=auto   -DENABLE_LOGGING=1 -DENABLE_GETNAMEINFO=1 -Wall -Wextra -O2 -DNDEBUG -fPIE -MD -MT CMakeFiles/test-srt.dir/test/test_many_connections.cpp.o -MF CMakeFiles/test-srt.dir/test/test_many_connections.cpp.o.d -o CMakeFiles/test-srt.dir/test/test_many_connections.cpp.o -c /usr/src/RPM/BUILD/srt-1.4.4/test/test_many_connections.cpp
gmake[2]: Leaving directory '/usr/src/RPM/BUILD/srt-1.4.4/x86_64-alt-linux'
gmake[2]: Entering directory '/usr/src/RPM/BUILD/srt-1.4.4/x86_64-alt-linux'
[ 66%] Linking CXX executable srt-file-transmit
/usr/bin/cmake -E cmake_link_script CMakeFiles/srt-file-transmit.dir/link.txt --verbose=1
/usr/bin/c++ -pipe -frecord-gcc-switches -Wall -g -O2 -flto=auto   -DENABLE_LOGGING=1 -DENABLE_GETNAMEINFO=1 -Wall -Wextra -O2 -DNDEBUG -rdynamic CMakeFiles/srt-file-transmit.dir/apps/srt-file-transmit.cpp.o CMakeFiles/srtsupport_virtual.dir/apps/apputil.cpp.o CMakeFiles/srtsupport_virtual.dir/apps/logsupport.cpp.o CMakeFiles/srtsupport_virtual.dir/apps/logsupport_appdefs.cpp.o CMakeFiles/srtsupport_virtual.dir/apps/socketoptions.cpp.o CMakeFiles/srtsupport_virtual.dir/apps/transmitmedia.cpp.o CMakeFiles/srtsupport_virtual.dir/apps/uriparser.cpp.o CMakeFiles/srtsupport_virtual.dir/apps/verbose.cpp.o -o srt-file-transmit  -Wl,-rpath,/usr/src/RPM/BUILD/srt-1.4.4/x86_64-alt-linux: libsrt.so.1.4.4 
gmake[2]: Leaving directory '/usr/src/RPM/BUILD/srt-1.4.4/x86_64-alt-linux'
gmake[1]: Entering directory '/usr/src/RPM/BUILD/srt-1.4.4/x86_64-alt-linux'
[ 79%] Built target srt-file-transmit
gmake[1]: Leaving directory '/usr/src/RPM/BUILD/srt-1.4.4/x86_64-alt-linux'
gmake[2]: Entering directory '/usr/src/RPM/BUILD/srt-1.4.4/x86_64-alt-linux'
[ 71%] Building CXX object CMakeFiles/test-srt.dir/test/test_cryspr.cpp.o
/usr/bin/c++ -DENABLE_MONOTONIC_CLOCK=1 -DENABLE_SOCK_CLOEXEC=1 -DGTEST_LINKED_AS_SHARED_LIBRARY=1 -DHAI_ENABLE_SRT=1 -DHAI_PATCH=1 -DHAVE_INET_PTON=1 -DHAVE_PTHREAD_GETNAME_NP=1 -DHAVE_PTHREAD_SETNAME_NP=1 -DLINUX=1 -DSRT_ENABLE_APP_READER -DSRT_ENABLE_BINDTODEVICE -DSRT_ENABLE_CLOSE_SYNCH -DSRT_ENABLE_ENCRYPTION -DSRT_VERSION=\"1.4.4\" -DUSE_GNUTLS=1 -D_GNU_SOURCE -I/usr/src/RPM/BUILD/srt-1.4.4/common -I/usr/src/RPM/BUILD/srt-1.4.4/srtcore -I/usr/src/RPM/BUILD/srt-1.4.4/haicrypt -I/usr/src/RPM/BUILD/srt-1.4.4/x86_64-alt-linux -I/usr/src/RPM/BUILD/srt-1.4.4/apps -I/usr/include/p11-kit-1 -pipe -frecord-gcc-switches -Wall -g -O2 -flto=auto   -DENABLE_LOGGING=1 -DENABLE_GETNAMEINFO=1 -Wall -Wextra -O2 -DNDEBUG -fPIE -MD -MT CMakeFiles/test-srt.dir/test/test_cryspr.cpp.o -MF CMakeFiles/test-srt.dir/test/test_cryspr.cpp.o.d -o CMakeFiles/test-srt.dir/test/test_cryspr.cpp.o -c /usr/src/RPM/BUILD/srt-1.4.4/test/test_cryspr.cpp
gmake[2]: Leaving directory '/usr/src/RPM/BUILD/srt-1.4.4/x86_64-alt-linux'
gmake[2]: Entering directory '/usr/src/RPM/BUILD/srt-1.4.4/x86_64-alt-linux'
[ 65%] Building CXX object CMakeFiles/srt-test-file.dir/testing/testmedia.cpp.o
/usr/bin/c++ -DENABLE_MONOTONIC_CLOCK=1 -DENABLE_SOCK_CLOEXEC=1 -DHAI_ENABLE_SRT=1 -DHAI_PATCH=1 -DHAVE_INET_PTON=1 -DHAVE_PTHREAD_GETNAME_NP=1 -DHAVE_PTHREAD_SETNAME_NP=1 -DLINUX=1 -DSRT_ENABLE_APP_READER -DSRT_ENABLE_BINDTODEVICE -DSRT_ENABLE_CLOSE_SYNCH -DSRT_ENABLE_ENCRYPTION -DSRT_VERSION=\"1.4.4\" -DUSE_GNUTLS=1 -D_GNU_SOURCE -I/usr/src/RPM/BUILD/srt-1.4.4/common -I/usr/src/RPM/BUILD/srt-1.4.4/srtcore -I/usr/src/RPM/BUILD/srt-1.4.4/haicrypt -I/usr/src/RPM/BUILD/srt-1.4.4/x86_64-alt-linux -I/usr/src/RPM/BUILD/srt-1.4.4/apps -pipe -frecord-gcc-switches -Wall -g -O2 -flto=auto   -DENABLE_LOGGING=1 -DENABLE_GETNAMEINFO=1 -Wall -Wextra -O2 -DNDEBUG -fPIE -MD -MT CMakeFiles/srt-test-file.dir/testing/testmedia.cpp.o -MF CMakeFiles/srt-test-file.dir/testing/testmedia.cpp.o.d -o CMakeFiles/srt-test-file.dir/testing/testmedia.cpp.o -c /usr/src/RPM/BUILD/srt-1.4.4/testing/testmedia.cpp
gmake[2]: Leaving directory '/usr/src/RPM/BUILD/srt-1.4.4/x86_64-alt-linux'
gmake[2]: Entering directory '/usr/src/RPM/BUILD/srt-1.4.4/x86_64-alt-linux'
[ 76%] Building CXX object CMakeFiles/srt-test-file.dir/apps/uriparser.cpp.o
/usr/bin/c++ -DENABLE_MONOTONIC_CLOCK=1 -DENABLE_SOCK_CLOEXEC=1 -DHAI_ENABLE_SRT=1 -DHAI_PATCH=1 -DHAVE_INET_PTON=1 -DHAVE_PTHREAD_GETNAME_NP=1 -DHAVE_PTHREAD_SETNAME_NP=1 -DLINUX=1 -DSRT_ENABLE_APP_READER -DSRT_ENABLE_BINDTODEVICE -DSRT_ENABLE_CLOSE_SYNCH -DSRT_ENABLE_ENCRYPTION -DSRT_VERSION=\"1.4.4\" -DUSE_GNUTLS=1 -D_GNU_SOURCE -I/usr/src/RPM/BUILD/srt-1.4.4/common -I/usr/src/RPM/BUILD/srt-1.4.4/srtcore -I/usr/src/RPM/BUILD/srt-1.4.4/haicrypt -I/usr/src/RPM/BUILD/srt-1.4.4/x86_64-alt-linux -I/usr/src/RPM/BUILD/srt-1.4.4/apps -pipe -frecord-gcc-switches -Wall -g -O2 -flto=auto   -DENABLE_LOGGING=1 -DENABLE_GETNAMEINFO=1 -Wall -Wextra -O2 -DNDEBUG -fPIE -MD -MT CMakeFiles/srt-test-file.dir/apps/uriparser.cpp.o -MF CMakeFiles/srt-test-file.dir/apps/uriparser.cpp.o.d -o CMakeFiles/srt-test-file.dir/apps/uriparser.cpp.o -c /usr/src/RPM/BUILD/srt-1.4.4/apps/uriparser.cpp
gmake[2]: Leaving directory '/usr/src/RPM/BUILD/srt-1.4.4/x86_64-alt-linux'
gmake[2]: Entering directory '/usr/src/RPM/BUILD/srt-1.4.4/x86_64-alt-linux'
[ 78%] Building CXX object CMakeFiles/srt-test-file.dir/apps/logsupport_appdefs.cpp.o
/usr/bin/c++ -DENABLE_MONOTONIC_CLOCK=1 -DENABLE_SOCK_CLOEXEC=1 -DHAI_ENABLE_SRT=1 -DHAI_PATCH=1 -DHAVE_INET_PTON=1 -DHAVE_PTHREAD_GETNAME_NP=1 -DHAVE_PTHREAD_SETNAME_NP=1 -DLINUX=1 -DSRT_ENABLE_APP_READER -DSRT_ENABLE_BINDTODEVICE -DSRT_ENABLE_CLOSE_SYNCH -DSRT_ENABLE_ENCRYPTION -DSRT_VERSION=\"1.4.4\" -DUSE_GNUTLS=1 -D_GNU_SOURCE -I/usr/src/RPM/BUILD/srt-1.4.4/common -I/usr/src/RPM/BUILD/srt-1.4.4/srtcore -I/usr/src/RPM/BUILD/srt-1.4.4/haicrypt -I/usr/src/RPM/BUILD/srt-1.4.4/x86_64-alt-linux -I/usr/src/RPM/BUILD/srt-1.4.4/apps -pipe -frecord-gcc-switches -Wall -g -O2 -flto=auto   -DENABLE_LOGGING=1 -DENABLE_GETNAMEINFO=1 -Wall -Wextra -O2 -DNDEBUG -fPIE -MD -MT CMakeFiles/srt-test-file.dir/apps/logsupport_appdefs.cpp.o -MF CMakeFiles/srt-test-file.dir/apps/logsupport_appdefs.cpp.o.d -o CMakeFiles/srt-test-file.dir/apps/logsupport_appdefs.cpp.o -c /usr/src/RPM/BUILD/srt-1.4.4/apps/logsupport_appdefs.cpp
gmake[2]: Leaving directory '/usr/src/RPM/BUILD/srt-1.4.4/x86_64-alt-linux'
gmake[2]: Entering directory '/usr/src/RPM/BUILD/srt-1.4.4/x86_64-alt-linux'
[ 72%] Building CXX object CMakeFiles/srt-test-relay.dir/testing/testmedia.cpp.o
/usr/bin/c++ -DENABLE_MONOTONIC_CLOCK=1 -DENABLE_SOCK_CLOEXEC=1 -DHAI_ENABLE_SRT=1 -DHAI_PATCH=1 -DHAVE_INET_PTON=1 -DHAVE_PTHREAD_GETNAME_NP=1 -DHAVE_PTHREAD_SETNAME_NP=1 -DLINUX=1 -DSRT_ENABLE_APP_READER -DSRT_ENABLE_BINDTODEVICE -DSRT_ENABLE_CLOSE_SYNCH -DSRT_ENABLE_ENCRYPTION -DSRT_ENABLE_VERBOSE_LOCK -DSRT_VERSION=\"1.4.4\" -DUSE_GNUTLS=1 -D_GNU_SOURCE -I/usr/src/RPM/BUILD/srt-1.4.4/common -I/usr/src/RPM/BUILD/srt-1.4.4/srtcore -I/usr/src/RPM/BUILD/srt-1.4.4/haicrypt -I/usr/src/RPM/BUILD/srt-1.4.4/x86_64-alt-linux -I/usr/src/RPM/BUILD/srt-1.4.4/apps -pipe -frecord-gcc-switches -Wall -g -O2 -flto=auto   -DENABLE_LOGGING=1 -DENABLE_GETNAMEINFO=1 -Wall -Wextra -O2 -DNDEBUG -fPIE -MD -MT CMakeFiles/srt-test-relay.dir/testing/testmedia.cpp.o -MF CMakeFiles/srt-test-relay.dir/testing/testmedia.cpp.o.d -o CMakeFiles/srt-test-relay.dir/testing/testmedia.cpp.o -c /usr/src/RPM/BUILD/srt-1.4.4/testing/testmedia.cpp
gmake[2]: Leaving directory '/usr/src/RPM/BUILD/srt-1.4.4/x86_64-alt-linux'
gmake[2]: Entering directory '/usr/src/RPM/BUILD/srt-1.4.4/x86_64-alt-linux'
[ 70%] Linking CXX executable srt-tunnel
/usr/bin/cmake -E cmake_link_script CMakeFiles/srt-tunnel.dir/link.txt --verbose=1
/usr/bin/c++ -pipe -frecord-gcc-switches -Wall -g -O2 -flto=auto   -DENABLE_LOGGING=1 -DENABLE_GETNAMEINFO=1 -Wall -Wextra -O2 -DNDEBUG -rdynamic CMakeFiles/srt-tunnel.dir/apps/srt-tunnel.cpp.o CMakeFiles/srtsupport_virtual.dir/apps/apputil.cpp.o CMakeFiles/srtsupport_virtual.dir/apps/logsupport.cpp.o CMakeFiles/srtsupport_virtual.dir/apps/logsupport_appdefs.cpp.o CMakeFiles/srtsupport_virtual.dir/apps/socketoptions.cpp.o CMakeFiles/srtsupport_virtual.dir/apps/transmitmedia.cpp.o CMakeFiles/srtsupport_virtual.dir/apps/uriparser.cpp.o CMakeFiles/srtsupport_virtual.dir/apps/verbose.cpp.o -o srt-tunnel  -Wl,-rpath,/usr/src/RPM/BUILD/srt-1.4.4/x86_64-alt-linux: libsrt.so.1.4.4 
/usr/src/RPM/BUILD/srt-1.4.4/apps/verbose.hpp:30:7: warning: type 'struct Log' violates the C++ One Definition Rule [-Wodr]
   30 | class Log
      |       ^
/usr/src/RPM/BUILD/srt-1.4.4/apps/verbose.hpp:30:7: note: a different type is defined in another translation unit
   30 | class Log
      |       ^
/usr/src/RPM/BUILD/srt-1.4.4/apps/verbose.hpp:34:10: note: the first difference of corresponding definitions is field 'lockline'
   34 |     bool lockline = false;
      |          ^
/usr/src/RPM/BUILD/srt-1.4.4/apps/verbose.hpp:30:7: note: a type with different number of fields is defined in another translation unit
   30 | class Log
      |       ^
/usr/src/RPM/BUILD/srt-1.4.4/apps/verbose.hpp:56:5: warning: type of '__dt_comp ' does not match original declaration [-Wlto-type-mismatch]
   56 |     ~Log();
      |     ^
/usr/src/RPM/BUILD/srt-1.4.4/apps/verbose.cpp:39:5: note: '__dt_comp ' was previously declared here
   39 |     Log::~Log()
      |     ^
/usr/src/RPM/BUILD/srt-1.4.4/apps/verbose.cpp:39:5: note: code may be misoptimized unless '-fno-strict-aliasing' is used
gmake[2]: Leaving directory '/usr/src/RPM/BUILD/srt-1.4.4/x86_64-alt-linux'
gmake[1]: Entering directory '/usr/src/RPM/BUILD/srt-1.4.4/x86_64-alt-linux'
[ 84%] Built target srt-tunnel
gmake[1]: Leaving directory '/usr/src/RPM/BUILD/srt-1.4.4/x86_64-alt-linux'
gmake[2]: Entering directory '/usr/src/RPM/BUILD/srt-1.4.4/x86_64-alt-linux'
[ 77%] Building CXX object CMakeFiles/srt-test-file.dir/apps/logsupport.cpp.o
/usr/bin/c++ -DENABLE_MONOTONIC_CLOCK=1 -DENABLE_SOCK_CLOEXEC=1 -DHAI_ENABLE_SRT=1 -DHAI_PATCH=1 -DHAVE_INET_PTON=1 -DHAVE_PTHREAD_GETNAME_NP=1 -DHAVE_PTHREAD_SETNAME_NP=1 -DLINUX=1 -DSRT_ENABLE_APP_READER -DSRT_ENABLE_BINDTODEVICE -DSRT_ENABLE_CLOSE_SYNCH -DSRT_ENABLE_ENCRYPTION -DSRT_VERSION=\"1.4.4\" -DUSE_GNUTLS=1 -D_GNU_SOURCE -I/usr/src/RPM/BUILD/srt-1.4.4/common -I/usr/src/RPM/BUILD/srt-1.4.4/srtcore -I/usr/src/RPM/BUILD/srt-1.4.4/haicrypt -I/usr/src/RPM/BUILD/srt-1.4.4/x86_64-alt-linux -I/usr/src/RPM/BUILD/srt-1.4.4/apps -pipe -frecord-gcc-switches -Wall -g -O2 -flto=auto   -DENABLE_LOGGING=1 -DENABLE_GETNAMEINFO=1 -Wall -Wextra -O2 -DNDEBUG -fPIE -MD -MT CMakeFiles/srt-test-file.dir/apps/logsupport.cpp.o -MF CMakeFiles/srt-test-file.dir/apps/logsupport.cpp.o.d -o CMakeFiles/srt-test-file.dir/apps/logsupport.cpp.o -c /usr/src/RPM/BUILD/srt-1.4.4/apps/logsupport.cpp
gmake[2]: Leaving directory '/usr/src/RPM/BUILD/srt-1.4.4/x86_64-alt-linux'
gmake[2]: Entering directory '/usr/src/RPM/BUILD/srt-1.4.4/x86_64-alt-linux'
[ 73%] Building CXX object CMakeFiles/test-srt.dir/test/test_enforced_encryption.cpp.o
/usr/bin/c++ -DENABLE_MONOTONIC_CLOCK=1 -DENABLE_SOCK_CLOEXEC=1 -DGTEST_LINKED_AS_SHARED_LIBRARY=1 -DHAI_ENABLE_SRT=1 -DHAI_PATCH=1 -DHAVE_INET_PTON=1 -DHAVE_PTHREAD_GETNAME_NP=1 -DHAVE_PTHREAD_SETNAME_NP=1 -DLINUX=1 -DSRT_ENABLE_APP_READER -DSRT_ENABLE_BINDTODEVICE -DSRT_ENABLE_CLOSE_SYNCH -DSRT_ENABLE_ENCRYPTION -DSRT_VERSION=\"1.4.4\" -DUSE_GNUTLS=1 -D_GNU_SOURCE -I/usr/src/RPM/BUILD/srt-1.4.4/common -I/usr/src/RPM/BUILD/srt-1.4.4/srtcore -I/usr/src/RPM/BUILD/srt-1.4.4/haicrypt -I/usr/src/RPM/BUILD/srt-1.4.4/x86_64-alt-linux -I/usr/src/RPM/BUILD/srt-1.4.4/apps -I/usr/include/p11-kit-1 -pipe -frecord-gcc-switches -Wall -g -O2 -flto=auto   -DENABLE_LOGGING=1 -DENABLE_GETNAMEINFO=1 -Wall -Wextra -O2 -DNDEBUG -fPIE -MD -MT CMakeFiles/test-srt.dir/test/test_enforced_encryption.cpp.o -MF CMakeFiles/test-srt.dir/test/test_enforced_encryption.cpp.o.d -o CMakeFiles/test-srt.dir/test/test_enforced_encryption.cpp.o -c /usr/src/RPM/BUILD/srt-1.4.4/test/test_enforced_encryption.cpp
gmake[2]: Leaving directory '/usr/src/RPM/BUILD/srt-1.4.4/x86_64-alt-linux'
gmake[2]: Entering directory '/usr/src/RPM/BUILD/srt-1.4.4/x86_64-alt-linux'
[ 68%] Linking CXX executable srt-live-transmit
/usr/bin/cmake -E cmake_link_script CMakeFiles/srt-live-transmit.dir/link.txt --verbose=1
/usr/bin/c++ -pipe -frecord-gcc-switches -Wall -g -O2 -flto=auto   -DENABLE_LOGGING=1 -DENABLE_GETNAMEINFO=1 -Wall -Wextra -O2 -DNDEBUG -rdynamic CMakeFiles/srt-live-transmit.dir/apps/srt-live-transmit.cpp.o CMakeFiles/srtsupport_virtual.dir/apps/apputil.cpp.o CMakeFiles/srtsupport_virtual.dir/apps/logsupport.cpp.o CMakeFiles/srtsupport_virtual.dir/apps/logsupport_appdefs.cpp.o CMakeFiles/srtsupport_virtual.dir/apps/socketoptions.cpp.o CMakeFiles/srtsupport_virtual.dir/apps/transmitmedia.cpp.o CMakeFiles/srtsupport_virtual.dir/apps/uriparser.cpp.o CMakeFiles/srtsupport_virtual.dir/apps/verbose.cpp.o -o srt-live-transmit  -Wl,-rpath,/usr/src/RPM/BUILD/srt-1.4.4/x86_64-alt-linux: libsrt.so.1.4.4 
gmake[2]: Leaving directory '/usr/src/RPM/BUILD/srt-1.4.4/x86_64-alt-linux'
gmake[1]: Entering directory '/usr/src/RPM/BUILD/srt-1.4.4/x86_64-alt-linux'
[ 87%] Built target srt-live-transmit
gmake[1]: Leaving directory '/usr/src/RPM/BUILD/srt-1.4.4/x86_64-alt-linux'
gmake[2]: Entering directory '/usr/src/RPM/BUILD/srt-1.4.4/x86_64-alt-linux'
[ 81%] Building CXX object CMakeFiles/test-srt.dir/test/test_file_transmission.cpp.o
/usr/bin/c++ -DENABLE_MONOTONIC_CLOCK=1 -DENABLE_SOCK_CLOEXEC=1 -DGTEST_LINKED_AS_SHARED_LIBRARY=1 -DHAI_ENABLE_SRT=1 -DHAI_PATCH=1 -DHAVE_INET_PTON=1 -DHAVE_PTHREAD_GETNAME_NP=1 -DHAVE_PTHREAD_SETNAME_NP=1 -DLINUX=1 -DSRT_ENABLE_APP_READER -DSRT_ENABLE_BINDTODEVICE -DSRT_ENABLE_CLOSE_SYNCH -DSRT_ENABLE_ENCRYPTION -DSRT_VERSION=\"1.4.4\" -DUSE_GNUTLS=1 -D_GNU_SOURCE -I/usr/src/RPM/BUILD/srt-1.4.4/common -I/usr/src/RPM/BUILD/srt-1.4.4/srtcore -I/usr/src/RPM/BUILD/srt-1.4.4/haicrypt -I/usr/src/RPM/BUILD/srt-1.4.4/x86_64-alt-linux -I/usr/src/RPM/BUILD/srt-1.4.4/apps -I/usr/include/p11-kit-1 -pipe -frecord-gcc-switches -Wall -g -O2 -flto=auto   -DENABLE_LOGGING=1 -DENABLE_GETNAMEINFO=1 -Wall -Wextra -O2 -DNDEBUG -fPIE -MD -MT CMakeFiles/test-srt.dir/test/test_file_transmission.cpp.o -MF CMakeFiles/test-srt.dir/test/test_file_transmission.cpp.o.d -o CMakeFiles/test-srt.dir/test/test_file_transmission.cpp.o -c /usr/src/RPM/BUILD/srt-1.4.4/test/test_file_transmission.cpp
gmake[2]: Leaving directory '/usr/src/RPM/BUILD/srt-1.4.4/x86_64-alt-linux'
gmake[2]: Entering directory '/usr/src/RPM/BUILD/srt-1.4.4/x86_64-alt-linux'
[ 84%] Building CXX object CMakeFiles/srt-test-relay.dir/testing/testactivemedia.cpp.o
/usr/bin/c++ -DENABLE_MONOTONIC_CLOCK=1 -DENABLE_SOCK_CLOEXEC=1 -DHAI_ENABLE_SRT=1 -DHAI_PATCH=1 -DHAVE_INET_PTON=1 -DHAVE_PTHREAD_GETNAME_NP=1 -DHAVE_PTHREAD_SETNAME_NP=1 -DLINUX=1 -DSRT_ENABLE_APP_READER -DSRT_ENABLE_BINDTODEVICE -DSRT_ENABLE_CLOSE_SYNCH -DSRT_ENABLE_ENCRYPTION -DSRT_ENABLE_VERBOSE_LOCK -DSRT_VERSION=\"1.4.4\" -DUSE_GNUTLS=1 -D_GNU_SOURCE -I/usr/src/RPM/BUILD/srt-1.4.4/common -I/usr/src/RPM/BUILD/srt-1.4.4/srtcore -I/usr/src/RPM/BUILD/srt-1.4.4/haicrypt -I/usr/src/RPM/BUILD/srt-1.4.4/x86_64-alt-linux -I/usr/src/RPM/BUILD/srt-1.4.4/apps -pipe -frecord-gcc-switches -Wall -g -O2 -flto=auto   -DENABLE_LOGGING=1 -DENABLE_GETNAMEINFO=1 -Wall -Wextra -O2 -DNDEBUG -fPIE -MD -MT CMakeFiles/srt-test-relay.dir/testing/testactivemedia.cpp.o -MF CMakeFiles/srt-test-relay.dir/testing/testactivemedia.cpp.o.d -o CMakeFiles/srt-test-relay.dir/testing/testactivemedia.cpp.o -c /usr/src/RPM/BUILD/srt-1.4.4/testing/testactivemedia.cpp
gmake[2]: Leaving directory '/usr/src/RPM/BUILD/srt-1.4.4/x86_64-alt-linux'
gmake[2]: Entering directory '/usr/src/RPM/BUILD/srt-1.4.4/x86_64-alt-linux'
[ 83%] Building CXX object CMakeFiles/test-srt.dir/test/test_listen_callback.cpp.o
/usr/bin/c++ -DENABLE_MONOTONIC_CLOCK=1 -DENABLE_SOCK_CLOEXEC=1 -DGTEST_LINKED_AS_SHARED_LIBRARY=1 -DHAI_ENABLE_SRT=1 -DHAI_PATCH=1 -DHAVE_INET_PTON=1 -DHAVE_PTHREAD_GETNAME_NP=1 -DHAVE_PTHREAD_SETNAME_NP=1 -DLINUX=1 -DSRT_ENABLE_APP_READER -DSRT_ENABLE_BINDTODEVICE -DSRT_ENABLE_CLOSE_SYNCH -DSRT_ENABLE_ENCRYPTION -DSRT_VERSION=\"1.4.4\" -DUSE_GNUTLS=1 -D_GNU_SOURCE -I/usr/src/RPM/BUILD/srt-1.4.4/common -I/usr/src/RPM/BUILD/srt-1.4.4/srtcore -I/usr/src/RPM/BUILD/srt-1.4.4/haicrypt -I/usr/src/RPM/BUILD/srt-1.4.4/x86_64-alt-linux -I/usr/src/RPM/BUILD/srt-1.4.4/apps -I/usr/include/p11-kit-1 -pipe -frecord-gcc-switches -Wall -g -O2 -flto=auto   -DENABLE_LOGGING=1 -DENABLE_GETNAMEINFO=1 -Wall -Wextra -O2 -DNDEBUG -fPIE -MD -MT CMakeFiles/test-srt.dir/test/test_listen_callback.cpp.o -MF CMakeFiles/test-srt.dir/test/test_listen_callback.cpp.o.d -o CMakeFiles/test-srt.dir/test/test_listen_callback.cpp.o -c /usr/src/RPM/BUILD/srt-1.4.4/test/test_listen_callback.cpp
gmake[2]: Leaving directory '/usr/src/RPM/BUILD/srt-1.4.4/x86_64-alt-linux'
gmake[2]: Entering directory '/usr/src/RPM/BUILD/srt-1.4.4/x86_64-alt-linux'
[ 85%] Building CXX object CMakeFiles/srt-test-relay.dir/apps/apputil.cpp.o
/usr/bin/c++ -DENABLE_MONOTONIC_CLOCK=1 -DENABLE_SOCK_CLOEXEC=1 -DHAI_ENABLE_SRT=1 -DHAI_PATCH=1 -DHAVE_INET_PTON=1 -DHAVE_PTHREAD_GETNAME_NP=1 -DHAVE_PTHREAD_SETNAME_NP=1 -DLINUX=1 -DSRT_ENABLE_APP_READER -DSRT_ENABLE_BINDTODEVICE -DSRT_ENABLE_CLOSE_SYNCH -DSRT_ENABLE_ENCRYPTION -DSRT_ENABLE_VERBOSE_LOCK -DSRT_VERSION=\"1.4.4\" -DUSE_GNUTLS=1 -D_GNU_SOURCE -I/usr/src/RPM/BUILD/srt-1.4.4/common -I/usr/src/RPM/BUILD/srt-1.4.4/srtcore -I/usr/src/RPM/BUILD/srt-1.4.4/haicrypt -I/usr/src/RPM/BUILD/srt-1.4.4/x86_64-alt-linux -I/usr/src/RPM/BUILD/srt-1.4.4/apps -pipe -frecord-gcc-switches -Wall -g -O2 -flto=auto   -DENABLE_LOGGING=1 -DENABLE_GETNAMEINFO=1 -Wall -Wextra -O2 -DNDEBUG -fPIE -MD -MT CMakeFiles/srt-test-relay.dir/apps/apputil.cpp.o -MF CMakeFiles/srt-test-relay.dir/apps/apputil.cpp.o.d -o CMakeFiles/srt-test-relay.dir/apps/apputil.cpp.o -c /usr/src/RPM/BUILD/srt-1.4.4/apps/apputil.cpp
gmake[2]: Leaving directory '/usr/src/RPM/BUILD/srt-1.4.4/x86_64-alt-linux'
gmake[2]: Entering directory '/usr/src/RPM/BUILD/srt-1.4.4/x86_64-alt-linux'
[ 90%] Building CXX object CMakeFiles/srt-test-relay.dir/apps/verbose.cpp.o
/usr/bin/c++ -DENABLE_MONOTONIC_CLOCK=1 -DENABLE_SOCK_CLOEXEC=1 -DHAI_ENABLE_SRT=1 -DHAI_PATCH=1 -DHAVE_INET_PTON=1 -DHAVE_PTHREAD_GETNAME_NP=1 -DHAVE_PTHREAD_SETNAME_NP=1 -DLINUX=1 -DSRT_ENABLE_APP_READER -DSRT_ENABLE_BINDTODEVICE -DSRT_ENABLE_CLOSE_SYNCH -DSRT_ENABLE_ENCRYPTION -DSRT_ENABLE_VERBOSE_LOCK -DSRT_VERSION=\"1.4.4\" -DUSE_GNUTLS=1 -D_GNU_SOURCE -I/usr/src/RPM/BUILD/srt-1.4.4/common -I/usr/src/RPM/BUILD/srt-1.4.4/srtcore -I/usr/src/RPM/BUILD/srt-1.4.4/haicrypt -I/usr/src/RPM/BUILD/srt-1.4.4/x86_64-alt-linux -I/usr/src/RPM/BUILD/srt-1.4.4/apps -pipe -frecord-gcc-switches -Wall -g -O2 -flto=auto   -DENABLE_LOGGING=1 -DENABLE_GETNAMEINFO=1 -Wall -Wextra -O2 -DNDEBUG -fPIE -MD -MT CMakeFiles/srt-test-relay.dir/apps/verbose.cpp.o -MF CMakeFiles/srt-test-relay.dir/apps/verbose.cpp.o.d -o CMakeFiles/srt-test-relay.dir/apps/verbose.cpp.o -c /usr/src/RPM/BUILD/srt-1.4.4/apps/verbose.cpp
gmake[2]: Leaving directory '/usr/src/RPM/BUILD/srt-1.4.4/x86_64-alt-linux'
gmake[2]: Entering directory '/usr/src/RPM/BUILD/srt-1.4.4/x86_64-alt-linux'
[ 87%] Building CXX object CMakeFiles/test-srt.dir/test/test_muxer.cpp.o
/usr/bin/c++ -DENABLE_MONOTONIC_CLOCK=1 -DENABLE_SOCK_CLOEXEC=1 -DGTEST_LINKED_AS_SHARED_LIBRARY=1 -DHAI_ENABLE_SRT=1 -DHAI_PATCH=1 -DHAVE_INET_PTON=1 -DHAVE_PTHREAD_GETNAME_NP=1 -DHAVE_PTHREAD_SETNAME_NP=1 -DLINUX=1 -DSRT_ENABLE_APP_READER -DSRT_ENABLE_BINDTODEVICE -DSRT_ENABLE_CLOSE_SYNCH -DSRT_ENABLE_ENCRYPTION -DSRT_VERSION=\"1.4.4\" -DUSE_GNUTLS=1 -D_GNU_SOURCE -I/usr/src/RPM/BUILD/srt-1.4.4/common -I/usr/src/RPM/BUILD/srt-1.4.4/srtcore -I/usr/src/RPM/BUILD/srt-1.4.4/haicrypt -I/usr/src/RPM/BUILD/srt-1.4.4/x86_64-alt-linux -I/usr/src/RPM/BUILD/srt-1.4.4/apps -I/usr/include/p11-kit-1 -pipe -frecord-gcc-switches -Wall -g -O2 -flto=auto   -DENABLE_LOGGING=1 -DENABLE_GETNAMEINFO=1 -Wall -Wextra -O2 -DNDEBUG -fPIE -MD -MT CMakeFiles/test-srt.dir/test/test_muxer.cpp.o -MF CMakeFiles/test-srt.dir/test/test_muxer.cpp.o.d -o CMakeFiles/test-srt.dir/test/test_muxer.cpp.o -c /usr/src/RPM/BUILD/srt-1.4.4/test/test_muxer.cpp
gmake[2]: Leaving directory '/usr/src/RPM/BUILD/srt-1.4.4/x86_64-alt-linux'
gmake[2]: Entering directory '/usr/src/RPM/BUILD/srt-1.4.4/x86_64-alt-linux'
[ 82%] Building CXX object CMakeFiles/test-srt.dir/test/test_list.cpp.o
/usr/bin/c++ -DENABLE_MONOTONIC_CLOCK=1 -DENABLE_SOCK_CLOEXEC=1 -DGTEST_LINKED_AS_SHARED_LIBRARY=1 -DHAI_ENABLE_SRT=1 -DHAI_PATCH=1 -DHAVE_INET_PTON=1 -DHAVE_PTHREAD_GETNAME_NP=1 -DHAVE_PTHREAD_SETNAME_NP=1 -DLINUX=1 -DSRT_ENABLE_APP_READER -DSRT_ENABLE_BINDTODEVICE -DSRT_ENABLE_CLOSE_SYNCH -DSRT_ENABLE_ENCRYPTION -DSRT_VERSION=\"1.4.4\" -DUSE_GNUTLS=1 -D_GNU_SOURCE -I/usr/src/RPM/BUILD/srt-1.4.4/common -I/usr/src/RPM/BUILD/srt-1.4.4/srtcore -I/usr/src/RPM/BUILD/srt-1.4.4/haicrypt -I/usr/src/RPM/BUILD/srt-1.4.4/x86_64-alt-linux -I/usr/src/RPM/BUILD/srt-1.4.4/apps -I/usr/include/p11-kit-1 -pipe -frecord-gcc-switches -Wall -g -O2 -flto=auto   -DENABLE_LOGGING=1 -DENABLE_GETNAMEINFO=1 -Wall -Wextra -O2 -DNDEBUG -fPIE -MD -MT CMakeFiles/test-srt.dir/test/test_list.cpp.o -MF CMakeFiles/test-srt.dir/test/test_list.cpp.o.d -o CMakeFiles/test-srt.dir/test/test_list.cpp.o -c /usr/src/RPM/BUILD/srt-1.4.4/test/test_list.cpp
gmake[2]: Leaving directory '/usr/src/RPM/BUILD/srt-1.4.4/x86_64-alt-linux'
gmake[2]: Entering directory '/usr/src/RPM/BUILD/srt-1.4.4/x86_64-alt-linux'
[ 74%] Linking CXX executable srt-test-live
/usr/bin/cmake -E cmake_link_script CMakeFiles/srt-test-live.dir/link.txt --verbose=1
/usr/bin/c++ -pipe -frecord-gcc-switches -Wall -g -O2 -flto=auto   -DENABLE_LOGGING=1 -DENABLE_GETNAMEINFO=1 -Wall -Wextra -O2 -DNDEBUG -rdynamic CMakeFiles/srt-test-live.dir/testing/srt-test-live.cpp.o CMakeFiles/srt-test-live.dir/testing/testmedia.cpp.o CMakeFiles/srt-test-live.dir/apps/apputil.cpp.o CMakeFiles/srt-test-live.dir/apps/verbose.cpp.o CMakeFiles/srt-test-live.dir/apps/socketoptions.cpp.o CMakeFiles/srt-test-live.dir/apps/uriparser.cpp.o CMakeFiles/srt-test-live.dir/apps/logsupport.cpp.o CMakeFiles/srt-test-live.dir/apps/logsupport_appdefs.cpp.o -o srt-test-live  -Wl,-rpath,/usr/src/RPM/BUILD/srt-1.4.4/x86_64-alt-linux: libsrt.so.1.4.4 
gmake[2]: Leaving directory '/usr/src/RPM/BUILD/srt-1.4.4/x86_64-alt-linux'
gmake[1]: Entering directory '/usr/src/RPM/BUILD/srt-1.4.4/x86_64-alt-linux'
[ 95%] Built target srt-test-live
gmake[1]: Leaving directory '/usr/src/RPM/BUILD/srt-1.4.4/x86_64-alt-linux'
gmake[2]: Entering directory '/usr/src/RPM/BUILD/srt-1.4.4/x86_64-alt-linux'
[ 82%] Building CXX object CMakeFiles/test-srt.dir/test/test_ipv6.cpp.o
/usr/bin/c++ -DENABLE_MONOTONIC_CLOCK=1 -DENABLE_SOCK_CLOEXEC=1 -DGTEST_LINKED_AS_SHARED_LIBRARY=1 -DHAI_ENABLE_SRT=1 -DHAI_PATCH=1 -DHAVE_INET_PTON=1 -DHAVE_PTHREAD_GETNAME_NP=1 -DHAVE_PTHREAD_SETNAME_NP=1 -DLINUX=1 -DSRT_ENABLE_APP_READER -DSRT_ENABLE_BINDTODEVICE -DSRT_ENABLE_CLOSE_SYNCH -DSRT_ENABLE_ENCRYPTION -DSRT_VERSION=\"1.4.4\" -DUSE_GNUTLS=1 -D_GNU_SOURCE -I/usr/src/RPM/BUILD/srt-1.4.4/common -I/usr/src/RPM/BUILD/srt-1.4.4/srtcore -I/usr/src/RPM/BUILD/srt-1.4.4/haicrypt -I/usr/src/RPM/BUILD/srt-1.4.4/x86_64-alt-linux -I/usr/src/RPM/BUILD/srt-1.4.4/apps -I/usr/include/p11-kit-1 -pipe -frecord-gcc-switches -Wall -g -O2 -flto=auto   -DENABLE_LOGGING=1 -DENABLE_GETNAMEINFO=1 -Wall -Wextra -O2 -DNDEBUG -fPIE -MD -MT CMakeFiles/test-srt.dir/test/test_ipv6.cpp.o -MF CMakeFiles/test-srt.dir/test/test_ipv6.cpp.o.d -o CMakeFiles/test-srt.dir/test/test_ipv6.cpp.o -c /usr/src/RPM/BUILD/srt-1.4.4/test/test_ipv6.cpp
gmake[2]: Leaving directory '/usr/src/RPM/BUILD/srt-1.4.4/x86_64-alt-linux'
gmake[2]: Entering directory '/usr/src/RPM/BUILD/srt-1.4.4/x86_64-alt-linux'
[ 92%] Building CXX object CMakeFiles/srt-test-relay.dir/apps/socketoptions.cpp.o
/usr/bin/c++ -DENABLE_MONOTONIC_CLOCK=1 -DENABLE_SOCK_CLOEXEC=1 -DHAI_ENABLE_SRT=1 -DHAI_PATCH=1 -DHAVE_INET_PTON=1 -DHAVE_PTHREAD_GETNAME_NP=1 -DHAVE_PTHREAD_SETNAME_NP=1 -DLINUX=1 -DSRT_ENABLE_APP_READER -DSRT_ENABLE_BINDTODEVICE -DSRT_ENABLE_CLOSE_SYNCH -DSRT_ENABLE_ENCRYPTION -DSRT_ENABLE_VERBOSE_LOCK -DSRT_VERSION=\"1.4.4\" -DUSE_GNUTLS=1 -D_GNU_SOURCE -I/usr/src/RPM/BUILD/srt-1.4.4/common -I/usr/src/RPM/BUILD/srt-1.4.4/srtcore -I/usr/src/RPM/BUILD/srt-1.4.4/haicrypt -I/usr/src/RPM/BUILD/srt-1.4.4/x86_64-alt-linux -I/usr/src/RPM/BUILD/srt-1.4.4/apps -pipe -frecord-gcc-switches -Wall -g -O2 -flto=auto   -DENABLE_LOGGING=1 -DENABLE_GETNAMEINFO=1 -Wall -Wextra -O2 -DNDEBUG -fPIE -MD -MT CMakeFiles/srt-test-relay.dir/apps/socketoptions.cpp.o -MF CMakeFiles/srt-test-relay.dir/apps/socketoptions.cpp.o.d -o CMakeFiles/srt-test-relay.dir/apps/socketoptions.cpp.o -c /usr/src/RPM/BUILD/srt-1.4.4/apps/socketoptions.cpp
gmake[2]: Leaving directory '/usr/src/RPM/BUILD/srt-1.4.4/x86_64-alt-linux'
gmake[2]: Entering directory '/usr/src/RPM/BUILD/srt-1.4.4/x86_64-alt-linux'
[ 93%] Building CXX object CMakeFiles/srt-test-relay.dir/apps/uriparser.cpp.o
/usr/bin/c++ -DENABLE_MONOTONIC_CLOCK=1 -DENABLE_SOCK_CLOEXEC=1 -DHAI_ENABLE_SRT=1 -DHAI_PATCH=1 -DHAVE_INET_PTON=1 -DHAVE_PTHREAD_GETNAME_NP=1 -DHAVE_PTHREAD_SETNAME_NP=1 -DLINUX=1 -DSRT_ENABLE_APP_READER -DSRT_ENABLE_BINDTODEVICE -DSRT_ENABLE_CLOSE_SYNCH -DSRT_ENABLE_ENCRYPTION -DSRT_ENABLE_VERBOSE_LOCK -DSRT_VERSION=\"1.4.4\" -DUSE_GNUTLS=1 -D_GNU_SOURCE -I/usr/src/RPM/BUILD/srt-1.4.4/common -I/usr/src/RPM/BUILD/srt-1.4.4/srtcore -I/usr/src/RPM/BUILD/srt-1.4.4/haicrypt -I/usr/src/RPM/BUILD/srt-1.4.4/x86_64-alt-linux -I/usr/src/RPM/BUILD/srt-1.4.4/apps -pipe -frecord-gcc-switches -Wall -g -O2 -flto=auto   -DENABLE_LOGGING=1 -DENABLE_GETNAMEINFO=1 -Wall -Wextra -O2 -DNDEBUG -fPIE -MD -MT CMakeFiles/srt-test-relay.dir/apps/uriparser.cpp.o -MF CMakeFiles/srt-test-relay.dir/apps/uriparser.cpp.o.d -o CMakeFiles/srt-test-relay.dir/apps/uriparser.cpp.o -c /usr/src/RPM/BUILD/srt-1.4.4/apps/uriparser.cpp
gmake[2]: Leaving directory '/usr/src/RPM/BUILD/srt-1.4.4/x86_64-alt-linux'
gmake[2]: Entering directory '/usr/src/RPM/BUILD/srt-1.4.4/x86_64-alt-linux'
[ 71%] Linking CXX executable srt-test-multiplex
/usr/bin/cmake -E cmake_link_script CMakeFiles/srt-test-multiplex.dir/link.txt --verbose=1
/usr/bin/c++ -pipe -frecord-gcc-switches -Wall -g -O2 -flto=auto   -DENABLE_LOGGING=1 -DENABLE_GETNAMEINFO=1 -Wall -Wextra -O2 -DNDEBUG -rdynamic CMakeFiles/srt-test-multiplex.dir/testing/srt-test-multiplex.cpp.o CMakeFiles/srt-test-multiplex.dir/testing/testmedia.cpp.o CMakeFiles/srt-test-multiplex.dir/apps/apputil.cpp.o CMakeFiles/srt-test-multiplex.dir/apps/verbose.cpp.o CMakeFiles/srt-test-multiplex.dir/apps/socketoptions.cpp.o CMakeFiles/srt-test-multiplex.dir/apps/uriparser.cpp.o CMakeFiles/srt-test-multiplex.dir/apps/logsupport.cpp.o CMakeFiles/srt-test-multiplex.dir/apps/logsupport_appdefs.cpp.o -o srt-test-multiplex  -Wl,-rpath,/usr/src/RPM/BUILD/srt-1.4.4/x86_64-alt-linux: libsrt.so.1.4.4 
gmake[2]: Leaving directory '/usr/src/RPM/BUILD/srt-1.4.4/x86_64-alt-linux'
gmake[2]: Entering directory '/usr/src/RPM/BUILD/srt-1.4.4/x86_64-alt-linux'
[ 98%] Building CXX object CMakeFiles/srt-test-relay.dir/apps/logsupport_appdefs.cpp.o
/usr/bin/c++ -DENABLE_MONOTONIC_CLOCK=1 -DENABLE_SOCK_CLOEXEC=1 -DHAI_ENABLE_SRT=1 -DHAI_PATCH=1 -DHAVE_INET_PTON=1 -DHAVE_PTHREAD_GETNAME_NP=1 -DHAVE_PTHREAD_SETNAME_NP=1 -DLINUX=1 -DSRT_ENABLE_APP_READER -DSRT_ENABLE_BINDTODEVICE -DSRT_ENABLE_CLOSE_SYNCH -DSRT_ENABLE_ENCRYPTION -DSRT_ENABLE_VERBOSE_LOCK -DSRT_VERSION=\"1.4.4\" -DUSE_GNUTLS=1 -D_GNU_SOURCE -I/usr/src/RPM/BUILD/srt-1.4.4/common -I/usr/src/RPM/BUILD/srt-1.4.4/srtcore -I/usr/src/RPM/BUILD/srt-1.4.4/haicrypt -I/usr/src/RPM/BUILD/srt-1.4.4/x86_64-alt-linux -I/usr/src/RPM/BUILD/srt-1.4.4/apps -pipe -frecord-gcc-switches -Wall -g -O2 -flto=auto   -DENABLE_LOGGING=1 -DENABLE_GETNAMEINFO=1 -Wall -Wextra -O2 -DNDEBUG -fPIE -MD -MT CMakeFiles/srt-test-relay.dir/apps/logsupport_appdefs.cpp.o -MF CMakeFiles/srt-test-relay.dir/apps/logsupport_appdefs.cpp.o.d -o CMakeFiles/srt-test-relay.dir/apps/logsupport_appdefs.cpp.o -c /usr/src/RPM/BUILD/srt-1.4.4/apps/logsupport_appdefs.cpp
gmake[2]: Leaving directory '/usr/src/RPM/BUILD/srt-1.4.4/x86_64-alt-linux'
gmake[1]: Entering directory '/usr/src/RPM/BUILD/srt-1.4.4/x86_64-alt-linux'
[ 98%] Built target srt-test-multiplex
gmake[1]: Leaving directory '/usr/src/RPM/BUILD/srt-1.4.4/x86_64-alt-linux'
gmake[2]: Entering directory '/usr/src/RPM/BUILD/srt-1.4.4/x86_64-alt-linux'
[ 86%] Linking CXX executable srt-test-file
/usr/bin/cmake -E cmake_link_script CMakeFiles/srt-test-file.dir/link.txt --verbose=1
/usr/bin/c++ -pipe -frecord-gcc-switches -Wall -g -O2 -flto=auto   -DENABLE_LOGGING=1 -DENABLE_GETNAMEINFO=1 -Wall -Wextra -O2 -DNDEBUG -rdynamic CMakeFiles/srt-test-file.dir/testing/srt-test-file.cpp.o CMakeFiles/srt-test-file.dir/testing/testmedia.cpp.o CMakeFiles/srt-test-file.dir/apps/apputil.cpp.o CMakeFiles/srt-test-file.dir/apps/verbose.cpp.o CMakeFiles/srt-test-file.dir/apps/socketoptions.cpp.o CMakeFiles/srt-test-file.dir/apps/uriparser.cpp.o CMakeFiles/srt-test-file.dir/apps/logsupport.cpp.o CMakeFiles/srt-test-file.dir/apps/logsupport_appdefs.cpp.o -o srt-test-file  -Wl,-rpath,/usr/src/RPM/BUILD/srt-1.4.4/x86_64-alt-linux: libsrt.so.1.4.4 
gmake[2]: Leaving directory '/usr/src/RPM/BUILD/srt-1.4.4/x86_64-alt-linux'
gmake[1]: Entering directory '/usr/src/RPM/BUILD/srt-1.4.4/x86_64-alt-linux'
[ 98%] Built target srt-test-file
gmake[1]: Leaving directory '/usr/src/RPM/BUILD/srt-1.4.4/x86_64-alt-linux'
gmake[2]: Entering directory '/usr/src/RPM/BUILD/srt-1.4.4/x86_64-alt-linux'
[ 88%] Building CXX object CMakeFiles/test-srt.dir/test/test_seqno.cpp.o
/usr/bin/c++ -DENABLE_MONOTONIC_CLOCK=1 -DENABLE_SOCK_CLOEXEC=1 -DGTEST_LINKED_AS_SHARED_LIBRARY=1 -DHAI_ENABLE_SRT=1 -DHAI_PATCH=1 -DHAVE_INET_PTON=1 -DHAVE_PTHREAD_GETNAME_NP=1 -DHAVE_PTHREAD_SETNAME_NP=1 -DLINUX=1 -DSRT_ENABLE_APP_READER -DSRT_ENABLE_BINDTODEVICE -DSRT_ENABLE_CLOSE_SYNCH -DSRT_ENABLE_ENCRYPTION -DSRT_VERSION=\"1.4.4\" -DUSE_GNUTLS=1 -D_GNU_SOURCE -I/usr/src/RPM/BUILD/srt-1.4.4/common -I/usr/src/RPM/BUILD/srt-1.4.4/srtcore -I/usr/src/RPM/BUILD/srt-1.4.4/haicrypt -I/usr/src/RPM/BUILD/srt-1.4.4/x86_64-alt-linux -I/usr/src/RPM/BUILD/srt-1.4.4/apps -I/usr/include/p11-kit-1 -pipe -frecord-gcc-switches -Wall -g -O2 -flto=auto   -DENABLE_LOGGING=1 -DENABLE_GETNAMEINFO=1 -Wall -Wextra -O2 -DNDEBUG -fPIE -MD -MT CMakeFiles/test-srt.dir/test/test_seqno.cpp.o -MF CMakeFiles/test-srt.dir/test/test_seqno.cpp.o.d -o CMakeFiles/test-srt.dir/test/test_seqno.cpp.o -c /usr/src/RPM/BUILD/srt-1.4.4/test/test_seqno.cpp
gmake[2]: Leaving directory '/usr/src/RPM/BUILD/srt-1.4.4/x86_64-alt-linux'
gmake[2]: Entering directory '/usr/src/RPM/BUILD/srt-1.4.4/x86_64-alt-linux'
[ 94%] Building CXX object CMakeFiles/test-srt.dir/test/test_threadname.cpp.o
/usr/bin/c++ -DENABLE_MONOTONIC_CLOCK=1 -DENABLE_SOCK_CLOEXEC=1 -DGTEST_LINKED_AS_SHARED_LIBRARY=1 -DHAI_ENABLE_SRT=1 -DHAI_PATCH=1 -DHAVE_INET_PTON=1 -DHAVE_PTHREAD_GETNAME_NP=1 -DHAVE_PTHREAD_SETNAME_NP=1 -DLINUX=1 -DSRT_ENABLE_APP_READER -DSRT_ENABLE_BINDTODEVICE -DSRT_ENABLE_CLOSE_SYNCH -DSRT_ENABLE_ENCRYPTION -DSRT_VERSION=\"1.4.4\" -DUSE_GNUTLS=1 -D_GNU_SOURCE -I/usr/src/RPM/BUILD/srt-1.4.4/common -I/usr/src/RPM/BUILD/srt-1.4.4/srtcore -I/usr/src/RPM/BUILD/srt-1.4.4/haicrypt -I/usr/src/RPM/BUILD/srt-1.4.4/x86_64-alt-linux -I/usr/src/RPM/BUILD/srt-1.4.4/apps -I/usr/include/p11-kit-1 -pipe -frecord-gcc-switches -Wall -g -O2 -flto=auto   -DENABLE_LOGGING=1 -DENABLE_GETNAMEINFO=1 -Wall -Wextra -O2 -DNDEBUG -fPIE -MD -MT CMakeFiles/test-srt.dir/test/test_threadname.cpp.o -MF CMakeFiles/test-srt.dir/test/test_threadname.cpp.o.d -o CMakeFiles/test-srt.dir/test/test_threadname.cpp.o -c /usr/src/RPM/BUILD/srt-1.4.4/test/test_threadname.cpp
gmake[2]: Leaving directory '/usr/src/RPM/BUILD/srt-1.4.4/x86_64-alt-linux'
gmake[2]: Entering directory '/usr/src/RPM/BUILD/srt-1.4.4/x86_64-alt-linux'
[ 97%] Building CXX object CMakeFiles/srt-test-relay.dir/apps/logsupport.cpp.o
/usr/bin/c++ -DENABLE_MONOTONIC_CLOCK=1 -DENABLE_SOCK_CLOEXEC=1 -DHAI_ENABLE_SRT=1 -DHAI_PATCH=1 -DHAVE_INET_PTON=1 -DHAVE_PTHREAD_GETNAME_NP=1 -DHAVE_PTHREAD_SETNAME_NP=1 -DLINUX=1 -DSRT_ENABLE_APP_READER -DSRT_ENABLE_BINDTODEVICE -DSRT_ENABLE_CLOSE_SYNCH -DSRT_ENABLE_ENCRYPTION -DSRT_ENABLE_VERBOSE_LOCK -DSRT_VERSION=\"1.4.4\" -DUSE_GNUTLS=1 -D_GNU_SOURCE -I/usr/src/RPM/BUILD/srt-1.4.4/common -I/usr/src/RPM/BUILD/srt-1.4.4/srtcore -I/usr/src/RPM/BUILD/srt-1.4.4/haicrypt -I/usr/src/RPM/BUILD/srt-1.4.4/x86_64-alt-linux -I/usr/src/RPM/BUILD/srt-1.4.4/apps -pipe -frecord-gcc-switches -Wall -g -O2 -flto=auto   -DENABLE_LOGGING=1 -DENABLE_GETNAMEINFO=1 -Wall -Wextra -O2 -DNDEBUG -fPIE -MD -MT CMakeFiles/srt-test-relay.dir/apps/logsupport.cpp.o -MF CMakeFiles/srt-test-relay.dir/apps/logsupport.cpp.o.d -o CMakeFiles/srt-test-relay.dir/apps/logsupport.cpp.o -c /usr/src/RPM/BUILD/srt-1.4.4/apps/logsupport.cpp
gmake[2]: Leaving directory '/usr/src/RPM/BUILD/srt-1.4.4/x86_64-alt-linux'
gmake[2]: Entering directory '/usr/src/RPM/BUILD/srt-1.4.4/x86_64-alt-linux'
[ 95%] Building CXX object CMakeFiles/test-srt.dir/test/test_timer.cpp.o
/usr/bin/c++ -DENABLE_MONOTONIC_CLOCK=1 -DENABLE_SOCK_CLOEXEC=1 -DGTEST_LINKED_AS_SHARED_LIBRARY=1 -DHAI_ENABLE_SRT=1 -DHAI_PATCH=1 -DHAVE_INET_PTON=1 -DHAVE_PTHREAD_GETNAME_NP=1 -DHAVE_PTHREAD_SETNAME_NP=1 -DLINUX=1 -DSRT_ENABLE_APP_READER -DSRT_ENABLE_BINDTODEVICE -DSRT_ENABLE_CLOSE_SYNCH -DSRT_ENABLE_ENCRYPTION -DSRT_VERSION=\"1.4.4\" -DUSE_GNUTLS=1 -D_GNU_SOURCE -I/usr/src/RPM/BUILD/srt-1.4.4/common -I/usr/src/RPM/BUILD/srt-1.4.4/srtcore -I/usr/src/RPM/BUILD/srt-1.4.4/haicrypt -I/usr/src/RPM/BUILD/srt-1.4.4/x86_64-alt-linux -I/usr/src/RPM/BUILD/srt-1.4.4/apps -I/usr/include/p11-kit-1 -pipe -frecord-gcc-switches -Wall -g -O2 -flto=auto   -DENABLE_LOGGING=1 -DENABLE_GETNAMEINFO=1 -Wall -Wextra -O2 -DNDEBUG -fPIE -MD -MT CMakeFiles/test-srt.dir/test/test_timer.cpp.o -MF CMakeFiles/test-srt.dir/test/test_timer.cpp.o.d -o CMakeFiles/test-srt.dir/test/test_timer.cpp.o -c /usr/src/RPM/BUILD/srt-1.4.4/test/test_timer.cpp
gmake[2]: Leaving directory '/usr/src/RPM/BUILD/srt-1.4.4/x86_64-alt-linux'
gmake[2]: Entering directory '/usr/src/RPM/BUILD/srt-1.4.4/x86_64-alt-linux'
[ 79%] Building CXX object CMakeFiles/test-srt.dir/test/test_epoll.cpp.o
/usr/bin/c++ -DENABLE_MONOTONIC_CLOCK=1 -DENABLE_SOCK_CLOEXEC=1 -DGTEST_LINKED_AS_SHARED_LIBRARY=1 -DHAI_ENABLE_SRT=1 -DHAI_PATCH=1 -DHAVE_INET_PTON=1 -DHAVE_PTHREAD_GETNAME_NP=1 -DHAVE_PTHREAD_SETNAME_NP=1 -DLINUX=1 -DSRT_ENABLE_APP_READER -DSRT_ENABLE_BINDTODEVICE -DSRT_ENABLE_CLOSE_SYNCH -DSRT_ENABLE_ENCRYPTION -DSRT_VERSION=\"1.4.4\" -DUSE_GNUTLS=1 -D_GNU_SOURCE -I/usr/src/RPM/BUILD/srt-1.4.4/common -I/usr/src/RPM/BUILD/srt-1.4.4/srtcore -I/usr/src/RPM/BUILD/srt-1.4.4/haicrypt -I/usr/src/RPM/BUILD/srt-1.4.4/x86_64-alt-linux -I/usr/src/RPM/BUILD/srt-1.4.4/apps -I/usr/include/p11-kit-1 -pipe -frecord-gcc-switches -Wall -g -O2 -flto=auto   -DENABLE_LOGGING=1 -DENABLE_GETNAMEINFO=1 -Wall -Wextra -O2 -DNDEBUG -fPIE -MD -MT CMakeFiles/test-srt.dir/test/test_epoll.cpp.o -MF CMakeFiles/test-srt.dir/test/test_epoll.cpp.o.d -o CMakeFiles/test-srt.dir/test/test_epoll.cpp.o -c /usr/src/RPM/BUILD/srt-1.4.4/test/test_epoll.cpp
gmake[2]: Leaving directory '/usr/src/RPM/BUILD/srt-1.4.4/x86_64-alt-linux'
gmake[2]: Entering directory '/usr/src/RPM/BUILD/srt-1.4.4/x86_64-alt-linux'
[ 80%] Building CXX object CMakeFiles/test-srt.dir/test/test_fec_rebuilding.cpp.o
/usr/bin/c++ -DENABLE_MONOTONIC_CLOCK=1 -DENABLE_SOCK_CLOEXEC=1 -DGTEST_LINKED_AS_SHARED_LIBRARY=1 -DHAI_ENABLE_SRT=1 -DHAI_PATCH=1 -DHAVE_INET_PTON=1 -DHAVE_PTHREAD_GETNAME_NP=1 -DHAVE_PTHREAD_SETNAME_NP=1 -DLINUX=1 -DSRT_ENABLE_APP_READER -DSRT_ENABLE_BINDTODEVICE -DSRT_ENABLE_CLOSE_SYNCH -DSRT_ENABLE_ENCRYPTION -DSRT_VERSION=\"1.4.4\" -DUSE_GNUTLS=1 -D_GNU_SOURCE -I/usr/src/RPM/BUILD/srt-1.4.4/common -I/usr/src/RPM/BUILD/srt-1.4.4/srtcore -I/usr/src/RPM/BUILD/srt-1.4.4/haicrypt -I/usr/src/RPM/BUILD/srt-1.4.4/x86_64-alt-linux -I/usr/src/RPM/BUILD/srt-1.4.4/apps -I/usr/include/p11-kit-1 -pipe -frecord-gcc-switches -Wall -g -O2 -flto=auto   -DENABLE_LOGGING=1 -DENABLE_GETNAMEINFO=1 -Wall -Wextra -O2 -DNDEBUG -fPIE -MD -MT CMakeFiles/test-srt.dir/test/test_fec_rebuilding.cpp.o -MF CMakeFiles/test-srt.dir/test/test_fec_rebuilding.cpp.o.d -o CMakeFiles/test-srt.dir/test/test_fec_rebuilding.cpp.o -c /usr/src/RPM/BUILD/srt-1.4.4/test/test_fec_rebuilding.cpp
gmake[2]: Leaving directory '/usr/src/RPM/BUILD/srt-1.4.4/x86_64-alt-linux'
gmake[2]: Entering directory '/usr/src/RPM/BUILD/srt-1.4.4/x86_64-alt-linux'
[ 95%] Building CXX object CMakeFiles/test-srt.dir/test/test_unitqueue.cpp.o
/usr/bin/c++ -DENABLE_MONOTONIC_CLOCK=1 -DENABLE_SOCK_CLOEXEC=1 -DGTEST_LINKED_AS_SHARED_LIBRARY=1 -DHAI_ENABLE_SRT=1 -DHAI_PATCH=1 -DHAVE_INET_PTON=1 -DHAVE_PTHREAD_GETNAME_NP=1 -DHAVE_PTHREAD_SETNAME_NP=1 -DLINUX=1 -DSRT_ENABLE_APP_READER -DSRT_ENABLE_BINDTODEVICE -DSRT_ENABLE_CLOSE_SYNCH -DSRT_ENABLE_ENCRYPTION -DSRT_VERSION=\"1.4.4\" -DUSE_GNUTLS=1 -D_GNU_SOURCE -I/usr/src/RPM/BUILD/srt-1.4.4/common -I/usr/src/RPM/BUILD/srt-1.4.4/srtcore -I/usr/src/RPM/BUILD/srt-1.4.4/haicrypt -I/usr/src/RPM/BUILD/srt-1.4.4/x86_64-alt-linux -I/usr/src/RPM/BUILD/srt-1.4.4/apps -I/usr/include/p11-kit-1 -pipe -frecord-gcc-switches -Wall -g -O2 -flto=auto   -DENABLE_LOGGING=1 -DENABLE_GETNAMEINFO=1 -Wall -Wextra -O2 -DNDEBUG -fPIE -MD -MT CMakeFiles/test-srt.dir/test/test_unitqueue.cpp.o -MF CMakeFiles/test-srt.dir/test/test_unitqueue.cpp.o.d -o CMakeFiles/test-srt.dir/test/test_unitqueue.cpp.o -c /usr/src/RPM/BUILD/srt-1.4.4/test/test_unitqueue.cpp
gmake[2]: Leaving directory '/usr/src/RPM/BUILD/srt-1.4.4/x86_64-alt-linux'
gmake[2]: Entering directory '/usr/src/RPM/BUILD/srt-1.4.4/x86_64-alt-linux'
[ 97%] Building CXX object CMakeFiles/test-srt.dir/test/test_reuseaddr.cpp.o
/usr/bin/c++ -DENABLE_MONOTONIC_CLOCK=1 -DENABLE_SOCK_CLOEXEC=1 -DGTEST_LINKED_AS_SHARED_LIBRARY=1 -DHAI_ENABLE_SRT=1 -DHAI_PATCH=1 -DHAVE_INET_PTON=1 -DHAVE_PTHREAD_GETNAME_NP=1 -DHAVE_PTHREAD_SETNAME_NP=1 -DLINUX=1 -DSRT_ENABLE_APP_READER -DSRT_ENABLE_BINDTODEVICE -DSRT_ENABLE_CLOSE_SYNCH -DSRT_ENABLE_ENCRYPTION -DSRT_VERSION=\"1.4.4\" -DUSE_GNUTLS=1 -D_GNU_SOURCE -I/usr/src/RPM/BUILD/srt-1.4.4/common -I/usr/src/RPM/BUILD/srt-1.4.4/srtcore -I/usr/src/RPM/BUILD/srt-1.4.4/haicrypt -I/usr/src/RPM/BUILD/srt-1.4.4/x86_64-alt-linux -I/usr/src/RPM/BUILD/srt-1.4.4/apps -I/usr/include/p11-kit-1 -pipe -frecord-gcc-switches -Wall -g -O2 -flto=auto   -DENABLE_LOGGING=1 -DENABLE_GETNAMEINFO=1 -Wall -Wextra -O2 -DNDEBUG -fPIE -MD -MT CMakeFiles/test-srt.dir/test/test_reuseaddr.cpp.o -MF CMakeFiles/test-srt.dir/test/test_reuseaddr.cpp.o.d -o CMakeFiles/test-srt.dir/test/test_reuseaddr.cpp.o -c /usr/src/RPM/BUILD/srt-1.4.4/test/test_reuseaddr.cpp
gmake[2]: Leaving directory '/usr/src/RPM/BUILD/srt-1.4.4/x86_64-alt-linux'
gmake[2]: Entering directory '/usr/src/RPM/BUILD/srt-1.4.4/x86_64-alt-linux'
[ 96%] Building CXX object CMakeFiles/test-srt.dir/test/test_utilities.cpp.o
/usr/bin/c++ -DENABLE_MONOTONIC_CLOCK=1 -DENABLE_SOCK_CLOEXEC=1 -DGTEST_LINKED_AS_SHARED_LIBRARY=1 -DHAI_ENABLE_SRT=1 -DHAI_PATCH=1 -DHAVE_INET_PTON=1 -DHAVE_PTHREAD_GETNAME_NP=1 -DHAVE_PTHREAD_SETNAME_NP=1 -DLINUX=1 -DSRT_ENABLE_APP_READER -DSRT_ENABLE_BINDTODEVICE -DSRT_ENABLE_CLOSE_SYNCH -DSRT_ENABLE_ENCRYPTION -DSRT_VERSION=\"1.4.4\" -DUSE_GNUTLS=1 -D_GNU_SOURCE -I/usr/src/RPM/BUILD/srt-1.4.4/common -I/usr/src/RPM/BUILD/srt-1.4.4/srtcore -I/usr/src/RPM/BUILD/srt-1.4.4/haicrypt -I/usr/src/RPM/BUILD/srt-1.4.4/x86_64-alt-linux -I/usr/src/RPM/BUILD/srt-1.4.4/apps -I/usr/include/p11-kit-1 -pipe -frecord-gcc-switches -Wall -g -O2 -flto=auto   -DENABLE_LOGGING=1 -DENABLE_GETNAMEINFO=1 -Wall -Wextra -O2 -DNDEBUG -fPIE -MD -MT CMakeFiles/test-srt.dir/test/test_utilities.cpp.o -MF CMakeFiles/test-srt.dir/test/test_utilities.cpp.o.d -o CMakeFiles/test-srt.dir/test/test_utilities.cpp.o -c /usr/src/RPM/BUILD/srt-1.4.4/test/test_utilities.cpp
gmake[2]: Leaving directory '/usr/src/RPM/BUILD/srt-1.4.4/x86_64-alt-linux'
gmake[2]: Entering directory '/usr/src/RPM/BUILD/srt-1.4.4/x86_64-alt-linux'
[ 89%] Building CXX object CMakeFiles/test-srt.dir/test/test_socket_options.cpp.o
/usr/bin/c++ -DENABLE_MONOTONIC_CLOCK=1 -DENABLE_SOCK_CLOEXEC=1 -DGTEST_LINKED_AS_SHARED_LIBRARY=1 -DHAI_ENABLE_SRT=1 -DHAI_PATCH=1 -DHAVE_INET_PTON=1 -DHAVE_PTHREAD_GETNAME_NP=1 -DHAVE_PTHREAD_SETNAME_NP=1 -DLINUX=1 -DSRT_ENABLE_APP_READER -DSRT_ENABLE_BINDTODEVICE -DSRT_ENABLE_CLOSE_SYNCH -DSRT_ENABLE_ENCRYPTION -DSRT_VERSION=\"1.4.4\" -DUSE_GNUTLS=1 -D_GNU_SOURCE -I/usr/src/RPM/BUILD/srt-1.4.4/common -I/usr/src/RPM/BUILD/srt-1.4.4/srtcore -I/usr/src/RPM/BUILD/srt-1.4.4/haicrypt -I/usr/src/RPM/BUILD/srt-1.4.4/x86_64-alt-linux -I/usr/src/RPM/BUILD/srt-1.4.4/apps -I/usr/include/p11-kit-1 -pipe -frecord-gcc-switches -Wall -g -O2 -flto=auto   -DENABLE_LOGGING=1 -DENABLE_GETNAMEINFO=1 -Wall -Wextra -O2 -DNDEBUG -fPIE -MD -MT CMakeFiles/test-srt.dir/test/test_socket_options.cpp.o -MF CMakeFiles/test-srt.dir/test/test_socket_options.cpp.o.d -o CMakeFiles/test-srt.dir/test/test_socket_options.cpp.o -c /usr/src/RPM/BUILD/srt-1.4.4/test/test_socket_options.cpp
gmake[2]: Leaving directory '/usr/src/RPM/BUILD/srt-1.4.4/x86_64-alt-linux'
gmake[2]: Entering directory '/usr/src/RPM/BUILD/srt-1.4.4/x86_64-alt-linux'
[ 99%] Linking CXX executable srt-test-relay
/usr/bin/cmake -E cmake_link_script CMakeFiles/srt-test-relay.dir/link.txt --verbose=1
/usr/bin/c++ -pipe -frecord-gcc-switches -Wall -g -O2 -flto=auto   -DENABLE_LOGGING=1 -DENABLE_GETNAMEINFO=1 -Wall -Wextra -O2 -DNDEBUG -rdynamic CMakeFiles/srt-test-relay.dir/testing/srt-test-relay.cpp.o CMakeFiles/srt-test-relay.dir/testing/testmedia.cpp.o CMakeFiles/srt-test-relay.dir/testing/testactivemedia.cpp.o CMakeFiles/srt-test-relay.dir/apps/apputil.cpp.o CMakeFiles/srt-test-relay.dir/apps/verbose.cpp.o CMakeFiles/srt-test-relay.dir/apps/socketoptions.cpp.o CMakeFiles/srt-test-relay.dir/apps/uriparser.cpp.o CMakeFiles/srt-test-relay.dir/apps/logsupport.cpp.o CMakeFiles/srt-test-relay.dir/apps/logsupport_appdefs.cpp.o -o srt-test-relay  -Wl,-rpath,/usr/src/RPM/BUILD/srt-1.4.4/x86_64-alt-linux: libsrt.so.1.4.4 
gmake[2]: Leaving directory '/usr/src/RPM/BUILD/srt-1.4.4/x86_64-alt-linux'
gmake[1]: Entering directory '/usr/src/RPM/BUILD/srt-1.4.4/x86_64-alt-linux'
[ 99%] Built target srt-test-relay
gmake[1]: Leaving directory '/usr/src/RPM/BUILD/srt-1.4.4/x86_64-alt-linux'
gmake[2]: Entering directory '/usr/src/RPM/BUILD/srt-1.4.4/x86_64-alt-linux'
[ 91%] Building CXX object CMakeFiles/test-srt.dir/test/test_sync.cpp.o
/usr/bin/c++ -DENABLE_MONOTONIC_CLOCK=1 -DENABLE_SOCK_CLOEXEC=1 -DGTEST_LINKED_AS_SHARED_LIBRARY=1 -DHAI_ENABLE_SRT=1 -DHAI_PATCH=1 -DHAVE_INET_PTON=1 -DHAVE_PTHREAD_GETNAME_NP=1 -DHAVE_PTHREAD_SETNAME_NP=1 -DLINUX=1 -DSRT_ENABLE_APP_READER -DSRT_ENABLE_BINDTODEVICE -DSRT_ENABLE_CLOSE_SYNCH -DSRT_ENABLE_ENCRYPTION -DSRT_VERSION=\"1.4.4\" -DUSE_GNUTLS=1 -D_GNU_SOURCE -I/usr/src/RPM/BUILD/srt-1.4.4/common -I/usr/src/RPM/BUILD/srt-1.4.4/srtcore -I/usr/src/RPM/BUILD/srt-1.4.4/haicrypt -I/usr/src/RPM/BUILD/srt-1.4.4/x86_64-alt-linux -I/usr/src/RPM/BUILD/srt-1.4.4/apps -I/usr/include/p11-kit-1 -pipe -frecord-gcc-switches -Wall -g -O2 -flto=auto   -DENABLE_LOGGING=1 -DENABLE_GETNAMEINFO=1 -Wall -Wextra -O2 -DNDEBUG -fPIE -MD -MT CMakeFiles/test-srt.dir/test/test_sync.cpp.o -MF CMakeFiles/test-srt.dir/test/test_sync.cpp.o.d -o CMakeFiles/test-srt.dir/test/test_sync.cpp.o -c /usr/src/RPM/BUILD/srt-1.4.4/test/test_sync.cpp
gmake[2]: Leaving directory '/usr/src/RPM/BUILD/srt-1.4.4/x86_64-alt-linux'
gmake[2]: Entering directory '/usr/src/RPM/BUILD/srt-1.4.4/x86_64-alt-linux'
[100%] Linking CXX executable test-srt
/usr/bin/cmake -E cmake_link_script CMakeFiles/test-srt.dir/link.txt --verbose=1
/usr/bin/c++ -pipe -frecord-gcc-switches -Wall -g -O2 -flto=auto   -DENABLE_LOGGING=1 -DENABLE_GETNAMEINFO=1 -Wall -Wextra -O2 -DNDEBUG -rdynamic CMakeFiles/test-srt.dir/test/test_buffer.cpp.o CMakeFiles/test-srt.dir/test/test_bonding.cpp.o CMakeFiles/test-srt.dir/test/test_common.cpp.o CMakeFiles/test-srt.dir/test/test_connection_timeout.cpp.o CMakeFiles/test-srt.dir/test/test_many_connections.cpp.o CMakeFiles/test-srt.dir/test/test_cryspr.cpp.o CMakeFiles/test-srt.dir/test/test_enforced_encryption.cpp.o CMakeFiles/test-srt.dir/test/test_epoll.cpp.o CMakeFiles/test-srt.dir/test/test_fec_rebuilding.cpp.o CMakeFiles/test-srt.dir/test/test_file_transmission.cpp.o CMakeFiles/test-srt.dir/test/test_ipv6.cpp.o CMakeFiles/test-srt.dir/test/test_list.cpp.o CMakeFiles/test-srt.dir/test/test_listen_callback.cpp.o CMakeFiles/test-srt.dir/test/test_muxer.cpp.o CMakeFiles/test-srt.dir/test/test_seqno.cpp.o CMakeFiles/test-srt.dir/test/test_socket_options.cpp.o CMakeFiles/test-srt.dir/test/test_sync.cpp.o CMakeFiles/test-srt.dir/test/test_threadname.cpp.o CMakeFiles/test-srt.dir/test/test_timer.cpp.o CMakeFiles/test-srt.dir/test/test_unitqueue.cpp.o CMakeFiles/test-srt.dir/test/test_utilities.cpp.o CMakeFiles/test-srt.dir/test/test_reuseaddr.cpp.o -o test-srt  -Wl,-rpath,/usr/src/RPM/BUILD/srt-1.4.4/x86_64-alt-linux /usr/lib64/libgtest_main.so.1.11.0 libsrt.so.1.4.4 /usr/lib64/libgtest.so.1.11.0 
gmake[2]: Leaving directory '/usr/src/RPM/BUILD/srt-1.4.4/x86_64-alt-linux'
gmake[1]: Entering directory '/usr/src/RPM/BUILD/srt-1.4.4/x86_64-alt-linux'
[100%] Built target test-srt
gmake[1]: Leaving directory '/usr/src/RPM/BUILD/srt-1.4.4/x86_64-alt-linux'
gmake: Entering directory '/usr/src/RPM/BUILD/srt-1.4.4/x86_64-alt-linux'
/usr/bin/cmake -E cmake_progress_start /usr/src/RPM/BUILD/srt-1.4.4/x86_64-alt-linux/CMakeFiles 0
gmake: Leaving directory '/usr/src/RPM/BUILD/srt-1.4.4/x86_64-alt-linux'
+ exit 0
Executing(%install): /bin/sh -e /usr/src/tmp/rpm-tmp.42170
+ umask 022
+ /bin/mkdir -p /usr/src/RPM/BUILD
+ cd /usr/src/RPM/BUILD
+ /bin/chmod -Rf u+rwX -- /usr/src/tmp/srt-buildroot
+ :
+ /bin/rm -rf -- /usr/src/tmp/srt-buildroot
+ PATH=/usr/libexec/rpm-build:/usr/src/bin:/bin:/usr/bin:/usr/X11R6/bin:/usr/games
+ cd srt-1.4.4
+ DESTDIR=/usr/src/tmp/srt-buildroot
+ cmake --install x86_64-alt-linux --verbose
-- Install configuration: "Release"
-- Installing: /usr/src/tmp/srt-buildroot/usr/lib64/libsrt.so.1.4.4
-- Installing: /usr/src/tmp/srt-buildroot/usr/lib64/libsrt.so.1.4
-- Installing: /usr/src/tmp/srt-buildroot/usr/lib64/libsrt.so
-- Installing: /usr/src/tmp/srt-buildroot/usr/include/srt/version.h
-- Installing: /usr/src/tmp/srt-buildroot/usr/include/srt/srt.h
-- Installing: /usr/src/tmp/srt-buildroot/usr/include/srt/logging_api.h
-- Installing: /usr/src/tmp/srt-buildroot/usr/include/srt/access_control.h
-- Installing: /usr/src/tmp/srt-buildroot/usr/include/srt/platform_sys.h
-- Installing: /usr/src/tmp/srt-buildroot/usr/include/srt/udt.h
-- Installing: /usr/src/tmp/srt-buildroot/usr/lib64/pkgconfig/haisrt.pc
-- Installing: /usr/src/tmp/srt-buildroot/usr/lib64/pkgconfig/srt.pc
-- Installing: /usr/src/tmp/srt-buildroot/usr/bin/srt-live-transmit
-- Set runtime path of "/usr/src/tmp/srt-buildroot/usr/bin/srt-live-transmit" to ""
-- Up-to-date: /usr/src/tmp/srt-buildroot/usr/bin/srt-live-transmit
-- Installing: /usr/src/tmp/srt-buildroot/usr/bin/srt-file-transmit
-- Set runtime path of "/usr/src/tmp/srt-buildroot/usr/bin/srt-file-transmit" to ""
-- Up-to-date: /usr/src/tmp/srt-buildroot/usr/bin/srt-file-transmit
-- Installing: /usr/src/tmp/srt-buildroot/usr/bin/srt-tunnel
-- Set runtime path of "/usr/src/tmp/srt-buildroot/usr/bin/srt-tunnel" to ""
-- Up-to-date: /usr/src/tmp/srt-buildroot/usr/bin/srt-tunnel
-- Installing: /usr/src/tmp/srt-buildroot/usr/bin/utility-test
-- Installing: /usr/src/tmp/srt-buildroot/usr/bin/uriparser-test
-- Installing: /usr/src/tmp/srt-buildroot/usr/bin/srt-test-live
-- Set runtime path of "/usr/src/tmp/srt-buildroot/usr/bin/srt-test-live" to ""
-- Installing: /usr/src/tmp/srt-buildroot/usr/bin/srt-test-file
-- Set runtime path of "/usr/src/tmp/srt-buildroot/usr/bin/srt-test-file" to ""
-- Installing: /usr/src/tmp/srt-buildroot/usr/bin/srt-test-relay
-- Set runtime path of "/usr/src/tmp/srt-buildroot/usr/bin/srt-test-relay" to ""
-- Installing: /usr/src/tmp/srt-buildroot/usr/bin/srt-test-multiplex
-- Set runtime path of "/usr/src/tmp/srt-buildroot/usr/bin/srt-test-multiplex" to ""
-- Installing: /usr/src/tmp/srt-buildroot/usr/bin/srt-ffplay
+ rm -f /usr/src/tmp/srt-buildroot//usr/lib64/pkgconfig/haisrt.pc
+ /usr/lib/rpm/brp-alt
Cleaning files in /usr/src/tmp/srt-buildroot (auto)
mode of './usr/lib64/libsrt.so.1.4.4' changed from 0755 (rwxr-xr-x) to 0644 (rw-r--r--)
Verifying and fixing files in /usr/src/tmp/srt-buildroot (binconfig,pkgconfig,libtool,desktop,gnuconfig)
/usr/lib64/pkgconfig/srt.pc: Cflags: '-I${includedir} -I${includedir}/srt' --> '-I${includedir}/srt'
/usr/lib64/pkgconfig/srt.pc: Libs: '-L${libdir} -lsrt   ' --> '-lsrt'
Checking contents of files in /usr/src/tmp/srt-buildroot/ (default)
Compressing files in /usr/src/tmp/srt-buildroot (auto)
Adjusting library links in /usr/src/tmp/srt-buildroot
./usr/lib64: (from <cmdline>:0)
	libsrt.so.1.4 -> libsrt.so.1.4.4
Verifying ELF objects in /usr/src/tmp/srt-buildroot (arch=normal,fhs=normal,lfs=relaxed,lint=relaxed,rpath=normal,stack=normal,textrel=normal,unresolved=normal)
Executing(%check): /bin/sh -e /usr/src/tmp/rpm-tmp.89158
+ umask 022
+ /bin/mkdir -p /usr/src/RPM/BUILD
+ cd /usr/src/RPM/BUILD
+ cd srt-1.4.4
+ ./x86_64-alt-linux/test-srt
Running main() from /usr/src/RPM/BUILD/googletest-release-1.11.0/googletest/src/gtest_main.cc
[==========] Running 232 tests from 29 test suites.
[----------] Global test environment set-up.
[----------] 5 tests from ReuseAddr
[ RUN      ] ReuseAddr.SameAddr1
Bind to: localhost.localdomain:5000
Connecting to: localhost.localdomain:5000
Accepted from: localhost.localdomain:33324
Client exit
Server exit
Bind to: localhost.localdomain:5000
Connecting to: localhost.localdomain:5000
Accepted from: localhost.localdomain:35397
Client exit
Server exit
[       OK ] ReuseAddr.SameAddr1 (257 ms)
[ RUN      ] ReuseAddr.SameAddr2
Bind to: :5000
Connecting to: :5000
Accepted from: :40590
Client exit
Server exit
Bind to: :5000
Connecting to: :5000
Accepted from: :52121
Client exit
Server exit
[       OK ] ReuseAddr.SameAddr2 (252 ms)
[ RUN      ] ReuseAddr.DiffAddr
Bind to: localhost.localdomain:5000
Connecting to: localhost.localdomain:5000
Accepted from: localhost.localdomain:38639
Client exit
Server exit
Bind to: :5000
Connecting to: :5000
Accepted from: :38307
Client exit
Server exit
[       OK ] ReuseAddr.DiffAddr (255 ms)
[ RUN      ] ReuseAddr.Wildcard
Bind to: :5000
Connecting to: localhost.localdomain:5000
Accepted from: localhost.localdomain:41273
Client exit
Server exit
Bind to: :5000
02:24:19.484831/test-srt*E:SRT.sm: bind: Address: :5000 conflicts with existing wildcard binding: :5000
Binding should fail: Operation not supported: Another socket is bound to that port and is not reusable for requested settings
[       OK ] ReuseAddr.Wildcard (129 ms)
[ RUN      ] ReuseAddr.ProtocolVersion
Bind to: :5000
Connecting to: :5000
Accepted from: :58282
Client exit
Server exit
Bind to: :5000
Connecting to: localhost.localdomain:5000
Accepted from: :42548
Client exit
Server exit
[       OK ] ReuseAddr.ProtocolVersion (255 ms)
[----------] 5 tests from ReuseAddr (1150 ms total)

[----------] 1 test from CircularBuffer
[ RUN      ] CircularBuffer.Overall
[       OK ] CircularBuffer.Overall (0 ms)
[----------] 1 test from CircularBuffer (0 ms total)

[----------] 1 test from ConfigString
[ RUN      ] ConfigString.Setting
[       OK ] ConfigString.Setting (0 ms)
[----------] 1 test from ConfigString (0 ms total)

[----------] 3 tests from CUnitQueue
[ RUN      ] CUnitQueue.Increase
[       OK ] CUnitQueue.Increase (0 ms)
[ RUN      ] CUnitQueue.IncreaseAndFree
[       OK ] CUnitQueue.IncreaseAndFree (0 ms)
[ RUN      ] CUnitQueue.IncreaseAndFreeGrouped
[       OK ] CUnitQueue.IncreaseAndFreeGrouped (0 ms)
[----------] 3 tests from CUnitQueue (0 ms total)

[----------] 2 tests from ThreadName
[ RUN      ] ThreadName.GetSet
[       OK ] ThreadName.GetSet (0 ms)
[ RUN      ] ThreadName.AutoReset
[       OK ] ThreadName.AutoReset (0 ms)
[----------] 2 tests from ThreadName (0 ms total)

[----------] 9 tests from SyncDuration
[ RUN      ] SyncDuration.BasicChecks
[       OK ] SyncDuration.BasicChecks (0 ms)
[ RUN      ] SyncDuration.DurationFrom
[       OK ] SyncDuration.DurationFrom (0 ms)
[ RUN      ] SyncDuration.RelOperators
[       OK ] SyncDuration.RelOperators (0 ms)
[ RUN      ] SyncDuration.OperatorMinus
[       OK ] SyncDuration.OperatorMinus (0 ms)
[ RUN      ] SyncDuration.OperatorMinusEq
[       OK ] SyncDuration.OperatorMinusEq (0 ms)
[ RUN      ] SyncDuration.OperatorPlus
[       OK ] SyncDuration.OperatorPlus (0 ms)
[ RUN      ] SyncDuration.OperatorPlusEq
[       OK ] SyncDuration.OperatorPlusEq (0 ms)
[ RUN      ] SyncDuration.OperatorMultInt
[       OK ] SyncDuration.OperatorMultInt (0 ms)
[ RUN      ] SyncDuration.OperatorMultIntEq
[       OK ] SyncDuration.OperatorMultIntEq (0 ms)
[----------] 9 tests from SyncDuration (0 ms total)

[----------] 1 test from SyncRandom
[ RUN      ] SyncRandom.GenRandomInt
[       OK ] SyncRandom.GenRandomInt (1 ms)
[----------] 1 test from SyncRandom (1 ms total)

[----------] 7 tests from SyncTimePoint
[ RUN      ] SyncTimePoint.DefaultConstructorZero
[       OK ] SyncTimePoint.DefaultConstructorZero (0 ms)
[ RUN      ] SyncTimePoint.RelOperators
[       OK ] SyncTimePoint.RelOperators (0 ms)
[ RUN      ] SyncTimePoint.OperatorMinus
[       OK ] SyncTimePoint.OperatorMinus (0 ms)
[ RUN      ] SyncTimePoint.OperatorEq
[       OK ] SyncTimePoint.OperatorEq (0 ms)
[ RUN      ] SyncTimePoint.OperatorMinusPlusDuration
[       OK ] SyncTimePoint.OperatorMinusPlusDuration (0 ms)
[ RUN      ] SyncTimePoint.OperatorPlusEqDuration
[       OK ] SyncTimePoint.OperatorPlusEqDuration (0 ms)
[ RUN      ] SyncTimePoint.OperatorMinusEqDuration
[       OK ] SyncTimePoint.OperatorMinusEqDuration (0 ms)
[----------] 7 tests from SyncTimePoint (0 ms total)

[----------] 2 tests from SyncUniqueLock
[ RUN      ] SyncUniqueLock.LockUnlock
[       OK ] SyncUniqueLock.LockUnlock (0 ms)
[ RUN      ] SyncUniqueLock.Scope
[       OK ] SyncUniqueLock.Scope (0 ms)
[----------] 2 tests from SyncUniqueLock (0 ms total)

[----------] 6 tests from SyncEvent
[ RUN      ] SyncEvent.WaitFor
SyncEvent::wait_for(50us) took 103us
SyncEvent::wait_for(100us) took 153us
SyncEvent::wait_for(500us) took 554us
SyncEvent::wait_for(1 ms) took 1.055 ms
SyncEvent::wait_for(101 ms) took 101.057 ms
SyncEvent::wait_for(1001 ms) took 1001.09 ms
[       OK ] SyncEvent.WaitFor (1104 ms)
[ RUN      ] SyncEvent.WaitForNotifyOne
[       OK ] SyncEvent.WaitForNotifyOne (100 ms)
[ RUN      ] SyncEvent.WaitNotifyOne
[       OK ] SyncEvent.WaitNotifyOne (100 ms)
[ RUN      ] SyncEvent.WaitForTwoNotifyOne
SyncEvent::WaitForTwoNotifyOne: NOTIFICATION came from 1 clients: 0
SyncEvent::WaitForTwoNotifyOne: READY THREAD: 0 STATUS ready RESULT 42
SyncEvent::WaitForTwoNotifyOne: TMOUT THREAD: 1 STATUS timeout RESULT 0
[       OK ] SyncEvent.WaitForTwoNotifyOne (3000 ms)
[ RUN      ] SyncEvent.WaitForTwoNotifyAll
[       OK ] SyncEvent.WaitForTwoNotifyAll (200 ms)
[ RUN      ] SyncEvent.WaitForNotifyAll
[       OK ] SyncEvent.WaitForNotifyAll (500 ms)
[----------] 6 tests from SyncEvent (5005 ms total)

[----------] 1 test from SyncThread
[ RUN      ] SyncThread.Joinable
[       OK ] SyncThread.Joinable (50 ms)
[----------] 1 test from SyncThread (50 ms total)

[----------] 2 tests from Sync
[ RUN      ] Sync.FormatTime
Current time formated:    20D 02:28:42.267298 [STDY]
Same time formated again: 20D 02:28:42.267298 [STDY] (0 us)
Same time formated again: 20D 02:28:42.267298 [STDY] (0 us)
Time +500 ms formated:    20D 02:28:42.767298 [STDY] (500000 us)
Time +1  sec formated:    20D 02:28:43.267298 [STDY] (1000000 us)
Time +5  sec formated:    20D 02:28:47.267298 [STDY] (5000000 us)
Time -4350 ms formated:   20D 02:28:37.917298 [STDY] (-4350000 us)
[       OK ] Sync.FormatTime (1 ms)
[ RUN      ] Sync.FormatTimeSys
Current time formated:    02:24:24.269179 [SYST]
Same time formated again: 02:24:24.269179 [SYST] (0 us)
Same time formated again: 02:24:24.269179 [SYST] (0 us)
Time +500 ms formated:    02:24:24.769179 [SYST] (500000 us)
Time +1  sec formated:    02:24:25.269179 [SYST] (1000000 us)
Time +5  sec formated:    02:24:29.269179 [SYST] (5000000 us)
Time -4350 ms formated:   02:24:19.919179 [SYST] (-4350000 us)
[       OK ] Sync.FormatTimeSys (1 ms)
[----------] 2 tests from Sync (3 ms total)

[----------] 20 tests from TestSocketOptions
[ RUN      ] TestSocketOptions.DefaultVals
[       OK ] TestSocketOptions.DefaultVals (0 ms)
[ RUN      ] TestSocketOptions.MaxVals
Skipping SRTO_KMPREANNOUNCE
Skipping SRTO_KMREFRESHRATE
[       OK ] TestSocketOptions.MaxVals (0 ms)
[ RUN      ] TestSocketOptions.MinVals
[       OK ] TestSocketOptions.MinVals (0 ms)
[ RUN      ] TestSocketOptions.InvalidVals
02:24:24.809285/old*E:SRT.km: SRTO_FC: minimum allowed value is 32 (provided: -1)
02:24:24.809296/old*E:SRT.km: SRTO_FC: minimum allowed value is 32 (provided: 31)
02:24:24.809303/old*E:SRT.ac: SRTO_KMPREANNOUNCE=-1 can't be negative
02:24:24.809310/old*E:SRT.ac: SRTO_KMREFRESHRATE=-1 can't be negative
02:24:24.809343/old*E:SRT.ac: SRTO_PAYLOADSIZE: value exceeds SRT_LIVE_MAX_PLSIZE, maximum payload per MTU.
[       OK ] TestSocketOptions.InvalidVals (0 ms)
[ RUN      ] TestSocketOptions.RestrictionBind
02:24:24.809562/old!W:SRT.ac: SRTO_KMREFRESHRATE=0x400: setting SRTO_KMPREANNOUNCE=0x1ff
[       OK ] TestSocketOptions.RestrictionBind (2 ms)
[ RUN      ] TestSocketOptions.RestrictionListening
[       OK ] TestSocketOptions.RestrictionListening (1 ms)
[ RUN      ] TestSocketOptions.RestrictionConnected
[       OK ] TestSocketOptions.RestrictionConnected (17 ms)
[ RUN      ] TestSocketOptions.TLPktDropInherits
[       OK ] TestSocketOptions.TLPktDropInherits (2010 ms)
[ RUN      ] TestSocketOptions.Latency
[       OK ] TestSocketOptions.Latency (16 ms)
[ RUN      ] TestSocketOptions.LossMaxTTL
[       OK ] TestSocketOptions.LossMaxTTL (15 ms)
[ RUN      ] TestSocketOptions.MinInputBWWrongLen
[       OK ] TestSocketOptions.MinInputBWWrongLen (0 ms)
[ RUN      ] TestSocketOptions.MinInputBWDefault
[       OK ] TestSocketOptions.MinInputBWDefault (17 ms)
[ RUN      ] TestSocketOptions.MinInputBWSet
[       OK ] TestSocketOptions.MinInputBWSet (15 ms)
[ RUN      ] TestSocketOptions.MinInputBWRuntime
[       OK ] TestSocketOptions.MinInputBWRuntime (16 ms)
[ RUN      ] TestSocketOptions.StreamIDWrongLen
[       OK ] TestSocketOptions.StreamIDWrongLen (0 ms)
[ RUN      ] TestSocketOptions.StreamIDOdd
[       OK ] TestSocketOptions.StreamIDOdd (16 ms)
[ RUN      ] TestSocketOptions.StreamIDEven
[       OK ] TestSocketOptions.StreamIDEven (17 ms)
[ RUN      ] TestSocketOptions.StreamIDAlmostFull
[       OK ] TestSocketOptions.StreamIDAlmostFull (18 ms)
[ RUN      ] TestSocketOptions.StreamIDFull
[       OK ] TestSocketOptions.StreamIDFull (16 ms)
[ RUN      ] TestSocketOptions.StreamIDLenListener
[       OK ] TestSocketOptions.StreamIDLenListener (15 ms)
[----------] 20 tests from TestSocketOptions (2197 ms total)

[----------] 8 tests from CSeqNo
[ RUN      ] CSeqNo.constants
[       OK ] CSeqNo.constants (0 ms)
[ RUN      ] CSeqNo.seqcmp
[       OK ] CSeqNo.seqcmp (0 ms)
[ RUN      ] CSeqNo.seqoff
[       OK ] CSeqNo.seqoff (0 ms)
[ RUN      ] CSeqNo.seqlen
[       OK ] CSeqNo.seqlen (0 ms)
[ RUN      ] CSeqNo.incseq
[       OK ] CSeqNo.incseq (0 ms)
[ RUN      ] CSeqNo.decseq
[       OK ] CSeqNo.decseq (0 ms)
[ RUN      ] CSeqNo.incseqint
[       OK ] CSeqNo.incseqint (0 ms)
[ RUN      ] CSeqNo.decseqint
[       OK ] CSeqNo.decseqint (0 ms)
[----------] 8 tests from CSeqNo (0 ms total)

[----------] 1 test from CUDT
[ RUN      ] CUDT.getFlightSpan
[       OK ] CUDT.getFlightSpan (0 ms)
[----------] 1 test from CUDT (0 ms total)

[----------] 1 test from Core
[ RUN      ] Core.ListenCallback
TEST 1: Connect to an encrypted socket correctly (should succeed)
TEST: Accessing user 'admin', might throw if not found
TEST: Setting password 'thelocalmanager' as per user 'admin'
TEST 2: Connect with a wrong password (should reject the handshake)
TEST: Accessing user 'admin', might throw if not found
TEST: Setting password 'thelocalmanager' as per user 'admin'
02:24:27.009639/SRT:RcvQ:w42!W:SRT.cn: KMREQ/rcv: (snd) Rx process failure - BADSECRET
02:24:27.009928/SRT:RcvQ:w42*E:SRT.cn: interpretSrtHandshake: KMREQ result abnornal - rejecting per enforced encryption
02:24:27.009955/SRT:RcvQ:w42!W:SRT.cn: @65511130:newConnection: connection rejected due to: INTERNAL REJECTION - ERROR:BADSECRET
02:24:27.009970/SRT:RcvQ:w42!W:SRT.cn: processConnectRequest: rsp(REJECT): 1010 - Incorrect passphrase
TEST 3: Connect with wrong username (should exit on exception)
TEST: Accessing user 'haivision', might throw if not found
02:24:27.010814/SRT:RcvQ:w42!W:SRT.cn: runAcceptHook: hook interrupted by exception
02:24:27.010824/SRT:RcvQ:w42!W:SRT.cn: @65511128:newConnection: connection rejected due to: INTERNAL REJECTION - ERROR:UNKNOWN
02:24:27.010830/SRT:RcvQ:w42!W:SRT.cn: processConnectRequest: rsp(REJECT): 1000 - Unknown or erroneous
02:24:27.011091/old*E:SRT.cn: HS VERSION=5 but no handshake extension found!
[       OK ] Core.ListenCallback (18 ms)
[----------] 1 test from Core (18 ms total)

[----------] 39 tests from CSndLossListTest
[ RUN      ] CSndLossListTest.Create
[       OK ] CSndLossListTest.Create (0 ms)
[ RUN      ] CSndLossListTest.InsertPopOneElem
[       OK ] CSndLossListTest.InsertPopOneElem (0 ms)
[ RUN      ] CSndLossListTest.InsertNegativeSeqno
Expecting IPE message:
02:24:27.024936/old*E:SRT.qs: IPE: Tried to insert negative seqno 1:-1 into sender's loss list. Ignoring.
02:24:27.024943/old*E:SRT.qs: IPE: Tried to insert negative seqno -1:-1 into sender's loss list. Ignoring.
02:24:27.024945/old*E:SRT.qs: IPE: Tried to insert negative seqno -1:1 into sender's loss list. Ignoring.
[       OK ] CSndLossListTest.InsertNegativeSeqno (0 ms)
[ RUN      ] CSndLossListTest.InsertPopTwoElemsRange
[       OK ] CSndLossListTest.InsertPopTwoElemsRange (0 ms)
[ RUN      ] CSndLossListTest.InsertPopTwoElems
[       OK ] CSndLossListTest.InsertPopTwoElems (0 ms)
[ RUN      ] CSndLossListTest.InsertPopTwoSerialElems
[       OK ] CSndLossListTest.InsertPopTwoSerialElems (0 ms)
[ RUN      ] CSndLossListTest.InsertPopRangeAndSingle
[       OK ] CSndLossListTest.InsertPopRangeAndSingle (0 ms)
[ RUN      ] CSndLossListTest.InsertPopFourElems
[       OK ] CSndLossListTest.InsertPopFourElems (0 ms)
[ RUN      ] CSndLossListTest.InsertCoalesce
[       OK ] CSndLossListTest.InsertCoalesce (0 ms)
[ RUN      ] CSndLossListTest.BasicRemoveInListNodeHead01
[       OK ] CSndLossListTest.BasicRemoveInListNodeHead01 (0 ms)
[ RUN      ] CSndLossListTest.BasicRemoveInListNodeHead02
[       OK ] CSndLossListTest.BasicRemoveInListNodeHead02 (0 ms)
[ RUN      ] CSndLossListTest.BasicRemoveInListNodeHead03
[       OK ] CSndLossListTest.BasicRemoveInListNodeHead03 (0 ms)
[ RUN      ] CSndLossListTest.BasicRemoveInListNodeHead04
[       OK ] CSndLossListTest.BasicRemoveInListNodeHead04 (0 ms)
[ RUN      ] CSndLossListTest.BasicRemoveInListNotInNodeHead01
[       OK ] CSndLossListTest.BasicRemoveInListNotInNodeHead01 (0 ms)
[ RUN      ] CSndLossListTest.BasicRemoveInListNotInNodeHead02
[       OK ] CSndLossListTest.BasicRemoveInListNotInNodeHead02 (0 ms)
[ RUN      ] CSndLossListTest.BasicRemoveInListNotInNodeHead03
[       OK ] CSndLossListTest.BasicRemoveInListNotInNodeHead03 (0 ms)
[ RUN      ] CSndLossListTest.BasicRemoveInListNotInNodeHead04
[       OK ] CSndLossListTest.BasicRemoveInListNotInNodeHead04 (0 ms)
[ RUN      ] CSndLossListTest.BasicRemoveInListNotInNodeHead05
[       OK ] CSndLossListTest.BasicRemoveInListNotInNodeHead05 (0 ms)
[ RUN      ] CSndLossListTest.BasicRemoveInListNotInNodeHead06
[       OK ] CSndLossListTest.BasicRemoveInListNotInNodeHead06 (0 ms)
[ RUN      ] CSndLossListTest.BasicRemoveInListNotInNodeHead07
[       OK ] CSndLossListTest.BasicRemoveInListNotInNodeHead07 (0 ms)
[ RUN      ] CSndLossListTest.BasicRemoveInListNotInNodeHead08
[       OK ] CSndLossListTest.BasicRemoveInListNotInNodeHead08 (0 ms)
[ RUN      ] CSndLossListTest.BasicRemoveInListNotInNodeHead09
[       OK ] CSndLossListTest.BasicRemoveInListNotInNodeHead09 (0 ms)
[ RUN      ] CSndLossListTest.BasicRemoveInListNotInNodeHead10
[       OK ] CSndLossListTest.BasicRemoveInListNotInNodeHead10 (0 ms)
[ RUN      ] CSndLossListTest.BasicRemoveInListNotInNodeHead11
[       OK ] CSndLossListTest.BasicRemoveInListNotInNodeHead11 (0 ms)
[ RUN      ] CSndLossListTest.InsertRemoveInsert01
[       OK ] CSndLossListTest.InsertRemoveInsert01 (0 ms)
[ RUN      ] CSndLossListTest.InsertHead01
[       OK ] CSndLossListTest.InsertHead01 (0 ms)
[ RUN      ] CSndLossListTest.InsertHead02
[       OK ] CSndLossListTest.InsertHead02 (0 ms)
[ RUN      ] CSndLossListTest.InsertHeadIncrease01
[       OK ] CSndLossListTest.InsertHeadIncrease01 (0 ms)
[ RUN      ] CSndLossListTest.InsertHeadOverlap01
[       OK ] CSndLossListTest.InsertHeadOverlap01 (0 ms)
[ RUN      ] CSndLossListTest.InsertHeadOverlap02
[       OK ] CSndLossListTest.InsertHeadOverlap02 (0 ms)
[ RUN      ] CSndLossListTest.InsertHeadNegativeOffset01
Expecting IPE message:
02:24:27.025028/old*E:SRT.qs: IPE: New loss record is too old. Ignoring. First loss seqno 10000000, insert seqno 1:1
[       OK ] CSndLossListTest.InsertHeadNegativeOffset01 (0 ms)
[ RUN      ] CSndLossListTest.InsertHeadNegativeOffset02
[       OK ] CSndLossListTest.InsertHeadNegativeOffset02 (0 ms)
[ RUN      ] CSndLossListTest.InsertFullListCoalesce
02:24:27.025043/old*E:SRT.qs: IPE: New loss record is too far from the first record. Ignoring. First loss seqno 1, insert seqno 257:257
[       OK ] CSndLossListTest.InsertFullListCoalesce (0 ms)
[ RUN      ] CSndLossListTest.InsertFullListNoCoalesce
02:24:27.025059/old*E:SRT.qs: IPE: New loss record is too far from the first record. Ignoring. First loss seqno 2, insert seqno 258:258
[       OK ] CSndLossListTest.InsertFullListNoCoalesce (0 ms)
[ RUN      ] CSndLossListTest.InsertFullListNegativeOffset
02:24:27.025073/old*E:SRT.qs: IPE: Tried to insert too big range of seqno: 257. Ignoring. seqno 1:257
[       OK ] CSndLossListTest.InsertFullListNegativeOffset (0 ms)
[ RUN      ] CSndLossListTest.InsertPositiveOffsetTooFar
02:24:27.025086/old*E:SRT.qs: IPE: New loss record is too far from the first record. Ignoring. First loss seqno 1000, insert seqno 1256:1256
02:24:27.025087/old*E:SRT.qs: IPE: New loss record is too far from the first record. Ignoring. First loss seqno 1000, insert seqno 1512:1512
[       OK ] CSndLossListTest.InsertPositiveOffsetTooFar (0 ms)
[ RUN      ] CSndLossListTest.InsertNoUpdateElement01
[       OK ] CSndLossListTest.InsertNoUpdateElement01 (0 ms)
[ RUN      ] CSndLossListTest.InsertNoUpdateElement03
[       OK ] CSndLossListTest.InsertNoUpdateElement03 (0 ms)
[ RUN      ] CSndLossListTest.InsertUpdateElement01
[       OK ] CSndLossListTest.InsertUpdateElement01 (0 ms)
[----------] 39 tests from CSndLossListTest (0 ms total)

[----------] 1 test from Transmission
[ RUN      ] Transmission.FileUpload
Running test on port 5000
WILL CREATE source file with size=84410368 (= 7 * 12058624[sndbuf])
Connection initialized
Finished sending, closing sockets:
Sockets closed, joining receiver thread
Received 0 bytes, breaking.
Comparing files
[       OK ] Transmission.FileUpload (9936 ms)
[----------] 1 test from Transmission (9936 ms total)

[----------] 11 tests from TestFEC
[ RUN      ] TestFEC.ConfigExchange
[       OK ] TestFEC.ConfigExchange (1 ms)
[ RUN      ] TestFEC.ConfigExchangeFaux
02:24:36.963264/old*E:SRT.ac: SRTO_PACKETFILTER: Incorrect syntax. Use: FILTERTYPE[,KEY:VALUE...]. FILTERTYPE (FEC) must be installed (or builtin)
02:24:36.963354/old*E:SRT.ac: SRTO_PACKETFILTER: Incorrect config: at least 'cols' must be specified and > 1
02:24:36.963422/old*E:SRT.ac: SRTO_PACKETFILTER: Incorrect config: 'rows' must be >=1 or negative < -1
02:24:36.963477/old*E:SRT.ac: SRTO_PACKETFILTER: Incorrect config: 'rows' must be >=1 or negative < -1
02:24:36.963528/old*E:SRT.ac: SRTO_PACKETFILTER: Incorrect config: value for 'layout' must be 'even' or 'staircase'
02:24:36.963585/old*E:SRT.ac: SRTO_PACKETFILTER: Incorrect config: 'arq' value 'sometimes' invalid. Allowed: never, onreq, always
02:24:36.963651/old*E:SRT.ac: SRTO_PACKETFILTER: Incorrect config: Extra parameters. Allowed only: cols, rows, layout, arq
(NOTE: expecting a failure message)
02:24:36.963704/old*E:SRT.cn: Packet Filter (fec): collision on 'cols' parameter (agent:20 peer:10)
[       OK ] TestFEC.ConfigExchangeFaux (4 ms)
[ RUN      ] TestFEC.Connection
/usr/src/RPM/BUILD/srt-1.4.4/test/test_fec_rebuilding.cpp:311: Failure
Expected: (a) != (SRT_ERROR), actual: -1 vs -1
[  FAILED  ] TestFEC.Connection (2008 ms)
[ RUN      ] TestFEC.ConnectionReorder
02:24:38.982666/SRT:RcvQ:w48!W:SRT.cn: processConnectRequest: rsp(REJECT): 1005 - Listener's backlog exceeded
/usr/src/RPM/BUILD/srt-1.4.4/test/test_fec_rebuilding.cpp:364: Failure
Expected: (a) != (SRT_ERROR), actual: -1 vs -1
[  FAILED  ] TestFEC.ConnectionReorder (2002 ms)
[ RUN      ] TestFEC.ConnectionFull1
02:24:40.985714/SRT:RcvQ:w48!W:SRT.cn: processConnectRequest: rsp(REJECT): 1005 - Listener's backlog exceeded
/usr/src/RPM/BUILD/srt-1.4.4/test/test_fec_rebuilding.cpp:417: Failure
Expected: (a) != (SRT_ERROR), actual: -1 vs -1
[  FAILED  ] TestFEC.ConnectionFull1 (2010 ms)
[ RUN      ] TestFEC.ConnectionFull2
02:24:42.994750/SRT:RcvQ:w48!W:SRT.cn: processConnectRequest: rsp(REJECT): 1005 - Listener's backlog exceeded
/usr/src/RPM/BUILD/srt-1.4.4/test/test_fec_rebuilding.cpp:469: Failure
Expected: (a) != (SRT_ERROR), actual: -1 vs -1
[  FAILED  ] TestFEC.ConnectionFull2 (2003 ms)
[ RUN      ] TestFEC.ConnectionMess
02:24:44.993609/SRT:RcvQ:w48!W:SRT.cn: processConnectRequest: rsp(REJECT): 1005 - Listener's backlog exceeded
/usr/src/RPM/BUILD/srt-1.4.4/test/test_fec_rebuilding.cpp:522: Failure
Expected: (a) != (SRT_ERROR), actual: -1 vs -1
[  FAILED  ] TestFEC.ConnectionMess (2002 ms)
[ RUN      ] TestFEC.ConnectionForced
02:24:46.995933/SRT:RcvQ:w48!W:SRT.cn: processConnectRequest: rsp(REJECT): 1005 - Listener's backlog exceeded
/usr/src/RPM/BUILD/srt-1.4.4/test/test_fec_rebuilding.cpp:573: Failure
Expected: (a) != (SRT_ERROR), actual: -1 vs -1
[  FAILED  ] TestFEC.ConnectionForced (2001 ms)
[ RUN      ] TestFEC.RejectionConflict
02:24:48.997418/SRT:RcvQ:w48!W:SRT.cn: processConnectRequest: rsp(REJECT): 1005 - Listener's backlog exceeded
/usr/src/RPM/BUILD/srt-1.4.4/test/test_fec_rebuilding.cpp:620: Failure
Expected equality of these values:
  srt_getrejectreason(s)
    Which is: 5
  SRT_REJ_FILTER
    Which is: 14
02:24:48.997549/old*E:SRT.cn: srt_accept: socket @65511108 is not in listening state (forgot srt_listen?)
[  FAILED  ] TestFEC.RejectionConflict (0 ms)
[ RUN      ] TestFEC.RejectionIncompleteEmpty
02:24:48.997984/SRT:RcvQ:w48!W:SRT.cn: processConnectRequest: rsp(REJECT): 1005 - Listener's backlog exceeded
/usr/src/RPM/BUILD/srt-1.4.4/test/test_fec_rebuilding.cpp:660: Failure
Expected equality of these values:
  srt_getrejectreason(s)
    Which is: 5
  SRT_REJ_FILTER
    Which is: 14
02:24:48.998138/old*E:SRT.cn: srt_accept: socket @65511106 is not in listening state (forgot srt_listen?)
[  FAILED  ] TestFEC.RejectionIncompleteEmpty (0 ms)
[ RUN      ] TestFEC.RejectionIncomplete
02:24:48.998474/SRT:RcvQ:w48!W:SRT.cn: processConnectRequest: rsp(REJECT): 1005 - Listener's backlog exceeded
/usr/src/RPM/BUILD/srt-1.4.4/test/test_fec_rebuilding.cpp:704: Failure
Expected equality of these values:
  srt_getrejectreason(s)
    Which is: 5
  SRT_REJ_FILTER
    Which is: 14
02:24:48.998651/old*E:SRT.cn: srt_accept: socket @65511104 is not in listening state (forgot srt_listen?)
[  FAILED  ] TestFEC.RejectionIncomplete (0 ms)
[----------] 11 tests from TestFEC (12037 ms total)

[----------] 3 tests from TestFECRebuilding
[ RUN      ] TestFECRebuilding.Prepare
[       OK ] TestFECRebuilding.Prepare (0 ms)
[ RUN      ] TestFECRebuilding.NoRebuild
[       OK ] TestFECRebuilding.NoRebuild (0 ms)
[ RUN      ] TestFECRebuilding.Rebuild
[       OK ] TestFECRebuilding.Rebuild (0 ms)
[----------] 3 tests from TestFECRebuilding (0 ms total)

[----------] 13 tests from CEPoll
[ RUN      ] CEPoll.InfiniteWait
/usr/src/RPM/BUILD/srt-1.4.4/test/test_epoll.cpp:16: Failure
Expected equality of these values:
  srt_startup()
    Which is: 1
  0
[  FAILED  ] CEPoll.InfiniteWait (0 ms)
[ RUN      ] CEPoll.WaitNoSocketsInEpoll
/usr/src/RPM/BUILD/srt-1.4.4/test/test_epoll.cpp:33: Failure
Expected equality of these values:
  srt_startup()
    Which is: 1
  0
[  FAILED  ] CEPoll.WaitNoSocketsInEpoll (0 ms)
[ RUN      ] CEPoll.WaitNoSocketsInEpoll2
/usr/src/RPM/BUILD/srt-1.4.4/test/test_epoll.cpp:54: Failure
Expected equality of these values:
  srt_startup()
    Which is: 1
  0
[  FAILED  ] CEPoll.WaitNoSocketsInEpoll2 (0 ms)
[ RUN      ] CEPoll.WaitEmptyCall
/usr/src/RPM/BUILD/srt-1.4.4/test/test_epoll.cpp:70: Failure
Expected equality of these values:
  srt_startup()
    Which is: 1
  0
[  FAILED  ] CEPoll.WaitEmptyCall (0 ms)
[ RUN      ] CEPoll.UWaitEmptyCall
/usr/src/RPM/BUILD/srt-1.4.4/test/test_epoll.cpp:94: Failure
Expected equality of these values:
  srt_startup()
    Which is: 1
  0
[  FAILED  ] CEPoll.UWaitEmptyCall (0 ms)
[ RUN      ] CEPoll.WaitAllSocketsInEpollReleased
/usr/src/RPM/BUILD/srt-1.4.4/test/test_epoll.cpp:118: Failure
Expected equality of these values:
  srt_startup()
    Which is: 1
  0
[  FAILED  ] CEPoll.WaitAllSocketsInEpollReleased (0 ms)
[ RUN      ] CEPoll.WaitAllSocketsInEpollReleased2
/usr/src/RPM/BUILD/srt-1.4.4/test/test_epoll.cpp:153: Failure
Expected equality of these values:
  srt_startup()
    Which is: 1
  0
[  FAILED  ] CEPoll.WaitAllSocketsInEpollReleased2 (0 ms)
[ RUN      ] CEPoll.WrongEpoll_idOnAddUSock
/usr/src/RPM/BUILD/srt-1.4.4/test/test_epoll.cpp:183: Failure
Expected equality of these values:
  srt_startup()
    Which is: 1
  0
[  FAILED  ] CEPoll.WrongEpoll_idOnAddUSock (0 ms)
[ RUN      ] CEPoll.HandleEpollEvent
/usr/src/RPM/BUILD/srt-1.4.4/test/test_epoll.cpp:207: Failure
Expected equality of these values:
  srt_startup()
    Which is: 1
  0
[  FAILED  ] CEPoll.HandleEpollEvent (0 ms)
[ RUN      ] CEPoll.NotifyConnectionBreak
/usr/src/RPM/BUILD/srt-1.4.4/test/test_epoll.cpp:268: Failure
Expected equality of these values:
  srt_startup()
    Which is: 1
  0
[  FAILED  ] CEPoll.NotifyConnectionBreak (0 ms)
[ RUN      ] CEPoll.HandleEpollEvent2
/usr/src/RPM/BUILD/srt-1.4.4/test/test_epoll.cpp:384: Failure
Expected equality of these values:
  srt_startup()
    Which is: 1
  0
[  FAILED  ] CEPoll.HandleEpollEvent2 (0 ms)
[ RUN      ] CEPoll.HandleEpollNoEvent
/usr/src/RPM/BUILD/srt-1.4.4/test/test_epoll.cpp:446: Failure
Expected equality of these values:
  srt_startup()
    Which is: 1
  0
[  FAILED  ] CEPoll.HandleEpollNoEvent (0 ms)
[ RUN      ] CEPoll.ThreadedUpdate
/usr/src/RPM/BUILD/srt-1.4.4/test/test_epoll.cpp:497: Failure
Expected equality of these values:
  srt_startup()
    Which is: 1
  0
[  FAILED  ] CEPoll.ThreadedUpdate (0 ms)
[----------] 13 tests from CEPoll (0 ms total)

[----------] 1 test from TestEPoll
[ RUN      ] TestEPoll.SimpleAsync
/usr/src/RPM/BUILD/srt-1.4.4/test/test_epoll.cpp:754: Failure
Expected equality of these values:
  srt_startup()
    Which is: 1
  0
[  FAILED  ] TestEPoll.SimpleAsync (0 ms)
[----------] 1 test from TestEPoll (0 ms total)

[----------] 42 tests from TestEnforcedEncryption
[ RUN      ] TestEnforcedEncryption.PasswordLength
/usr/src/RPM/BUILD/srt-1.4.4/test/test_enforced_encryption.cpp:235: Failure
Expected equality of these values:
  srt_startup()
    Which is: 1
  0
[  FAILED  ] TestEnforcedEncryption.PasswordLength (0 ms)
[ RUN      ] TestEnforcedEncryption.SetGetDefault
/usr/src/RPM/BUILD/srt-1.4.4/test/test_enforced_encryption.cpp:235: Failure
Expected equality of these values:
  srt_startup()
    Which is: 1
  0
[  FAILED  ] TestEnforcedEncryption.SetGetDefault (0 ms)
[ RUN      ] TestEnforcedEncryption.CASE_A_1_NonBlocking_Enforced_On_On_Pwd_Set_Set_Match
/usr/src/RPM/BUILD/srt-1.4.4/test/test_enforced_encryption.cpp:235: Failure
Expected equality of these values:
  srt_startup()
    Which is: 1
  0
[  FAILED  ] TestEnforcedEncryption.CASE_A_1_NonBlocking_Enforced_On_On_Pwd_Set_Set_Match (0 ms)
[ RUN      ] TestEnforcedEncryption.CASE_A_1_Blocking_Enforced_On_On_Pwd_Set_Set_Match
/usr/src/RPM/BUILD/srt-1.4.4/test/test_enforced_encryption.cpp:235: Failure
Expected equality of these values:
  srt_startup()
    Which is: 1
  0
[  FAILED  ] TestEnforcedEncryption.CASE_A_1_Blocking_Enforced_On_On_Pwd_Set_Set_Match (0 ms)
[ RUN      ] TestEnforcedEncryption.CASE_A_2_NonBlocking_Enforced_On_On_Pwd_Set_Set_Mismatch
/usr/src/RPM/BUILD/srt-1.4.4/test/test_enforced_encryption.cpp:235: Failure
Expected equality of these values:
  srt_startup()
    Which is: 1
  0
[  FAILED  ] TestEnforcedEncryption.CASE_A_2_NonBlocking_Enforced_On_On_Pwd_Set_Set_Mismatch (0 ms)
[ RUN      ] TestEnforcedEncryption.CASE_A_2_Blocking_Enforced_On_On_Pwd_Set_Set_Mismatch
/usr/src/RPM/BUILD/srt-1.4.4/test/test_enforced_encryption.cpp:235: Failure
Expected equality of these values:
  srt_startup()
    Which is: 1
  0
[  FAILED  ] TestEnforcedEncryption.CASE_A_2_Blocking_Enforced_On_On_Pwd_Set_Set_Mismatch (0 ms)
[ RUN      ] TestEnforcedEncryption.CASE_A_3_NonBlocking_Enforced_On_On_Pwd_Set_None
/usr/src/RPM/BUILD/srt-1.4.4/test/test_enforced_encryption.cpp:235: Failure
Expected equality of these values:
  srt_startup()
    Which is: 1
  0
[  FAILED  ] TestEnforcedEncryption.CASE_A_3_NonBlocking_Enforced_On_On_Pwd_Set_None (0 ms)
[ RUN      ] TestEnforcedEncryption.CASE_A_3_Blocking_Enforced_On_On_Pwd_Set_None
/usr/src/RPM/BUILD/srt-1.4.4/test/test_enforced_encryption.cpp:235: Failure
Expected equality of these values:
  srt_startup()
    Which is: 1
  0
[  FAILED  ] TestEnforcedEncryption.CASE_A_3_Blocking_Enforced_On_On_Pwd_Set_None (0 ms)
[ RUN      ] TestEnforcedEncryption.CASE_A_4_NonBlocking_Enforced_On_On_Pwd_None_Set
/usr/src/RPM/BUILD/srt-1.4.4/test/test_enforced_encryption.cpp:235: Failure
Expected equality of these values:
  srt_startup()
    Which is: 1
  0
[  FAILED  ] TestEnforcedEncryption.CASE_A_4_NonBlocking_Enforced_On_On_Pwd_None_Set (0 ms)
[ RUN      ] TestEnforcedEncryption.CASE_A_4_Blocking_Enforced_On_On_Pwd_None_Set
/usr/src/RPM/BUILD/srt-1.4.4/test/test_enforced_encryption.cpp:235: Failure
Expected equality of these values:
  srt_startup()
    Which is: 1
  0
[  FAILED  ] TestEnforcedEncryption.CASE_A_4_Blocking_Enforced_On_On_Pwd_None_Set (0 ms)
[ RUN      ] TestEnforcedEncryption.CASE_A_5_NonBlocking_Enforced_On_On_Pwd_None_None
/usr/src/RPM/BUILD/srt-1.4.4/test/test_enforced_encryption.cpp:235: Failure
Expected equality of these values:
  srt_startup()
    Which is: 1
  0
[  FAILED  ] TestEnforcedEncryption.CASE_A_5_NonBlocking_Enforced_On_On_Pwd_None_None (0 ms)
[ RUN      ] TestEnforcedEncryption.CASE_A_5_Blocking_Enforced_On_On_Pwd_None_None
/usr/src/RPM/BUILD/srt-1.4.4/test/test_enforced_encryption.cpp:235: Failure
Expected equality of these values:
  srt_startup()
    Which is: 1
  0
[  FAILED  ] TestEnforcedEncryption.CASE_A_5_Blocking_Enforced_On_On_Pwd_None_None (0 ms)
[ RUN      ] TestEnforcedEncryption.CASE_B_1_NonBlocking_Enforced_On_Off_Pwd_Set_Set_Match
/usr/src/RPM/BUILD/srt-1.4.4/test/test_enforced_encryption.cpp:235: Failure
Expected equality of these values:
  srt_startup()
    Which is: 1
  0
[  FAILED  ] TestEnforcedEncryption.CASE_B_1_NonBlocking_Enforced_On_Off_Pwd_Set_Set_Match (0 ms)
[ RUN      ] TestEnforcedEncryption.CASE_B_1_Blocking_Enforced_On_Off_Pwd_Set_Set_Match
/usr/src/RPM/BUILD/srt-1.4.4/test/test_enforced_encryption.cpp:235: Failure
Expected equality of these values:
  srt_startup()
    Which is: 1
  0
[  FAILED  ] TestEnforcedEncryption.CASE_B_1_Blocking_Enforced_On_Off_Pwd_Set_Set_Match (0 ms)
[ RUN      ] TestEnforcedEncryption.CASE_B_2_NonBlocking_Enforced_On_Off_Pwd_Set_Set_Mismatch
/usr/src/RPM/BUILD/srt-1.4.4/test/test_enforced_encryption.cpp:235: Failure
Expected equality of these values:
  srt_startup()
    Which is: 1
  0
[  FAILED  ] TestEnforcedEncryption.CASE_B_2_NonBlocking_Enforced_On_Off_Pwd_Set_Set_Mismatch (0 ms)
[ RUN      ] TestEnforcedEncryption.CASE_B_2_Blocking_Enforced_On_Off_Pwd_Set_Set_Mismatch
/usr/src/RPM/BUILD/srt-1.4.4/test/test_enforced_encryption.cpp:235: Failure
Expected equality of these values:
  srt_startup()
    Which is: 1
  0
[  FAILED  ] TestEnforcedEncryption.CASE_B_2_Blocking_Enforced_On_Off_Pwd_Set_Set_Mismatch (0 ms)
[ RUN      ] TestEnforcedEncryption.CASE_B_3_NonBlocking_Enforced_On_Off_Pwd_Set_None
/usr/src/RPM/BUILD/srt-1.4.4/test/test_enforced_encryption.cpp:235: Failure
Expected equality of these values:
  srt_startup()
    Which is: 1
  0
[  FAILED  ] TestEnforcedEncryption.CASE_B_3_NonBlocking_Enforced_On_Off_Pwd_Set_None (0 ms)
[ RUN      ] TestEnforcedEncryption.CASE_B_3_Blocking_Enforced_On_Off_Pwd_Set_None
/usr/src/RPM/BUILD/srt-1.4.4/test/test_enforced_encryption.cpp:235: Failure
Expected equality of these values:
  srt_startup()
    Which is: 1
  0
[  FAILED  ] TestEnforcedEncryption.CASE_B_3_Blocking_Enforced_On_Off_Pwd_Set_None (0 ms)
[ RUN      ] TestEnforcedEncryption.CASE_B_4_NonBlocking_Enforced_On_Off_Pwd_None_Set
/usr/src/RPM/BUILD/srt-1.4.4/test/test_enforced_encryption.cpp:235: Failure
Expected equality of these values:
  srt_startup()
    Which is: 1
  0
[  FAILED  ] TestEnforcedEncryption.CASE_B_4_NonBlocking_Enforced_On_Off_Pwd_None_Set (0 ms)
[ RUN      ] TestEnforcedEncryption.CASE_B_4_Blocking_Enforced_On_Off_Pwd_None_Set
/usr/src/RPM/BUILD/srt-1.4.4/test/test_enforced_encryption.cpp:235: Failure
Expected equality of these values:
  srt_startup()
    Which is: 1
  0
[  FAILED  ] TestEnforcedEncryption.CASE_B_4_Blocking_Enforced_On_Off_Pwd_None_Set (0 ms)
[ RUN      ] TestEnforcedEncryption.CASE_B_5_NonBlocking_Enforced_On_Off_Pwd_None_None
/usr/src/RPM/BUILD/srt-1.4.4/test/test_enforced_encryption.cpp:235: Failure
Expected equality of these values:
  srt_startup()
    Which is: 1
  0
[  FAILED  ] TestEnforcedEncryption.CASE_B_5_NonBlocking_Enforced_On_Off_Pwd_None_None (0 ms)
[ RUN      ] TestEnforcedEncryption.CASE_B_5_Blocking_Enforced_On_Off_Pwd_None_None
/usr/src/RPM/BUILD/srt-1.4.4/test/test_enforced_encryption.cpp:235: Failure
Expected equality of these values:
  srt_startup()
    Which is: 1
  0
[  FAILED  ] TestEnforcedEncryption.CASE_B_5_Blocking_Enforced_On_Off_Pwd_None_None (0 ms)
[ RUN      ] TestEnforcedEncryption.CASE_C_1_NonBlocking_Enforced_Off_On_Pwd_Set_Set_Match
/usr/src/RPM/BUILD/srt-1.4.4/test/test_enforced_encryption.cpp:235: Failure
Expected equality of these values:
  srt_startup()
    Which is: 1
  0
[  FAILED  ] TestEnforcedEncryption.CASE_C_1_NonBlocking_Enforced_Off_On_Pwd_Set_Set_Match (0 ms)
[ RUN      ] TestEnforcedEncryption.CASE_C_1_Blocking_Enforced_Off_On_Pwd_Set_Set_Match
/usr/src/RPM/BUILD/srt-1.4.4/test/test_enforced_encryption.cpp:235: Failure
Expected equality of these values:
  srt_startup()
    Which is: 1
  0
[  FAILED  ] TestEnforcedEncryption.CASE_C_1_Blocking_Enforced_Off_On_Pwd_Set_Set_Match (0 ms)
[ RUN      ] TestEnforcedEncryption.CASE_C_2_NonBlocking_Enforced_Off_On_Pwd_Set_Set_Mismatch
/usr/src/RPM/BUILD/srt-1.4.4/test/test_enforced_encryption.cpp:235: Failure
Expected equality of these values:
  srt_startup()
    Which is: 1
  0
[  FAILED  ] TestEnforcedEncryption.CASE_C_2_NonBlocking_Enforced_Off_On_Pwd_Set_Set_Mismatch (0 ms)
[ RUN      ] TestEnforcedEncryption.CASE_C_2_Blocking_Enforced_Off_On_Pwd_Set_Set_Mismatch
/usr/src/RPM/BUILD/srt-1.4.4/test/test_enforced_encryption.cpp:235: Failure
Expected equality of these values:
  srt_startup()
    Which is: 1
  0
[  FAILED  ] TestEnforcedEncryption.CASE_C_2_Blocking_Enforced_Off_On_Pwd_Set_Set_Mismatch (0 ms)
[ RUN      ] TestEnforcedEncryption.CASE_C_3_NonBlocking_Enforced_Off_On_Pwd_Set_None
/usr/src/RPM/BUILD/srt-1.4.4/test/test_enforced_encryption.cpp:235: Failure
Expected equality of these values:
  srt_startup()
    Which is: 1
  0
[  FAILED  ] TestEnforcedEncryption.CASE_C_3_NonBlocking_Enforced_Off_On_Pwd_Set_None (0 ms)
[ RUN      ] TestEnforcedEncryption.CASE_C_3_Blocking_Enforced_Off_On_Pwd_Set_None
/usr/src/RPM/BUILD/srt-1.4.4/test/test_enforced_encryption.cpp:235: Failure
Expected equality of these values:
  srt_startup()
    Which is: 1
  0
[  FAILED  ] TestEnforcedEncryption.CASE_C_3_Blocking_Enforced_Off_On_Pwd_Set_None (0 ms)
[ RUN      ] TestEnforcedEncryption.CASE_C_4_NonBlocking_Enforced_Off_On_Pwd_None_Set
/usr/src/RPM/BUILD/srt-1.4.4/test/test_enforced_encryption.cpp:235: Failure
Expected equality of these values:
  srt_startup()
    Which is: 1
  0
[  FAILED  ] TestEnforcedEncryption.CASE_C_4_NonBlocking_Enforced_Off_On_Pwd_None_Set (0 ms)
[ RUN      ] TestEnforcedEncryption.CASE_C_4_Blocking_Enforced_Off_On_Pwd_None_Set
/usr/src/RPM/BUILD/srt-1.4.4/test/test_enforced_encryption.cpp:235: Failure
Expected equality of these values:
  srt_startup()
    Which is: 1
  0
[  FAILED  ] TestEnforcedEncryption.CASE_C_4_Blocking_Enforced_Off_On_Pwd_None_Set (0 ms)
[ RUN      ] TestEnforcedEncryption.CASE_C_5_NonBlocking_Enforced_Off_On_Pwd_None_None
/usr/src/RPM/BUILD/srt-1.4.4/test/test_enforced_encryption.cpp:235: Failure
Expected equality of these values:
  srt_startup()
    Which is: 1
  0
[  FAILED  ] TestEnforcedEncryption.CASE_C_5_NonBlocking_Enforced_Off_On_Pwd_None_None (0 ms)
[ RUN      ] TestEnforcedEncryption.CASE_C_5_Blocking_Enforced_Off_On_Pwd_None_None
/usr/src/RPM/BUILD/srt-1.4.4/test/test_enforced_encryption.cpp:235: Failure
Expected equality of these values:
  srt_startup()
    Which is: 1
  0
[  FAILED  ] TestEnforcedEncryption.CASE_C_5_Blocking_Enforced_Off_On_Pwd_None_None (0 ms)
[ RUN      ] TestEnforcedEncryption.CASE_D_1_NonBlocking_Enforced_Off_Off_Pwd_Set_Set_Match
/usr/src/RPM/BUILD/srt-1.4.4/test/test_enforced_encryption.cpp:235: Failure
Expected equality of these values:
  srt_startup()
    Which is: 1
  0
[  FAILED  ] TestEnforcedEncryption.CASE_D_1_NonBlocking_Enforced_Off_Off_Pwd_Set_Set_Match (0 ms)
[ RUN      ] TestEnforcedEncryption.CASE_D_1_Blocking_Enforced_Off_Off_Pwd_Set_Set_Match
/usr/src/RPM/BUILD/srt-1.4.4/test/test_enforced_encryption.cpp:235: Failure
Expected equality of these values:
  srt_startup()
    Which is: 1
  0
[  FAILED  ] TestEnforcedEncryption.CASE_D_1_Blocking_Enforced_Off_Off_Pwd_Set_Set_Match (0 ms)
[ RUN      ] TestEnforcedEncryption.CASE_D_2_NonBlocking_Enforced_Off_Off_Pwd_Set_Set_Mismatch
/usr/src/RPM/BUILD/srt-1.4.4/test/test_enforced_encryption.cpp:235: Failure
Expected equality of these values:
  srt_startup()
    Which is: 1
  0
[  FAILED  ] TestEnforcedEncryption.CASE_D_2_NonBlocking_Enforced_Off_Off_Pwd_Set_Set_Mismatch (0 ms)
[ RUN      ] TestEnforcedEncryption.CASE_D_2_Blocking_Enforced_Off_Off_Pwd_Set_Set_Mismatch
/usr/src/RPM/BUILD/srt-1.4.4/test/test_enforced_encryption.cpp:235: Failure
Expected equality of these values:
  srt_startup()
    Which is: 1
  0
[  FAILED  ] TestEnforcedEncryption.CASE_D_2_Blocking_Enforced_Off_Off_Pwd_Set_Set_Mismatch (0 ms)
[ RUN      ] TestEnforcedEncryption.CASE_D_3_NonBlocking_Enforced_Off_Off_Pwd_Set_None
/usr/src/RPM/BUILD/srt-1.4.4/test/test_enforced_encryption.cpp:235: Failure
Expected equality of these values:
  srt_startup()
    Which is: 1
  0
[  FAILED  ] TestEnforcedEncryption.CASE_D_3_NonBlocking_Enforced_Off_Off_Pwd_Set_None (0 ms)
[ RUN      ] TestEnforcedEncryption.CASE_D_3_Blocking_Enforced_Off_Off_Pwd_Set_None
/usr/src/RPM/BUILD/srt-1.4.4/test/test_enforced_encryption.cpp:235: Failure
Expected equality of these values:
  srt_startup()
    Which is: 1
  0
[  FAILED  ] TestEnforcedEncryption.CASE_D_3_Blocking_Enforced_Off_Off_Pwd_Set_None (0 ms)
[ RUN      ] TestEnforcedEncryption.CASE_D_4_NonBlocking_Enforced_Off_Off_Pwd_None_Set
/usr/src/RPM/BUILD/srt-1.4.4/test/test_enforced_encryption.cpp:235: Failure
Expected equality of these values:
  srt_startup()
    Which is: 1
  0
[  FAILED  ] TestEnforcedEncryption.CASE_D_4_NonBlocking_Enforced_Off_Off_Pwd_None_Set (0 ms)
[ RUN      ] TestEnforcedEncryption.CASE_D_4_Blocking_Enforced_Off_Off_Pwd_None_Set
/usr/src/RPM/BUILD/srt-1.4.4/test/test_enforced_encryption.cpp:235: Failure
Expected equality of these values:
  srt_startup()
    Which is: 1
  0
[  FAILED  ] TestEnforcedEncryption.CASE_D_4_Blocking_Enforced_Off_Off_Pwd_None_Set (0 ms)
[ RUN      ] TestEnforcedEncryption.CASE_D_5_NonBlocking_Enforced_Off_Off_Pwd_None_None
/usr/src/RPM/BUILD/srt-1.4.4/test/test_enforced_encryption.cpp:235: Failure
Expected equality of these values:
  srt_startup()
    Which is: 1
  0
[  FAILED  ] TestEnforcedEncryption.CASE_D_5_NonBlocking_Enforced_Off_Off_Pwd_None_None (0 ms)
[ RUN      ] TestEnforcedEncryption.CASE_D_5_Blocking_Enforced_Off_Off_Pwd_None_None
/usr/src/RPM/BUILD/srt-1.4.4/test/test_enforced_encryption.cpp:235: Failure
Expected equality of these values:
  srt_startup()
    Which is: 1
  0
[  FAILED  ] TestEnforcedEncryption.CASE_D_5_Blocking_Enforced_Off_Off_Pwd_None_None (0 ms)
[----------] 42 tests from TestEnforcedEncryption (0 ms total)

[----------] 9 tests from TestCRYSPRmethods
[ RUN      ] TestCRYSPRmethods.MethodOpen
[       OK ] TestCRYSPRmethods.MethodOpen (0 ms)
[ RUN      ] TestCRYSPRmethods.init
[       OK ] TestCRYSPRmethods.init (0 ms)
[ RUN      ] TestCRYSPRmethods.open
[       OK ] TestCRYSPRmethods.open (0 ms)
[ RUN      ] TestCRYSPRmethods.close
[       OK ] TestCRYSPRmethods.close (0 ms)
[ RUN      ] TestCRYSPRmethods.prng
[       OK ] TestCRYSPRmethods.prng (0 ms)
[ RUN      ] TestCRYSPRmethods.aes_set_key
[       OK ] TestCRYSPRmethods.aes_set_key (0 ms)
[ RUN      ] TestCRYSPRmethods.AESecb
[       OK ] TestCRYSPRmethods.AESecb (0 ms)
[ RUN      ] TestCRYSPRmethods.AESctr
[       OK ] TestCRYSPRmethods.AESctr (0 ms)
[ RUN      ] TestCRYSPRmethods.SHA1
[       OK ] TestCRYSPRmethods.SHA1 (0 ms)
[----------] 9 tests from TestCRYSPRmethods (0 ms total)

[----------] 32 tests from TestCRYSPRcypto
[ RUN      ] TestCRYSPRcypto.CtrlBlock
[       OK ] TestCRYSPRcypto.CtrlBlock (0 ms)
[ RUN      ] TestCRYSPRcypto.PBKDF2_tv1_k128
[       OK ] TestCRYSPRcypto.PBKDF2_tv1_k128 (0 ms)
[ RUN      ] TestCRYSPRcypto.PBKDF2_tv1_k192
[       OK ] TestCRYSPRcypto.PBKDF2_tv1_k192 (0 ms)
[ RUN      ] TestCRYSPRcypto.PBKDF2_tv1_k256
[       OK ] TestCRYSPRcypto.PBKDF2_tv1_k256 (0 ms)
[ RUN      ] TestCRYSPRcypto.PBKDF2_tv2_i1
[       OK ] TestCRYSPRcypto.PBKDF2_tv2_i1 (0 ms)
[ RUN      ] TestCRYSPRcypto.PBKDF2_tv2_i20
[       OK ] TestCRYSPRcypto.PBKDF2_tv2_i20 (0 ms)
[ RUN      ] TestCRYSPRcypto.PBKDF2_tv2_i4096
[       OK ] TestCRYSPRcypto.PBKDF2_tv2_i4096 (0 ms)
[ RUN      ] TestCRYSPRcypto.PBKDF2_tv3_0
[       OK ] TestCRYSPRcypto.PBKDF2_tv3_0 (0 ms)
[ RUN      ] TestCRYSPRcypto.KMWRAP_tv1_k128
[       OK ] TestCRYSPRcypto.KMWRAP_tv1_k128 (0 ms)
[ RUN      ] TestCRYSPRcypto.KMWRAP_tv1_k192
[       OK ] TestCRYSPRcypto.KMWRAP_tv1_k192 (0 ms)
[ RUN      ] TestCRYSPRcypto.KMWRAP_tv1_k256
[       OK ] TestCRYSPRcypto.KMWRAP_tv1_k256 (0 ms)
[ RUN      ] TestCRYSPRcypto.KMUNWRAP_tv1_k128
[       OK ] TestCRYSPRcypto.KMUNWRAP_tv1_k128 (0 ms)
[ RUN      ] TestCRYSPRcypto.KMUNWRAP_tv1_k192
[       OK ] TestCRYSPRcypto.KMUNWRAP_tv1_k192 (0 ms)
[ RUN      ] TestCRYSPRcypto.KMUNWRAP_tv1_k256
[       OK ] TestCRYSPRcypto.KMUNWRAP_tv1_k256 (0 ms)
[ RUN      ] TestCRYSPRcypto.EncryptAESecb_tv1_128
[       OK ] TestCRYSPRcypto.EncryptAESecb_tv1_128 (0 ms)
[ RUN      ] TestCRYSPRcypto.EncryptAESecb_tv1_192
[       OK ] TestCRYSPRcypto.EncryptAESecb_tv1_192 (0 ms)
[ RUN      ] TestCRYSPRcypto.EncryptAESecb_tv1_256
[       OK ] TestCRYSPRcypto.EncryptAESecb_tv1_256 (0 ms)
[ RUN      ] TestCRYSPRcypto.EncryptAESecb_tv2_128
[       OK ] TestCRYSPRcypto.EncryptAESecb_tv2_128 (0 ms)
[ RUN      ] TestCRYSPRcypto.EncryptAESecb_tv2_192
[       OK ] TestCRYSPRcypto.EncryptAESecb_tv2_192 (0 ms)
[ RUN      ] TestCRYSPRcypto.EncryptAESecb_tv2_256
[       OK ] TestCRYSPRcypto.EncryptAESecb_tv2_256 (0 ms)
[ RUN      ] TestCRYSPRcypto.DecryptAESecb_tv1_128
[       OK ] TestCRYSPRcypto.DecryptAESecb_tv1_128 (0 ms)
[ RUN      ] TestCRYSPRcypto.DecryptAESecb_tv1_192
[       OK ] TestCRYSPRcypto.DecryptAESecb_tv1_192 (0 ms)
[ RUN      ] TestCRYSPRcypto.DecryptAESecb_tv1_256
[       OK ] TestCRYSPRcypto.DecryptAESecb_tv1_256 (0 ms)
[ RUN      ] TestCRYSPRcypto.DecryptAESecb_tv2_128
[       OK ] TestCRYSPRcypto.DecryptAESecb_tv2_128 (0 ms)
[ RUN      ] TestCRYSPRcypto.DecryptAESecb_tv2_192
[       OK ] TestCRYSPRcypto.DecryptAESecb_tv2_192 (0 ms)
[ RUN      ] TestCRYSPRcypto.DecryptAESecb_tv2_256
[       OK ] TestCRYSPRcypto.DecryptAESecb_tv2_256 (0 ms)
[ RUN      ] TestCRYSPRcypto.EncryptAESctr_tv1_128
[       OK ] TestCRYSPRcypto.EncryptAESctr_tv1_128 (0 ms)
[ RUN      ] TestCRYSPRcypto.EncryptAESctr_tv1_192
[       OK ] TestCRYSPRcypto.EncryptAESctr_tv1_192 (0 ms)
[ RUN      ] TestCRYSPRcypto.EncryptAESctr_tv1_256
[       OK ] TestCRYSPRcypto.EncryptAESctr_tv1_256 (0 ms)
[ RUN      ] TestCRYSPRcypto.DecryptAESctr_tv1_128
[       OK ] TestCRYSPRcypto.DecryptAESctr_tv1_128 (0 ms)
[ RUN      ] TestCRYSPRcypto.DecryptAESctr_tv1_192
[       OK ] TestCRYSPRcypto.DecryptAESctr_tv1_192 (0 ms)
[ RUN      ] TestCRYSPRcypto.DecryptAESctr_tv1_256
[       OK ] TestCRYSPRcypto.DecryptAESctr_tv1_256 (0 ms)
[----------] 32 tests from TestCRYSPRcypto (2 ms total)

[----------] 1 test from TestConnection
[ RUN      ] TestConnection.Multiple
/usr/src/RPM/BUILD/srt-1.4.4/test/test_many_connections.cpp:48: Failure
Expected equality of these values:
  srt_startup()
    Which is: 1
  0
[  FAILED  ] TestConnection.Multiple (0 ms)
[----------] 1 test from TestConnection (0 ms total)

[----------] 2 tests from TestConnectionTimeout
[ RUN      ] TestConnectionTimeout.Nonblocking
/usr/src/RPM/BUILD/srt-1.4.4/test/test_connection_timeout.cpp:37: Failure
Expected equality of these values:
  srt_startup()
    Which is: 1
  0
/usr/src/RPM/BUILD/srt-1.4.4/test/test_connection_timeout.cpp:67: Failure
Expected: (close(m_udp_sock)) != (-1), actual: -1 vs -1
[  FAILED  ] TestConnectionTimeout.Nonblocking (0 ms)
[ RUN      ] TestConnectionTimeout.BlockingLoop
/usr/src/RPM/BUILD/srt-1.4.4/test/test_connection_timeout.cpp:37: Failure
Expected equality of these values:
  srt_startup()
    Which is: 1
  0
/usr/src/RPM/BUILD/srt-1.4.4/test/test_connection_timeout.cpp:67: Failure
Expected: (close(m_udp_sock)) != (-1), actual: -1 vs -1
[  FAILED  ] TestConnectionTimeout.BlockingLoop (0 ms)
[----------] 2 tests from TestConnectionTimeout (0 ms total)

[----------] 3 tests from CIPAddress
[ RUN      ] CIPAddress.IPv4_pton
[       OK ] CIPAddress.IPv4_pton (0 ms)
[ RUN      ] CIPAddress.IPv6_pton
[       OK ] CIPAddress.IPv6_pton (0 ms)
[ RUN      ] CIPAddress.IPv4_in_IPv6_pton
[       OK ] CIPAddress.IPv4_in_IPv6_pton (0 ms)
[----------] 3 tests from CIPAddress (0 ms total)

[----------] 5 tests from CRcvBuffer
[ RUN      ] CRcvBuffer.Create
[       OK ] CRcvBuffer.Create (0 ms)
[ RUN      ] CRcvBuffer.FullBuffer
[       OK ] CRcvBuffer.FullBuffer (0 ms)
[ RUN      ] CRcvBuffer.ReadDataIPE
Expecting IPE message: 
02:24:49.002488/old*E:SRT.br:  IPE readBuffer on null packet pointer
[       OK ] CRcvBuffer.ReadDataIPE (0 ms)
[ RUN      ] CRcvBuffer.ReadData
[       OK ] CRcvBuffer.ReadData (0 ms)
[ RUN      ] CRcvBuffer.AddData
[       OK ] CRcvBuffer.AddData (0 ms)
[----------] 5 tests from CRcvBuffer (0 ms total)

[----------] Global test environment tear-down
[==========] 232 tests from 29 test suites ran. (30403 ms total)
[  PASSED  ] 164 tests.
[  FAILED  ] 68 tests, listed below:
[  FAILED  ] TestFEC.Connection
[  FAILED  ] TestFEC.ConnectionReorder
[  FAILED  ] TestFEC.ConnectionFull1
[  FAILED  ] TestFEC.ConnectionFull2
[  FAILED  ] TestFEC.ConnectionMess
[  FAILED  ] TestFEC.ConnectionForced
[  FAILED  ] TestFEC.RejectionConflict
[  FAILED  ] TestFEC.RejectionIncompleteEmpty
[  FAILED  ] TestFEC.RejectionIncomplete
[  FAILED  ] CEPoll.InfiniteWait
[  FAILED  ] CEPoll.WaitNoSocketsInEpoll
[  FAILED  ] CEPoll.WaitNoSocketsInEpoll2
[  FAILED  ] CEPoll.WaitEmptyCall
[  FAILED  ] CEPoll.UWaitEmptyCall
[  FAILED  ] CEPoll.WaitAllSocketsInEpollReleased
[  FAILED  ] CEPoll.WaitAllSocketsInEpollReleased2
[  FAILED  ] CEPoll.WrongEpoll_idOnAddUSock
[  FAILED  ] CEPoll.HandleEpollEvent
[  FAILED  ] CEPoll.NotifyConnectionBreak
[  FAILED  ] CEPoll.HandleEpollEvent2
[  FAILED  ] CEPoll.HandleEpollNoEvent
[  FAILED  ] CEPoll.ThreadedUpdate
[  FAILED  ] TestEPoll.SimpleAsync
[  FAILED  ] TestEnforcedEncryption.PasswordLength
[  FAILED  ] TestEnforcedEncryption.SetGetDefault
[  FAILED  ] TestEnforcedEncryption.CASE_A_1_NonBlocking_Enforced_On_On_Pwd_Set_Set_Match
[  FAILED  ] TestEnforcedEncryption.CASE_A_1_Blocking_Enforced_On_On_Pwd_Set_Set_Match
[  FAILED  ] TestEnforcedEncryption.CASE_A_2_NonBlocking_Enforced_On_On_Pwd_Set_Set_Mismatch
[  FAILED  ] TestEnforcedEncryption.CASE_A_2_Blocking_Enforced_On_On_Pwd_Set_Set_Mismatch
[  FAILED  ] TestEnforcedEncryption.CASE_A_3_NonBlocking_Enforced_On_On_Pwd_Set_None
[  FAILED  ] TestEnforcedEncryption.CASE_A_3_Blocking_Enforced_On_On_Pwd_Set_None
[  FAILED  ] TestEnforcedEncryption.CASE_A_4_NonBlocking_Enforced_On_On_Pwd_None_Set
[  FAILED  ] TestEnforcedEncryption.CASE_A_4_Blocking_Enforced_On_On_Pwd_None_Set
[  FAILED  ] TestEnforcedEncryption.CASE_A_5_NonBlocking_Enforced_On_On_Pwd_None_None
[  FAILED  ] TestEnforcedEncryption.CASE_A_5_Blocking_Enforced_On_On_Pwd_None_None
[  FAILED  ] TestEnforcedEncryption.CASE_B_1_NonBlocking_Enforced_On_Off_Pwd_Set_Set_Match
[  FAILED  ] TestEnforcedEncryption.CASE_B_1_Blocking_Enforced_On_Off_Pwd_Set_Set_Match
[  FAILED  ] TestEnforcedEncryption.CASE_B_2_NonBlocking_Enforced_On_Off_Pwd_Set_Set_Mismatch
[  FAILED  ] TestEnforcedEncryption.CASE_B_2_Blocking_Enforced_On_Off_Pwd_Set_Set_Mismatch
[  FAILED  ] TestEnforcedEncryption.CASE_B_3_NonBlocking_Enforced_On_Off_Pwd_Set_None
[  FAILED  ] TestEnforcedEncryption.CASE_B_3_Blocking_Enforced_On_Off_Pwd_Set_None
[  FAILED  ] TestEnforcedEncryption.CASE_B_4_NonBlocking_Enforced_On_Off_Pwd_None_Set
[  FAILED  ] TestEnforcedEncryption.CASE_B_4_Blocking_Enforced_On_Off_Pwd_None_Set
[  FAILED  ] TestEnforcedEncryption.CASE_B_5_NonBlocking_Enforced_On_Off_Pwd_None_None
[  FAILED  ] TestEnforcedEncryption.CASE_B_5_Blocking_Enforced_On_Off_Pwd_None_None
[  FAILED  ] TestEnforcedEncryption.CASE_C_1_NonBlocking_Enforced_Off_On_Pwd_Set_Set_Match
[  FAILED  ] TestEnforcedEncryption.CASE_C_1_Blocking_Enforced_Off_On_Pwd_Set_Set_Match
[  FAILED  ] TestEnforcedEncryption.CASE_C_2_NonBlocking_Enforced_Off_On_Pwd_Set_Set_Mismatch
[  FAILED  ] TestEnforcedEncryption.CASE_C_2_Blocking_Enforced_Off_On_Pwd_Set_Set_Mismatch
[  FAILED  ] TestEnforcedEncryption.CASE_C_3_NonBlocking_Enforced_Off_On_Pwd_Set_None
[  FAILED  ] TestEnforcedEncryption.CASE_C_3_Blocking_Enforced_Off_On_Pwd_Set_None
[  FAILED  ] TestEnforcedEncryption.CASE_C_4_NonBlocking_Enforced_Off_On_Pwd_None_Set
[  FAILED  ] TestEnforcedEncryption.CASE_C_4_Blocking_Enforced_Off_On_Pwd_None_Set
[  FAILED  ] TestEnforcedEncryption.CASE_C_5_NonBlocking_Enforced_Off_On_Pwd_None_None
[  FAILED  ] TestEnforcedEncryption.CASE_C_5_Blocking_Enforced_Off_On_Pwd_None_None
[  FAILED  ] TestEnforcedEncryption.CASE_D_1_NonBlocking_Enforced_Off_Off_Pwd_Set_Set_Match
[  FAILED  ] TestEnforcedEncryption.CASE_D_1_Blocking_Enforced_Off_Off_Pwd_Set_Set_Match
[  FAILED  ] TestEnforcedEncryption.CASE_D_2_NonBlocking_Enforced_Off_Off_Pwd_Set_Set_Mismatch
[  FAILED  ] TestEnforcedEncryption.CASE_D_2_Blocking_Enforced_Off_Off_Pwd_Set_Set_Mismatch
[  FAILED  ] TestEnforcedEncryption.CASE_D_3_NonBlocking_Enforced_Off_Off_Pwd_Set_None
[  FAILED  ] TestEnforcedEncryption.CASE_D_3_Blocking_Enforced_Off_Off_Pwd_Set_None
[  FAILED  ] TestEnforcedEncryption.CASE_D_4_NonBlocking_Enforced_Off_Off_Pwd_None_Set
[  FAILED  ] TestEnforcedEncryption.CASE_D_4_Blocking_Enforced_Off_Off_Pwd_None_Set
[  FAILED  ] TestEnforcedEncryption.CASE_D_5_NonBlocking_Enforced_Off_Off_Pwd_None_None
[  FAILED  ] TestEnforcedEncryption.CASE_D_5_Blocking_Enforced_Off_Off_Pwd_None_None
[  FAILED  ] TestConnection.Multiple
[  FAILED  ] TestConnectionTimeout.Nonblocking
[  FAILED  ] TestConnectionTimeout.BlockingLoop

68 FAILED TESTS
  YOU HAVE 6 DISABLED TESTS

error: Bad exit status from /usr/src/tmp/rpm-tmp.89158 (%check)


RPM build errors:
    Bad exit status from /usr/src/tmp/rpm-tmp.89158 (%check)
Command exited with non-zero status 1
211.18user 18.54system 0:51.64elapsed 444%CPU (0avgtext+0avgdata 401104maxresident)k
0inputs+0outputs (0major+5890108minor)pagefaults 0swaps
hsh-rebuild: rebuild of `srt-1.4.4-alt1.src.rpm' failed.
Command exited with non-zero status 1
214.84user 20.67system 0:56.78elapsed 414%CPU (0avgtext+0avgdata 401104maxresident)k
0inputs+0outputs (30610major+6140471minor)pagefaults 0swaps