<86>Oct 25 00:05:41 userdel[692927]: delete user 'rooter'
<86>Oct 25 00:05:41 userdel[692927]: removed group 'rooter' owned by 'rooter'
<86>Oct 25 00:05:41 userdel[692927]: removed shadow group 'rooter' owned by 'rooter'
<86>Oct 25 00:05:41 groupadd[692962]: group added to /etc/group: name=rooter, GID=909
<86>Oct 25 00:05:41 groupadd[692962]: group added to /etc/gshadow: name=rooter
<86>Oct 25 00:05:41 groupadd[692962]: new group: name=rooter, GID=909
<86>Oct 25 00:05:41 useradd[692999]: new user: name=rooter, UID=909, GID=909, home=/root, shell=/bin/bash
<86>Oct 25 00:05:41 userdel[693048]: delete user 'builder'
<86>Oct 25 00:05:41 userdel[693048]: removed group 'builder' owned by 'builder'
<86>Oct 25 00:05:41 userdel[693048]: removed shadow group 'builder' owned by 'builder'
<86>Oct 25 00:05:41 groupadd[693101]: group added to /etc/group: name=builder, GID=910
<86>Oct 25 00:05:41 groupadd[693101]: group added to /etc/gshadow: name=builder
<86>Oct 25 00:05:41 groupadd[693101]: new group: name=builder, GID=910
<86>Oct 25 00:05:41 useradd[693144]: new user: name=builder, UID=910, GID=910, home=/usr/src, shell=/bin/bash
<13>Oct 25 00:05:42 rpmi: rpm-macros-meson-0.59.1-alt1 sisyphus+283305.100.1.1 1629309068 installed
<13>Oct 25 00:05:42 rpmi: ninja-build-1.10.2-alt1 sisyphus+278497.100.1.2 1626232127 installed
<13>Oct 25 00:05:42 rpmi: libgdbm-1.8.3-alt10 sisyphus+278100.1600.1.1 1626058413 installed
<13>Oct 25 00:05:42 rpmi: libexpat-2.2.10-alt1 sisyphus+276608.100.1.2 1625153355 installed
<13>Oct 25 00:05:42 rpmi: libp11-kit-0.23.15-alt2 sisyphus+287552.300.2.1 1634541413 installed
<13>Oct 25 00:05:42 rpmi: libtasn1-4.17.0-alt2 sisyphus+285706.100.1.1 1632328563 installed
<13>Oct 25 00:05:42 rpmi: rpm-macros-alternatives-0.5.1-alt1 sisyphus+278157.100.2.1 1626055790 installed
<13>Oct 25 00:05:42 rpmi: alternatives-0.5.1-alt1 sisyphus+278157.100.2.1 1626055790 installed
<13>Oct 25 00:05:42 rpmi: ca-certificates-2021.10.06-alt1 sisyphus+286526.200.1.1 1633528578 installed
<13>Oct 25 00:05:42 rpmi: ca-trust-0.1.2-alt1 sisyphus+233348.100.1.1 1561653823 installed
<13>Oct 25 00:05:42 rpmi: p11-kit-trust-0.23.15-alt2 sisyphus+287552.300.2.1 1634541413 installed
<13>Oct 25 00:05:42 rpmi: libcrypto1.1-1.1.1l-alt2 sisyphus+287339.100.1.1 1634383589 installed
<13>Oct 25 00:05:42 rpmi: libssl1.1-1.1.1l-alt2 sisyphus+287339.100.1.1 1634383589 installed
<13>Oct 25 00:05:43 rpmi: python3-3.9.7-alt3 sisyphus+287552.400.2.1 1634542953 installed
<13>Oct 25 00:05:43 rpmi: python3-base-3.9.7-alt3 sisyphus+287552.400.2.1 1634542953 installed
<13>Oct 25 00:05:43 rpmi: python3-module-typing_extensions-3.10.0.2-alt1 sisyphus+284722.240.2.1 1631022103 installed
<13>Oct 25 00:05:43 rpmi: meson-0.59.1-alt1 sisyphus+283305.100.1.1 1629309068 installed
Building target platforms: x86_64
Building for target x86_64
Wrote: /usr/src/in/nosrpm/qboot-0.0-alt1.git96842c5a6.nosrc.rpm (w1.gzdio)
Installing qboot-0.0-alt1.git96842c5a6.src.rpm
Building target platforms: x86_64
Building for target x86_64
Executing(%prep): /bin/sh -e /usr/src/tmp/rpm-tmp.10187
+ umask 022
+ /bin/mkdir -p /usr/src/RPM/BUILD
+ cd /usr/src/RPM/BUILD
+ cd /usr/src/RPM/BUILD
+ rm -rf qboot-0.0
+ echo 'Source #0 (qboot-0.0.tar):'
Source #0 (qboot-0.0.tar):
+ /bin/tar -xf /usr/src/RPM/SOURCES/qboot-0.0.tar
+ cd qboot-0.0
+ /bin/chmod -c -Rf u+rwX,go-w .
+ exit 0
Executing(%build): /bin/sh -e /usr/src/tmp/rpm-tmp.10187
+ umask 022
+ /bin/mkdir -p /usr/src/RPM/BUILD
+ cd /usr/src/RPM/BUILD
+ cd qboot-0.0
+ mkdir -p noarch-alt-linux
+ CFLAGS='-pipe -frecord-gcc-switches -Wall -g -O2 -flto=auto'
+ export CFLAGS
+ CXXFLAGS='-pipe -frecord-gcc-switches -Wall -g -O2 -flto=auto'
+ export CXXFLAGS
+ FFLAGS='-pipe -frecord-gcc-switches -Wall -g -O2 -flto=auto'
+ export FFLAGS
+ FCFLAGS='-pipe -frecord-gcc-switches -Wall -g -O2 -flto=auto'
+ export FCFLAGS
+ /usr/bin/meson . noarch-alt-linux --buildtype=plain --prefix=/usr --bindir=/usr/bin --sbindir=/usr/sbin --libexecdir=/usr/lib --libdir=/usr/lib64 --localstatedir=/var --sharedstatedir=/var/lib --includedir=/usr/include --datadir=/usr/share --sysconfdir=/etc --mandir=/usr/share/man --infodir=/usr/share/info --localedir=/usr/share/locale --wrap-mode=nodownload
The Meson build system
Version: 0.59.1
Source dir: /usr/src/RPM/BUILD/qboot-0.0
Build dir: /usr/src/RPM/BUILD/qboot-0.0/noarch-alt-linux
Build type: native build
Project name: qboot
Project version: undefined
C compiler for the host machine: cc (gcc 11.2.1 "x86_64-alt-linux-gcc (GCC) 11.2.1 20210911 (ALT Sisyphus 11.2.1-alt1)")
C linker for the host machine: cc ld.bfd 2.37.20210928
Host machine cpu family: x86_64
Host machine cpu: x86_64
Program objcopy found: YES (/usr/bin/objcopy)
Compiler for C supports link arguments -Wl,--build-id=none: YES 
Build targets in project: 2

Found ninja-1.10.2 at /usr/bin/ninja
+ ninja-build -j32 -C noarch-alt-linux
ninja: Entering directory `noarch-alt-linux'
[1/17] Compiling C object bios.bin.elf.p/cstart.S.o
[2/17] Compiling C object bios.bin.elf.p/entry.S.o
[3/17] Compiling C object bios.bin.elf.p/code16.c.o
[4/17] Compiling C object bios.bin.elf.p/malloc.c.o
[5/17] Compiling C object bios.bin.elf.p/linuxboot.c.o
[6/17] Compiling C object bios.bin.elf.p/code32seg.c.o
[7/17] Compiling C object bios.bin.elf.p/main.c.o
[8/17] Compiling C object bios.bin.elf.p/hwsetup.c.o
[9/17] Compiling C object bios.bin.elf.p/tables.c.o
[10/17] Compiling C object bios.bin.elf.p/mptable.c.o
[11/17] Compiling C object bios.bin.elf.p/smbios.c.o
[12/17] Compiling C object bios.bin.elf.p/fw_cfg.c.o
[13/17] Compiling C object bios.bin.elf.p/string.c.o
[14/17] Compiling C object bios.bin.elf.p/printf.c.o
[15/17] Compiling C object bios.bin.elf.p/pci.c.o
[16/17] Linking target bios.bin.elf
FAILED: bios.bin.elf 
cc  -o bios.bin.elf bios.bin.elf.p/code16.c.o bios.bin.elf.p/code32seg.c.o bios.bin.elf.p/cstart.S.o bios.bin.elf.p/entry.S.o bios.bin.elf.p/fw_cfg.c.o bios.bin.elf.p/hwsetup.c.o bios.bin.elf.p/linuxboot.c.o bios.bin.elf.p/main.c.o bios.bin.elf.p/malloc.c.o bios.bin.elf.p/mptable.c.o bios.bin.elf.p/pci.c.o bios.bin.elf.p/printf.c.o bios.bin.elf.p/string.c.o bios.bin.elf.p/smbios.c.o bios.bin.elf.p/tables.c.o -Wl,--as-needed -Wl,--no-undefined -pipe -frecord-gcc-switches -Wall -g -O2 -flto=auto -nostdlib -m32 -Wl,--build-id=none -Wl,-T/usr/src/RPM/BUILD/qboot-0.0/flat.lds
../main.c: In function ‘main’:
lto1: warning: writing 4 bytes into a region of size 0 [-Wstringop-overflow=]
lto1: warning: writing 4 bytes into a region of size 0 [-Wstringop-overflow=]
In function ‘memset’,
    inlined from ‘setup_mptable’ at ../mptable.c:65:2,
    inlined from ‘main’ at ../main.c:101:2:
../include/string.h:20:16: warning: ‘__builtin_memset’ writing 8 bytes into a region of size 0 overflows the destination [-Wstringop-overflow=]
   20 |         return __builtin_memset(s, c, n);
      |                ^
In function ‘memset’,
    inlined from ‘setup_mptable’ at ../mptable.c:76:2,
    inlined from ‘main’ at ../main.c:101:2:
../include/string.h:20:16: warning: ‘__builtin_memset’ writing 40 bytes into a region of size 0 overflows the destination [-Wstringop-overflow=]
   20 |         return __builtin_memset(s, c, n);
      |                ^
In function ‘memcpy’,
    inlined from ‘setup_mptable’ at ../mptable.c:79:2,
    inlined from ‘main’ at ../main.c:101:2:
../include/string.h:25:16: warning: ‘__builtin_memcpy’ writing 8 bytes into a region of size 0 overflows the destination [-Wstringop-overflow=]
   25 |         return __builtin_memcpy(dest, src, n);
      |                ^
In function ‘memcpy’,
    inlined from ‘setup_mptable’ at ../mptable.c:80:2,
    inlined from ‘main’ at ../main.c:101:2:
../include/string.h:25:16: warning: ‘__builtin_memcpy’ writing 12 bytes into a region of size 0 overflows the destination [-Wstringop-overflow=]
   25 |         return __builtin_memcpy(dest, src, n);
      |                ^
In function ‘memset’,
    inlined from ‘setup_mptable’ at ../mptable.c:92:3,
    inlined from ‘main’ at ../main.c:101:2:
../include/string.h:20:16: warning: ‘__builtin_memset’ writing 20 bytes into a region of size 0 overflows the destination [-Wstringop-overflow=]
   20 |         return __builtin_memset(s, c, n);
      |                ^
../code16.c: Assembler messages:
../code16.c:37: Error: redundant addr32 prefix
../code16.c:27: Error: redundant addr32 prefix
../code16.c:18: Error: redundant addr32 prefix
make: *** [/usr/src/tmp/ccaHgxjE.mk:2: /usr/src/tmp/ccGM1kq6.ltrans0.ltrans.o] Error 1
lto-wrapper: fatal error: make returned 2 exit status
compilation terminated.
ld: error: lto-wrapper failed
collect2: error: ld returned 1 exit status
ninja: build stopped: subcommand failed.
error: Bad exit status from /usr/src/tmp/rpm-tmp.10187 (%build)


RPM build errors:
    Bad exit status from /usr/src/tmp/rpm-tmp.10187 (%build)
Command exited with non-zero status 1
0.69user 0.34system 0:00.69elapsed 149%CPU (0avgtext+0avgdata 33568maxresident)k
0inputs+0outputs (0major+103019minor)pagefaults 0swaps
hsh-rebuild: rebuild of `qboot-0.0-alt1.git96842c5a6.src.rpm' failed.
Command exited with non-zero status 1
4.08user 2.69system 0:05.70elapsed 118%CPU (0avgtext+0avgdata 105060maxresident)k
2592inputs+0outputs (45954major+337155minor)pagefaults 0swaps