<86>Sep 24 03:52:42 userdel[1270235]: delete user 'rooter'
<86>Sep 24 03:52:42 userdel[1270235]: removed group 'rooter' owned by 'rooter'
<86>Sep 24 03:52:42 groupadd[1270240]: group added to /etc/group: name=rooter, GID=651
<86>Sep 24 03:52:42 groupadd[1270240]: group added to /etc/gshadow: name=rooter
<86>Sep 24 03:52:42 groupadd[1270240]: new group: name=rooter, GID=651
<86>Sep 24 03:52:42 useradd[1270244]: new user: name=rooter, UID=651, GID=651, home=/root, shell=/bin/bash
<86>Sep 24 03:52:42 userdel[1270250]: delete user 'builder'
<86>Sep 24 03:52:42 userdel[1270250]: removed group 'builder' owned by 'builder'
<86>Sep 24 03:52:42 userdel[1270250]: removed shadow group 'builder' owned by 'builder'
<86>Sep 24 03:52:42 groupadd[1270255]: group added to /etc/group: name=builder, GID=652
<86>Sep 24 03:52:42 groupadd[1270255]: group added to /etc/gshadow: name=builder
<86>Sep 24 03:52:42 groupadd[1270255]: new group: name=builder, GID=652
<86>Sep 24 03:52:42 useradd[1270259]: new user: name=builder, UID=652, GID=652, home=/usr/src, shell=/bin/bash
/usr/src/in/srpm/gle-4.2.5-alt2.src.rpm: The use of such a license name is ambiguous: GPL
<13>Sep 24 03:52:44 rpmi: xorg-proto-devel-2021.5-alt1 sisyphus+285490.100.1.1 1632124129 installed
<13>Sep 24 03:52:44 rpmi: libjpeg-2:2.0.6-alt4 sisyphus+284191.100.1.1 1630330711 installed
<13>Sep 24 03:52:44 rpmi: libICE-1.0.10-alt1 sisyphus+278827.100.1.1 1626220279 installed
<13>Sep 24 03:52:44 rpmi: libglvnd-7:1.3.3-alt1 sisyphus+279467.100.1.1 1626548117 installed
<13>Sep 24 03:52:44 rpmi: libpng16-1.6.37-alt1 sisyphus+275734.100.2.1 1624788826 installed
<13>Sep 24 03:52:44 rpmi: libexpat-2.2.10-alt1 sisyphus+276608.100.1.2 1625153355 installed
<13>Sep 24 03:52:44 rpmi: libSM-1.2.3-alt1 sisyphus+278820.100.1.1 1626219264 installed
<13>Sep 24 03:52:44 rpmi: zlib-devel-1.2.11-alt2 sisyphus+283721.100.1.1 1629847002 installed
<13>Sep 24 03:52:45 rpmi: libpng-devel-1.6.37-alt1 sisyphus+275734.100.2.1 1624788826 installed
<13>Sep 24 03:52:45 rpmi: libICE-devel-1.0.10-alt1 sisyphus+278827.100.1.1 1626220279 installed
<13>Sep 24 03:52:45 rpmi: libSM-devel-1.2.3-alt1 sisyphus+278820.100.1.1 1626219264 installed
<13>Sep 24 03:52:45 rpmi: qt4-common-4.8.7-alt24 sisyphus+283856.100.1.1 1629987286 installed
<13>Sep 24 03:52:45 rpmi: libqt4-core-4.8.7-alt24 sisyphus+283856.100.1.1 1629987286 installed
<13>Sep 24 03:52:45 rpmi: libqt4-sql-4.8.7-alt24 sisyphus+283856.100.1.1 1629987286 installed
<13>Sep 24 03:52:45 rpmi: libXau-1.0.9-alt1 sisyphus+278247.100.1.1 1626080736 installed
<13>Sep 24 03:52:45 rpmi: libwayland-server-1.19.0-alt1 sisyphus+279023.100.1.1 1626353895 installed
<13>Sep 24 03:52:45 rpmi: libicu69-1:6.9.1-alt2 sisyphus+277632.100.1.1 1625726150 installed
<13>Sep 24 03:52:45 rpmi: libgraphite2-1.3.14-alt2.1 sisyphus+279571.100.1.2 1626605111 installed
<13>Sep 24 03:52:45 rpmi: libgraphite2-devel-1.3.14-alt2.1 sisyphus+279571.100.1.2 1626605111 installed
<13>Sep 24 03:52:45 rpmi: icu-utils-1:6.9.1-alt2 sisyphus+277632.100.1.1 1625726150 installed
<13>Sep 24 03:52:46 rpmi: libicu-devel-1:6.9.1-alt2 sisyphus+277632.100.1.1 1625726150 installed
<13>Sep 24 03:52:46 rpmi: libXau-devel-1.0.9-alt1 sisyphus+278247.100.1.1 1626080736 installed
<13>Sep 24 03:52:46 rpmi: libqt4-clucene-4.8.7-alt24 sisyphus+283856.100.1.1 1629987286 installed
<13>Sep 24 03:52:46 rpmi: libqt4-xml-4.8.7-alt24 sisyphus+283856.100.1.1 1629987286 installed
<13>Sep 24 03:52:46 rpmi: libqt4-test-4.8.7-alt24 sisyphus+283856.100.1.1 1629987286 installed
<13>Sep 24 03:52:46 rpmi: rpm-macros-qt4-4.8.7-alt24 sisyphus+283856.100.1.1 1629987286 installed
<13>Sep 24 03:52:46 rpmi: libOpenGL-7:1.3.3-alt1 sisyphus+279467.100.1.1 1626548117 installed
<13>Sep 24 03:52:46 rpmi: libGLES-7:1.3.3-alt1 sisyphus+279467.100.1.1 1626548117 installed
<13>Sep 24 03:52:46 rpmi: libsqlite3-3.36.0-alt1 sisyphus+285498.100.1.1 1632132963 installed
<13>Sep 24 03:52:46 rpmi: libqt4-sql-sqlite-4.8.7-alt24 sisyphus+283856.100.1.1 1629987286 installed
<13>Sep 24 03:52:46 rpmi: libwebp7-1.2.1-alt1 sisyphus+282658.100.1.1 1628955702 installed
<13>Sep 24 03:52:46 rpmi: libncurses-6.2.20210123-alt2 sisyphus+283886.200.2.1 1630022599 installed
<13>Sep 24 03:52:46 rpmi: libtinfo-devel-6.2.20210123-alt2 sisyphus+283886.200.2.1 1630022599 installed
<13>Sep 24 03:52:46 rpmi: libltdl7-2.4.6-alt4 sisyphus+284398.100.1.1 1630577601 installed
<13>Sep 24 03:52:46 rpmi: libunixODBC2-2.3.7-alt1 sisyphus+275749.100.1.1 1624752988 installed
<13>Sep 24 03:52:46 rpmi: libunixODBC-devel-compat-2.3.7-alt1 sisyphus+275749.100.1.1 1624752988 installed
<13>Sep 24 03:52:46 rpmi: libunixODBC-devel-2.3.7-alt1 sisyphus+275749.100.1.1 1624752988 installed
<13>Sep 24 03:52:46 rpmi: liblcms2-2.12-alt1 sisyphus+279091.100.1.1 1626376955 installed
<13>Sep 24 03:52:46 rpmi: libmng-2.0.3-alt2 sisyphus+275730.100.1.1 1624750901 installed
<13>Sep 24 03:52:46 rpmi: libjbig-2.1-alt1 sisyphus+276068.100.1.1 1624815400 installed
<13>Sep 24 03:52:46 rpmi: libtiff5-4.3.0-alt1 sisyphus+285311.100.1.1 1631733776 installed
<13>Sep 24 03:52:46 rpmi: liblz4-1:1.9.3-alt1 sisyphus+278100.4000.1.1 1626059441 installed
<13>Sep 24 03:52:46 rpmi: libsystemd-1:249.4-alt2 sisyphus+284628.100.1.1 1630859802 installed
<13>Sep 24 03:52:46 rpmi: libdbus-1.12.20-alt1 sisyphus+281278.100.1.1 1627484261 installed
<13>Sep 24 03:52:46 rpmi: libqt4-dbus-4.8.7-alt24 sisyphus+283856.100.1.1 1629987286 installed
<13>Sep 24 03:52:46 rpmi: libqt4-script-4.8.7-alt24 sisyphus+283856.100.1.1 1629987286 installed
<13>Sep 24 03:52:46 rpmi: libdbus-devel-1.12.20-alt1 sisyphus+281278.100.1.1 1627484261 installed
<13>Sep 24 03:52:46 rpmi: libpixman-3:0.40.0-alt2 sisyphus+281167.100.1.1 1627444504 installed
<13>Sep 24 03:52:46 rpmi: libxshmfence-1.3-alt1 sisyphus+278248.100.1.1 1626080762 installed
<13>Sep 24 03:52:46 rpmi: libX11-locales-3:1.7.2-alt1 sisyphus+279629.100.1.1 1626637383 installed
<13>Sep 24 03:52:46 rpmi: libXdmcp-1.1.3-alt1 sisyphus+278816.100.1.1 1626219231 installed
<13>Sep 24 03:52:46 rpmi: libxcb-1.14-alt1 sisyphus+277968.100.1.3 1625952322 installed
<13>Sep 24 03:52:46 rpmi: libX11-3:1.7.2-alt1 sisyphus+279629.100.1.1 1626637383 installed
<13>Sep 24 03:52:46 rpmi: libXext-1.3.4-alt1 sisyphus+278817.100.1.3 1626262596 installed
<13>Sep 24 03:52:46 rpmi: libXrender-0.9.10-alt1 sisyphus+278480.100.1.2 1626227740 installed
<13>Sep 24 03:52:46 rpmi: libXfixes-6.0.0-alt1 sisyphus+284644.300.1.1 1630910331 installed
<13>Sep 24 03:52:46 rpmi: libXcursor-1.2.0-alt1 sisyphus+278256.100.1.2 1626134578 installed
<13>Sep 24 03:52:46 rpmi: libXrandr-1.5.2-alt1 sisyphus+275330.100.2.2 1624575558 installed
<13>Sep 24 03:52:46 rpmi: libXi-1.8-alt1 sisyphus+285490.200.1.1 1632124174 installed
<13>Sep 24 03:52:46 rpmi: libXinerama-1.1.4-alt1 sisyphus+275328.100.2.2 1624575558 installed
<13>Sep 24 03:52:47 rpmi: libxcb-devel-1.14-alt1 sisyphus+277968.100.1.3 1625952322 installed
<13>Sep 24 03:52:48 rpmi: libX11-devel-3:1.7.2-alt1 sisyphus+279629.100.1.1 1626637383 installed
<13>Sep 24 03:52:48 rpmi: libXext-devel-1.3.4-alt1 sisyphus+278817.100.1.3 1626262596 installed
<13>Sep 24 03:52:48 rpmi: libXrender-devel-0.9.10-alt1 sisyphus+278480.100.1.2 1626227740 installed
<13>Sep 24 03:52:48 rpmi: libXfixes-devel-6.0.0-alt1 sisyphus+284644.300.1.1 1630910331 installed
<13>Sep 24 03:52:48 rpmi: libXi-devel-1.8-alt1 sisyphus+285490.200.1.1 1632124174 installed
<13>Sep 24 03:52:48 rpmi: libXrandr-devel-1.5.2-alt1 sisyphus+275330.100.2.2 1624575558 installed
<13>Sep 24 03:52:48 rpmi: libXcursor-devel-1.2.0-alt1 sisyphus+278256.100.1.2 1626134578 installed
<13>Sep 24 03:52:48 rpmi: libXinerama-devel-1.1.4-alt1 sisyphus+275328.100.2.2 1624575558 installed
<13>Sep 24 03:52:48 rpmi: libXxf86vm-1.1.4-alt2 sisyphus+275334.100.2.2 1624577011 installed
<13>Sep 24 03:52:48 rpmi: libXtst-1.2.3-alt1 sisyphus+278848.100.1.2 1626298055 installed
<13>Sep 24 03:52:48 rpmi: libXtst-devel-1.2.3-alt1 sisyphus+278848.100.1.2 1626298055 installed
<13>Sep 24 03:52:48 rpmi: libXv-1.0.11-alt1 sisyphus+278228.100.1.1 1626079278 installed
<13>Sep 24 03:52:48 rpmi: libXv-devel-1.0.11-alt1 sisyphus+278228.100.1.1 1626079278 installed
<13>Sep 24 03:52:48 rpmi: libXt-1.2.1-alt1 sisyphus+265202.200.1.1 1611565457 installed
<13>Sep 24 03:52:48 rpmi: libwayland-client-1.19.0-alt1 sisyphus+279023.100.1.1 1626353895 installed
<13>Sep 24 03:52:48 rpmi: libpciaccess-1:0.16-alt1 sisyphus+278288.100.1.1 1626084210 installed
<13>Sep 24 03:52:48 rpmi: libdrm-1:2.4.107-alt2 sisyphus+283492.100.1.3 1629454692 installed
<13>Sep 24 03:52:48 rpmi: libGLX-mesa-4:21.2.2-alt1 sisyphus+285669.100.1.1 1632300436 installed
<13>Sep 24 03:52:48 rpmi: libGLX-7:1.3.3-alt1 sisyphus+279467.100.1.1 1626548117 installed
<13>Sep 24 03:52:48 rpmi: libGL-7:1.3.3-alt1 sisyphus+279467.100.1.1 1626548117 installed
<13>Sep 24 03:52:48 rpmi: libGLU-4:9.0.1-alt1 sisyphus+278350.100.1.2 1626174382 installed
<13>Sep 24 03:52:48 rpmi: libgbm-4:21.2.2-alt1 sisyphus+285669.100.1.1 1632300436 installed
<13>Sep 24 03:52:48 rpmi: libEGL-mesa-4:21.2.2-alt1 sisyphus+285669.100.1.1 1632300436 installed
<13>Sep 24 03:52:48 rpmi: libEGL-7:1.3.3-alt1 sisyphus+279467.100.1.1 1626548117 installed
<13>Sep 24 03:52:48 rpmi: libglvnd-devel-7:1.3.3-alt1 sisyphus+279467.100.1.1 1626548117 installed
<13>Sep 24 03:52:48 rpmi: libGL-devel-4:21.2.2-alt1 sisyphus+285669.100.1.1 1632300436 installed
<13>Sep 24 03:52:48 rpmi: libGLU-devel-4:9.0.1-alt1 sisyphus+278350.100.1.2 1626174382 installed
<13>Sep 24 03:52:48 rpmi: gcc-c++-common-1.4.27-alt1 sisyphus+278099.1300.1.1 1626028636 installed
<13>Sep 24 03:52:48 rpmi: libstdc++11-devel-11.2.1-alt1 sisyphus+285602.200.1.1 1632233545 installed
<13>Sep 24 03:52:49 rpmi: gcc11-c++-11.2.1-alt1 sisyphus+285602.200.1.1 1632233545 installed
<13>Sep 24 03:52:49 rpmi: libbrotlicommon-1.0.9-alt2 sisyphus+278430.100.1.2 1626213212 installed
<13>Sep 24 03:52:49 rpmi: libbrotlidec-1.0.9-alt2 sisyphus+278430.100.1.2 1626213212 installed
<13>Sep 24 03:52:49 rpmi: libharfbuzz-3.0.0-alt1 sisyphus+285665.100.6.1 1632349054 installed
<13>Sep 24 03:52:49 rpmi: libfreetype-2.11.0-alt1 sisyphus+281294.100.1.1 1627488670 installed
<13>Sep 24 03:52:49 rpmi: fontconfig-2.13.1-alt2 sisyphus+283256.100.1.1 1629274953 installed
Updating fonts cache: <29>Sep 24 03:52:50 fontconfig: Updating fonts cache: succeeded
[ DONE ]
<13>Sep 24 03:52:50 rpmi: libqt4-gui-4.8.7-alt24 sisyphus+283856.100.1.1 1629987286 installed
<13>Sep 24 03:52:50 rpmi: libqt4-opengl-4.8.7-alt24 sisyphus+283856.100.1.1 1629987286 installed
<13>Sep 24 03:52:51 rpmi: libqt4-designer-4.8.7-alt24 sisyphus+283856.100.1.1 1629987286 installed
<13>Sep 24 03:52:51 rpmi: libqt4-uitools-4.8.7-alt24 sisyphus+283856.100.1.1 1629987286 installed
<13>Sep 24 03:52:51 rpmi: libqt4-svg-4.8.7-alt24 sisyphus+283856.100.1.1 1629987286 installed
<13>Sep 24 03:52:51 rpmi: libqt4-scripttools-4.8.7-alt24 sisyphus+283856.100.1.1 1629987286 installed
<13>Sep 24 03:52:51 rpmi: libcairo-1:1.16.0-alt1 sisyphus+275343.100.2.3 1624578007 installed
<13>Sep 24 03:52:51 rpmi: libharfbuzz-icu-3.0.0-alt1 sisyphus+285665.100.6.1 1632349054 installed
<13>Sep 24 03:52:51 rpmi: libharfbuzz-gobject-3.0.0-alt1 sisyphus+285665.100.6.1 1632349054 installed
<13>Sep 24 03:52:51 rpmi: libgdbm-1.8.3-alt10 sisyphus+278100.1600.1.1 1626058413 installed
<13>Sep 24 03:52:51 rpmi: xml-utils-1:2.9.12-alt1 sisyphus+279621.1100.1.1 1626630109 installed
<13>Sep 24 03:52:51 rpmi: rpm-build-gir-0.7.3-alt3 sisyphus+242150.100.1.1 1575312005 installed
<13>Sep 24 03:52:51 rpmi: libp11-kit-0.23.15-alt2 sisyphus+278382.100.1.2 1626190666 installed
<13>Sep 24 03:52:51 rpmi: libtasn1-4.17.0-alt2 sisyphus+285706.100.1.1 1632328563 installed
<13>Sep 24 03:52:51 rpmi: rpm-macros-alternatives-0.5.1-alt1 sisyphus+278157.100.2.1 1626055790 installed
<13>Sep 24 03:52:51 rpmi: alternatives-0.5.1-alt1 sisyphus+278157.100.2.1 1626055790 installed
<13>Sep 24 03:52:51 rpmi: ca-certificates-2021.06.03-alt1 sisyphus+273509.400.1.1 1622736045 installed
<13>Sep 24 03:52:51 rpmi: ca-trust-0.1.2-alt1 sisyphus+233348.100.1.1 1561653823 installed
<13>Sep 24 03:52:51 rpmi: p11-kit-trust-0.23.15-alt2 sisyphus+278382.100.1.2 1626190666 installed
<13>Sep 24 03:52:51 rpmi: libcrypto1.1-1.1.1l-alt1 sisyphus+283685.100.1.1 1629815887 installed
<13>Sep 24 03:52:51 rpmi: libssl1.1-1.1.1l-alt1 sisyphus+283685.100.1.1 1629815887 installed
<13>Sep 24 03:52:51 rpmi: libqt4-network-4.8.7-alt24 sisyphus+283856.100.1.1 1629987286 installed
<13>Sep 24 03:52:51 rpmi: python3-3.9.7-alt2 sisyphus+285822.100.1.1 1632418078 installed
<13>Sep 24 03:52:52 rpmi: python3-base-3.9.7-alt2 sisyphus+285822.100.1.1 1632418078 installed
<13>Sep 24 03:52:52 rpmi: glib2-devel-2.68.4-alt2 sisyphus+285241.100.1.1 1631645660 installed
<13>Sep 24 03:52:52 rpmi: libfreetype-devel-2.11.0-alt1 sisyphus+281294.100.1.1 1627488670 installed
<13>Sep 24 03:52:52 rpmi: libharfbuzz-devel-3.0.0-alt1 sisyphus+285665.100.6.1 1632349054 installed
<13>Sep 24 03:52:52 rpmi: fontconfig-devel-2.13.1-alt2 sisyphus+283256.100.1.1 1629274953 installed
<13>Sep 24 03:52:52 rpmi: libqt4-xmlpatterns-4.8.7-alt24 sisyphus+283856.100.1.1 1629987286 installed
<13>Sep 24 03:52:52 rpmi: libqt4-declarative-4.8.7-alt24 sisyphus+283856.100.1.1 1629987286 installed
<13>Sep 24 03:52:52 rpmi: libqt4-qt3support-4.8.7-alt24 sisyphus+283856.100.1.1 1629987286 installed
<13>Sep 24 03:52:52 rpmi: libqt4-help-4.8.7-alt24 sisyphus+283856.100.1.1 1629987286 installed
<13>Sep 24 03:52:52 rpmi: libssl-devel-1.1.1l-alt1 sisyphus+283685.100.1.1 1629815887 installed
<13>Sep 24 03:52:52 rpmi: alsa-ucm-conf-1.2.5.1-alt1 sisyphus+274777.200.1.1 1624089157 installed
<13>Sep 24 03:52:52 rpmi: alsa-topology-conf-1.2.5.1-alt1 sisyphus+274777.100.1.1 1624089141 installed
<13>Sep 24 03:52:52 rpmi: libalsa-1:1.2.5.1-alt1 sisyphus+279749.100.1.1 1626687316 installed
<13>Sep 24 03:52:52 rpmi: libqt4-multimedia-4.8.7-alt24 sisyphus+283856.100.1.1 1629987286 installed
<13>Sep 24 03:52:53 rpmi: libqt4-devel-4.8.7-alt24 sisyphus+283856.100.1.1 1629987286 installed
<13>Sep 24 03:52:53 rpmi: libcairo-devel-1:1.16.0-alt1 sisyphus+275343.100.2.3 1624578007 installed
<13>Sep 24 03:52:53 rpmi: gcc-c++-11-alt1 sisyphus+285602.400.1.1 1632238564 installed
<13>Sep 24 03:52:53 rpmi: libXt-devel-1.2.1-alt1 sisyphus+265202.200.1.1 1611565457 installed
<13>Sep 24 03:52:53 rpmi: libtiff-devel-4.3.0-alt1 sisyphus+285311.100.1.1 1631733776 installed
<13>Sep 24 03:52:53 rpmi: libncurses-devel-6.2.20210123-alt2 sisyphus+283886.200.2.1 1630022599 installed
<13>Sep 24 03:52:53 rpmi: libjpeg-devel-2:2.0.6-alt4 sisyphus+284191.100.1.1 1630330711 installed
<13>Sep 24 03:52:53 rpmi: xorg-cf-files-1.0.6-alt1 sisyphus+277132.100.1.1 1625404776 installed
<13>Sep 24 03:52:53 rpmi: imake-1.0.7-alt3 sisyphus+275315.100.2.1 1624906759 installed
<13>Sep 24 03:52:53 rpmi: dos2unix-7.4.2-alt1 sisyphus+279663.100.1.2 1626654194 installed
Building target platforms: x86_64
Building for target x86_64
Wrote: /usr/src/in/nosrpm/gle-4.2.5-alt2.nosrc.rpm (w1.gzdio)
Installing gle-4.2.5-alt2.src.rpm
Building target platforms: x86_64
Building for target x86_64
Executing(%prep): /bin/sh -e /usr/src/tmp/rpm-tmp.30211
+ umask 022
+ /bin/mkdir -p /usr/src/RPM/BUILD
+ cd /usr/src/RPM/BUILD
+ cd /usr/src/RPM/BUILD
+ rm -rf gle-graphics-4.2.5
+ echo 'Source #0 (gle-graphics-4.2.5-src.tar.gz):'
Source #0 (gle-graphics-4.2.5-src.tar.gz):
+ /bin/tar -xf -
+ /bin/gzip -dc /usr/src/RPM/SOURCES/gle-graphics-4.2.5-src.tar.gz
+ cd gle-graphics-4.2.5
+ echo 'Source #3 (gle-graphics-extrafonts-1.0.tar.gz):'
Source #3 (gle-graphics-extrafonts-1.0.tar.gz):
+ /bin/gzip -dc /usr/src/RPM/SOURCES/gle-graphics-extrafonts-1.0.tar.gz
+ /bin/tar -xf -
+ /bin/chmod -c -Rf u+rwX,go-w .
+ echo 'Patch #0 (gle-graphics-4.2.4c-alt-autoconf.patch):'
Patch #0 (gle-graphics-4.2.4c-alt-autoconf.patch):
+ /usr/bin/patch -p0
patching file configure.ac
Hunk #1 succeeded at 54 with fuzz 2 (offset 2 lines).
+ echo 'Patch #2 (gle-graphics-4.2.5-alt-glibc-compat.patch):'
Patch #2 (gle-graphics-4.2.5-alt-glibc-compat.patch):
+ /usr/bin/patch -p2
patching file src/gle/surface/ffitcontour.cpp
+ exit 0
Executing(%build): /bin/sh -e /usr/src/tmp/rpm-tmp.97132
+ umask 022
+ /bin/mkdir -p /usr/src/RPM/BUILD
+ cd /usr/src/RPM/BUILD
+ cd gle-graphics-4.2.5
+ autoreconf -fisv -fisv
autoreconf-default: Entering directory `.'
autoreconf-default: configure.ac: not using Gettext
autoreconf-default: running: aclocal --force --verbose 
aclocal-default: found macro AM_PROG_VALAC in /usr/share/aclocal-1.16/vala.m4: 23
aclocal-default: found macro AM_PROG_UPC in /usr/share/aclocal-1.16/upc.m4: 9
aclocal-default: found macro _AM_PROG_TAR in /usr/share/aclocal-1.16/tar.m4: 23
aclocal-default: found macro _AM_SUBST_NOTMAKE in /usr/share/aclocal-1.16/substnot.m4: 12
aclocal-default: found macro AM_SUBST_NOTMAKE in /usr/share/aclocal-1.16/substnot.m4: 17
aclocal-default: found macro AM_PROG_INSTALL_STRIP in /usr/share/aclocal-1.16/strip.m4: 17
aclocal-default: found macro AM_SILENT_RULES in /usr/share/aclocal-1.16/silent.m4: 12
aclocal-default: found macro AM_SANITY_CHECK in /usr/share/aclocal-1.16/sanity.m4: 11
aclocal-default: found macro AM_RUN_LOG in /usr/share/aclocal-1.16/runlog.m4: 12
aclocal-default: found macro AM_PATH_PYTHON in /usr/share/aclocal-1.16/python.m4: 35
aclocal-default: found macro AM_PYTHON_CHECK_VERSION in /usr/share/aclocal-1.16/python.m4: 234
aclocal-default: found macro _AM_PROG_CC_C_O in /usr/share/aclocal-1.16/prog-cc-c-o.m4: 12
aclocal-default: found macro AM_PROG_CC_C_O in /usr/share/aclocal-1.16/prog-cc-c-o.m4: 47
aclocal-default: found macro _AM_MANGLE_OPTION in /usr/share/aclocal-1.16/options.m4: 11
aclocal-default: found macro _AM_SET_OPTION in /usr/share/aclocal-1.16/options.m4: 17
aclocal-default: found macro _AM_SET_OPTIONS in /usr/share/aclocal-1.16/options.m4: 23
aclocal-default: found macro _AM_IF_OPTION in /usr/share/aclocal-1.16/options.m4: 29
aclocal-default: found macro AM_CONFIG_HEADER in /usr/share/aclocal-1.16/obsolete.m4: 11
aclocal-default: found macro AM_PROG_CC_STDC in /usr/share/aclocal-1.16/obsolete.m4: 17
aclocal-default: found macro AM_C_PROTOTYPES in /usr/share/aclocal-1.16/obsolete.m4: 26
aclocal-default: found macro fp_C_PROTOTYPES in /usr/share/aclocal-1.16/obsolete.m4: 28
aclocal-default: found macro AM_PROG_MKDIR_P in /usr/share/aclocal-1.16/mkdirp.m4: 11
aclocal-default: found macro AM_MISSING_PROG in /usr/share/aclocal-1.16/missing.m4: 11
aclocal-default: found macro AM_MISSING_HAS_RUN in /usr/share/aclocal-1.16/missing.m4: 20
aclocal-default: found macro AM_MAKE_INCLUDE in /usr/share/aclocal-1.16/make.m4: 13
aclocal-default: found macro AM_MAINTAINER_MODE in /usr/share/aclocal-1.16/maintainer.m4: 16
aclocal-default: found macro AM_PATH_LISPDIR in /usr/share/aclocal-1.16/lispdir.m4: 14
aclocal-default: found macro AM_PROG_LEX in /usr/share/aclocal-1.16/lex.m4: 13
aclocal-default: found macro AM_SET_LEADING_DOT in /usr/share/aclocal-1.16/lead-dot.m4: 10
aclocal-default: found macro AM_PROG_INSTALL_SH in /usr/share/aclocal-1.16/install-sh.m4: 11
aclocal-default: found macro AM_INIT_AUTOMAKE in /usr/share/aclocal-1.16/init.m4: 29
aclocal-default: found macro _AC_AM_CONFIG_HEADER_HOOK in /usr/share/aclocal-1.16/init.m4: 186
aclocal-default: found macro AM_PROG_GCJ in /usr/share/aclocal-1.16/gcj.m4: 10
aclocal-default: found macro AM_EXTRA_RECURSIVE_TARGETS in /usr/share/aclocal-1.16/extra-recurs.m4: 16
aclocal-default: found macro AM_WITH_DMALLOC in /usr/share/aclocal-1.16/dmalloc.m4: 12
aclocal-default: found macro _AM_OUTPUT_DEPENDENCY_COMMANDS in /usr/share/aclocal-1.16/depout.m4: 11
aclocal-default: found macro AM_OUTPUT_DEPENDENCY_COMMANDS in /usr/share/aclocal-1.16/depout.m4: 64
aclocal-default: found macro _AM_DEPENDENCIES in /usr/share/aclocal-1.16/depend.m4: 26
aclocal-default: found macro AM_SET_DEPDIR in /usr/share/aclocal-1.16/depend.m4: 163
aclocal-default: found macro AM_DEP_TRACK in /usr/share/aclocal-1.16/depend.m4: 171
aclocal-default: found macro AM_CONDITIONAL in /usr/share/aclocal-1.16/cond.m4: 12
aclocal-default: found macro AM_COND_IF in /usr/share/aclocal-1.16/cond-if.m4: 23
aclocal-default: found macro AM_AUX_DIR_EXPAND in /usr/share/aclocal-1.16/auxdir.m4: 47
aclocal-default: found macro AM_PROG_AS in /usr/share/aclocal-1.16/as.m4: 11
aclocal-default: found macro AM_PROG_AR in /usr/share/aclocal-1.16/ar-lib.m4: 13
aclocal-default: found macro AM_AUTOMAKE_VERSION in /usr/share/aclocal-1.16/amversion.m4: 14
aclocal-default: found macro AM_SET_CURRENT_AUTOMAKE_VERSION in /usr/share/aclocal-1.16/amversion.m4: 33
aclocal-default: found macro AM_PATH_PROG_WITH_TEST in /usr/share/aclocal/progtest.m4: 25
aclocal-default: found macro AM_PO_SUBDIRS in /usr/share/aclocal/po.m4: 23
aclocal-default: found macro AM_POSTPROCESS_PO_MAKEFILE in /usr/share/aclocal/po.m4: 219
aclocal-default: found macro AM_XGETTEXT_OPTION_INIT in /usr/share/aclocal/po.m4: 440
aclocal-default: found macro AM_XGETTEXT_OPTION in /usr/share/aclocal/po.m4: 446
aclocal-default: found macro PKG_PROG_PKG_CONFIG in /usr/share/aclocal/pkg.m4: 58
aclocal-default: found macro PKG_CHECK_EXISTS in /usr/share/aclocal/pkg.m4: 92
aclocal-default: found macro _PKG_SHORT_ERRORS_SUPPORTED in /usr/share/aclocal/pkg.m4: 121
aclocal-default: found macro PKG_CHECK_MODULES in /usr/share/aclocal/pkg.m4: 139
aclocal-default: found macro PKG_CHECK_MODULES_STATIC in /usr/share/aclocal/pkg.m4: 208
aclocal-default: found macro PKG_INSTALLDIR in /usr/share/aclocal/pkg.m4: 226
aclocal-default: found macro PKG_NOARCH_INSTALLDIR in /usr/share/aclocal/pkg.m4: 248
aclocal-default: found macro PKG_CHECK_VAR in /usr/share/aclocal/pkg.m4: 267
aclocal-default: found macro AM_NLS in /usr/share/aclocal/nls.m4: 23
aclocal-default: found macro AC_PROG_GNU_M4 in /usr/share/aclocal/m4.m4: 19
aclocal-default: found macro AC_LIB_PREFIX in /usr/share/aclocal/lib-prefix.m4: 15
aclocal-default: found macro AC_LIB_PREPARE_PREFIX in /usr/share/aclocal/lib-prefix.m4: 115
aclocal-default: found macro AC_LIB_WITH_FINAL_PREFIX in /usr/share/aclocal/lib-prefix.m4: 138
aclocal-default: found macro AC_LIB_PREPARE_MULTILIB in /usr/share/aclocal/lib-prefix.m4: 155
aclocal-default: found macro AC_LIB_LINKFLAGS in /usr/share/aclocal/lib-link.m4: 17
aclocal-default: found macro AC_LIB_HAVE_LINKFLAGS in /usr/share/aclocal/lib-link.m4: 57
aclocal-default: found macro AC_LIB_RPATH in /usr/share/aclocal/lib-link.m4: 125
aclocal-default: found macro AC_LIB_FROMPACKAGE in /usr/share/aclocal/lib-link.m4: 161
aclocal-default: found macro AC_LIB_LINKFLAGS_BODY in /usr/share/aclocal/lib-link.m4: 181
aclocal-default: found macro AC_LIB_APPENDTOVAR in /usr/share/aclocal/lib-link.m4: 705
aclocal-default: found macro AC_LIB_LINKFLAGS_FROM_LIBS in /usr/share/aclocal/lib-link.m4: 729
aclocal-default: found macro AC_LIB_PROG_LD_GNU in /usr/share/aclocal/lib-ld.m4: 12
aclocal-default: found macro AC_LIB_PROG_LD in /usr/share/aclocal/lib-ld.m4: 27
aclocal-default: found macro gt_INTL_MACOSX in /usr/share/aclocal/intlmacosx.m4: 18
aclocal-default: found macro AM_ICONV_LINKFLAGS_BODY in /usr/share/aclocal/iconv.m4: 10
aclocal-default: found macro AM_ICONV_LINK in /usr/share/aclocal/iconv.m4: 21
aclocal-default: found macro AM_ICONV in /usr/share/aclocal/iconv.m4: 246
aclocal-default: found macro gl_HOST_CPU_C_ABI in /usr/share/aclocal/host-cpu-c-abi.m4: 50
aclocal-default: found macro gl_HOST_CPU_C_ABI_32BIT in /usr/share/aclocal/host-cpu-c-abi.m4: 463
aclocal-default: found macro GLIB_GSETTINGS in /usr/share/aclocal/gsettings.m4: 9
aclocal-default: found macro _GSETTINGS_SUBST in /usr/share/aclocal/gsettings.m4: 83
aclocal-default: found macro GLIB_GNU_GETTEXT in /usr/share/aclocal/glib-gettext.m4: 366
aclocal-default: found macro AM_GLIB_GNU_GETTEXT in /usr/share/aclocal/glib-gettext.m4: 467
aclocal-default: found macro AM_GLIB_DEFINE_LOCALEDIR in /usr/share/aclocal/glib-gettext.m4: 468
aclocal-default: found macro GLIB_RUN_PROG in /usr/share/aclocal/glib-gettext.m4: 476
aclocal-default: found macro AM_PATH_GLIB_2_0 in /usr/share/aclocal/glib-2.0.m4: 11
aclocal-default: found macro AM_GNU_GETTEXT in /usr/share/aclocal/gettext.m4: 55
aclocal-default: found macro AM_GNU_GETTEXT_NEED in /usr/share/aclocal/gettext.m4: 375
aclocal-default: found macro AM_GNU_GETTEXT_VERSION in /usr/share/aclocal/gettext.m4: 382
aclocal-default: found macro AM_GNU_GETTEXT_REQUIRE_VERSION in /usr/share/aclocal/gettext.m4: 386
aclocal-default: found macro AC_CHECK_FT2 in /usr/share/aclocal/freetype2.m4: 28
aclocal-default: found macro BISON_I18N in /usr/share/aclocal/bison-i18n.m4: 18
aclocal-default: found macro LTOBSOLETE_VERSION in /usr/share/libtool/aclocal/lt~obsolete.m4: 37
aclocal-default: found macro AC_LIBTOOL_LINKER_OPTION in /usr/share/libtool/aclocal/lt~obsolete.m4: 39
aclocal-default: found macro AC_PROG_EGREP in /usr/share/libtool/aclocal/lt~obsolete.m4: 40
aclocal-default: found macro _LT_AC_PROG_ECHO_BACKSLASH in /usr/share/libtool/aclocal/lt~obsolete.m4: 41
aclocal-default: found macro _LT_AC_SHELL_INIT in /usr/share/libtool/aclocal/lt~obsolete.m4: 42
aclocal-default: found macro _LT_AC_SYS_LIBPATH_AIX in /usr/share/libtool/aclocal/lt~obsolete.m4: 43
aclocal-default: found macro _LT_PROG_LTMAIN in /usr/share/libtool/aclocal/lt~obsolete.m4: 44
aclocal-default: found macro _LT_AC_TAGVAR in /usr/share/libtool/aclocal/lt~obsolete.m4: 45
aclocal-default: found macro AC_LTDL_ENABLE_INSTALL in /usr/share/libtool/aclocal/lt~obsolete.m4: 46
aclocal-default: found macro AC_LTDL_PREOPEN in /usr/share/libtool/aclocal/lt~obsolete.m4: 47
aclocal-default: found macro _LT_AC_SYS_COMPILER in /usr/share/libtool/aclocal/lt~obsolete.m4: 48
aclocal-default: found macro _LT_AC_LOCK in /usr/share/libtool/aclocal/lt~obsolete.m4: 49
aclocal-default: found macro AC_LIBTOOL_SYS_OLD_ARCHIVE in /usr/share/libtool/aclocal/lt~obsolete.m4: 50
aclocal-default: found macro _LT_AC_TRY_DLOPEN_SELF in /usr/share/libtool/aclocal/lt~obsolete.m4: 51
aclocal-default: found macro AC_LIBTOOL_PROG_CC_C_O in /usr/share/libtool/aclocal/lt~obsolete.m4: 52
aclocal-default: found macro AC_LIBTOOL_SYS_HARD_LINK_LOCKS in /usr/share/libtool/aclocal/lt~obsolete.m4: 53
aclocal-default: found macro AC_LIBTOOL_OBJDIR in /usr/share/libtool/aclocal/lt~obsolete.m4: 54
aclocal-default: found macro AC_LTDL_OBJDIR in /usr/share/libtool/aclocal/lt~obsolete.m4: 55
aclocal-default: found macro AC_LIBTOOL_PROG_LD_HARDCODE_LIBPATH in /usr/share/libtool/aclocal/lt~obsolete.m4: 56
aclocal-default: found macro AC_LIBTOOL_SYS_LIB_STRIP in /usr/share/libtool/aclocal/lt~obsolete.m4: 57
aclocal-default: found macro AC_PATH_MAGIC in /usr/share/libtool/aclocal/lt~obsolete.m4: 58
aclocal-default: found macro AC_PROG_LD_GNU in /usr/share/libtool/aclocal/lt~obsolete.m4: 59
aclocal-default: found macro AC_PROG_LD_RELOAD_FLAG in /usr/share/libtool/aclocal/lt~obsolete.m4: 60
aclocal-default: found macro AC_DEPLIBS_CHECK_METHOD in /usr/share/libtool/aclocal/lt~obsolete.m4: 61
aclocal-default: found macro AC_LIBTOOL_PROG_COMPILER_NO_RTTI in /usr/share/libtool/aclocal/lt~obsolete.m4: 62
aclocal-default: found macro AC_LIBTOOL_SYS_GLOBAL_SYMBOL_PIPE in /usr/share/libtool/aclocal/lt~obsolete.m4: 63
aclocal-default: found macro AC_LIBTOOL_PROG_COMPILER_PIC in /usr/share/libtool/aclocal/lt~obsolete.m4: 64
aclocal-default: found macro AC_LIBTOOL_PROG_LD_SHLIBS in /usr/share/libtool/aclocal/lt~obsolete.m4: 65
aclocal-default: found macro AC_LIBTOOL_POSTDEP_PREDEP in /usr/share/libtool/aclocal/lt~obsolete.m4: 66
aclocal-default: found macro LT_AC_PROG_EGREP in /usr/share/libtool/aclocal/lt~obsolete.m4: 67
aclocal-default: found macro LT_AC_PROG_SED in /usr/share/libtool/aclocal/lt~obsolete.m4: 68
aclocal-default: found macro _LT_CC_BASENAME in /usr/share/libtool/aclocal/lt~obsolete.m4: 69
aclocal-default: found macro _LT_COMPILER_BOILERPLATE in /usr/share/libtool/aclocal/lt~obsolete.m4: 70
aclocal-default: found macro _LT_LINKER_BOILERPLATE in /usr/share/libtool/aclocal/lt~obsolete.m4: 71
aclocal-default: found macro _AC_PROG_LIBTOOL in /usr/share/libtool/aclocal/lt~obsolete.m4: 72
aclocal-default: found macro AC_LIBTOOL_SETUP in /usr/share/libtool/aclocal/lt~obsolete.m4: 73
aclocal-default: found macro _LT_AC_CHECK_DLFCN in /usr/share/libtool/aclocal/lt~obsolete.m4: 74
aclocal-default: found macro AC_LIBTOOL_SYS_DYNAMIC_LINKER in /usr/share/libtool/aclocal/lt~obsolete.m4: 75
aclocal-default: found macro _LT_AC_TAGCONFIG in /usr/share/libtool/aclocal/lt~obsolete.m4: 76
aclocal-default: found macro AC_DISABLE_FAST_INSTALL in /usr/share/libtool/aclocal/lt~obsolete.m4: 77
aclocal-default: found macro _LT_AC_LANG_CXX in /usr/share/libtool/aclocal/lt~obsolete.m4: 78
aclocal-default: found macro _LT_AC_LANG_F77 in /usr/share/libtool/aclocal/lt~obsolete.m4: 79
aclocal-default: found macro _LT_AC_LANG_GCJ in /usr/share/libtool/aclocal/lt~obsolete.m4: 80
aclocal-default: found macro AC_LIBTOOL_LANG_C_CONFIG in /usr/share/libtool/aclocal/lt~obsolete.m4: 81
aclocal-default: found macro _LT_AC_LANG_C_CONFIG in /usr/share/libtool/aclocal/lt~obsolete.m4: 82
aclocal-default: found macro AC_LIBTOOL_LANG_CXX_CONFIG in /usr/share/libtool/aclocal/lt~obsolete.m4: 83
aclocal-default: found macro _LT_AC_LANG_CXX_CONFIG in /usr/share/libtool/aclocal/lt~obsolete.m4: 84
aclocal-default: found macro AC_LIBTOOL_LANG_F77_CONFIG in /usr/share/libtool/aclocal/lt~obsolete.m4: 85
aclocal-default: found macro _LT_AC_LANG_F77_CONFIG in /usr/share/libtool/aclocal/lt~obsolete.m4: 86
aclocal-default: found macro AC_LIBTOOL_LANG_GCJ_CONFIG in /usr/share/libtool/aclocal/lt~obsolete.m4: 87
aclocal-default: found macro _LT_AC_LANG_GCJ_CONFIG in /usr/share/libtool/aclocal/lt~obsolete.m4: 88
aclocal-default: found macro AC_LIBTOOL_LANG_RC_CONFIG in /usr/share/libtool/aclocal/lt~obsolete.m4: 89
aclocal-default: found macro _LT_AC_LANG_RC_CONFIG in /usr/share/libtool/aclocal/lt~obsolete.m4: 90
aclocal-default: found macro AC_LIBTOOL_CONFIG in /usr/share/libtool/aclocal/lt~obsolete.m4: 91
aclocal-default: found macro _LT_AC_FILE_LTDLL_C in /usr/share/libtool/aclocal/lt~obsolete.m4: 92
aclocal-default: found macro _LT_REQUIRED_DARWIN_CHECKS in /usr/share/libtool/aclocal/lt~obsolete.m4: 93
aclocal-default: found macro _LT_AC_PROG_CXXCPP in /usr/share/libtool/aclocal/lt~obsolete.m4: 94
aclocal-default: found macro _LT_PREPARE_SED_QUOTE_VARS in /usr/share/libtool/aclocal/lt~obsolete.m4: 95
aclocal-default: found macro _LT_PROG_ECHO_BACKSLASH in /usr/share/libtool/aclocal/lt~obsolete.m4: 96
aclocal-default: found macro _LT_PROG_F77 in /usr/share/libtool/aclocal/lt~obsolete.m4: 97
aclocal-default: found macro _LT_PROG_FC in /usr/share/libtool/aclocal/lt~obsolete.m4: 98
aclocal-default: found macro _LT_PROG_CXX in /usr/share/libtool/aclocal/lt~obsolete.m4: 99
aclocal-default: found macro LTVERSION_VERSION in /usr/share/libtool/aclocal/ltversion.m4: 18
aclocal-default: found macro LTSUGAR_VERSION in /usr/share/libtool/aclocal/ltsugar.m4: 14
aclocal-default: found macro LTOPTIONS_VERSION in /usr/share/libtool/aclocal/ltoptions.m4: 14
aclocal-default: found macro AC_LIBTOOL_DLOPEN in /usr/share/libtool/aclocal/ltoptions.m4: 113
aclocal-default: found macro AC_LIBTOOL_WIN32_DLL in /usr/share/libtool/aclocal/ltoptions.m4: 148
aclocal-default: found macro AC_ENABLE_SHARED in /usr/share/libtool/aclocal/ltoptions.m4: 197
aclocal-default: found macro AC_DISABLE_SHARED in /usr/share/libtool/aclocal/ltoptions.m4: 201
aclocal-default: found macro AM_ENABLE_SHARED in /usr/share/libtool/aclocal/ltoptions.m4: 205
aclocal-default: found macro AM_DISABLE_SHARED in /usr/share/libtool/aclocal/ltoptions.m4: 206
aclocal-default: found macro AC_ENABLE_STATIC in /usr/share/libtool/aclocal/ltoptions.m4: 251
aclocal-default: found macro AC_DISABLE_STATIC in /usr/share/libtool/aclocal/ltoptions.m4: 255
aclocal-default: found macro AM_ENABLE_STATIC in /usr/share/libtool/aclocal/ltoptions.m4: 259
aclocal-default: found macro AM_DISABLE_STATIC in /usr/share/libtool/aclocal/ltoptions.m4: 260
aclocal-default: found macro AC_ENABLE_FAST_INSTALL in /usr/share/libtool/aclocal/ltoptions.m4: 305
aclocal-default: ignoring macro AC_DISABLE_FAST_INSTALL in /usr/share/libtool/aclocal/ltoptions.m4: 312
aclocal-default: found macro AC_LIBTOOL_PICMODE in /usr/share/libtool/aclocal/ltoptions.m4: 411
aclocal-default: found macro LT_CONFIG_LTDL_DIR in /usr/share/libtool/aclocal/ltdl.m4: 16
aclocal-default: found macro LTDL_CONVENIENCE in /usr/share/libtool/aclocal/ltdl.m4: 68
aclocal-default: found macro AC_LIBLTDL_CONVENIENCE in /usr/share/libtool/aclocal/ltdl.m4: 81
aclocal-default: found macro LTDL_INSTALLABLE in /usr/share/libtool/aclocal/ltdl.m4: 124
aclocal-default: found macro AC_LIBLTDL_INSTALLABLE in /usr/share/libtool/aclocal/ltdl.m4: 137
aclocal-default: found macro _LT_LIBOBJ in /usr/share/libtool/aclocal/ltdl.m4: 213
aclocal-default: found macro LTDL_INIT in /usr/share/libtool/aclocal/ltdl.m4: 226
aclocal-default: found macro AC_LIB_LTDL in /usr/share/libtool/aclocal/ltdl.m4: 352
aclocal-default: found macro AC_WITH_LTDL in /usr/share/libtool/aclocal/ltdl.m4: 353
aclocal-default: found macro LT_WITH_LTDL in /usr/share/libtool/aclocal/ltdl.m4: 354
aclocal-default: found macro _LTDL_SETUP in /usr/share/libtool/aclocal/ltdl.m4: 367
aclocal-default: found macro LT_SYS_DLOPEN_DEPLIBS in /usr/share/libtool/aclocal/ltdl.m4: 443
aclocal-default: found macro AC_LTDL_SYS_DLOPEN_DEPLIBS in /usr/share/libtool/aclocal/ltdl.m4: 545
aclocal-default: found macro LT_SYS_MODULE_EXT in /usr/share/libtool/aclocal/ltdl.m4: 552
aclocal-default: found macro AC_LTDL_SHLIBEXT in /usr/share/libtool/aclocal/ltdl.m4: 580
aclocal-default: found macro LT_SYS_MODULE_PATH in /usr/share/libtool/aclocal/ltdl.m4: 587
aclocal-default: found macro AC_LTDL_SHLIBPATH in /usr/share/libtool/aclocal/ltdl.m4: 599
aclocal-default: found macro LT_SYS_DLSEARCH_PATH in /usr/share/libtool/aclocal/ltdl.m4: 606
aclocal-default: found macro AC_LTDL_SYSSEARCHPATH in /usr/share/libtool/aclocal/ltdl.m4: 627
aclocal-default: found macro LT_LIB_DLLOAD in /usr/share/libtool/aclocal/ltdl.m4: 653
aclocal-default: found macro AC_LTDL_DLLIB in /usr/share/libtool/aclocal/ltdl.m4: 748
aclocal-default: found macro LT_SYS_SYMBOL_USCORE in /usr/share/libtool/aclocal/ltdl.m4: 756
aclocal-default: found macro AC_LTDL_SYMBOL_USCORE in /usr/share/libtool/aclocal/ltdl.m4: 793
aclocal-default: found macro LT_FUNC_DLSYM_USCORE in /usr/share/libtool/aclocal/ltdl.m4: 800
aclocal-default: found macro AC_LTDL_DLSYM_USCORE in /usr/share/libtool/aclocal/ltdl.m4: 907
aclocal-default: found macro LT_FUNC_ARGZ in /usr/share/libtool/aclocal/ltargz.m4: 12
aclocal-default: found macro LT_INIT in /usr/share/libtool/aclocal/libtool.m4: 61
aclocal-default: found macro AC_PROG_LIBTOOL in /usr/share/libtool/aclocal/libtool.m4: 99
aclocal-default: found macro AM_PROG_LIBTOOL in /usr/share/libtool/aclocal/libtool.m4: 100
aclocal-default: found macro LT_OUTPUT in /usr/share/libtool/aclocal/libtool.m4: 619
aclocal-default: found macro LT_SUPPORTED_TAG in /usr/share/libtool/aclocal/libtool.m4: 812
aclocal-default: found macro LT_LANG in /usr/share/libtool/aclocal/libtool.m4: 823
aclocal-default: found macro AC_LIBTOOL_CXX in /usr/share/libtool/aclocal/libtool.m4: 915
aclocal-default: found macro AC_LIBTOOL_F77 in /usr/share/libtool/aclocal/libtool.m4: 916
aclocal-default: found macro AC_LIBTOOL_FC in /usr/share/libtool/aclocal/libtool.m4: 917
aclocal-default: found macro AC_LIBTOOL_GCJ in /usr/share/libtool/aclocal/libtool.m4: 918
aclocal-default: found macro AC_LIBTOOL_RC in /usr/share/libtool/aclocal/libtool.m4: 919
aclocal-default: found macro _LT_WITH_SYSROOT in /usr/share/libtool/aclocal/libtool.m4: 1247
aclocal-default: found macro _LT_COMPILER_OPTION in /usr/share/libtool/aclocal/libtool.m4: 1598
aclocal-default: found macro AC_LIBTOOL_COMPILER_OPTION in /usr/share/libtool/aclocal/libtool.m4: 1640
aclocal-default: found macro _LT_LINKER_OPTION in /usr/share/libtool/aclocal/libtool.m4: 1649
aclocal-default: ignoring macro AC_LIBTOOL_LINKER_OPTION in /usr/share/libtool/aclocal/libtool.m4: 1684
aclocal-default: found macro LT_CMD_MAX_LEN in /usr/share/libtool/aclocal/libtool.m4: 1691
aclocal-default: found macro AC_LIBTOOL_SYS_MAX_CMD_LEN in /usr/share/libtool/aclocal/libtool.m4: 1830
aclocal-default: found macro LT_SYS_DLOPEN_SELF in /usr/share/libtool/aclocal/libtool.m4: 1941
aclocal-default: found macro AC_LIBTOOL_DLOPEN_SELF in /usr/share/libtool/aclocal/libtool.m4: 2066
aclocal-default: found macro _LT_PATH_TOOL_PREFIX in /usr/share/libtool/aclocal/libtool.m4: 3184
aclocal-default: found macro AC_PATH_TOOL_PREFIX in /usr/share/libtool/aclocal/libtool.m4: 3246
aclocal-default: found macro LT_PATH_LD in /usr/share/libtool/aclocal/libtool.m4: 3269
aclocal-default: found macro AM_PROG_LD in /usr/share/libtool/aclocal/libtool.m4: 3358
aclocal-default: found macro AC_PROG_LD in /usr/share/libtool/aclocal/libtool.m4: 3359
aclocal-default: found macro LT_PATH_NM in /usr/share/libtool/aclocal/libtool.m4: 3688
aclocal-default: found macro AM_PROG_NM in /usr/share/libtool/aclocal/libtool.m4: 3783
aclocal-default: found macro AC_PROG_NM in /usr/share/libtool/aclocal/libtool.m4: 3784
aclocal-default: found macro _LT_DLL_DEF_P in /usr/share/libtool/aclocal/libtool.m4: 3855
aclocal-default: found macro LT_LIB_M in /usr/share/libtool/aclocal/libtool.m4: 3869
aclocal-default: found macro AC_CHECK_LIBM in /usr/share/libtool/aclocal/libtool.m4: 3888
aclocal-default: found macro LT_PROG_GCJ in /usr/share/libtool/aclocal/libtool.m4: 8177
aclocal-default: found macro LT_AC_PROG_GCJ in /usr/share/libtool/aclocal/libtool.m4: 8186
aclocal-default: found macro LT_PROG_GO in /usr/share/libtool/aclocal/libtool.m4: 8193
aclocal-default: found macro LT_PROG_RC in /usr/share/libtool/aclocal/libtool.m4: 8200
aclocal-default: found macro LT_AC_PROG_RC in /usr/share/libtool/aclocal/libtool.m4: 8205
aclocal-default: ignoring macro LT_AC_PROG_SED in /usr/share/libtool/aclocal/libtool.m4: 8325
aclocal-default: saw macro PKG_PROG_PKG_CONFIG
aclocal-default: saw macro PKG_PROG_PKG_CONFIG
aclocal-default: saw macro PKG_CHECK_EXISTS
aclocal-default: saw macro PKG_PROG_PKG_CONFIG
aclocal-default: saw macro PKG_CHECK_EXISTS
aclocal-default: saw macro _PKG_SHORT_ERRORS_SUPPORTED
aclocal-default: saw macro PKG_PROG_PKG_CONFIG
aclocal-default: saw macro PKG_CHECK_MODULES
aclocal-default: saw macro PKG_PROG_PKG_CONFIG
aclocal-default: saw macro _PKG_SHORT_ERRORS_SUPPORTED
aclocal-default: saw macro PKG_CHECK_MODULES_STATIC
aclocal-default: saw macro PKG_PROG_PKG_CONFIG
aclocal-default: saw macro PKG_CHECK_MODULES
aclocal-default: saw macro PKG_INSTALLDIR
aclocal-default: saw macro PKG_NOARCH_INSTALLDIR
aclocal-default: saw macro PKG_CHECK_VAR
aclocal-default: saw macro PKG_PROG_PKG_CONFIG
aclocal-default: saw macro PKG_PROG_PKG_CONFIG
aclocal-default: saw macro PKG_PROG_PKG_CONFIG
aclocal-default: saw macro PKG_PROG_PKG_CONFIG
aclocal-default: saw macro PKG_PROG_PKG_CONFIG
aclocal-default: saw macro PKG_PROG_PKG_CONFIG
aclocal-default: saw macro PKG_CHECK_MODULES
aclocal-default: saw macro PKG_CHECK_MODULES
aclocal-default: saw macro PKG_CHECK_MODULES
aclocal-default: running WARNINGS=none /usr/bin/autom4te-2.60 --language Autoconf-without-aclocal-m4 /usr/share/aclocal-1.16/internal/ac-config-macro-dirs.m4 '/usr/share/aclocal/pkg.m4' --trace='AC_DEFUN:$f::$n::${::}%' --trace='AC_DEFUN_ONCE:$f::$n::${::}%' --trace='AU_DEFUN:$f::$n::${::}%' --trace='_AM_AUTOCONF_VERSION:$f::$n::${::}%' --trace='AC_CONFIG_MACRO_DIR_TRACE:$f::$n::${::}%' --trace='AC_CONFIG_MACRO_DIR:$f::$n::${::}%' --trace='_AM_CONFIG_MACRO_DIRS:$f::$n::${::}%' --trace='PKG_CHECK_EXISTS:$f::$n' --trace='_PKG_SHORT_ERRORS_SUPPORTED:$f::$n' --trace='PKG_CHECK_MODULES:$f::$n' --trace='PKG_PROG_PKG_CONFIG:$f::$n' --trace='PKG_CHECK_VAR:$f::$n' --trace='PKG_INSTALLDIR:$f::$n' --trace='PKG_CHECK_MODULES_STATIC:$f::$n' --trace='PKG_NOARCH_INSTALLDIR:$f::$n' configure.ac
aclocal-default: writing aclocal.m4
autoreconf-default: configure.ac: tracing
autoconf-2.60: running /usr/bin/autom4te-2.60 --force --verbose --language=autoconf --output=- --trace=AC_CONFIG_AUX_DIR:$n::${::}% --trace=AC_CONFIG_HEADERS:$n::${::}% --trace=AC_CONFIG_SUBDIRS:$n::${::}% --trace=AC_INIT:$n::${::}% --trace=AC_PROG_LIBTOOL:$n::${::}% --trace=LT_INIT:$n::${::}% --trace=LT_CONFIG_LTDL_DIR:$n::${::}% --trace=AM_GNU_GETTEXT:$n::${::}% --trace=AM_INIT_AUTOMAKE:$n::${::}% --trace=IT_PROG_INTLTOOL:$n::${::}% --trace=GTK_DOC_CHECK:$n::${::}% configure.ac
autom4te-2.60: the trace request object is:
autom4te-2.60: $VAR1 = bless( [
autom4te-2.60:                  '1',
autom4te-2.60:                  0,
autom4te-2.60:                  [
autom4te-2.60:                    '/usr/share/autoconf-2.60'
autom4te-2.60:                  ],
autom4te-2.60:                  [
autom4te-2.60:                    '/usr/share/autoconf-2.60/autoconf/autoconf.m4f',
autom4te-2.60:                    'aclocal.m4',
autom4te-2.60:                    'configure.ac'
autom4te-2.60:                  ],
autom4te-2.60:                  {
autom4te-2.60:                    'AM_GNU_GETTEXT' => 1,
autom4te-2.60:                    '_AM_SUBST_NOTMAKE' => 1,
autom4te-2.60:                    'AC_FC_SRCEXT' => 1,
autom4te-2.60:                    'AM_CONDITIONAL' => 1,
autom4te-2.60:                    'AC_CONFIG_SUBDIRS' => 1,
autom4te-2.60:                    'AC_CONFIG_LINKS' => 1,
autom4te-2.60:                    'AC_CONFIG_AUX_DIR' => 1,
autom4te-2.60:                    'AM_PROG_F77_C_O' => 1,
autom4te-2.60:                    'include' => 1,
autom4te-2.60:                    'm4_pattern_allow' => 1,
autom4te-2.60:                    'LT_SUPPORTED_TAG' => 1,
autom4te-2.60:                    'AC_FC_PP_DEFINE' => 1,
autom4te-2.60:                    'AH_OUTPUT' => 1,
autom4te-2.60:                    '_AM_COND_IF' => 1,
autom4te-2.60:                    'AC_PROG_LIBTOOL' => 1,
autom4te-2.60:                    'AM_PROG_MOC' => 1,
autom4te-2.60:                    'AC_REQUIRE_AUX_FILE' => 1,
autom4te-2.60:                    'AM_NLS' => 1,
autom4te-2.60:                    'AM_ENABLE_MULTILIB' => 1,
autom4te-2.60:                    '_AM_MAKEFILE_INCLUDE' => 1,
autom4te-2.60:                    '_m4_warn' => 1,
autom4te-2.60:                    'AM_PROG_MKDIR_P' => 1,
autom4te-2.60:                    'AC_DEFINE_TRACE_LITERAL' => 1,
autom4te-2.60:                    'm4_pattern_forbid' => 1,
autom4te-2.60:                    'AC_CANONICAL_BUILD' => 1,
autom4te-2.60:                    'IT_PROG_INTLTOOL' => 1,
autom4te-2.60:                    'LT_INIT' => 1,
autom4te-2.60:                    'AC_CONFIG_LIBOBJ_DIR' => 1,
autom4te-2.60:                    'AC_SUBST' => 1,
autom4te-2.60:                    'AM_PROG_AR' => 1,
autom4te-2.60:                    'AM_SILENT_RULES' => 1,
autom4te-2.60:                    '_AM_COND_ENDIF' => 1,
autom4te-2.60:                    'AM_PROG_CXX_C_O' => 1,
autom4te-2.60:                    '_LT_AC_TAGCONFIG' => 1,
autom4te-2.60:                    'AM_PROG_FC_C_O' => 1,
autom4te-2.60:                    'AM_MAINTAINER_MODE' => 1,
autom4te-2.60:                    'AM_GNU_GETTEXT_INTL_SUBDIR' => 1,
autom4te-2.60:                    'AC_CANONICAL_SYSTEM' => 1,
autom4te-2.60:                    '_AM_COND_ELSE' => 1,
autom4te-2.60:                    'AC_FC_PP_SRCEXT' => 1,
autom4te-2.60:                    'AM_PATH_GUILE' => 1,
autom4te-2.60:                    'AC_CANONICAL_TARGET' => 1,
autom4te-2.60:                    'AC_CANONICAL_HOST' => 1,
autom4te-2.60:                    'GTK_DOC_CHECK' => 1,
autom4te-2.60:                    'AM_POT_TOOLS' => 1,
autom4te-2.60:                    'm4_include' => 1,
autom4te-2.60:                    'AM_XGETTEXT_OPTION' => 1,
autom4te-2.60:                    'sinclude' => 1,
autom4te-2.60:                    'LT_CONFIG_LTDL_DIR' => 1,
autom4te-2.60:                    'AM_INIT_AUTOMAKE' => 1,
autom4te-2.60:                    'AC_SUBST_TRACE' => 1,
autom4te-2.60:                    'AC_FC_FREEFORM' => 1,
autom4te-2.60:                    'm4_sinclude' => 1,
autom4te-2.60:                    'AM_MAKEFILE_INCLUDE' => 1,
autom4te-2.60:                    'AC_LIBSOURCE' => 1,
autom4te-2.60:                    'AM_PROG_CC_C_O' => 1,
autom4te-2.60:                    'AC_CONFIG_FILES' => 1,
autom4te-2.60:                    'AC_INIT' => 1,
autom4te-2.60:                    'AM_AUTOMAKE_VERSION' => 1,
autom4te-2.60:                    'AC_CONFIG_HEADERS' => 1,
autom4te-2.60:                    'AM_EXTRA_RECURSIVE_TARGETS' => 1
autom4te-2.60:                  }
autom4te-2.60:                ], 'Autom4te::Request' );
autom4te-2.60: running: /usr/bin/m4 --nesting-limit=1024 --gnu --include=/usr/share/autoconf-2.60 --debug=aflq --fatal-warning --debugfile=autom4te.cache/traces.1t --trace=AC_CANONICAL_BUILD --trace=AC_CANONICAL_HOST --trace=AC_CANONICAL_SYSTEM --trace=AC_CANONICAL_TARGET --trace=AC_CONFIG_AUX_DIR --trace=AC_CONFIG_FILES --trace=AC_CONFIG_HEADERS --trace=AC_CONFIG_LIBOBJ_DIR --trace=AC_CONFIG_LINKS --trace=AC_CONFIG_SUBDIRS --trace=AC_DEFINE_TRACE_LITERAL --trace=AC_FC_FREEFORM --trace=AC_FC_PP_DEFINE --trace=AC_FC_PP_SRCEXT --trace=AC_FC_SRCEXT --trace=AC_INIT --trace=AC_LIBSOURCE --trace=AC_PROG_LIBTOOL --trace=AC_REQUIRE_AUX_FILE --trace=AC_SUBST --trace=AC_SUBST_TRACE --trace=AH_OUTPUT --trace=AM_AUTOMAKE_VERSION --trace=AM_CONDITIONAL --trace=AM_ENABLE_MULTILIB --trace=AM_EXTRA_RECURSIVE_TARGETS --trace=AM_GNU_GETTEXT --trace=AM_GNU_GETTEXT_INTL_SUBDIR --trace=AM_INIT_AUTOMAKE --trace=AM_MAINTAINER_MODE --trace=AM_MAKEFILE_INCLUDE --trace=AM_NLS --trace=AM_PATH_GUILE --trace=AM_POT_TOOLS --trace=AM_PROG_AR --trace=AM_PROG_CC_C_O --trace=AM_PROG_CXX_C_O --trace=AM_PROG_F77_C_O --trace=AM_PROG_FC_C_O --trace=AM_PROG_MKDIR_P --trace=AM_PROG_MOC --trace=AM_SILENT_RULES --trace=AM_XGETTEXT_OPTION --trace=GTK_DOC_CHECK --trace=IT_PROG_INTLTOOL --trace=LT_CONFIG_LTDL_DIR --trace=LT_INIT --trace=LT_SUPPORTED_TAG --trace=_AM_COND_ELSE --trace=_AM_COND_ENDIF --trace=_AM_COND_IF --trace=_AM_MAKEFILE_INCLUDE --trace=_AM_SUBST_NOTMAKE --trace=_LT_AC_TAGCONFIG --trace=_m4_warn --trace=include --trace=m4_include --trace=m4_pattern_allow --trace=m4_pattern_forbid --trace=m4_sinclude --trace=sinclude --reload-state=/usr/share/autoconf-2.60/autoconf/autoconf.m4f --undefine=__m4_version__ aclocal.m4 configure.ac > autom4te.cache/output.1t
autom4te-2.60: formatting traces for `/usr/src/tmp/arCMRWogqMH1/am4tzWNBg8JZFV/warnings': _m4_warn
autom4te-2.60: reading /usr/src/tmp/arCMRWogqMH1/am4tzWNBg8JZFV/warnings
autom4te-2.60: formatting traces for `-': AC_CONFIG_AUX_DIR, AC_CONFIG_HEADERS, AC_CONFIG_SUBDIRS, AC_INIT, AC_PROG_LIBTOOL, AM_GNU_GETTEXT, AM_INIT_AUTOMAKE, GTK_DOC_CHECK, IT_PROG_INTLTOOL, LT_CONFIG_LTDL_DIR, LT_INIT
autoreconf-default: configure.ac: not using Libtool
autoreconf-default: configure.ac: not using Intltool
autoreconf-default: configure.ac: not using gtk-doc
autoreconf-default: running: /usr/bin/autoconf-2.60 --force --verbose
autoconf-2.60: running /usr/bin/autom4te-2.60 --force --verbose --language=autoconf --output=configure configure.ac
autom4te-2.60: the trace request object is:
autom4te-2.60: $VAR1 = bless( [
autom4te-2.60:                  '1',
autom4te-2.60:                  0,
autom4te-2.60:                  [
autom4te-2.60:                    '/usr/share/autoconf-2.60'
autom4te-2.60:                  ],
autom4te-2.60:                  [
autom4te-2.60:                    '/usr/share/autoconf-2.60/autoconf/autoconf.m4f',
autom4te-2.60:                    'aclocal.m4',
autom4te-2.60:                    'configure.ac'
autom4te-2.60:                  ],
autom4te-2.60:                  {
autom4te-2.60:                    'AM_MAKEFILE_INCLUDE' => 1,
autom4te-2.60:                    '_AM_COND_ENDIF' => 1,
autom4te-2.60:                    'AM_GNU_GETTEXT' => 1,
autom4te-2.60:                    'AH_OUTPUT' => 1,
autom4te-2.60:                    'AM_POT_TOOLS' => 1,
autom4te-2.60:                    'LT_CONFIG_LTDL_DIR' => 1,
autom4te-2.60:                    'AC_FC_PP_DEFINE' => 1,
autom4te-2.60:                    'LT_SUPPORTED_TAG' => 1,
autom4te-2.60:                    'AM_PROG_AR' => 1,
autom4te-2.60:                    'AC_FC_PP_SRCEXT' => 1,
autom4te-2.60:                    'm4_pattern_forbid' => 1,
autom4te-2.60:                    'AC_CONFIG_LIBOBJ_DIR' => 1,
autom4te-2.60:                    '_AM_COND_IF' => 1,
autom4te-2.60:                    'AC_CONFIG_HEADERS' => 1,
autom4te-2.60:                    'AC_FC_SRCEXT' => 1,
autom4te-2.60:                    'AC_SUBST' => 1,
autom4te-2.60:                    'AC_CANONICAL_HOST' => 1,
autom4te-2.60:                    '_AM_COND_ELSE' => 1,
autom4te-2.60:                    'AC_CONFIG_AUX_DIR' => 1,
autom4te-2.60:                    'AM_ENABLE_MULTILIB' => 1,
autom4te-2.60:                    'AM_PROG_MKDIR_P' => 1,
autom4te-2.60:                    'IT_PROG_INTLTOOL' => 1,
autom4te-2.60:                    'AC_CONFIG_LINKS' => 1,
autom4te-2.60:                    '_AM_SUBST_NOTMAKE' => 1,
autom4te-2.60:                    'AM_NLS' => 1,
autom4te-2.60:                    'AM_PROG_CC_C_O' => 1,
autom4te-2.60:                    'AC_CANONICAL_SYSTEM' => 1,
autom4te-2.60:                    'AM_CONDITIONAL' => 1,
autom4te-2.60:                    'AC_REQUIRE_AUX_FILE' => 1,
autom4te-2.60:                    'AC_PROG_LIBTOOL' => 1,
autom4te-2.60:                    'm4_sinclude' => 1,
autom4te-2.60:                    'AM_MAINTAINER_MODE' => 1,
autom4te-2.60:                    'AM_PROG_MOC' => 1,
autom4te-2.60:                    'AC_SUBST_TRACE' => 1,
autom4te-2.60:                    'AC_CONFIG_FILES' => 1,
autom4te-2.60:                    'AM_SILENT_RULES' => 1,
autom4te-2.60:                    'AC_INIT' => 1,
autom4te-2.60:                    '_AM_MAKEFILE_INCLUDE' => 1,
autom4te-2.60:                    'AM_PROG_FC_C_O' => 1,
autom4te-2.60:                    'AC_DEFINE_TRACE_LITERAL' => 1,
autom4te-2.60:                    'AM_GNU_GETTEXT_INTL_SUBDIR' => 1,
autom4te-2.60:                    'AM_PROG_CXX_C_O' => 1,
autom4te-2.60:                    'AM_PROG_F77_C_O' => 1,
autom4te-2.60:                    'AM_EXTRA_RECURSIVE_TARGETS' => 1,
autom4te-2.60:                    'AM_PATH_GUILE' => 1,
autom4te-2.60:                    'include' => 1,
autom4te-2.60:                    'GTK_DOC_CHECK' => 1,
autom4te-2.60:                    'AM_INIT_AUTOMAKE' => 1,
autom4te-2.60:                    'm4_include' => 1,
autom4te-2.60:                    '_m4_warn' => 1,
autom4te-2.60:                    'AM_XGETTEXT_OPTION' => 1,
autom4te-2.60:                    '_LT_AC_TAGCONFIG' => 1,
autom4te-2.60:                    'AM_AUTOMAKE_VERSION' => 1,
autom4te-2.60:                    'm4_pattern_allow' => 1,
autom4te-2.60:                    'sinclude' => 1,
autom4te-2.60:                    'AC_LIBSOURCE' => 1,
autom4te-2.60:                    'AC_FC_FREEFORM' => 1,
autom4te-2.60:                    'AC_CONFIG_SUBDIRS' => 1,
autom4te-2.60:                    'AC_CANONICAL_BUILD' => 1,
autom4te-2.60:                    'LT_INIT' => 1,
autom4te-2.60:                    'AC_CANONICAL_TARGET' => 1
autom4te-2.60:                  }
autom4te-2.60:                ], 'Autom4te::Request' );
autom4te-2.60: running: /usr/bin/m4 --nesting-limit=1024 --gnu --include=/usr/share/autoconf-2.60 --debug=aflq --fatal-warning --debugfile=autom4te.cache/traces.1t --trace=AC_CANONICAL_BUILD --trace=AC_CANONICAL_HOST --trace=AC_CANONICAL_SYSTEM --trace=AC_CANONICAL_TARGET --trace=AC_CONFIG_AUX_DIR --trace=AC_CONFIG_FILES --trace=AC_CONFIG_HEADERS --trace=AC_CONFIG_LIBOBJ_DIR --trace=AC_CONFIG_LINKS --trace=AC_CONFIG_SUBDIRS --trace=AC_DEFINE_TRACE_LITERAL --trace=AC_FC_FREEFORM --trace=AC_FC_PP_DEFINE --trace=AC_FC_PP_SRCEXT --trace=AC_FC_SRCEXT --trace=AC_INIT --trace=AC_LIBSOURCE --trace=AC_PROG_LIBTOOL --trace=AC_REQUIRE_AUX_FILE --trace=AC_SUBST --trace=AC_SUBST_TRACE --trace=AH_OUTPUT --trace=AM_AUTOMAKE_VERSION --trace=AM_CONDITIONAL --trace=AM_ENABLE_MULTILIB --trace=AM_EXTRA_RECURSIVE_TARGETS --trace=AM_GNU_GETTEXT --trace=AM_GNU_GETTEXT_INTL_SUBDIR --trace=AM_INIT_AUTOMAKE --trace=AM_MAINTAINER_MODE --trace=AM_MAKEFILE_INCLUDE --trace=AM_NLS --trace=AM_PATH_GUILE --trace=AM_POT_TOOLS --trace=AM_PROG_AR --trace=AM_PROG_CC_C_O --trace=AM_PROG_CXX_C_O --trace=AM_PROG_F77_C_O --trace=AM_PROG_FC_C_O --trace=AM_PROG_MKDIR_P --trace=AM_PROG_MOC --trace=AM_SILENT_RULES --trace=AM_XGETTEXT_OPTION --trace=GTK_DOC_CHECK --trace=IT_PROG_INTLTOOL --trace=LT_CONFIG_LTDL_DIR --trace=LT_INIT --trace=LT_SUPPORTED_TAG --trace=_AM_COND_ELSE --trace=_AM_COND_ENDIF --trace=_AM_COND_IF --trace=_AM_MAKEFILE_INCLUDE --trace=_AM_SUBST_NOTMAKE --trace=_LT_AC_TAGCONFIG --trace=_m4_warn --trace=include --trace=m4_include --trace=m4_pattern_allow --trace=m4_pattern_forbid --trace=m4_sinclude --trace=sinclude --reload-state=/usr/share/autoconf-2.60/autoconf/autoconf.m4f --undefine=__m4_version__ aclocal.m4 configure.ac > autom4te.cache/output.1t
autom4te-2.60: formatting traces for `/usr/src/tmp/arCMRWogqMH1/am4tyxZafmhMfS/warnings': _m4_warn
autom4te-2.60: reading /usr/src/tmp/arCMRWogqMH1/am4tyxZafmhMfS/warnings
autom4te-2.60: creating configure
autom4te-2.60: formatting traces for `/usr/src/tmp/arCMRWogqMH1/am4tyxZafmhMfS/patterns': m4_pattern_allow, m4_pattern_forbid
autom4te-2.60: forbidden tokens: ^_?A[CHUM]_|_AC_|^LIBOBJS$|^_?m4_|^dnl$|^_?AS_|^_?PKG_[A-Z_]+$
autom4te-2.60: forbidden token : ^LIBOBJS$ => do not use LIBOBJS directly, use AC_LIBOBJ (see section `AC_LIBOBJ vs LIBOBJS'
autom4te-2.60: allowed   tokens: ^AS_FLAGS$|^SHELL$|^PATH_SEPARATOR$|^PACKAGE_NAME$|^PACKAGE_TARNAME$|^PACKAGE_VERSION$|^PACKAGE_STRING$|^PACKAGE_BUGREPORT$|^PACKAGE_URL$|^exec_prefix$|^prefix$|^program_transform_name$|^bindir$|^sbindir$|^libexecdir$|^datarootdir$|^datadir$|^sysconfdir$|^sharedstatedir$|^localstatedir$|^includedir$|^oldincludedir$|^docdir$|^infodir$|^htmldir$|^dvidir$|^pdfdir$|^psdir$|^libdir$|^localedir$|^mandir$|^PACKAGE_NAME$|^PACKAGE_TARNAME$|^PACKAGE_VERSION$|^PACKAGE_STRING$|^PACKAGE_BUGREPORT$|^PACKAGE_URL$|^DEFS$|^ECHO_C$|^ECHO_N$|^ECHO_T$|^LIBS$|^build_alias$|^host_alias$|^target_alias$|^CXX$|^CXXFLAGS$|^LDFLAGS$|^LIBS$|^CPPFLAGS$|^CXX$|^ac_ct_CXX$|^EXEEXT$|^OBJEXT$|^INSTALL_PROGRAM$|^INSTALL_SCRIPT$|^INSTALL_DATA$|^MKDIR_P$|^build$|^build_cpu$|^build_vendor$|^build_os$|^host$|^host_cpu$|^host_vendor$|^host_os$|^CXXCPP$|^CPPFLAGS$|^CXXCPP$|^GREP$|^EGREP$|^STDC_HEADERS$|^HAVE_SYS_PARAM_H$|^WORDS_BIGENDIAN$|^AC_APPLE_UNIVERSAL_BUILD$|^uint16_t$|^PKG_CONFIG(_(PATH|LIBDIR|SYSROOT_DIR|ALLOW_SYSTEM_(CFLAGS|LIBS)))?$|^PKG_CONFIG_(DISABLE_UNINSTALLED|TOP_BUILD_DIR|DEBUG_SPEW)$|^PKG_CONFIG$|^PKG_CONFIG_PATH$|^PKG_CONFIG_LIBDIR$|^PKG_CONFIG$|^__CYGWIN__$|^__CYGWIN__$|^__UNIX__$|^__WIN32__$|^__NOCYGWIN__$|^__MACOS__$|^__FREEBSD__$|^__LINUX__$|^__GNU_HURD__$|^XMKMF$|^HAVE_LIBZ$|^HAVE_SOCKETS$|^HAVE_JPEGLIB_H$|^HAVE_LIBJPEG$|^HAVE_TIFFIO_H$|^HAVE_LIBTIFF$|^HAVE_LIBPNG$|^libpng_CFLAGS$|^libpng_LIBS$|^HAVE_LIBPNG$|^LIBPNG_CONFIG$|^HAVE_LIBPNG$|^cairo_CFLAGS$|^cairo_LIBS$|^POPPLER_CFLAGS$|^POPPLER_LIBS$|^QMAKE_PROG$|^QMAKE_PROG$|^HAVE_GL_GLU_H$|^HAVE_LIBGLU_H$|^HAVE_LIBGLE_STATIC$|^HAVE_LIBGLE$|^HAVE_LIBGLE_STATIC$|^HAVE_LIBTINFO$|^HAVE_NCURSES_H$|^HAVE_CURSES_H$|^STRIP$|^ac_ct_STRIP$|^STRIPALL$|^STRIPUNNEEDED$|^STRIPALL$|^STRIPUNNEEDED$|^HAVE_X11$|^HAVE_CAIRO$|^HAVE_POPPLER$|^HAVE_SOCKETS$|^HAVE_LIBTIFF$|^HAVE_LIBPNG$|^HAVE_LIBJPEG$|^HAVE_CAIRO$|^HAVE_NOSCRIPTS$|^HAVE_QT$|^HAVE_LIBGLE$|^HAVE_LIBGLE_CPPFLAGS$|^HAVE_LIBGLE_STATIC$|^HAVE_AUTOPACKAGE$|^HAVE_MAC$|^HAVE_FREEBSD$|^HAVE_WIN32$|^HAVE_NOCYGWIN$|^HAVE_CYGWIN$|^HAVE_MINGW$|^HAVE_RPATH$|^QMAKE_PROG$|^MAKE_MANIP$|^AP_CONFIG_ARGS$|^GLE_SNAPSHOT$|^SIMPLE_LIBS$|^SIMPLE_LIBS_DL$|^SIMPLE_LDFLAGS$|^MANIP_LIBS$|^MANIP_LDFLAGS$|^LIBGLE_CPPFLAGS$|^LIBGLE_LDFLAGS$|^GLE_INSTALL_DATA$|^GLE_INSTALL_BIN$|^GLE_VERSION$|^MAKE_AUTOPACKAGE$|^QT_CONFIG$|^QT_RPATH$|^QT_LIBGLU_LIB$|^QT_CPPFLAGS$|^QT_LDFLAGS$|^HAVE_EXTRA_FONTS$|^LIBOBJS$|^LTLIBOBJS$
autoreconf-default: running: /usr/bin/autoheader-2.60 --force --verbose
autoheader-2.60: autoheader-2.60: running '/usr/bin/autom4te-2.60' --language=autoconf  --force --verbose to trace from configure.ac
autoheader-2.60: running: '/usr/bin/autom4te-2.60' --language=autoconf  --force --verbose --trace AC_CONFIG_HEADERS:'$$config_h ||= '"'"'$1'"'"';' --trace AH_OUTPUT:'$$verbatim{'"'"'$1'"'"'} = '"'"'$2'"'"';' --trace AC_DEFINE_TRACE_LITERAL:'$$symbol{'"'"'$1'"'"'} = 1;' configure.ac >/usr/src/tmp/arCMRWogqMH1/ahZfr8KpqHn0/traces.pl
autom4te-2.60: the trace request object is:
autom4te-2.60: $VAR1 = bless( [
autom4te-2.60:                  '1',
autom4te-2.60:                  0,
autom4te-2.60:                  [
autom4te-2.60:                    '/usr/share/autoconf-2.60'
autom4te-2.60:                  ],
autom4te-2.60:                  [
autom4te-2.60:                    '/usr/share/autoconf-2.60/autoconf/autoconf.m4f',
autom4te-2.60:                    'aclocal.m4',
autom4te-2.60:                    'configure.ac'
autom4te-2.60:                  ],
autom4te-2.60:                  {
autom4te-2.60:                    'AM_GNU_GETTEXT_INTL_SUBDIR' => 1,
autom4te-2.60:                    'AM_AUTOMAKE_VERSION' => 1,
autom4te-2.60:                    'sinclude' => 1,
autom4te-2.60:                    '_AM_SUBST_NOTMAKE' => 1,
autom4te-2.60:                    'AC_CONFIG_LIBOBJ_DIR' => 1,
autom4te-2.60:                    'AC_FC_PP_SRCEXT' => 1,
autom4te-2.60:                    'AC_CONFIG_LINKS' => 1,
autom4te-2.60:                    'AM_PROG_MKDIR_P' => 1,
autom4te-2.60:                    'm4_include' => 1,
autom4te-2.60:                    'AC_SUBST' => 1,
autom4te-2.60:                    'AC_FC_PP_DEFINE' => 1,
autom4te-2.60:                    'AC_CONFIG_AUX_DIR' => 1,
autom4te-2.60:                    'AC_CANONICAL_BUILD' => 1,
autom4te-2.60:                    'm4_pattern_allow' => 1,
autom4te-2.60:                    'AM_PROG_CC_C_O' => 1,
autom4te-2.60:                    'AM_PROG_F77_C_O' => 1,
autom4te-2.60:                    'LT_INIT' => 1,
autom4te-2.60:                    'AC_CANONICAL_SYSTEM' => 1,
autom4te-2.60:                    'AC_CONFIG_HEADERS' => 1,
autom4te-2.60:                    '_LT_AC_TAGCONFIG' => 1,
autom4te-2.60:                    'AM_EXTRA_RECURSIVE_TARGETS' => 1,
autom4te-2.60:                    'AM_PROG_MOC' => 1,
autom4te-2.60:                    'm4_sinclude' => 1,
autom4te-2.60:                    'LT_SUPPORTED_TAG' => 1,
autom4te-2.60:                    'AM_PROG_FC_C_O' => 1,
autom4te-2.60:                    'AM_POT_TOOLS' => 1,
autom4te-2.60:                    'AM_SILENT_RULES' => 1,
autom4te-2.60:                    'AH_OUTPUT' => 1,
autom4te-2.60:                    'AM_INIT_AUTOMAKE' => 1,
autom4te-2.60:                    'AC_SUBST_TRACE' => 1,
autom4te-2.60:                    'AC_REQUIRE_AUX_FILE' => 1,
autom4te-2.60:                    'AC_INIT' => 1,
autom4te-2.60:                    '_AM_COND_ENDIF' => 1,
autom4te-2.60:                    'AM_PROG_CXX_C_O' => 1,
autom4te-2.60:                    'AC_FC_SRCEXT' => 1,
autom4te-2.60:                    'AM_MAKEFILE_INCLUDE' => 1,
autom4te-2.60:                    'AM_XGETTEXT_OPTION' => 1,
autom4te-2.60:                    'AC_CONFIG_FILES' => 1,
autom4te-2.60:                    '_AM_COND_ELSE' => 1,
autom4te-2.60:                    'include' => 1,
autom4te-2.60:                    'AM_PATH_GUILE' => 1,
autom4te-2.60:                    'AM_PROG_AR' => 1,
autom4te-2.60:                    'AC_CONFIG_SUBDIRS' => 1,
autom4te-2.60:                    'AM_MAINTAINER_MODE' => 1,
autom4te-2.60:                    '_m4_warn' => 1,
autom4te-2.60:                    'IT_PROG_INTLTOOL' => 1,
autom4te-2.60:                    'AM_GNU_GETTEXT' => 1,
autom4te-2.60:                    'AM_CONDITIONAL' => 1,
autom4te-2.60:                    'AC_LIBSOURCE' => 1,
autom4te-2.60:                    '_AM_COND_IF' => 1,
autom4te-2.60:                    'AC_PROG_LIBTOOL' => 1,
autom4te-2.60:                    'AC_DEFINE_TRACE_LITERAL' => 1,
autom4te-2.60:                    'AM_ENABLE_MULTILIB' => 1,
autom4te-2.60:                    'AM_NLS' => 1,
autom4te-2.60:                    'GTK_DOC_CHECK' => 1,
autom4te-2.60:                    'LT_CONFIG_LTDL_DIR' => 1,
autom4te-2.60:                    'AC_FC_FREEFORM' => 1,
autom4te-2.60:                    'm4_pattern_forbid' => 1,
autom4te-2.60:                    'AC_CANONICAL_TARGET' => 1,
autom4te-2.60:                    'AC_CANONICAL_HOST' => 1,
autom4te-2.60:                    '_AM_MAKEFILE_INCLUDE' => 1
autom4te-2.60:                  }
autom4te-2.60:                ], 'Autom4te::Request' );
autom4te-2.60: running: /usr/bin/m4 --nesting-limit=1024 --gnu --include=/usr/share/autoconf-2.60 --debug=aflq --fatal-warning --debugfile=autom4te.cache/traces.1t --trace=AC_CANONICAL_BUILD --trace=AC_CANONICAL_HOST --trace=AC_CANONICAL_SYSTEM --trace=AC_CANONICAL_TARGET --trace=AC_CONFIG_AUX_DIR --trace=AC_CONFIG_FILES --trace=AC_CONFIG_HEADERS --trace=AC_CONFIG_LIBOBJ_DIR --trace=AC_CONFIG_LINKS --trace=AC_CONFIG_SUBDIRS --trace=AC_DEFINE_TRACE_LITERAL --trace=AC_FC_FREEFORM --trace=AC_FC_PP_DEFINE --trace=AC_FC_PP_SRCEXT --trace=AC_FC_SRCEXT --trace=AC_INIT --trace=AC_LIBSOURCE --trace=AC_PROG_LIBTOOL --trace=AC_REQUIRE_AUX_FILE --trace=AC_SUBST --trace=AC_SUBST_TRACE --trace=AH_OUTPUT --trace=AM_AUTOMAKE_VERSION --trace=AM_CONDITIONAL --trace=AM_ENABLE_MULTILIB --trace=AM_EXTRA_RECURSIVE_TARGETS --trace=AM_GNU_GETTEXT --trace=AM_GNU_GETTEXT_INTL_SUBDIR --trace=AM_INIT_AUTOMAKE --trace=AM_MAINTAINER_MODE --trace=AM_MAKEFILE_INCLUDE --trace=AM_NLS --trace=AM_PATH_GUILE --trace=AM_POT_TOOLS --trace=AM_PROG_AR --trace=AM_PROG_CC_C_O --trace=AM_PROG_CXX_C_O --trace=AM_PROG_F77_C_O --trace=AM_PROG_FC_C_O --trace=AM_PROG_MKDIR_P --trace=AM_PROG_MOC --trace=AM_SILENT_RULES --trace=AM_XGETTEXT_OPTION --trace=GTK_DOC_CHECK --trace=IT_PROG_INTLTOOL --trace=LT_CONFIG_LTDL_DIR --trace=LT_INIT --trace=LT_SUPPORTED_TAG --trace=_AM_COND_ELSE --trace=_AM_COND_ENDIF --trace=_AM_COND_IF --trace=_AM_MAKEFILE_INCLUDE --trace=_AM_SUBST_NOTMAKE --trace=_LT_AC_TAGCONFIG --trace=_m4_warn --trace=include --trace=m4_include --trace=m4_pattern_allow --trace=m4_pattern_forbid --trace=m4_sinclude --trace=sinclude --reload-state=/usr/share/autoconf-2.60/autoconf/autoconf.m4f --undefine=__m4_version__ aclocal.m4 configure.ac > autom4te.cache/output.1t
autom4te-2.60: formatting traces for `/usr/src/tmp/arCMRWogqMH1/am4tFujhTnNm1x/warnings': _m4_warn
autom4te-2.60: reading /usr/src/tmp/arCMRWogqMH1/am4tFujhTnNm1x/warnings
autom4te-2.60: formatting traces for `-': AC_CONFIG_HEADERS, AC_DEFINE_TRACE_LITERAL, AH_OUTPUT
autoheader-2.60: 'src/config.h.in' is updated
autoreconf-default: configure.ac: not using Automake
autoreconf-default: Leaving directory `.'
+ CFLAGS='-pipe -frecord-gcc-switches -Wall -g -O2 -flto=auto'
+ export CFLAGS
+ CXXFLAGS='-pipe -frecord-gcc-switches -Wall -g -O2 -flto=auto'
+ export CXXFLAGS
+ FFLAGS='-pipe -frecord-gcc-switches -Wall -g -O2 -flto=auto'
+ export FFLAGS
+ FCFLAGS='-pipe -frecord-gcc-switches -Wall -g -O2 -flto=auto'
+ export FCFLAGS
+ '[' -n '' ']'
++ sed -r 's/(^|[[:space:]]+)-[^m][^[:space:]]*//g'
++ printf %s '-pipe -frecord-gcc-switches -Wall -g -O2 -flto=auto'
+ ASFLAGS=
+ export ASFLAGS
+ export lt_cv_deplibs_check_method=pass_all
+ lt_cv_deplibs_check_method=pass_all
+ readlink -e -- ./configure
+ xargs -ri dirname -- '{}'
+ sort -u
+ xargs -ri find '{}' -type f '(' -name config.sub -or -name config.guess ')' -printf '%h/\n'
+ xargs -rn1 install -pm755 -- /usr/share/gnu-config/config.sub /usr/share/gnu-config/config.guess
+ ./configure --build=x86_64-alt-linux --host=x86_64-alt-linux --prefix=/usr --exec-prefix=/usr --bindir=/usr/bin --sbindir=/usr/sbin --sysconfdir=/etc --datadir=/usr/share --includedir=/usr/include --libdir=/usr/lib64 --libexecdir=/usr/lib --localstatedir=/var/lib --sharedstatedir=/var/lib --mandir=/usr/share/man --infodir=/usr/share/info --disable-dependency-tracking --disable-silent-rules --without-included-gettext --with-manip --with-x --with-qt=/usr/lib64/qt4 --with-rpath=no --with-jpeg=yes --with-png=yes --with-tiff=yes --with-z=yes --with-extrafonts
configure: WARNING: unrecognized options: --disable-dependency-tracking, --disable-silent-rules, --without-included-gettext
checking for x86_64-alt-linux-g++... x86_64-alt-linux-g++
checking whether the C++ compiler works... yes
checking for C++ compiler default output file name... a.out
checking for suffix of executables... 
checking whether we are cross compiling... no
checking for suffix of object files... o
checking whether we are using the GNU C++ compiler... yes
checking whether x86_64-alt-linux-g++ accepts -g... yes
checking for a BSD-compatible install... /bin/install -c
checking for a thread-safe mkdir -p... /bin/mkdir -p
checking build system type... x86_64-alt-linux-gnu
checking host system type... x86_64-alt-linux-gnu
checking how to run the C++ preprocessor... x86_64-alt-linux-g++ -E
checking for grep that handles long lines and -e... /bin/grep
checking for egrep... /bin/grep -E
checking for ANSI C header files... yes
checking for sys/types.h... yes
checking for sys/stat.h... yes
checking for stdlib.h... yes
checking for string.h... yes
checking for memory.h... yes
checking for strings.h... yes
checking for inttypes.h... yes
checking for stdint.h... yes
checking for unistd.h... yes
checking sys/param.h usability... yes
checking sys/param.h presence... yes
checking for sys/param.h... yes
checking whether byte ordering is bigendian... no
checking for uint16_t... yes
checking for x86_64-alt-linux-pkg-config... no
checking for pkg-config... /usr/bin/pkg-config
checking pkg-config is at least version 0.9.0... yes
checking for X... libraries , headers 
checking for XOpenDisplay in -lX11... yes
checking for deflate in -lz... yes
checking for library containing socket... none required
checking for library containing gethostbyname... none required
checking for jpeg_destroy_decompress in -ljpeg... yes
checking jpeglib.h usability... yes
checking jpeglib.h presence... yes
checking for jpeglib.h... yes
checking for TIFFReadScanline in -ltiff... yes
checking tiffio.h usability... yes
checking tiffio.h presence... yes
checking for tiffio.h... yes
checking for libpng >= 0... yes
checking for cairo >= 1.10.0... yes
   cairo CFLAGS: -I/usr/include/cairo -I/usr/include/freetype2 -I/usr/include/harfbuzz -I/usr/include/glib-2.0 -I/usr/lib64/glib-2.0/include -I/usr/include/libpng16
   cairo LIBS: -lcairo
checking for poppler-glib >= 0.10.0... no
checking GL/glu.h usability... yes
checking GL/glu.h presence... yes
checking for GL/glu.h... yes
checking for gluLookAt in -lGLU... yes
checking for library containing dlopen... -ldl
checking for tgetent in -ltinfo... yes
checking for library containing wbkgdset... -lncurses
checking ncurses.h usability... yes
checking ncurses.h presence... yes
checking for ncurses.h... yes
checking for x86_64-alt-linux-strip,gstrip... no
checking for strip,gstrip... no
Checking if strip is GNU strip
strip is GNU strip (strip)
configure: creating ./config.status
config.status: creating Makefile
config.status: creating src/gle/Makefile
config.status: creating src/gle/bitmap/Makefile
config.status: creating src/gle/letzfitz/Makefile
config.status: creating src/gle/surface/Makefile
config.status: creating src/gle/tokens/Makefile
config.status: creating src/fbuild/Makefile
config.status: creating src/makefmt/Makefile
config.status: creating src/manip/Makefile
config.status: creating src/TeX/Makefile
config.status: creating src/gui/MakefileAC
config.status: creating src/gui/qgle.pro
config.status: creating src/doc/gle.1
config.status: creating platform/autoconf/gle-graphics.pc
config.status: creating platform/autopackage/gle4.apspec
config.status: creating src/config.h
configure: WARNING: unrecognized options: --disable-dependency-tracking, --disable-silent-rules, --without-included-gettext

CPPFLAGS: -DHAVE_CONFIG_H $(VERSION_INFO) -Wno-write-strings -I/usr/include/cairo -I/usr/include/freetype2 -I/usr/include/harfbuzz -I/usr/include/glib-2.0 -I/usr/lib64/glib-2.0/include -I/usr/include/libpng16 -I/usr/include/libpng16 
LDFLAGS:    -L. 
LIBS: -lcairo -lpng16 -lz -ltiff -ljpeg -lz -lX11  
SIMPLE_LIBS: 
SIMPLE_LIBS_DL: -ldl 
SIMPLE_LDFLAGS: 

** Configuration summary for GLE 4.2.5 (x86_64-alt-linux-gnu):

   ** Bitmap support:
      PNG support: yes
      TIFF support: yes
      JPEG support: yes
      Statically link: no

   ** X11 preview support: yes
   ** Cairo graphics support: yes
   ** Poppler PDF support: no
   ** Socket support: yes
   ** Include 'manip' utility: yes
   ** Debug mode: off

   ** GLE GUI support: yes
      Using Qt version 4.8.7 in /usr/lib64

** Install data into: /usr/share/gle-graphics/4.2.5
** Install binary into: /usr/bin
   (use ./configure --prefix=dir to change the installation directory.)

GLE 4.2.5 has been configured. The next step is to run "make". After "make" completes, run "make install" to install GLE.
+ make
make: Entering directory '/usr/src/RPM/BUILD/gle-graphics-4.2.5'
/bin/mkdir -p build
/bin/mkdir -p build/bin
/bin/mkdir -p build/lib
/bin/mkdir -p build/doc
/bin/mkdir -p build/gleinc
make -C src/gle make_glebtool
make[1]: Entering directory '/usr/src/RPM/BUILD/gle-graphics-4.2.5/src/gle'
x86_64-alt-linux-g++ -DHAVE_CONFIG_H -DGLEVN="\"4.2.5\"" -Wno-write-strings -I/usr/include/cairo -I/usr/include/freetype2 -I/usr/include/harfbuzz -I/usr/include/glib-2.0 -I/usr/lib64/glib-2.0/include -I/usr/include/libpng16 -I/usr/include/libpng16 -c cutils.cpp -o cutils.static.o
x86_64-alt-linux-g++ -DHAVE_CONFIG_H -DGLEVN="\"4.2.5\"" -Wno-write-strings -I/usr/include/cairo -I/usr/include/freetype2 -I/usr/include/harfbuzz -I/usr/include/glib-2.0 -I/usr/lib64/glib-2.0/include -I/usr/include/libpng16 -I/usr/include/libpng16 -c file_io.cpp -o file_io.static.o
x86_64-alt-linux-g++ -DHAVE_CONFIG_H -DGLEVN="\"4.2.5\"" -Wno-write-strings -I/usr/include/cairo -I/usr/include/freetype2 -I/usr/include/harfbuzz -I/usr/include/glib-2.0 -I/usr/lib64/glib-2.0/include -I/usr/include/libpng16 -I/usr/include/libpng16  glebtool.cpp cutils.static.o file_io.static.o   -o ../../build/bin/glebtool
../../build/bin/glebtool -setrelpath /usr/bin /usr/lib64 /usr/share/gle-graphics/4.2.5 /usr/share/doc/gle-graphics ../config.h
GLE will be installed as follows:
Binary:   "/usr/bin"
Library:  "/usr/lib64"
          (Up: 1, Relative: "lib64")
GLE_TOP:  "/usr/share/gle-graphics/4.2.5"
          (Up: 1, Relative: "share/gle-graphics/4.2.5")
DOC:      "/usr/share/doc/gle-graphics"
          (Up: 2, Relative: "doc/gle-graphics")
echo "begin config gle" > ../../build/glerc
echo "   current = 4.2.5" >> ../../build/glerc
echo "end config" >> ../../build/glerc
make[1]: Leaving directory '/usr/src/RPM/BUILD/gle-graphics-4.2.5/src/gle'
make -C src/gle/bitmap
make[1]: Entering directory '/usr/src/RPM/BUILD/gle-graphics-4.2.5/src/gle/bitmap'
x86_64-alt-linux-g++ -fPIC -DHAVE_CONFIG_H -DGLEVN="\"4.2.5\"" -Wno-write-strings -I/usr/include/cairo -I/usr/include/freetype2 -I/usr/include/harfbuzz -I/usr/include/glib-2.0 -I/usr/lib64/glib-2.0/include -I/usr/include/libpng16 -I/usr/include/libpng16 -c img2ps.cpp -o img2ps.o
In file included from img2ps.cpp:48:
img2ps.h:198:16: warning: 'uint16' is deprecated [-Wdeprecated-declarations]
  198 |         uint16 m_TIFFCompress;
      |                ^~~~~~~~~~~~~~
In file included from /usr/include/tiffio.h:31,
                 from img2ps.h:50,
                 from img2ps.cpp:48:
/usr/include/tiff.h:81:38: note: declared here
   81 | typedef TIFF_MSC_DEPRECATED uint16_t uint16 TIFF_GCC_DEPRECATED;
      |                                      ^~~~~~
In file included from img2ps.cpp:48:
img2ps.h:210:35: warning: 'uint16' is deprecated [-Wdeprecated-declarations]
  210 |         uint16 getTIFFCompression() { return m_TIFFCompress; }
      |                                   ^
In file included from /usr/include/tiffio.h:31,
                 from img2ps.h:50,
                 from img2ps.cpp:48:
/usr/include/tiff.h:81:38: note: declared here
   81 | typedef TIFF_MSC_DEPRECATED uint16_t uint16 TIFF_GCC_DEPRECATED;
      |                                      ^~~~~~
x86_64-alt-linux-g++ -fPIC -DHAVE_CONFIG_H -DGLEVN="\"4.2.5\"" -Wno-write-strings -I/usr/include/cairo -I/usr/include/freetype2 -I/usr/include/harfbuzz -I/usr/include/glib-2.0 -I/usr/lib64/glib-2.0/include -I/usr/include/libpng16 -I/usr/include/libpng16 -c lzwencode.cpp -o lzwencode.o
In file included from lzwencode.cpp:28:
img2ps.h:198:16: warning: 'uint16' is deprecated [-Wdeprecated-declarations]
  198 |         uint16 m_TIFFCompress;
      |                ^~~~~~~~~~~~~~
In file included from /usr/include/tiffio.h:31,
                 from img2ps.h:50,
                 from lzwencode.cpp:28:
/usr/include/tiff.h:81:38: note: declared here
   81 | typedef TIFF_MSC_DEPRECATED uint16_t uint16 TIFF_GCC_DEPRECATED;
      |                                      ^~~~~~
In file included from lzwencode.cpp:28:
img2ps.h:210:35: warning: 'uint16' is deprecated [-Wdeprecated-declarations]
  210 |         uint16 getTIFFCompression() { return m_TIFFCompress; }
      |                                   ^
In file included from /usr/include/tiffio.h:31,
                 from img2ps.h:50,
                 from lzwencode.cpp:28:
/usr/include/tiff.h:81:38: note: declared here
   81 | typedef TIFF_MSC_DEPRECATED uint16_t uint16 TIFF_GCC_DEPRECATED;
      |                                      ^~~~~~
lzwencode.cpp: In function 'void GLELZWEncoderClearHash(encodeState*)':
lzwencode.cpp:128:26: warning: ISO C++17 does not allow 'register' storage class specifier [-Wregister]
  128 |         register hash_t *hp = &sp->enc_hashtab[HSIZE-1];
      |                          ^~
lzwencode.cpp:129:23: warning: ISO C++17 does not allow 'register' storage class specifier [-Wregister]
  129 |         register long i = HSIZE-8;
      |                       ^
lzwencode.cpp: In member function 'int GLELZWByteStream::encode(GLEBYTE*, GLEDWORD)':
lzwencode.cpp:211:31: warning: ISO C++17 does not allow 'register' storage class specifier [-Wregister]
  211 |         register encodeState *sp = (encodeState*)m_Data;
      |                               ^~
lzwencode.cpp:212:23: warning: ISO C++17 does not allow 'register' storage class specifier [-Wregister]
  212 |         register long fcode;
      |                       ^~~~~
lzwencode.cpp:213:26: warning: ISO C++17 does not allow 'register' storage class specifier [-Wregister]
  213 |         register hash_t *hp;
      |                          ^~
lzwencode.cpp:214:22: warning: ISO C++17 does not allow 'register' storage class specifier [-Wregister]
  214 |         register int h, c;
      |                      ^
lzwencode.cpp:214:25: warning: ISO C++17 does not allow 'register' storage class specifier [-Wregister]
  214 |         register int h, c;
      |                         ^
lzwencode.cpp: In member function 'int GLELZWByteStream::postEncode()':
lzwencode.cpp:365:31: warning: ISO C++17 does not allow 'register' storage class specifier [-Wregister]
  365 |         register encodeState *sp = (encodeState*)m_Data;
      |                               ^~
x86_64-alt-linux-g++ -fPIC -DHAVE_CONFIG_H -DGLEVN="\"4.2.5\"" -Wno-write-strings -I/usr/include/cairo -I/usr/include/freetype2 -I/usr/include/harfbuzz -I/usr/include/glib-2.0 -I/usr/lib64/glib-2.0/include -I/usr/include/libpng16 -I/usr/include/libpng16 -c glegif.cpp -o glegif.o
In file included from glegif.cpp:46:
img2ps.h:198:16: warning: 'uint16' is deprecated [-Wdeprecated-declarations]
  198 |         uint16 m_TIFFCompress;
      |                ^~~~~~~~~~~~~~
In file included from /usr/include/tiffio.h:31,
                 from img2ps.h:50,
                 from glegif.cpp:46:
/usr/include/tiff.h:81:38: note: declared here
   81 | typedef TIFF_MSC_DEPRECATED uint16_t uint16 TIFF_GCC_DEPRECATED;
      |                                      ^~~~~~
In file included from glegif.cpp:46:
img2ps.h:210:35: warning: 'uint16' is deprecated [-Wdeprecated-declarations]
  210 |         uint16 getTIFFCompression() { return m_TIFFCompress; }
      |                                   ^
In file included from /usr/include/tiffio.h:31,
                 from img2ps.h:50,
                 from glegif.cpp:46:
/usr/include/tiff.h:81:38: note: declared here
   81 | typedef TIFF_MSC_DEPRECATED uint16_t uint16 TIFF_GCC_DEPRECATED;
      |                                      ^~~~~~
x86_64-alt-linux-g++ -fPIC -DHAVE_CONFIG_H -DGLEVN="\"4.2.5\"" -Wno-write-strings -I/usr/include/cairo -I/usr/include/freetype2 -I/usr/include/harfbuzz -I/usr/include/glib-2.0 -I/usr/lib64/glib-2.0/include -I/usr/include/libpng16 -I/usr/include/libpng16 -c glejpeg.cpp -o glejpeg.o
In file included from glejpeg.cpp:46:
img2ps.h:198:16: warning: 'uint16' is deprecated [-Wdeprecated-declarations]
  198 |         uint16 m_TIFFCompress;
      |                ^~~~~~~~~~~~~~
In file included from /usr/include/tiffio.h:31,
                 from img2ps.h:50,
                 from glejpeg.cpp:46:
/usr/include/tiff.h:81:38: note: declared here
   81 | typedef TIFF_MSC_DEPRECATED uint16_t uint16 TIFF_GCC_DEPRECATED;
      |                                      ^~~~~~
In file included from glejpeg.cpp:46:
img2ps.h:210:35: warning: 'uint16' is deprecated [-Wdeprecated-declarations]
  210 |         uint16 getTIFFCompression() { return m_TIFFCompress; }
      |                                   ^
In file included from /usr/include/tiffio.h:31,
                 from img2ps.h:50,
                 from glejpeg.cpp:46:
/usr/include/tiff.h:81:38: note: declared here
   81 | typedef TIFF_MSC_DEPRECATED uint16_t uint16 TIFF_GCC_DEPRECATED;
      |                                      ^~~~~~
x86_64-alt-linux-g++ -fPIC -DHAVE_CONFIG_H -DGLEVN="\"4.2.5\"" -Wno-write-strings -I/usr/include/cairo -I/usr/include/freetype2 -I/usr/include/harfbuzz -I/usr/include/glib-2.0 -I/usr/lib64/glib-2.0/include -I/usr/include/libpng16 -I/usr/include/libpng16 -c gletiff.cpp -o gletiff.o
In file included from gletiff.cpp:50:
img2ps.h:198:16: warning: 'uint16' is deprecated [-Wdeprecated-declarations]
  198 |         uint16 m_TIFFCompress;
      |                ^~~~~~~~~~~~~~
In file included from /usr/include/tiffio.h:31,
                 from gletiff.cpp:49:
/usr/include/tiff.h:81:38: note: declared here
   81 | typedef TIFF_MSC_DEPRECATED uint16_t uint16 TIFF_GCC_DEPRECATED;
      |                                      ^~~~~~
In file included from gletiff.cpp:50:
img2ps.h:210:35: warning: 'uint16' is deprecated [-Wdeprecated-declarations]
  210 |         uint16 getTIFFCompression() { return m_TIFFCompress; }
      |                                   ^
In file included from /usr/include/tiffio.h:31,
                 from gletiff.cpp:49:
/usr/include/tiff.h:81:38: note: declared here
   81 | typedef TIFF_MSC_DEPRECATED uint16_t uint16 TIFF_GCC_DEPRECATED;
      |                                      ^~~~~~
gletiff.cpp: In member function 'virtual int GLETIFF::readHeader()':
gletiff.cpp:73:16: warning: 'uint16' is deprecated [-Wdeprecated-declarations]
   73 |         uint16 samplesperpixel, bitspersample, planarconfiguration;
      |                ^~~~~~~~~~~~~~~
In file included from /usr/include/tiffio.h:31,
                 from gletiff.cpp:49:
/usr/include/tiff.h:81:38: note: declared here
   81 | typedef TIFF_MSC_DEPRECATED uint16_t uint16 TIFF_GCC_DEPRECATED;
      |                                      ^~~~~~
gletiff.cpp:73:33: warning: 'uint16' is deprecated [-Wdeprecated-declarations]
   73 |         uint16 samplesperpixel, bitspersample, planarconfiguration;
      |                                 ^~~~~~~~~~~~~
In file included from /usr/include/tiffio.h:31,
                 from gletiff.cpp:49:
/usr/include/tiff.h:81:38: note: declared here
   81 | typedef TIFF_MSC_DEPRECATED uint16_t uint16 TIFF_GCC_DEPRECATED;
      |                                      ^~~~~~
gletiff.cpp:73:48: warning: 'uint16' is deprecated [-Wdeprecated-declarations]
   73 |         uint16 samplesperpixel, bitspersample, planarconfiguration;
      |                                                ^~~~~~~~~~~~~~~~~~~
In file included from /usr/include/tiffio.h:31,
                 from gletiff.cpp:49:
/usr/include/tiff.h:81:38: note: declared here
   81 | typedef TIFF_MSC_DEPRECATED uint16_t uint16 TIFF_GCC_DEPRECATED;
      |                                      ^~~~~~
gletiff.cpp:74:16: warning: 'uint16' is deprecated [-Wdeprecated-declarations]
   74 |         uint16 photometric, extrasamples, *sampleinfo;
      |                ^~~~~~~~~~~
In file included from /usr/include/tiffio.h:31,
                 from gletiff.cpp:49:
/usr/include/tiff.h:81:38: note: declared here
   81 | typedef TIFF_MSC_DEPRECATED uint16_t uint16 TIFF_GCC_DEPRECATED;
      |                                      ^~~~~~
gletiff.cpp:74:29: warning: 'uint16' is deprecated [-Wdeprecated-declarations]
   74 |         uint16 photometric, extrasamples, *sampleinfo;
      |                             ^~~~~~~~~~~~
In file included from /usr/include/tiffio.h:31,
                 from gletiff.cpp:49:
/usr/include/tiff.h:81:38: note: declared here
   81 | typedef TIFF_MSC_DEPRECATED uint16_t uint16 TIFF_GCC_DEPRECATED;
      |                                      ^~~~~~
gletiff.cpp:74:44: warning: 'uint16' is deprecated [-Wdeprecated-declarations]
   74 |         uint16 photometric, extrasamples, *sampleinfo;
      |                                            ^~~~~~~~~~
In file included from /usr/include/tiffio.h:31,
                 from gletiff.cpp:49:
/usr/include/tiff.h:81:38: note: declared here
   81 | typedef TIFF_MSC_DEPRECATED uint16_t uint16 TIFF_GCC_DEPRECATED;
      |                                      ^~~~~~
gletiff.cpp: In member function 'virtual int GLETIFF::prepare(int)':
gletiff.cpp:152:25: warning: 'uint16' is deprecated [-Wdeprecated-declarations]
  152 |                 uint16 *rmap, *gmap, *bmap;
      |                         ^~~~
In file included from /usr/include/tiffio.h:31,
                 from gletiff.cpp:49:
/usr/include/tiff.h:81:38: note: declared here
   81 | typedef TIFF_MSC_DEPRECATED uint16_t uint16 TIFF_GCC_DEPRECATED;
      |                                      ^~~~~~
gletiff.cpp:152:32: warning: 'uint16' is deprecated [-Wdeprecated-declarations]
  152 |                 uint16 *rmap, *gmap, *bmap;
      |                                ^~~~
In file included from /usr/include/tiffio.h:31,
                 from gletiff.cpp:49:
/usr/include/tiff.h:81:38: note: declared here
   81 | typedef TIFF_MSC_DEPRECATED uint16_t uint16 TIFF_GCC_DEPRECATED;
      |                                      ^~~~~~
gletiff.cpp:152:39: warning: 'uint16' is deprecated [-Wdeprecated-declarations]
  152 |                 uint16 *rmap, *gmap, *bmap;
      |                                       ^~~~
In file included from /usr/include/tiffio.h:31,
                 from gletiff.cpp:49:
/usr/include/tiff.h:81:38: note: declared here
   81 | typedef TIFF_MSC_DEPRECATED uint16_t uint16 TIFF_GCC_DEPRECATED;
      |                                      ^~~~~~
x86_64-alt-linux-g++ -fPIC -DHAVE_CONFIG_H -DGLEVN="\"4.2.5\"" -Wno-write-strings -I/usr/include/cairo -I/usr/include/freetype2 -I/usr/include/harfbuzz -I/usr/include/glib-2.0 -I/usr/lib64/glib-2.0/include -I/usr/include/libpng16 -I/usr/include/libpng16 -c glepng.cpp -o glepng.o
In file included from glepng.cpp:46:
img2ps.h:198:16: warning: 'uint16' is deprecated [-Wdeprecated-declarations]
  198 |         uint16 m_TIFFCompress;
      |                ^~~~~~~~~~~~~~
In file included from /usr/include/tiffio.h:31,
                 from img2ps.h:50,
                 from glepng.cpp:46:
/usr/include/tiff.h:81:38: note: declared here
   81 | typedef TIFF_MSC_DEPRECATED uint16_t uint16 TIFF_GCC_DEPRECATED;
      |                                      ^~~~~~
In file included from glepng.cpp:46:
img2ps.h:210:35: warning: 'uint16' is deprecated [-Wdeprecated-declarations]
  210 |         uint16 getTIFFCompression() { return m_TIFFCompress; }
      |                                   ^
In file included from /usr/include/tiffio.h:31,
                 from img2ps.h:50,
                 from glepng.cpp:46:
/usr/include/tiff.h:81:38: note: declared here
   81 | typedef TIFF_MSC_DEPRECATED uint16_t uint16 TIFF_GCC_DEPRECATED;
      |                                      ^~~~~~
x86_64-alt-linux-g++ -fPIC -DHAVE_CONFIG_H -DGLEVN="\"4.2.5\"" -Wno-write-strings -I/usr/include/cairo -I/usr/include/freetype2 -I/usr/include/harfbuzz -I/usr/include/glib-2.0 -I/usr/lib64/glib-2.0/include -I/usr/include/libpng16 -I/usr/include/libpng16 -c ascii85.cpp -o ascii85.o
In file included from ascii85.cpp:48:
img2ps.h:198:16: warning: 'uint16' is deprecated [-Wdeprecated-declarations]
  198 |         uint16 m_TIFFCompress;
      |                ^~~~~~~~~~~~~~
In file included from /usr/include/tiffio.h:31,
                 from img2ps.h:50,
                 from ascii85.cpp:48:
/usr/include/tiff.h:81:38: note: declared here
   81 | typedef TIFF_MSC_DEPRECATED uint16_t uint16 TIFF_GCC_DEPRECATED;
      |                                      ^~~~~~
In file included from ascii85.cpp:48:
img2ps.h:210:35: warning: 'uint16' is deprecated [-Wdeprecated-declarations]
  210 |         uint16 getTIFFCompression() { return m_TIFFCompress; }
      |                                   ^
In file included from /usr/include/tiffio.h:31,
                 from img2ps.h:50,
                 from ascii85.cpp:48:
/usr/include/tiff.h:81:38: note: declared here
   81 | typedef TIFF_MSC_DEPRECATED uint16_t uint16 TIFF_GCC_DEPRECATED;
      |                                      ^~~~~~
make[1]: Leaving directory '/usr/src/RPM/BUILD/gle-graphics-4.2.5/src/gle/bitmap'
make -C src/gle/surface
make[1]: Entering directory '/usr/src/RPM/BUILD/gle-graphics-4.2.5/src/gle/surface'
x86_64-alt-linux-g++ -fPIC -DHAVE_CONFIG_H -DGLEVN="\"4.2.5\"" -Wno-write-strings -I/usr/include/cairo -I/usr/include/freetype2 -I/usr/include/harfbuzz -I/usr/include/glib-2.0 -I/usr/lib64/glib-2.0/include -I/usr/include/libpng16 -I/usr/include/libpng16 -c gsurface.cpp -o gsurface.o
In file included from ../glepro.h:42,
                 from ../all.h:73,
                 from gsurface.cpp:44:
../tokens/Tokenizer.h:138:54: error: ISO C++17 does not allow dynamic exception specifications
  138 | double tokenizer_string_to_double(const char* value) throw(ParserError);
      |                                                      ^~~~~
../tokens/Tokenizer.h:146:46: error: ISO C++17 does not allow dynamic exception specifications
  146 | void g_throw_parser_error(const string& err) throw(ParserError);
      |                                              ^~~~~
../tokens/Tokenizer.h:148:53: error: ISO C++17 does not allow dynamic exception specifications
  148 | void g_throw_parser_error(const char* err, int idx) throw(ParserError);
      |                                                     ^~~~~
../tokens/Tokenizer.h:150:81: error: ISO C++17 does not allow dynamic exception specifications
  150 | void g_throw_parser_error(const char* str1, const char* str2, const char* str3) throw(ParserError);
      |                                                                                 ^~~~~
../tokens/Tokenizer.h:152:99: error: ISO C++17 does not allow dynamic exception specifications
  152 | void g_throw_parser_error_sys(const char* str1, const char* str2 = NULL, const char* str3 = NULL) throw(ParserError);
      |                                                                                                   ^~~~~
../tokens/Tokenizer.h:303:31: error: ISO C++17 does not allow dynamic exception specifications
  303 |         int has_more_tokens() throw(ParserError);
      |                               ^~~~~
../tokens/Tokenizer.h:306:30: error: ISO C++17 does not allow dynamic exception specifications
  306 |         string& next_token() throw(ParserError);
      |                              ^~~~~
../tokens/Tokenizer.h:309:73: error: ISO C++17 does not allow dynamic exception specifications
  309 |         string& next_continuous_string_excluding(const char* forbidden) throw(ParserError);
      |                                                                         ^~~~~
../tokens/Tokenizer.h:311:34: error: ISO C++17 does not allow dynamic exception specifications
  311 |         string& try_next_token() throw(ParserError);
      |                                  ^~~~~
../tokens/Tokenizer.h:313:29: error: ISO C++17 does not allow dynamic exception specifications
  313 |         string& read_line() throw(ParserError);
      |                             ^~~~~
../tokens/Tokenizer.h:315:30: error: ISO C++17 does not allow dynamic exception specifications
  315 |         double next_double() throw(ParserError);
      |                              ^~~~~
../tokens/Tokenizer.h:317:28: error: ISO C++17 does not allow dynamic exception specifications
  317 |         int next_integer() throw(ParserError);
      |                            ^~~~~
../tokens/Tokenizer.h:333:53: error: ISO C++17 does not allow dynamic exception specifications
  333 |         void next_token_and_pos(TokenAndPos& tkpos) throw(ParserError);
      |                                                     ^~~~~
../tokens/Tokenizer.h:345:40: error: ISO C++17 does not allow dynamic exception specifications
  345 |         void peek_token(string* token) throw(ParserError);
      |                                        ^~~~~
../tokens/Tokenizer.h:366:46: error: ISO C++17 does not allow dynamic exception specifications
  366 |         int is_next_token(const char* token) throw(ParserError);
      |                                              ^~~~~
../tokens/Tokenizer.h:368:48: error: ISO C++17 does not allow dynamic exception specifications
  368 |         int is_next_token_i(const char* token) throw(ParserError);
      |                                                ^~~~~
../tokens/Tokenizer.h:370:48: error: ISO C++17 does not allow dynamic exception specifications
  370 |         int is_next_token(const string& token) throw(ParserError) {
      |                                                ^~~~~
../tokens/Tokenizer.h:377:52: error: ISO C++17 does not allow dynamic exception specifications
  377 |         int is_next_token_in(const char* charlist) throw(ParserError);
      |                                                    ^~~~~
../tokens/Tokenizer.h:379:51: error: ISO C++17 does not allow dynamic exception specifications
  379 |         void ensure_next_token(const char* token) throw(ParserError);
      |                                                   ^~~~~
../tokens/Tokenizer.h:383:53: error: ISO C++17 does not allow dynamic exception specifications
  383 |         void ensure_next_token_i(const char* token) throw(ParserError);
      |                                                     ^~~~~
../tokens/Tokenizer.h:385:56: error: ISO C++17 does not allow dynamic exception specifications
  385 |         int ensure_next_token_in(const char* charlist) throw(ParserError);
      |                                                        ^~~~~
../tokens/Tokenizer.h:389:59: error: ISO C++17 does not allow dynamic exception specifications
  389 |         void ensure_next_token_list(const char* charlist) throw(ParserError);
      |                                                           ^~~~~
../tokens/Tokenizer.h:395:40: error: ISO C++17 does not allow dynamic exception specifications
  395 |         void read_till_close_comment() throw(ParserError);
      |                                        ^~~~~
../tokens/Tokenizer.h:397:41: error: ISO C++17 does not allow dynamic exception specifications
  397 |         string& next_multilevel_token() throw(ParserError);
      |                                         ^~~~~
../tokens/Tokenizer.h:399:44: error: ISO C++17 does not allow dynamic exception specifications
  399 |         virtual char token_read_sig_char() throw(ParserError);
      |                                            ^~~~~
../tokens/Tokenizer.h:451:38: error: ISO C++17 does not allow dynamic exception specifications
  451 |         void copy_string(char endch) throw(ParserError);
      |                                      ^~~~~
../tokens/Tokenizer.h:452:46: error: ISO C++17 does not allow dynamic exception specifications
  452 |         void multi_level_do_multi(char open) throw(ParserError);
      |                                              ^~~~~
../tokens/Tokenizer.h:453:26: error: ISO C++17 does not allow dynamic exception specifications
  453 |         void get_token() throw(ParserError);
      |                          ^~~~~
../tokens/Tokenizer.h:456:28: error: ISO C++17 does not allow dynamic exception specifications
  456 |         void get_token_2() throw(ParserError);
      |                            ^~~~~
../tokens/Tokenizer.h:457:32: error: ISO C++17 does not allow dynamic exception specifications
  457 |         void get_check_token() throw(ParserError);
      |                                ^~~~~
../tokens/Tokenizer.h:472:45: error: ISO C++17 does not allow dynamic exception specifications
  472 |         void open_tokens(const char* fname) throw(ParserError);
      |                                             ^~~~~
../tokens/Tokenizer.h:473:47: error: ISO C++17 does not allow dynamic exception specifications
  473 |         void open_tokens(const string& fname) throw(ParserError);
      |                                               ^~~~~
In file included from ../all.h:73,
                 from gsurface.cpp:44:
../glepro.h:75:58: error: ISO C++17 does not allow dynamic exception specifications
   75 | GLERC<GLEColor> pass_color_var(const std::string& token) throw(ParserError);
      |                                                          ^~~~~
../glepro.h:78:26: error: ISO C++17 does not allow dynamic exception specifications
   78 | int pass_marker(char *s) throw(ParserError);
      |                          ^~~~~
../glepro.h:148:71: error: ISO C++17 does not allow dynamic exception specifications
  148 | void validate_open_input_stream(ifstream& input, const string& fname) throw(ParserError);
      |                                                                       ^~~~~
../glepro.h:149:74: error: ISO C++17 does not allow dynamic exception specifications
  149 | FILE* validate_fopen(const string& fname, const char *mode, bool isread) throw(ParserError);
      |                                                                          ^~~~~
../glepro.h:150:59: error: ISO C++17 does not allow dynamic exception specifications
  150 | void validate_file_name(const string& fname, bool isread) throw(ParserError);
      |                                                           ^~~~~
In file included from ../gle-interface/gle-interface.h:1209,
                 from ../core.h:43,
                 from gsurface.cpp:46:
../gle-interface/gle-sourcefile.h:94:21: error: ISO C++17 does not allow dynamic exception specifications
   94 |         void load() throw(ParserError);
      |                     ^~~~~
../gle-interface/gle-sourcefile.h:131:21: error: ISO C++17 does not allow dynamic exception specifications
  131 |         void load() throw(ParserError);
      |                     ^~~~~
In file included from ../core.h:44,
                 from gsurface.cpp:46:
../d_interface.h:89:113: error: ISO C++17 does not allow dynamic exception specifications
   89 |         virtual void opendev(double width, double height, GLEFileLocation* outputfile, const string& inputfile) throw(ParserError) = 0;
      |                                                                                                                 ^~~~~
In file included from ../core.h:44,
                 from gsurface.cpp:46:
../d_interface.h:172:113: error: ISO C++17 does not allow dynamic exception specifications
  172 |         virtual void opendev(double width, double height, GLEFileLocation* outputfile, const string& inputfile) throw(ParserError);
      |                                                                                                                 ^~~~~
In file included from ../core.h:44,
                 from gsurface.cpp:46:
../d_interface.h:268:113: error: ISO C++17 does not allow dynamic exception specifications
  268 |         virtual void opendev(double width, double height, GLEFileLocation* outputfile, const string& inputfile) throw(ParserError);
      |                                                                                                                 ^~~~~
../d_interface.h:311:113: error: ISO C++17 does not allow dynamic exception specifications
  311 |         virtual void opendev(double width, double height, GLEFileLocation* outputfile, const string& inputfile) throw(ParserError);
      |                                                                                                                 ^~~~~
../d_interface.h:319:113: error: ISO C++17 does not allow dynamic exception specifications
  319 |         virtual void opendev(double width, double height, GLEFileLocation* outputfile, const string& inputfile) throw(ParserError);
      |                                                                                                                 ^~~~~
../d_interface.h:328:113: error: ISO C++17 does not allow dynamic exception specifications
  328 |         virtual void opendev(double width, double height, GLEFileLocation* outputfile, const string& inputfile) throw(ParserError);
      |                                                                                                                 ^~~~~
../d_interface.h:392:113: error: ISO C++17 does not allow dynamic exception specifications
  392 |         virtual void opendev(double width, double height, GLEFileLocation* outputfile, const string& inputfile) throw(ParserError);
      |                                                                                                                 ^~~~~
In file included from ../core.h:44,
                 from gsurface.cpp:46:
../d_interface.h:493:113: error: ISO C++17 does not allow dynamic exception specifications
  493 |         virtual void opendev(double width, double height, GLEFileLocation* outputfile, const string& inputfile) throw(ParserError);
      |                                                                                                                 ^~~~~
In file included from gsurface.cpp:46:
../core.h:223:47: error: ISO C++17 does not allow dynamic exception specifications
  223 | void g_marker2(int i, double sz, double dval) throw (ParserError);
      |                                               ^~~~~
../core.h:240:62: error: ISO C++17 does not allow dynamic exception specifications
  240 | void g_bitmap(string& fname, double wx, double wy, int type) throw(ParserError);
      |                                                              ^~~~~
../core.h:241:65: error: ISO C++17 does not allow dynamic exception specifications
  241 | void g_bitmap_info(string& fname, int xvar, int yvar, int type) throw(ParserError);
      |                                                                 ^~~~~
../core.h:252:68: error: ISO C++17 does not allow dynamic exception specifications
  252 | void g_arrowline(double x2, double y2, int flag, int can_fillpath) throw(ParserError);
      |                                                                    ^~~~~
../core.h:276:54: error: ISO C++17 does not allow dynamic exception specifications
  276 | void g_arrow(double dx, double dy, int can_fillpath) throw(ParserError);
      |                                                      ^~~~~
../core.h:298:47: error: ISO C++17 does not allow dynamic exception specifications
  298 | int g_set_compatibility(const string& compat) throw (ParserError);
      |                                               ^~~~~
../core.h:299:49: error: ISO C++17 does not allow dynamic exception specifications
  299 | int g_parse_compatibility(const string& compat) throw (ParserError);
      |                                                 ^~~~~
../core.h:326:43: error: ISO C++17 does not allow dynamic exception specifications
  326 | void g_set_arrow_style(const char* shape) throw (ParserError);
      |                                           ^~~~~
../core.h:327:39: error: ISO C++17 does not allow dynamic exception specifications
  327 | void g_set_arrow_tip(const char* tip) throw (ParserError);
      |                                       ^~~~~
../core.h:329:59: error: ISO C++17 does not allow dynamic exception specifications
  329 | void g_bitmap(GLEBitmap*, double wx, double wy, int type) throw(ParserError);
      |                                                           ^~~~~
../core.h:421:47: error: ISO C++17 does not allow dynamic exception specifications
  421 | void g_postscript(char *ss,double w,double h) throw (ParserError);
      |                                               ^~~~~
In file included from gsurface.cpp:48:
../texinterface.h:222:42: error: ISO C++17 does not allow dynamic exception specifications
  222 |         TeXObject* draw(const char* str) throw(ParserError);
      |                                          ^~~~~
../texinterface.h:223:72: error: ISO C++17 does not allow dynamic exception specifications
  223 |         TeXObject* drawUTF8(const char* str, GLERectangle* box = NULL) throw(ParserError);
      |                                                                        ^~~~~
../texinterface.h:224:68: error: ISO C++17 does not allow dynamic exception specifications
  224 |         TeXObject* draw(const std::string& str, GLERectangle* box) throw(ParserError);
      |                                                                    ^~~~~
../texinterface.h:225:81: error: ISO C++17 does not allow dynamic exception specifications
  225 |         TeXObject* draw(const char* str, int nblines, GLERectangle* box = NULL) throw(ParserError);
      |                                                                                 ^~~~~
../texinterface.h:226:102: error: ISO C++17 does not allow dynamic exception specifications
  226 |         TeXObject* draw(const char* str, TeXObjectInfo& info, int nblines, GLERectangle* box = NULL) throw(ParserError);
      |                                                                                                      ^~~~~
../texinterface.h:227:96: error: ISO C++17 does not allow dynamic exception specifications
  227 |         TeXObject* drawObj(TeXHashObject* hobj, TeXObjectInfo& info, GLERectangle* box = NULL) throw(ParserError);
      |                                                                                                ^~~~~
In file included from gsurface.cpp:59:
../begin.h:74:33: error: ISO C++17 does not allow dynamic exception specifications
   74 | double token_next_double(int i) throw(ParserError);
      |                                 ^~~~~
gsurface.cpp:72:18: error: ISO C++17 does not allow dynamic exception specifications
   72 | void pass_line() throw(ParserError);
      |                  ^~~~~
gsurface.cpp:233:18: error: ISO C++17 does not allow dynamic exception specifications
  233 | void pass_line() throw(ParserError) {
      |                  ^~~~~
make[1]: *** [Makefile:60: gsurface.o] Error 1
make[1]: Leaving directory '/usr/src/RPM/BUILD/gle-graphics-4.2.5/src/gle/surface'
make: *** [Makefile:160: make_all] Error 2
make: Leaving directory '/usr/src/RPM/BUILD/gle-graphics-4.2.5'
error: Bad exit status from /usr/src/tmp/rpm-tmp.97132 (%build)


RPM build errors:
    Bad exit status from /usr/src/tmp/rpm-tmp.97132 (%build)
Command exited with non-zero status 1
9.27user 1.87system 0:12.17elapsed 91%CPU (0avgtext+0avgdata 136668maxresident)k
0inputs+0outputs (0major+700096minor)pagefaults 0swaps
hsh-rebuild: rebuild of `gle-4.2.5-alt2.src.rpm' failed.
Command exited with non-zero status 1
20.49user 4.90system 0:27.37elapsed 92%CPU (0avgtext+0avgdata 136668maxresident)k
0inputs+0outputs (0major+989137minor)pagefaults 0swaps