86>Jul 3 07:28:51 userdel[2353689]: delete user 'rooter'
<86>Jul 3 07:28:51 userdel[2353689]: removed group 'rooter' owned by 'rooter'
<86>Jul 3 07:28:51 userdel[2353689]: removed shadow group 'rooter' owned by 'rooter'
<86>Jul 3 07:28:51 groupadd[2353694]: group added to /etc/group: name=rooter, GID=642
<86>Jul 3 07:28:51 groupadd[2353694]: group added to /etc/gshadow: name=rooter
<86>Jul 3 07:28:51 groupadd[2353694]: new group: name=rooter, GID=642
<86>Jul 3 07:28:51 useradd[2353698]: new user: name=rooter, UID=642, GID=642, home=/root, shell=/bin/bash
<86>Jul 3 07:28:51 userdel[2353704]: delete user 'builder'
<86>Jul 3 07:28:51 userdel[2353704]: removed group 'builder' owned by 'builder'
<86>Jul 3 07:28:51 userdel[2353704]: removed shadow group 'builder' owned by 'builder'
<86>Jul 3 07:28:51 groupadd[2353709]: group added to /etc/group: name=builder, GID=643
<86>Jul 3 07:28:51 groupadd[2353709]: group added to /etc/gshadow: name=builder
<86>Jul 3 07:28:51 groupadd[2353709]: new group: name=builder, GID=643
<86>Jul 3 07:28:51 useradd[2353718]: new user: name=builder, UID=643, GID=643, home=/usr/src, shell=/bin/bash
warning: user aris does not exist - using root
warning: group aris does not exist - using root
warning: user aris does not exist - using root
warning: group aris does not exist - using root
warning: user aris does not exist - using root
warning: group aris does not exist - using root
<13>Jul 3 07:28:54 rpmi: xml-utils-1:2.9.12-alt1 sisyphus+275606.100.1.1 1624544756 installed
<13>Jul 3 07:28:54 rpmi: rpm-build-gir-0.7.3-alt3 sisyphus+242150.100.1.1 1575312005 installed
<13>Jul 3 07:28:54 rpmi: rpm-build-vala-0.3-alt1 1332324961 installed
<13>Jul 3 07:28:57 rpmi: sgml-common-0.6.3-alt15 sisyphus+276099.100.1.1 1624817971 installed
<13>Jul 3 07:28:57 rpmi: docbook-dtds-4.5-alt1 sisyphus+276837.100.1.1 1625242123 installed
<13>Jul 3 07:28:57 rpmi: vapi-common-0.52.4-alt1 sisyphus+273611.100.1.1 1622836610 installed
<13>Jul 3 07:28:57 rpmi: libogg-1.3.5-alt1 sisyphus+262536.100.3.1 1625189808 installed
<13>Jul 3 07:28:57 rpmi: libvorbis-1.3.7-alt1 sisyphus+275738.100.1.1 1624751601 installed
<13>Jul 3 07:28:57 rpmi: libxslt-1.1.34-alt3 sisyphus+275636.100.1.1 1624616833 installed
<13>Jul 3 07:28:57 rpmi: libsqlite3-3.35.5-alt1 sisyphus+270436.100.1.1 1619019785 installed
<13>Jul 3 07:28:57 rpmi: libnspr-1:4.31-alt1 sisyphus+273509.100.1.1 1622733773 installed
<13>Jul 3 07:28:57 rpmi: libgdbm-1.8.3-alt10 sisyphus+275301.100.2.1 1624464967 installed
<13>Jul 3 07:28:57 rpmi: libexpat-2.2.10-alt1 sisyphus+276608.100.1.2 1625153355 installed
<13>Jul 3 07:28:57 rpmi: libidn2-2.3.1-alt1 sisyphus+272590.100.1.1 1622036908 installed
<13>Jul 3 07:28:57 rpmi: libnettle8-3.7.3-alt1 sisyphus+276723.100.1.2 1625211788 installed
<13>Jul 3 07:28:57 rpmi: libp11-kit-0.23.15-alt2 sisyphus+252784.100.2.2 1591274915 installed
<13>Jul 3 07:28:57 rpmi: libtasn1-4.17.0-alt1 sisyphus+276722.100.1.1 1625211284 installed
<13>Jul 3 07:28:57 rpmi: libhogweed6-3.7.3-alt1 sisyphus+276723.100.1.2 1625211788 installed
<13>Jul 3 07:28:57 rpmi: libgnutls30-3.6.16-alt1 sisyphus+273086.100.1.1 1622478144 installed
<13>Jul 3 07:28:57 rpmi: xsltproc-1.1.34-alt3 sisyphus+275636.100.1.1 1624616833 installed
<13>Jul 3 07:28:57 rpmi: libflac8-1.3.3.0.79.37d1-alt1 sisyphus+276615.100.2.1 1625160488 installed
<13>Jul 3 07:28:57 rpmi: docbook-style-xsl-1.79.1-alt4 sisyphus+232871.100.1.1 1561238010 installed
<13>Jul 3 07:28:58 rpmi: libverto-0.3.2-alt1_1 sisyphus+268398.100.1.1 1616717436 installed
<13>Jul 3 07:28:58 rpmi: publicsuffix-list-dafsa-20210419-alt1 sisyphus+270358.100.1.1 1618924010 installed
<13>Jul 3 07:28:58 rpmi: libpsl-0.21.1-alt2 sisyphus+271468.100.1.1 1620753481 installed
<13>Jul 3 07:28:58 rpmi: liblmdb-0.9.23-alt1 sisyphus+275369.100.1.2 1624493869 installed
<13>Jul 3 07:28:58 rpmi: libkeyutils-1.6.3-alt1 sisyphus+266061.100.1.1 1612919566 installed
<13>Jul 3 07:28:58 rpmi: libcom_err-1.46.2.0.16.f114-alt1 sisyphus+276538.100.2.1 1625107888 installed
<13>Jul 3 07:28:58 rpmi: libtdb-1.4.3-alt1 sisyphus+265234.27100.49.1 1613758997 installed
<13>Jul 3 07:28:58 rpmi: libltdl7-2.4.6-alt3 sisyphus+269178.2000.13.1 1618328447 installed
<13>Jul 3 07:28:58 rpmi: libopus-1.3.1-alt3 sisyphus+248017.100.1.1 1584520346 installed
<13>Jul 3 07:28:58 rpmi: libgsm-1.0.17-alt1 sisyphus+275359.100.2.1 1624907612 installed
<13>Jul 3 07:28:58 rpmi: libsndfile-1.0.31-alt1 sisyphus+272065.100.1.1 1621321692 installed
<13>Jul 3 07:28:58 rpmi: liblz4-1:1.9.3-alt1 sisyphus+276625.100.1.3 1625166777 installed
<13>Jul 3 07:28:58 rpmi: libgpg-error-1.42-alt1 sisyphus+275524.40.1.1 1624455807 installed
<13>Jul 3 07:28:58 rpmi: libgcrypt20-1.9.3-alt1 sisyphus+275524.100.1.1 1624455938 installed
<13>Jul 3 07:28:58 rpmi: libsystemd-1:248.3-alt1 sisyphus+272702.500.6.1 1622206882 installed
<13>Jul 3 07:28:58 rpmi: libdbus-1.12.18-alt1 sisyphus+275285.100.2.2 1624573321 installed
<13>Jul 3 07:28:58 rpmi: sound-theme-freedesktop-0.8-alt1 1402011605 installed
<13>Jul 3 07:28:58 rpmi: libasyncns-0.8-alt2.qa1 sisyphus+275091.100.1.1 1624402241 installed
<13>Jul 3 07:28:58 rpmi: libXdmcp-1.1.3-alt1 sisyphus+225206.600.1.2 1552949347 installed
<13>Jul 3 07:28:58 rpmi: libXau-1.0.9-alt1 sisyphus+223149.200.2.1 1551268156 installed
<13>Jul 3 07:28:58 rpmi: libxcb-1.14-alt1 sisyphus+247358.200.1.3 1583854223 installed
<13>Jul 3 07:28:58 rpmi: libpulseaudio-14.2-alt5 sisyphus+275541.100.1.1 1624460812 installed
<13>Jul 3 07:28:58 rpmi: libOpenSP-1.5.2-alt3.qa1 sisyphus+275224.100.2.1 1624562590 installed
<13>Jul 3 07:28:58 rpmi: openjade-1.3.2-alt15 sisyphus+275151.100.1.1 1624410010 installed
<13>Jul 3 07:28:58 rpmi: docbook-style-dsssl-1.79-alt3 sisyphus+276057.100.1.1 1624814788 installed
<13>Jul 3 07:28:58 rpmi: libpython-2.7.18-alt5 sisyphus+270920.100.1.1 1619657735 installed
<13>Jul 3 07:28:59 rpmi: python2-base-2.7.18-alt5 sisyphus+270920.100.1.1 1619657735 installed
<13>Jul 3 07:28:59 rpmi: python-modules-curses-2.7.18-alt5 sisyphus+270920.100.1.1 1619657735 installed
<13>Jul 3 07:28:59 rpmi: python-sphinx-objects.inv-1:2.3.11.20210603-alt1 sisyphus+273776.100.1.1 1623098186 installed
<13>Jul 3 07:28:59 rpmi: libffi-devel-1:3.3-alt1 sisyphus+251953.40.2.1 1589890886 installed
<13>Jul 3 07:28:59 rpmi: libproxy-0.4.17-alt1.1 sisyphus+269879.13200.52.1 1622230380 installed
<13>Jul 3 07:28:59 rpmi: gsettings-desktop-schemas-data-40.0-alt1 sisyphus+268501.300.4.2 1617041783 installed
<13>Jul 3 07:28:59 rpmi: shared-mime-info-2.1-alt1 sisyphus+264261.100.1.1 1609507718 installed
<13>Jul 3 07:28:59 rpmi: libgio-2.68.3-alt1 sisyphus+274220.40.2.1 1623407398 installed
<13>Jul 3 07:28:59 rpmi: gsettings-desktop-schemas-40.0-alt1 sisyphus+268501.300.4.2 1617041783 installed
<13>Jul 3 07:28:59 rpmi: gobject-introspection-1.68.0-alt1 sisyphus+268501.200.4.2 1617041737 installed
<13>Jul 3 07:28:59 rpmi: gobject-introspection-x11-1.68.0-alt1 sisyphus+268501.200.4.2 1617041737 installed
<13>Jul 3 07:28:59 rpmi: libgstreamer1.0-1.18.4-alt2 sisyphus+271170.400.1.1 1620030775 installed
<13>Jul 3 07:28:59 rpmi: rpm-macros-alternatives-0.5.1-alt1 sisyphus+276601.100.1.1 1625149883 installed
<13>Jul 3 07:28:59 rpmi: alternatives-0.5.1-alt1 sisyphus+276601.100.1.1 1625149883 installed
<13>Jul 3 07:28:59 rpmi: ca-certificates-2021.06.03-alt1 sisyphus+273509.400.1.1 1622736045 installed
<13>Jul 3 07:28:59 rpmi: ca-trust-0.1.2-alt1 sisyphus+233348.100.1.1 1561653823 installed
<13>Jul 3 07:28:59 rpmi: p11-kit-trust-0.23.15-alt2 sisyphus+252784.100.2.2 1591274915 installed
<13>Jul 3 07:28:59 rpmi: libcrypto1.1-1.1.1k-alt1 sisyphus+268375.100.1.1 1616684123 installed
<13>Jul 3 07:28:59 rpmi: libssl1.1-1.1.1k-alt1 sisyphus+268375.100.1.1 1616684123 installed
<13>Jul 3 07:28:59 rpmi: libpython3-3.9.6-alt1 sisyphus+276295.100.1.1 1624964289 installed
<13>Jul 3 07:28:59 rpmi: python3-3.9.6-alt1 sisyphus+276295.100.1.1 1624964289 installed
<13>Jul 3 07:29:00 rpmi: python3-base-3.9.6-alt1 sisyphus+276295.100.1.1 1624964289 installed
<13>Jul 3 07:29:00 rpmi: python-modules-compiler-2.7.18-alt5 sisyphus+270920.100.1.1 1619657735 installed
<13>Jul 3 07:29:00 rpmi: python-modules-email-2.7.18-alt5 sisyphus+270920.100.1.1 1619657735 installed
<13>Jul 3 07:29:00 rpmi: python-modules-unittest-2.7.18-alt5 sisyphus+270920.100.1.1 1619657735 installed
<13>Jul 3 07:29:00 rpmi: python-modules-encodings-2.7.18-alt5 sisyphus+270920.100.1.1 1619657735 installed
<13>Jul 3 07:29:01 rpmi: python-modules-2.7.18-alt5 sisyphus+270920.100.1.1 1619657735 installed
<13>Jul 3 07:29:01 rpmi: python3-module-six-1.15.0-alt2 sisyphus+270533.5100.6.1 1619685463 installed
<13>Jul 3 07:29:01 rpmi: glib2-devel-2.68.3-alt1 sisyphus+274220.40.2.1 1623407398 installed
<13>Jul 3 07:29:01 rpmi: python3-module-pkg_resources-1:57.0.0-alt1 sisyphus+272429.100.1.1 1621886156 installed
<13>Jul 3 07:29:01 rpmi: libgio-devel-2.68.3-alt1 sisyphus+274220.40.2.1 1623407398 installed
<13>Jul 3 07:29:01 rpmi: python3-module-genshi-0.7.4-alt2 sisyphus+275930.100.2.1 1624873830 installed
<13>Jul 3 07:29:01 rpmi: python-modules-xml-2.7.18-alt5 sisyphus+270920.100.1.1 1619657735 installed
<13>Jul 3 07:29:01 rpmi: python-modules-hotshot-2.7.18-alt5 sisyphus+270920.100.1.1 1619657735 installed
<13>Jul 3 07:29:01 rpmi: python-modules-bsddb-2.7.18-alt5 sisyphus+270920.100.1.1 1619657735 installed
<13>Jul 3 07:29:01 rpmi: python-modules-ctypes-2.7.18-alt5 sisyphus+270920.100.1.1 1619657735 installed
<13>Jul 3 07:29:01 rpmi: python-modules-multiprocessing-2.7.18-alt5 sisyphus+270920.100.1.1 1619657735 installed
<13>Jul 3 07:29:01 rpmi: python-modules-logging-2.7.18-alt5 sisyphus+270920.100.1.1 1619657735 installed
<13>Jul 3 07:29:01 rpmi: python-2.7.18-alt5 sisyphus+270920.100.1.1 1619657735 installed
<13>Jul 3 07:29:01 rpmi: python3-module-pycparser-2.20-alt1 sisyphus+275852.100.1.2 1624813404 installed
<13>Jul 3 07:29:01 rpmi: python3-module-cffi-1.14.5-alt2 sisyphus+270533.2000.6.1 1619684526 installed
<13>Jul 3 07:29:01 rpmi: python3-module-cryptography-3.4.7-alt1 sisyphus+270667.100.1.1 1619307682 installed
<13>Jul 3 07:29:01 rpmi: python3-module-openssl-20.0.1-alt1 sisyphus+267607.100.2.1 1615475362 installed
<13>Jul 3 07:29:01 rpmi: python3-module-pytz-1:2021.1-alt1 sisyphus+267903.400.1.1 1615896636 installed
<13>Jul 3 07:29:02 rpmi: python3-module-babel-1:2.9.0-alt1 sisyphus+268784.200.2.1 1617263310 installed
<13>Jul 3 07:29:02 rpmi: python3-module-zope.interface-5.4.0-alt1 sisyphus+270674.200.1.1 1619413815 installed
<13>Jul 3 07:29:02 rpmi: python3-module-chameleon.core-3.8.1-alt1 sisyphus+275905.100.2.1 1624873063 installed
<13>Jul 3 07:29:02 rpmi: python3-module-click-7.1.2-alt2 sisyphus+275908.100.1.1 1624804412 installed
<13>Jul 3 07:29:02 rpmi: python3-module-polib-1.0.5-alt1.1.2 sisyphus+275973.100.1.1 1624809064 installed
<13>Jul 3 07:29:02 rpmi: python3-module-lingua-4.14-alt1 sisyphus+275951.100.2.2 1624876008 installed
<13>Jul 3 07:29:02 rpmi: python3-module-webencodings-0.5.1-alt2 sisyphus+276020.100.1.1 1624812421 installed
<13>Jul 3 07:29:02 rpmi: python3-module-cssselect-0.9.1-alt3 sisyphus+270533.2600.6.1 1619684675 installed
<13>Jul 3 07:29:02 rpmi: python3-module-html5lib-1:1.0.1-alt1 sisyphus+275822.100.1.3 1624804056 installed
<13>Jul 3 07:29:02 rpmi: python3-module-lxml-4.6.3.0.16.git5ecb40bc-alt1 sisyphus+276591.100.1.1 1625142400 installed
<13>Jul 3 07:29:02 rpmi: python3-module-docutils-0.17.1-alt1 sisyphus+271898.100.1.1 1621041818 installed
<13>Jul 3 07:29:02 rpmi: python3-module-chardet-1:3.0.4-alt2 sisyphus+275804.100.1.1 1624794263 installed
<13>Jul 3 07:29:02 rpmi: python3-module-idna-3.2-alt1 sisyphus+274748.100.1.1 1624021080 installed
<13>Jul 3 07:29:02 rpmi: python3-module-ndg-0.4.2-alt1.qa1 sisyphus+275837.100.1.2 1624808487 installed
<13>Jul 3 07:29:02 rpmi: python3-module-ndg-httpsclient-0.4.2-alt1.qa1 sisyphus+275837.100.1.2 1624808487 installed
<13>Jul 3 07:29:02 rpmi: python3-module-ntlm-1.1.0-alt1.2 sisyphus+275841.100.1.1 1624797814 installed
<13>Jul 3 07:29:03 rpmi: python3-module-urllib3-2:1.26.6-alt1 sisyphus+276579.100.1.1 1625137436 installed
<13>Jul 3 07:29:03 rpmi: python3-module-requests-2.25.1-alt2 sisyphus+267359.100.1.1 1614881487 installed
<13>Jul 3 07:29:03 rpmi: python3-module-imagesize-1.1.0-alt1 sisyphus+271943.200.1.1 1621159990 installed
<13>Jul 3 07:29:03 rpmi: python3-module-markupsafe-1:2.0.1-alt2 sisyphus+272516.100.1.1 1621946887 installed
<13>Jul 3 07:29:03 rpmi: python3-module-jinja2-3.0.1-alt1 sisyphus+274841.1100.1.1 1624295237 installed
<13>Jul 3 07:29:03 rpmi: python3-module-pyparsing-2.4.2-alt2 sisyphus+275978.100.1.1 1624809339 installed
<13>Jul 3 07:29:03 rpmi: python3-module-packaging-20.9-alt1 sisyphus+270533.300.6.1 1619683401 installed
<13>Jul 3 07:29:03 rpmi: python3-module-snowballstemmer-1.2.0-alt2.1 sisyphus+271943.400.1.1 1621160075 installed
<13>Jul 3 07:29:03 rpmi: python3-module-sphinxcontrib-applehelp-1.0.2-alt1 sisyphus+276002.100.2.2 1624878023 installed
<13>Jul 3 07:29:03 rpmi: python3-module-sphinxcontrib-devhelp-1.0.2-alt1 sisyphus+276003.100.2.2 1624879024 installed
<13>Jul 3 07:29:03 rpmi: python3-module-sphinxcontrib-htmlhelp-2.0.0-alt1 sisyphus+272876.100.1.1 1622446944 installed
<13>Jul 3 07:29:03 rpmi: python3-module-sphinxcontrib-jsmath-1.0.1-alt1 sisyphus+276004.100.1.1 1624811634 installed
<13>Jul 3 07:29:03 rpmi: python3-module-sphinxcontrib-qthelp-1.0.3-alt1 sisyphus+276005.100.2.2 1624879764 installed
<13>Jul 3 07:29:03 rpmi: python3-module-sphinxcontrib-serializinghtml-1.1.5-alt1 sisyphus+272874.100.1.1 1622445988 installed
<13>Jul 3 07:29:03 rpmi: python3-module-alabaster-0.7.6-alt3 sisyphus+271943.300.1.1 1621160028 installed
<13>Jul 3 07:29:03 rpmi: python3-module-Pygments-2.8.1-alt2 sisyphus+270791.100.1.1 1619525864 installed
<13>Jul 3 07:29:03 rpmi: python3-module-sphinx-1:4.0.2-alt1 sisyphus+272353.100.1.1 1621699337 installed
<13>Jul 3 07:29:03 rpmi: python3-module-markdown-3.3.4-alt1 sisyphus+276360.100.1.2 1624990678 installed
<86>Jul 3 07:29:03 groupadd[2366377]: group added to /etc/group: name=_keytab, GID=499
<86>Jul 3 07:29:03 groupadd[2366377]: group added to /etc/gshadow: name=_keytab
<86>Jul 3 07:29:03 groupadd[2366377]: new group: name=_keytab, GID=499
<13>Jul 3 07:29:03 rpmi: libkrb5-1.19.1-alt2 sisyphus+267847.100.1.1 1615814479 installed
<13>Jul 3 07:29:04 rpmi: glib-networking-2.68.1-alt1 sisyphus+270513.100.1.1 1619124111 installed
<13>Jul 3 07:29:04 rpmi: libsoup-2.72.0-alt1 sisyphus+258314.1100.14.2 1600844151 installed
<13>Jul 3 07:29:04 rpmi: vala-0.52.4-alt1 sisyphus+273611.100.1.1 1622836610 installed
<13>Jul 3 07:29:04 rpmi: libsoup-devel-2.72.0-alt1 sisyphus+258314.1100.14.2 1600844151 installed
<13>Jul 3 07:29:04 rpmi: libnss-3.66.0-alt1 sisyphus+273509.200.1.1 1622733913 installed
<13>Jul 3 07:29:04 rpmi: python3-module-nss-1.0.1-alt6 sisyphus+265234.10300.49.1 1613748018 installed
<13>Jul 3 07:29:04 rpmi: python3-module-beaker-1.11.0-alt1 sisyphus+275900.100.1.1 1624804024 installed
<13>Jul 3 07:29:04 rpmi: python3-module-mako-1.1.4-alt1 sisyphus+271731.100.1.1 1620892877 installed
<13>Jul 3 07:29:04 rpmi: alsa-ucm-conf-1.2.5.1-alt1 sisyphus+274777.200.1.1 1624089157 installed
<13>Jul 3 07:29:04 rpmi: alsa-topology-conf-1.2.5.1-alt1 sisyphus+274777.100.1.1 1624089141 installed
<13>Jul 3 07:29:04 rpmi: libalsa-1:1.2.5.1-alt1 sisyphus+274777.300.1.1 1624089218 installed
<13>Jul 3 07:29:04 rpmi: libcanberra-0.30-alt3 sisyphus+275093.100.2.3 1624562350 installed
<13>Jul 3 07:29:04 rpmi: libcanberra-devel-0.30-alt3 sisyphus+275093.100.2.3 1624562350 installed
<13>Jul 3 07:29:04 rpmi: libcanberra-vala-0.30-alt3 sisyphus+275093.100.2.3 1624562350 installed
<13>Jul 3 07:29:04 rpmi: gobject-introspection-devel-1.68.0-alt1 sisyphus+268501.200.4.2 1617041737 installed
<13>Jul 3 07:29:04 rpmi: vala-tools-0.52.4-alt1 sisyphus+273611.100.1.1 1622836610 installed
<13>Jul 3 07:29:04 rpmi: gtk-doc-1.33.2-alt1 sisyphus+275779.100.2.1 1624831686 installed
<13>Jul 3 07:29:04 rpmi: autoconf-archive-2021.02.19-alt1 sisyphus+267002.100.1.1 1614295590 installed
Building target platforms: x86_64
Building for target x86_64
Wrote: /usr/src/in/nosrpm/gsound-1.0.2-alt2.nosrc.rpm (w1.gzdio)
Installing gsound-1.0.2-alt2.src.rpm
Building target platforms: x86_64
Building for target x86_64
Executing(%prep): /bin/sh -e /usr/src/tmp/rpm-tmp.71932
+ umask 022
+ /bin/mkdir -p /usr/src/RPM/BUILD
+ cd /usr/src/RPM/BUILD
+ cd /usr/src/RPM/BUILD
+ rm -rf gsound-1.0.2
+ echo 'Source #0 (gsound-1.0.2.tar.xz):'
Source #0 (gsound-1.0.2.tar.xz):
+ /usr/bin/xz -dc /usr/src/RPM/SOURCES/gsound-1.0.2.tar.xz
+ /bin/tar -xf -
+ cd gsound-1.0.2
+ /bin/chmod -c -Rf u+rwX,go-w .
+ echo 'Patch #0 (gsound-1.0.2-alt-tools_makefile.patch):'
Patch #0 (gsound-1.0.2-alt-tools_makefile.patch):
+ /usr/bin/patch -p0
patching file tools/Makefile.am
+ exit 0
Executing(%build): /bin/sh -e /usr/src/tmp/rpm-tmp.4586
+ umask 022
+ /bin/mkdir -p /usr/src/RPM/BUILD
+ cd /usr/src/RPM/BUILD
+ cd gsound-1.0.2
+ autoreconf -fisv
autoreconf-default: Entering directory `.'
autoreconf-default: configure.ac: not using Gettext
autoreconf-default: running: aclocal --force
autoreconf-default: configure.ac: tracing
autoreconf-default: running: libtoolize --force --install
libtoolize-default: putting auxiliary files in AC_CONFIG_AUX_DIR, 'build-aux'.
libtoolize-default: linking file 'build-aux/config.guess'
libtoolize-default: linking file 'build-aux/config.sub'
libtoolize-default: linking file 'build-aux/install-sh'
libtoolize-default: linking file 'build-aux/ltmain.sh'
libtoolize-default: putting macros in AC_CONFIG_MACRO_DIRS, 'm4'.
libtoolize-default: linking file 'm4/libtool.m4'
libtoolize-default: linking file 'm4/ltoptions.m4'
libtoolize-default: linking file 'm4/ltsugar.m4'
libtoolize-default: linking file 'm4/ltversion.m4'
libtoolize-default: linking file 'm4/lt~obsolete.m4'
libtoolize-default: Consider adding '-I m4' to ACLOCAL_AMFLAGS in Makefile.am.
autoreconf-default: configure.ac: not using Intltool
autoreconf-default: running: gtkdocize
autoreconf-default: running: /usr/bin/autoconf-2.60 --force
autoreconf-default: running: /usr/bin/autoheader-2.60 --force
autoreconf-default: running: automake --add-missing --force-missing
configure.ac:14: installing 'build-aux/compile'
configure.ac:10: installing 'build-aux/missing'
gsound/Makefile.am: installing 'build-aux/depcomp'
autoreconf-default: Leaving directory `.'
+ CFLAGS='-pipe -frecord-gcc-switches -Wall -g -O2'
+ export CFLAGS
+ CXXFLAGS='-pipe -frecord-gcc-switches -Wall -g -O2'
+ export CXXFLAGS
+ FFLAGS='-pipe -frecord-gcc-switches -Wall -g -O2'
+ export FFLAGS
+ FCFLAGS='-pipe -frecord-gcc-switches -Wall -g -O2'
+ export FCFLAGS
+ '[' -n '' ']'
++ printf %s '-pipe -frecord-gcc-switches -Wall -g -O2'
++ sed -r 's/(^|[[:space:]]+)-[^m][^[:space:]]*//g'
+ ASFLAGS=
+ export ASFLAGS
+ export lt_cv_deplibs_check_method=pass_all
+ lt_cv_deplibs_check_method=pass_all
+ readlink -e -- ./configure
+ xargs -ri dirname -- '{}'
+ xargs -ri find '{}' -type f '(' -name config.sub -or -name config.guess ')' -printf '%h/\n'
+ sort -u
+ xargs -rn1 install -pm755 -- /usr/share/gnu-config/config.sub /usr/share/gnu-config/config.guess
+ ./configure --build=x86_64-alt-linux --host=x86_64-alt-linux --prefix=/usr --exec-prefix=/usr --bindir=/usr/bin --sbindir=/usr/sbin --sysconfdir=/etc --datadir=/usr/share --includedir=/usr/include --libdir=/usr/lib64 --libexecdir=/usr/libexec --localstatedir=/var/lib --sharedstatedir=/var/lib --mandir=/usr/share/man --infodir=/usr/share/info --disable-dependency-tracking --disable-silent-rules --without-included-gettext --disable-static --enable-gtk-doc
configure: WARNING: unrecognized options: --without-included-gettext
checking whether make supports nested variables... yes
checking for a BSD-compatible install... /bin/install -c
checking whether build environment is sane... yes
checking for a thread-safe mkdir -p... /bin/mkdir -p
checking for gawk... gawk
checking whether make sets $(MAKE)... yes
checking whether to enable maintainer-specific portions of Makefiles... yes
checking for x86_64-alt-linux-gcc... x86_64-alt-linux-gcc
checking whether the C compiler works... yes
checking for C compiler default output file name... a.out
checking for suffix of executables...
checking whether we are cross compiling... no
checking for suffix of object files... o
checking whether we are using the GNU C compiler... yes
checking whether x86_64-alt-linux-gcc accepts -g... yes
checking for x86_64-alt-linux-gcc option to accept ISO C89... none needed
checking whether x86_64-alt-linux-gcc understands -c and -o together... yes
checking whether make supports the include directive... yes (GNU style)
checking dependency style of x86_64-alt-linux-gcc... none
checking for valac... /usr/bin/valac
checking for a sed that does not truncate output... /bin/sed
checking whether C compiler accepts -Werror=unknown-warning-option... no
checking whether C compiler accepts -fno-strict-aliasing... yes
checking whether C compiler accepts -Wall... yes
checking whether C compiler accepts -Wextra... yes
checking whether C compiler accepts -Wundef... yes
checking whether C compiler accepts -Wnested-externs... yes
checking whether C compiler accepts -Wwrite-strings... yes
checking whether C compiler accepts -Wpointer-arith... yes
checking whether C compiler accepts -Wmissing-declarations... yes
checking whether C compiler accepts -Wmissing-prototypes... yes
checking whether C compiler accepts -Wstrict-prototypes... yes
checking whether C compiler accepts -Wredundant-decls... yes
checking whether C compiler accepts -Wno-unused-parameter... yes
checking whether C compiler accepts -Wno-missing-field-initializers... yes
checking whether C compiler accepts -Wdeclaration-after-statement... yes
checking whether C compiler accepts -Wformat=2... yes
checking whether C compiler accepts -Wold-style-definition... yes
checking whether C compiler accepts -Wcast-align... yes
checking whether C compiler accepts -Wformat-nonliteral... yes
checking whether C compiler accepts -Wformat-security... yes
checking whether C compiler accepts -Wsign-compare... yes
checking whether C compiler accepts -Wstrict-aliasing... yes
checking whether C compiler accepts -Wshadow... yes
checking whether C compiler accepts -Winline... yes
checking whether C compiler accepts -Wpacked... yes
checking whether C compiler accepts -Wmissing-format-attribute... yes
checking whether C compiler accepts -Wmissing-noreturn... yes
checking whether C compiler accepts -Winit-self... yes
checking whether C compiler accepts -Wredundant-decls... (cached) yes
checking whether C compiler accepts -Wmissing-include-dirs... yes
checking whether C compiler accepts -Wunused-but-set-variable... yes
checking whether C compiler accepts -Warray-bounds... yes
checking whether C compiler accepts -Wimplicit-function-declaration... yes
checking whether C compiler accepts -Wreturn-type... yes
checking whether C compiler accepts -Wswitch-enum... yes
checking whether C compiler accepts -Wswitch-default... yes
checking whether C compiler accepts -Wno-error=unused-parameter... yes
checking whether C compiler accepts -Wno-error=missing-field-initializers... yes
checking whether C compiler accepts -Werror=unknown-warning-option... (cached) no
checking whether the linker accepts -Wl,--no-as-needed... yes
checking build system type... x86_64-alt-linux-gnu
checking host system type... x86_64-alt-linux-gnu
checking how to print strings... printf
checking for a sed that does not truncate output... (cached) /bin/sed
checking for grep that handles long lines and -e... /bin/grep
checking for egrep... /bin/grep -E
checking for fgrep... /bin/grep -F
checking for ld used by x86_64-alt-linux-gcc... /usr/bin/ld
checking if the linker (/usr/bin/ld) is GNU ld... yes
checking for BSD- or MS-compatible name lister (nm)... /usr/bin/nm -B
checking the name lister (/usr/bin/nm -B) interface... BSD nm
checking whether ln -s works... yes
checking the maximum length of command line arguments... 1572864
checking how to convert x86_64-alt-linux-gnu file names to x86_64-alt-linux-gnu format... func_convert_file_noop
checking how to convert x86_64-alt-linux-gnu file names to toolchain format... func_convert_file_noop
checking for /usr/bin/ld option to reload object files... -r
checking for x86_64-alt-linux-objdump... no
checking for objdump... objdump
checking how to recognize dependent libraries... (cached) pass_all
checking for x86_64-alt-linux-dlltool... no
checking for dlltool... no
checking how to associate runtime and link libraries... printf %s\n
checking for x86_64-alt-linux-ar... no
checking for ar... ar
checking for archiver @FILE support... @
checking for x86_64-alt-linux-strip... no
checking for strip... strip
checking for x86_64-alt-linux-ranlib... no
checking for ranlib... ranlib
checking command to parse /usr/bin/nm -B output from x86_64-alt-linux-gcc object... ok
checking for sysroot... no
checking for a working dd... /bin/dd
checking how to truncate binary pipes... /bin/dd bs=4096 count=1
checking for x86_64-alt-linux-mt... no
checking for mt... no
checking if : is a manifest tool... no
checking how to run the C preprocessor... x86_64-alt-linux-gcc -E
checking for ANSI C header files... yes
checking for sys/types.h... yes
checking for sys/stat.h... yes
checking for stdlib.h... yes
checking for string.h... yes
checking for memory.h... yes
checking for strings.h... yes
checking for inttypes.h... yes
checking for stdint.h... yes
checking for unistd.h... yes
checking for dlfcn.h... yes
checking for objdir... .libs
checking if x86_64-alt-linux-gcc supports -fno-rtti -fno-exceptions... no
checking for x86_64-alt-linux-gcc option to produce PIC... -fPIC -DPIC
checking if x86_64-alt-linux-gcc PIC flag -fPIC -DPIC works... yes
checking if x86_64-alt-linux-gcc static flag -static works... no
checking if x86_64-alt-linux-gcc supports -c -o file.o... yes
checking if x86_64-alt-linux-gcc supports -c -o file.o... (cached) yes
checking whether the x86_64-alt-linux-gcc linker (/usr/bin/ld -m elf_x86_64) supports shared libraries... yes
checking whether -lc should be explicitly linked in... no
checking dynamic linker characteristics... GNU/Linux ld.so
checking how to hardcode library paths into programs... immediate
checking whether stripping libraries is possible... yes
checking if libtool supports shared libraries... yes
checking whether to build shared libraries... yes
checking whether to build static libraries... no
checking for x86_64-alt-linux-pkg-config... no
checking for pkg-config... /usr/bin/pkg-config
checking pkg-config is at least version 0.9.0... yes
checking for GSOUND... yes
checking for gtk-doc... yes
checking for gtkdoc-check... gtkdoc-check.test
checking for gtkdoc-check... /usr/bin/gtkdoc-check
checking for gtkdoc-rebase... /usr/bin/gtkdoc-rebase
checking for gtkdoc-mkpdf... no
checking whether to build gtk-doc documentation... yes
checking for GTKDOC_DEPS... yes
checking for gobject-introspection... yes
checking for x86_64-alt-linux-pkg-config... /usr/bin/pkg-config
checking pkg-config is at least version 0.9.0... yes
checking for vapigen... yes
checking that generated files are newer than configure... done
configure: creating ./config.status
config.status: creating Makefile
config.status: creating docs/Makefile
config.status: creating docs/version.xml
config.status: creating tools/Makefile
config.status: creating gsound/gsound.pc
config.status: creating gsound/Makefile
config.status: creating config.h
config.status: executing depfiles commands
config.status: executing libtool commands
configure: WARNING: unrecognized options: --without-included-gettext
+ make -j8
make all-recursive
Making all in gsound
make[2]: Entering directory '/usr/src/RPM/BUILD/gsound-1.0.2/gsound'
echo glib-2.0 gio-2.0 | tr ' ' '\n' > gsound.deps
make[2]: Leaving directory '/usr/src/RPM/BUILD/gsound-1.0.2/gsound'
make[2]: Entering directory '/usr/src/RPM/BUILD/gsound-1.0.2/gsound'
/bin/sh ../libtool --tag=CC --mode=compile x86_64-alt-linux-gcc -DHAVE_CONFIG_H -I. -I.. -pthread -D_REENTRANT -I/usr/include/glib-2.0 -I/usr/lib64/glib-2.0/include -fno-strict-aliasing -Wall -Wextra -Wundef -Wnested-externs -Wwrite-strings -Wpointer-arith -Wmissing-declarations -Wmissing-prototypes -Wstrict-prototypes -Wredundant-decls -Wno-unused-parameter -Wno-missing-field-initializers -Wdeclaration-after-statement -Wformat=2 -Wold-style-definition -Wcast-align -Wformat-nonliteral -Wformat-security -Wsign-compare -Wstrict-aliasing -Wshadow -Winline -Wpacked -Wmissing-format-attribute -Wmissing-noreturn -Winit-self -Wmissing-include-dirs -Wunused-but-set-variable -Warray-bounds -Wimplicit-function-declaration -Wreturn-type -Wswitch-enum -Wswitch-default -Wno-error=unused-parameter -Wno-error=missing-field-initializers -pipe -frecord-gcc-switches -Wall -g -O2 -c -o libgsound_la-gsound-context.lo `test -f 'gsound-context.c' || echo './'`gsound-context.c
libtool: compile: x86_64-alt-linux-gcc -DHAVE_CONFIG_H -I. -I.. -pthread -D_REENTRANT -I/usr/include/glib-2.0 -I/usr/lib64/glib-2.0/include -fno-strict-aliasing -Wall -Wextra -Wundef -Wnested-externs -Wwrite-strings -Wpointer-arith -Wmissing-declarations -Wmissing-prototypes -Wstrict-prototypes -Wredundant-decls -Wno-unused-parameter -Wno-missing-field-initializers -Wdeclaration-after-statement -Wformat=2 -Wold-style-definition -Wcast-align -Wformat-nonliteral -Wformat-security -Wsign-compare -Wstrict-aliasing -Wshadow -Winline -Wpacked -Wmissing-format-attribute -Wmissing-noreturn -Winit-self -Wmissing-include-dirs -Wunused-but-set-variable -Warray-bounds -Wimplicit-function-declaration -Wreturn-type -Wswitch-enum -Wswitch-default -Wno-error=unused-parameter -Wno-error=missing-field-initializers -pipe -frecord-gcc-switches -Wall -g -O2 -c gsound-context.c -fPIC -DPIC -o .libs/libgsound_la-gsound-context.o
make[2]: Leaving directory '/usr/src/RPM/BUILD/gsound-1.0.2/gsound'
make[2]: Entering directory '/usr/src/RPM/BUILD/gsound-1.0.2/gsound'
/bin/sh ../libtool --tag=CC --mode=link x86_64-alt-linux-gcc -fno-strict-aliasing -Wall -Wextra -Wundef -Wnested-externs -Wwrite-strings -Wpointer-arith -Wmissing-declarations -Wmissing-prototypes -Wstrict-prototypes -Wredundant-decls -Wno-unused-parameter -Wno-missing-field-initializers -Wdeclaration-after-statement -Wformat=2 -Wold-style-definition -Wcast-align -Wformat-nonliteral -Wformat-security -Wsign-compare -Wstrict-aliasing -Wshadow -Winline -Wpacked -Wmissing-format-attribute -Wmissing-noreturn -Winit-self -Wmissing-include-dirs -Wunused-but-set-variable -Warray-bounds -Wimplicit-function-declaration -Wreturn-type -Wswitch-enum -Wswitch-default -Wno-error=unused-parameter -Wno-error=missing-field-initializers -pipe -frecord-gcc-switches -Wall -g -O2 -version-info 0:2:0 -Wl,--no-as-needed -o libgsound.la -rpath /usr/lib64 libgsound_la-gsound-context.lo -lgio-2.0 -lgobject-2.0 -lglib-2.0 -lcanberra
libtool: link: x86_64-alt-linux-gcc -shared -fPIC -DPIC .libs/libgsound_la-gsound-context.o -lgio-2.0 -lgobject-2.0 -lglib-2.0 -lcanberra -g -O2 -Wl,--no-as-needed -Wl,-soname -Wl,libgsound.so.0 -o .libs/libgsound.so.0.0.2
libtool: link: (cd ".libs" && rm -f "libgsound.so.0" && ln -s "libgsound.so.0.0.2" "libgsound.so.0")
libtool: link: (cd ".libs" && rm -f "libgsound.so" && ln -s "libgsound.so.0.0.2" "libgsound.so")
libtool: link: ( cd ".libs" && rm -f "libgsound.la" && ln -s "../libgsound.la" "libgsound.la" )
make[2]: Leaving directory '/usr/src/RPM/BUILD/gsound-1.0.2/gsound'
make[2]: Entering directory '/usr/src/RPM/BUILD/gsound-1.0.2/gsound'
CPPFLAGS="" CFLAGS="-pipe -frecord-gcc-switches -Wall -g -O2" LDFLAGS="" CC="x86_64-alt-linux-gcc" PKG_CONFIG="/usr/bin/pkg-config" GI_HOST_OS="" DLLTOOL="false" /usr/bin/g-ir-scanner --add-include-path=. --symbol-prefix=gsound --warn-all -v --namespace=GSound --nsversion=1.0 --libtool="/bin/sh ../libtool" --include=GObject-2.0 --include=Gio-2.0 --library=libgsound.la --c-include "gsound.h" --cflags-begin --warn-all --cflags-end gsound-context.c gsound-context.h gsound-attr.h libgsound.la --output GSound-1.0.gir
x86_64-alt-linux-gcc -E -I. -I/usr/include/gio-unix-2.0 -I/usr/include/glib-2.0 -I/usr/lib64/glib-2.0/include -o g-ir-cpp-12ks0xtm.i -C --warn-all /usr/src/RPM/BUILD/gsound-1.0.2/gsound/g-ir-cpp-12ks0xtm.c
x86_64-alt-linux-gcc -pipe -frecord-gcc-switches -Wall -g -O2 -I/usr/include/gio-unix-2.0 -I/usr/include/glib-2.0 -I/usr/lib64/glib-2.0/include -I/usr/include/glib-2.0 -I/usr/lib64/glib-2.0/include -c /usr/src/RPM/BUILD/gsound-1.0.2/gsound/tmp-introspecttwt4totm/GSound-1.0.c -o /usr/src/RPM/BUILD/gsound-1.0.2/gsound/tmp-introspecttwt4totm/GSound-1.0.o -Wno-deprecated-declarations -pthread --warn-all
g-ir-scanner: link: /bin/sh ../libtool --mode=link --tag=CC x86_64-alt-linux-gcc -o /usr/src/RPM/BUILD/gsound-1.0.2/gsound/tmp-introspecttwt4totm/GSound-1.0 -export-dynamic -pipe -frecord-gcc-switches -Wall -g -O2 /usr/src/RPM/BUILD/gsound-1.0.2/gsound/tmp-introspecttwt4totm/GSound-1.0.o -L. libgsound.la -lgio-2.0 -lgobject-2.0 -Wl,--export-dynamic -lgmodule-2.0 -pthread -lglib-2.0
libtool: link: x86_64-alt-linux-gcc -o /usr/src/RPM/BUILD/gsound-1.0.2/gsound/tmp-introspecttwt4totm/.libs/GSound-1.0 -pipe -frecord-gcc-switches -Wall -g -O2 /usr/src/RPM/BUILD/gsound-1.0.2/gsound/tmp-introspecttwt4totm/GSound-1.0.o -Wl,--export-dynamic -pthread -Wl,--export-dynamic -L. ./.libs/libgsound.so -lgio-2.0 -lgobject-2.0 -lgmodule-2.0 -lglib-2.0 -pthread
make[2]: Leaving directory '/usr/src/RPM/BUILD/gsound-1.0.2/gsound'
make[2]: Entering directory '/usr/src/RPM/BUILD/gsound-1.0.2/gsound'
/usr/bin/vapigen-0.52 --library gsound --metadatadir . --pkg glib-2.0 --pkg gio-2.0 GSound-1.0.gir
Generation succeeded - 0 warning(s)
make[2]: Leaving directory '/usr/src/RPM/BUILD/gsound-1.0.2/gsound'
make[2]: Entering directory '/usr/src/RPM/BUILD/gsound-1.0.2/gsound'
/usr/bin/g-ir-compiler --includedir=. --includedir=. GSound-1.0.gir -o GSound-1.0.typelib
make[2]: Leaving directory '/usr/src/RPM/BUILD/gsound-1.0.2/gsound'
Making all in docs
make[2]: Entering directory '/usr/src/RPM/BUILD/gsound-1.0.2/docs'
if test "/usr/src/RPM/BUILD/gsound-1.0.2/docs" != "/usr/src/RPM/BUILD/gsound-1.0.2/docs" ; then \
files=`echo gsound-docs.sgml gsound-sections.txt gsound-overrides.txt gsound.types`; \
if test "x$files" != "x" ; then \
for file in $files ; do \
destdir=`dirname /usr/src/RPM/BUILD/gsound-1.0.2/docs/$file`; \
test -d "$destdir" || mkdir -p "$destdir"; \
test -f /usr/src/RPM/BUILD/gsound-1.0.2/docs/$file && \
cp -pf /usr/src/RPM/BUILD/gsound-1.0.2/docs/$file /usr/src/RPM/BUILD/gsound-1.0.2/docs/$file || true; \
done; \
fi; \
fi
touch setup-build.stamp
make[2]: Leaving directory '/usr/src/RPM/BUILD/gsound-1.0.2/docs'
make[2]: Entering directory '/usr/src/RPM/BUILD/gsound-1.0.2/docs'
/bin/mkdir -p xml && ( \
echo ""; \
echo ""; \
echo ""; \
echo ""; \
echo ""; \
echo ""; \
echo ""; \
) > xml/gtkdocentities.ent
make[2]: Leaving directory '/usr/src/RPM/BUILD/gsound-1.0.2/docs'
make[2]: Entering directory '/usr/src/RPM/BUILD/gsound-1.0.2/docs'
_source_dir='' ; \
for i in ../gsound ; do \
_source_dir="${_source_dir} --source-dir=$i" ; \
done ; \
gtkdoc-scan --module=gsound --ignore-headers="" ${_source_dir} --deprecated-guards="GSOUND_DISABLE_DEPRECATED" --rebuild-types --rebuild-sections
if grep -l '^..*$' gsound.types > /dev/null 2>&1 ; then \
scanobj_options=""; \
gtkdoc-scangobj 2>&1 --help | grep >/dev/null "\-\-verbose"; \
if test "$?" = "0"; then \
if test "x" = "x1"; then \
scanobj_options="--verbose"; \
fi; \
fi; \
CC="/bin/sh ../libtool --tag=CC --mode=compile x86_64-alt-linux-gcc -I/usr/include/glib-2.0 -I/usr/lib64/glib-2.0/include -pipe -frecord-gcc-switches -Wall -g -O2" LD="/bin/sh ../libtool --tag=CC --mode=link x86_64-alt-linux-gcc -lgobject-2.0 -lglib-2.0 -pipe -frecord-gcc-switches -Wall -g -O2 " RUN="/bin/sh ../libtool --mode=execute" CFLAGS="-I.. -I.. -Wno-error -Wno-deprecated-declarations -pipe -frecord-gcc-switches -Wall -g -O2" LDFLAGS=" ../gsound/libgsound.la " \
gtkdoc-scangobj $scanobj_options --module=gsound; \
else \
for i in gsound.actions gsound.args gsound.hierarchy gsound.interfaces gsound.prerequisites gsound.signals ; do \
test -f $i || touch $i ; \
done \
fi
touch scan-build.stamp
make[2]: Leaving directory '/usr/src/RPM/BUILD/gsound-1.0.2/docs'
make[2]: Entering directory '/usr/src/RPM/BUILD/gsound-1.0.2/docs'
_source_dir='' ; \
for i in ../gsound ; do \
_source_dir="${_source_dir} --source-dir=$i" ; \
done ; \
gtkdoc-mkdb --module=gsound --output-format=xml --expand-content-files="" --main-sgml-file=gsound-docs.sgml ${_source_dir} --sgml-mode --output-format=xml
unknown:0: warning: Value descriptions for GSoundError are missing in source code comment block.
touch sgml-build.stamp
make[2]: Leaving directory '/usr/src/RPM/BUILD/gsound-1.0.2/docs'
make[2]: Entering directory '/usr/src/RPM/BUILD/gsound-1.0.2/docs'
rm -rf html && mkdir html && \
mkhtml_options=""; \
gtkdoc-mkhtml 2>&1 --help | grep >/dev/null "\-\-verbose"; \
if test "$?" = "0"; then \
if test "x" = "x1"; then \
mkhtml_options="$mkhtml_options --verbose"; \
fi; \
fi; \
gtkdoc-mkhtml 2>&1 --help | grep >/dev/null "\-\-path"; \
if test "$?" = "0"; then \
mkhtml_options="$mkhtml_options --path=\"/usr/src/RPM/BUILD/gsound-1.0.2/docs\""; \
fi; \
cd html && gtkdoc-mkhtml $mkhtml_options gsound ../gsound-docs.sgml
WARNING: nested link may be undefined in output: nested inside parent element link
WARNING: nested link may be undefined in output: nested inside parent element link
gtkdoc-fixxref --module=gsound --module-dir=html --html-dir=/usr/share/gtk-doc/html
html/GSoundContext.html:197: warning: no link for: "g-object-unref" -> (g_object_unref()
).
html/GSoundContext.html:199: warning: no link for: "GInitable" -> (GInitable).
html/GSoundContext.html:200: warning: no link for: "g-object-new" -> (g_object_new()
).
html/GSoundContext.html:201: warning: no link for: "g-initable-init" -> (g_initable_init()
).
html/GSoundContext.html:299: warning: no link for: "play-simple" -> (play_simple()
).
html/GSoundContext.html:299: warning: no link for: "play-full" -> (play_full()
).
html/GSoundContext.html:308: warning: no link for: "GAsyncReadyCallback" -> (GAsyncReadyCallback).
html/GSoundContext.html:310: warning: no link for: "NULL:CAPS" -> (NULL
).
html/GSoundContext.html:383: warning: no link for: "GCancellable" -> (GCancellable).
html/GSoundContext.html:384: warning: no link for: "GError" -> (GError).
html/GSoundContext.html:452: warning: no link for: "TRUE:CAPS" -> (TRUE
).
html/GSoundContext.html:452: warning: no link for: "FALSE:CAPS" -> (FALSE
).
html/GSoundContext.html:468: warning: no link for: "GApplication" -> (GApplication).
html/GSoundContext.html:508: warning: no link for: "GHashTable" -> (GHashTable).
html/GSoundContext.html:606: warning: no link for: "g-cancellable-cancel" -> (g_cancellable_cancel()
).
html/GSoundContext.html:718: warning: no link for: "G-IO-ERROR-CANCELLED:CAPS" -> (G_IO_ERROR_CANCELLED).
html/GSoundContext.html:825: warning: no link for: "GAsyncResult" -> (GAsyncResult).
html/gsound-GSound-Attributes.html:497: warning: no link for: "g-set-application-name" -> (g_set_application_name()
).
html/gsound-GSound-Attributes.html:508: warning: no link for: "GApplication--application-id" -> (“application-id”).
touch html-build.stamp
make[2]: Leaving directory '/usr/src/RPM/BUILD/gsound-1.0.2/docs'
Making all in tools
make[2]: Entering directory '/usr/src/RPM/BUILD/gsound-1.0.2/tools'
x86_64-alt-linux-gcc -DHAVE_CONFIG_H -I. -I.. -I../gsound -pthread -D_REENTRANT -I/usr/include/glib-2.0 -I/usr/lib64/glib-2.0/include -pipe -frecord-gcc-switches -Wall -g -O2 -c -o gsound_play-gsound-play.o `test -f 'gsound-play.c' || echo './'`gsound-play.c
gsound-play.c: In function 'play':
gsound-play.c:93:2: warning: 'g_simple_async_result_new' is deprecated: Use 'g_task_new' instead [-Wdeprecated-declarations]
93 | _data_->_async_result = g_simple_async_result_new (NULL, _callback_, _user_data_, play);
| ^~~~~~
In file included from /usr/include/glib-2.0/gio/gio.h:136,
from ../gsound/gsound-context.h:22,
from ../gsound/gsound.h:22,
from gsound-play.c:28:
/usr/include/glib-2.0/gio/gsimpleasyncresult.h:51:21: note: declared here
51 | GSimpleAsyncResult *g_simple_async_result_new (GObject *source_object,
| ^~~~~~~~~~~~~~~~~~~~~~~~~
gsound-play.c:94:2: warning: 'g_simple_async_result_set_op_res_gpointer' is deprecated [-Wdeprecated-declarations]
94 | g_simple_async_result_set_op_res_gpointer (_data_->_async_result, _data_, play_data_free);
| ^~~~~~~~~~~~~~~~~~~~~~~~~~~~~~~~~~~~~~~~~
In file included from /usr/include/glib-2.0/gio/gio.h:136,
from ../gsound/gsound-context.h:22,
from ../gsound/gsound.h:22,
from gsound-play.c:28:
/usr/include/glib-2.0/gio/gsimpleasyncresult.h:75:21: note: declared here
75 | void g_simple_async_result_set_op_res_gpointer (GSimpleAsyncResult *simple,
| ^~~~~~~~~~~~~~~~~~~~~~~~~~~~~~~~~~~~~~~~~
gsound-play.c: In function 'play_finish':
gsound-play.c:101:2: warning: 'g_simple_async_result_propagate_error' is deprecated [-Wdeprecated-declarations]
101 | if (g_simple_async_result_propagate_error (G_SIMPLE_ASYNC_RESULT (_res_), error)) {
| ^~
In file included from /usr/include/glib-2.0/gio/gio.h:136,
from ../gsound/gsound-context.h:22,
from ../gsound/gsound.h:22,
from gsound-play.c:28:
/usr/include/glib-2.0/gio/gsimpleasyncresult.h:119:21: note: declared here
119 | gboolean g_simple_async_result_propagate_error (GSimpleAsyncResult *simple,
| ^~~~~~~~~~~~~~~~~~~~~~~~~~~~~~~~~~~~~
gsound-play.c:104:2: warning: 'g_simple_async_result_get_op_res_gpointer' is deprecated [-Wdeprecated-declarations]
104 | _data_ = g_simple_async_result_get_op_res_gpointer (G_SIMPLE_ASYNC_RESULT (_res_));
| ^~~~~~
In file included from /usr/include/glib-2.0/gio/gio.h:136,
from ../gsound/gsound-context.h:22,
from ../gsound/gsound.h:22,
from gsound-play.c:28:
/usr/include/glib-2.0/gio/gsimpleasyncresult.h:79:21: note: declared here
79 | gpointer g_simple_async_result_get_op_res_gpointer (GSimpleAsyncResult *simple);
| ^~~~~~~~~~~~~~~~~~~~~~~~~~~~~~~~~~~~~~~~~
gsound-play.c:100:12: warning: variable '_data_' set but not used [-Wunused-but-set-variable]
100 | PlayData* _data_;
| ^~~~~~
gsound-play.c: In function 'play_co':
gsound-play.c:144:4: warning: 'g_simple_async_result_set_from_error' is deprecated [-Wdeprecated-declarations]
144 | g_simple_async_result_set_from_error (_data_->_async_result, _data_->_inner_error_);
| ^~~~~~~~~~~~~~~~~~~~~~~~~~~~~~~~~~~~
In file included from /usr/include/glib-2.0/gio/gio.h:136,
from ../gsound/gsound-context.h:22,
from ../gsound/gsound.h:22,
from gsound-play.c:28:
/usr/include/glib-2.0/gio/gsimpleasyncresult.h:113:21: note: declared here
113 | void g_simple_async_result_set_from_error (GSimpleAsyncResult *simple,
| ^~~~~~~~~~~~~~~~~~~~~~~~~~~~~~~~~~~~
gsound-play.c:147:5: warning: 'g_simple_async_result_complete_in_idle' is deprecated [-Wdeprecated-declarations]
147 | g_simple_async_result_complete_in_idle (_data_->_async_result);
| ^~~~~~~~~~~~~~~~~~~~~~~~~~~~~~~~~~~~~~
In file included from /usr/include/glib-2.0/gio/gio.h:136,
from ../gsound/gsound-context.h:22,
from ../gsound/gsound.h:22,
from gsound-play.c:28:
/usr/include/glib-2.0/gio/gsimpleasyncresult.h:106:21: note: declared here
106 | void g_simple_async_result_complete_in_idle (GSimpleAsyncResult *simple);
| ^~~~~~~~~~~~~~~~~~~~~~~~~~~~~~~~~~~~~~
gsound-play.c:149:5: warning: 'g_simple_async_result_complete' is deprecated [-Wdeprecated-declarations]
149 | g_simple_async_result_complete (_data_->_async_result);
| ^~~~~~~~~~~~~~~~~~~~~~~~~~~~~~
In file included from /usr/include/glib-2.0/gio/gio.h:136,
from ../gsound/gsound-context.h:22,
from ../gsound/gsound.h:22,
from gsound-play.c:28:
/usr/include/glib-2.0/gio/gsimpleasyncresult.h:104:21: note: declared here
104 | void g_simple_async_result_complete (GSimpleAsyncResult *simple);
| ^~~~~~~~~~~~~~~~~~~~~~~~~~~~~~
gsound-play.c:156:3: warning: 'g_simple_async_result_complete_in_idle' is deprecated [-Wdeprecated-declarations]
156 | g_simple_async_result_complete_in_idle (_data_->_async_result);
| ^~~~~~~~~~~~~~~~~~~~~~~~~~~~~~~~~~~~~~
In file included from /usr/include/glib-2.0/gio/gio.h:136,
from ../gsound/gsound-context.h:22,
from ../gsound/gsound.h:22,
from gsound-play.c:28:
/usr/include/glib-2.0/gio/gsimpleasyncresult.h:106:21: note: declared here
106 | void g_simple_async_result_complete_in_idle (GSimpleAsyncResult *simple);
| ^~~~~~~~~~~~~~~~~~~~~~~~~~~~~~~~~~~~~~
gsound-play.c:158:3: warning: 'g_simple_async_result_complete' is deprecated [-Wdeprecated-declarations]
158 | g_simple_async_result_complete (_data_->_async_result);
| ^~~~~~~~~~~~~~~~~~~~~~~~~~~~~~
In file included from /usr/include/glib-2.0/gio/gio.h:136,
from ../gsound/gsound-context.h:22,
from ../gsound/gsound.h:22,
from gsound-play.c:28:
/usr/include/glib-2.0/gio/gsimpleasyncresult.h:104:21: note: declared here
104 | void g_simple_async_result_complete (GSimpleAsyncResult *simple);
| ^~~~~~~~~~~~~~~~~~~~~~~~~~~~~~
gsound-play.c: In function 'double_to_string':
gsound-play.c:174:7: warning: variable '_tmp1__length1' set but not used [-Wunused-but-set-variable]
174 | gint _tmp1__length1 = 0;
| ^~~~~~~~~~~~~~
make[2]: Leaving directory '/usr/src/RPM/BUILD/gsound-1.0.2/tools'
make[2]: Entering directory '/usr/src/RPM/BUILD/gsound-1.0.2/tools'
/bin/sh ../libtool --tag=CC --mode=link x86_64-alt-linux-gcc -pipe -frecord-gcc-switches -Wall -g -O2 ../gsound/libgsound.la -lgio-2.0 -lgobject-2.0 -lglib-2.0 -lcanberra -o gsound-play gsound_play-gsound-play.o
libtool: link: x86_64-alt-linux-gcc -pipe -frecord-gcc-switches -Wall -g -O2 -o .libs/gsound-play gsound_play-gsound-play.o ../gsound/.libs/libgsound.so -lgio-2.0 -lgobject-2.0 -lglib-2.0 -lcanberra
make[2]: Leaving directory '/usr/src/RPM/BUILD/gsound-1.0.2/tools'
+ exit 0
Executing(%install): /bin/sh -e /usr/src/tmp/rpm-tmp.64723
+ umask 022
+ /bin/mkdir -p /usr/src/RPM/BUILD
+ cd /usr/src/RPM/BUILD
+ /bin/chmod -Rf u+rwX -- /usr/src/tmp/gsound-buildroot
+ :
+ /bin/rm -rf -- /usr/src/tmp/gsound-buildroot
+ PATH=/usr/libexec/rpm-build:/usr/src/bin:/bin:/usr/bin:/usr/X11R6/bin:/usr/games
+ cd gsound-1.0.2
+ make 'INSTALL=/usr/libexec/rpm-build/install -p' install DESTDIR=/usr/src/tmp/gsound-buildroot
make: Entering directory '/usr/src/RPM/BUILD/gsound-1.0.2'
Making install in gsound
make[1]: Entering directory '/usr/src/RPM/BUILD/gsound-1.0.2/gsound'
make[2]: Entering directory '/usr/src/RPM/BUILD/gsound-1.0.2/gsound'
/bin/mkdir -p '/usr/src/tmp/gsound-buildroot/usr/lib64'
/bin/sh ../libtool --mode=install /usr/libexec/rpm-build/install -p libgsound.la '/usr/src/tmp/gsound-buildroot/usr/lib64'
libtool: install: /usr/libexec/rpm-build/install -p .libs/libgsound.so.0.0.2 /usr/src/tmp/gsound-buildroot/usr/lib64/libgsound.so.0.0.2
libtool: install: (cd /usr/src/tmp/gsound-buildroot/usr/lib64 && { ln -s -f libgsound.so.0.0.2 libgsound.so.0 || { rm -f libgsound.so.0 && ln -s libgsound.so.0.0.2 libgsound.so.0; }; })
libtool: install: (cd /usr/src/tmp/gsound-buildroot/usr/lib64 && { ln -s -f libgsound.so.0.0.2 libgsound.so || { rm -f libgsound.so && ln -s libgsound.so.0.0.2 libgsound.so; }; })
libtool: install: /usr/libexec/rpm-build/install -p .libs/libgsound.lai /usr/src/tmp/gsound-buildroot/usr/lib64/libgsound.la
libtool: warning: remember to run 'libtool --finish /usr/lib64'
/bin/mkdir -p '/usr/src/tmp/gsound-buildroot/usr/share/gir-1.0'
/usr/libexec/rpm-build/install -p -m 644 GSound-1.0.gir '/usr/src/tmp/gsound-buildroot/usr/share/gir-1.0'
/bin/mkdir -p '/usr/src/tmp/gsound-buildroot/usr/include'
/usr/libexec/rpm-build/install -p -m 644 gsound.h gsound-attr.h gsound-context.h '/usr/src/tmp/gsound-buildroot/usr/include'
/bin/mkdir -p '/usr/src/tmp/gsound-buildroot/usr/lib64/pkgconfig'
/usr/libexec/rpm-build/install -p -m 644 gsound.pc '/usr/src/tmp/gsound-buildroot/usr/lib64/pkgconfig'
/bin/mkdir -p '/usr/src/tmp/gsound-buildroot/usr/lib64/girepository-1.0'
/usr/libexec/rpm-build/install -p -m 644 GSound-1.0.typelib '/usr/src/tmp/gsound-buildroot/usr/lib64/girepository-1.0'
/bin/mkdir -p '/usr/src/tmp/gsound-buildroot/usr/share/vala/vapi'
/usr/libexec/rpm-build/install -p -m 644 gsound.vapi gsound.deps '/usr/src/tmp/gsound-buildroot/usr/share/vala/vapi'
make[2]: Leaving directory '/usr/src/RPM/BUILD/gsound-1.0.2/gsound'
make[1]: Leaving directory '/usr/src/RPM/BUILD/gsound-1.0.2/gsound'
Making install in docs
make[1]: Entering directory '/usr/src/RPM/BUILD/gsound-1.0.2/docs'
make[2]: Entering directory '/usr/src/RPM/BUILD/gsound-1.0.2/docs'
make[2]: Nothing to be done for 'install-exec-am'.
/usr/libexec/rpm-build/install -p -m 644 ./html/GSoundContext.html
/usr/libexec/rpm-build/install -p -m 644 ./html/annotation-glossary.html
/usr/libexec/rpm-build/install -p -m 644 ./html/api-index-full.html
/usr/libexec/rpm-build/install -p -m 644 ./html/ch01.html
/usr/libexec/rpm-build/install -p -m 644 ./html/deprecated-api-index.html
/usr/libexec/rpm-build/install -p -m 644 ./html/gsound-GSound-Attributes.html
/usr/libexec/rpm-build/install -p -m 644 ./html/gsound.devhelp2
/usr/libexec/rpm-build/install -p -m 644 ./html/home.png
/usr/libexec/rpm-build/install -p -m 644 ./html/index.html
/usr/libexec/rpm-build/install -p -m 644 ./html/left-insensitive.png
/usr/libexec/rpm-build/install -p -m 644 ./html/left.png
/usr/libexec/rpm-build/install -p -m 644 ./html/object-tree.html
/usr/libexec/rpm-build/install -p -m 644 ./html/right-insensitive.png
/usr/libexec/rpm-build/install -p -m 644 ./html/right.png
/usr/libexec/rpm-build/install -p -m 644 ./html/style.css
/usr/libexec/rpm-build/install -p -m 644 ./html/up-insensitive.png
/usr/libexec/rpm-build/install -p -m 644 ./html/up.png
make[2]: Leaving directory '/usr/src/RPM/BUILD/gsound-1.0.2/docs'
make[1]: Leaving directory '/usr/src/RPM/BUILD/gsound-1.0.2/docs'
Making install in tools
make[1]: Entering directory '/usr/src/RPM/BUILD/gsound-1.0.2/tools'
make[2]: Entering directory '/usr/src/RPM/BUILD/gsound-1.0.2/tools'
/bin/mkdir -p '/usr/src/tmp/gsound-buildroot/usr/bin'
/bin/sh ../libtool --mode=install /usr/libexec/rpm-build/install -p gsound-play '/usr/src/tmp/gsound-buildroot/usr/bin'
libtool: warning: '../gsound/libgsound.la' has not been installed in '/usr/lib64'
libtool: install: /usr/libexec/rpm-build/install -p .libs/gsound-play /usr/src/tmp/gsound-buildroot/usr/bin/gsound-play
make[2]: Nothing to be done for 'install-data-am'.
make[2]: Leaving directory '/usr/src/RPM/BUILD/gsound-1.0.2/tools'
make[1]: Leaving directory '/usr/src/RPM/BUILD/gsound-1.0.2/tools'
make[1]: Entering directory '/usr/src/RPM/BUILD/gsound-1.0.2'
make[2]: Entering directory '/usr/src/RPM/BUILD/gsound-1.0.2'
make[2]: Nothing to be done for 'install-exec-am'.
make[2]: Nothing to be done for 'install-data-am'.
make[2]: Leaving directory '/usr/src/RPM/BUILD/gsound-1.0.2'
make[1]: Leaving directory '/usr/src/RPM/BUILD/gsound-1.0.2'
make: Leaving directory '/usr/src/RPM/BUILD/gsound-1.0.2'
+ /usr/lib/rpm/find-lang gsound
+ /usr/lib/rpm/brp-alt
Cleaning files in /usr/src/tmp/gsound-buildroot (auto)
removed './usr/lib64/libgsound.la'
mode of './usr/lib64/libgsound.so.0.0.2' changed from 0755 (rwxr-xr-x) to 0644 (rw-r--r--)
Verifying and fixing files in /usr/src/tmp/gsound-buildroot (binconfig,pkgconfig,libtool,desktop,gnuconfig)
/usr/lib64/pkgconfig/gsound.pc: Cflags: '-I${includedir}' --> ''
/usr/lib64/pkgconfig/gsound.pc: Libs: '-L${libdir} -lgsound' --> '-lgsound'
Checking contents of files in /usr/src/tmp/gsound-buildroot/ (default)
Compressing files in /usr/src/tmp/gsound-buildroot (auto)
Adjusting library links in /usr/src/tmp/gsound-buildroot
./usr/lib64: (from :0)
libgsound.so.0 -> libgsound.so.0.0.2
Verifying ELF objects in /usr/src/tmp/gsound-buildroot (arch=normal,fhs=normal,lfs=relaxed,lint=relaxed,rpath=normal,stack=normal,textrel=normal,unresolved=normal)
Processing files: gsound-1.0.2-alt2
Executing(%doc): /bin/sh -e /usr/src/tmp/rpm-tmp.9061
+ umask 022
+ /bin/mkdir -p /usr/src/RPM/BUILD
+ cd /usr/src/RPM/BUILD
+ cd gsound-1.0.2
+ DOCDIR=/usr/src/tmp/gsound-buildroot/usr/share/doc/gsound-1.0.2
+ export DOCDIR
+ rm -rf /usr/src/tmp/gsound-buildroot/usr/share/doc/gsound-1.0.2
+ /bin/mkdir -p /usr/src/tmp/gsound-buildroot/usr/share/doc/gsound-1.0.2
+ cp -prL NEWS README /usr/src/tmp/gsound-buildroot/usr/share/doc/gsound-1.0.2
+ chmod -R go-w /usr/src/tmp/gsound-buildroot/usr/share/doc/gsound-1.0.2
+ chmod -R a+rX /usr/src/tmp/gsound-buildroot/usr/share/doc/gsound-1.0.2
+ exit 0
Finding Provides (using /usr/lib/rpm/find-provides)
Executing: /bin/sh -e /usr/src/tmp/rpm-tmp.UoD3Rt
find-provides: running scripts (alternatives,debuginfo,gir,lib,pam,perl,pkgconfig,python,python3,shell,typelib,vala)
Finding Requires (using /usr/lib/rpm/find-requires)
Executing: /bin/sh -e /usr/src/tmp/rpm-tmp.gY9wOs
find-requires: running scripts (cpp,debuginfo,files,gir-js,gir-python,gir,lib,pam,perl,pkgconfig,pkgconfiglib,python,python3,rpmlib,shebang,shell,static,symlinks,systemd-services,typelib,vala)
Requires: libgsound = 1.0.2-alt2, /lib64/ld-linux-x86-64.so.2, libc.so.6(GLIBC_2.2.5)(64bit), libc.so.6(GLIBC_2.4)(64bit), libgio-2.0.so.0()(64bit) >= set:okxfpwyHt9Kktuc2f3ZtdAZw2M1v6, libglib-2.0.so.0()(64bit) >= set:ojpE2feYzH7ot0JydEx1fk0krWZgDEdBWkJsVwIvZ42whZ1GfSoxCgG7hbcqvhttyIkX4LGf31iOhIbGcrV0, libgobject-2.0.so.0()(64bit) >= set:mkfqQG5x0, libgsound.so.0()(64bit) >= set:helUudUbTYvb8, rtld(GNU_HASH)
Requires(rpmlib): rpmlib(SetVersions)
Finding debuginfo files (using /usr/lib/rpm/find-debuginfo-files)
Executing: /bin/sh -e /usr/src/tmp/rpm-tmp.CWfDOt
Creating gsound-debuginfo package
Processing files: libgsound-1.0.2-alt2
Finding Provides (using /usr/lib/rpm/find-provides)
Executing: /bin/sh -e /usr/src/tmp/rpm-tmp.eIMk2p
find-provides: running scripts (alternatives,debuginfo,gir,lib,pam,perl,pkgconfig,python,python3,shell,typelib,vala)
lib.prov: /usr/src/tmp/gsound-buildroot/usr/lib64/libgsound.so.0: 14 symbols, 14 bpp
Finding Requires (using /usr/lib/rpm/find-requires)
Executing: /bin/sh -e /usr/src/tmp/rpm-tmp.mERuks
find-requires: running scripts (cpp,debuginfo,files,gir-js,gir-python,gir,lib,pam,perl,pkgconfig,pkgconfiglib,python,python3,rpmlib,shebang,shell,static,symlinks,systemd-services,typelib,vala)
Provides: libgsound.so.0()(64bit) = set:hd65FIBQwsFpY0h0fVRULmKQ4gbEa1
Requires: libc.so.6(GLIBC_2.2.5)(64bit), libc.so.6(GLIBC_2.4)(64bit), libcanberra.so.0()(64bit) >= set:kggZoSYcZdV0zDZk5vSrdjDrEV1yfZ27i, libgio-2.0.so.0()(64bit) >= set:okFcmQ9TYZ1twsBht4fQc2dwD0Zp5oImbyHzjY5h2, libglib-2.0.so.0()(64bit) >= set:okXlvFp2cZ34RhLZftNSvljtrLXZ0Zq6KhZhg0ufG0, libgobject-2.0.so.0()(64bit) >= set:mihfZvY21e3yYfBAUADge3bZdxVz3, rtld(GNU_HASH)
Requires(rpmlib): rpmlib(SetVersions)
Finding debuginfo files (using /usr/lib/rpm/find-debuginfo-files)
Executing: /bin/sh -e /usr/src/tmp/rpm-tmp.8wsQut
Creating libgsound-debuginfo package
Processing files: libgsound-devel-1.0.2-alt2
Finding Provides (using /usr/lib/rpm/find-provides)
Executing: /bin/sh -e /usr/src/tmp/rpm-tmp.cqJ2Kr
find-provides: running scripts (alternatives,debuginfo,gir,lib,pam,perl,pkgconfig,python,python3,shell,typelib,vala)
Finding Requires (using /usr/lib/rpm/find-requires)
Executing: /bin/sh -e /usr/src/tmp/rpm-tmp.JJoiht
find-requires: running scripts (cpp,debuginfo,files,gir-js,gir-python,gir,lib,pam,perl,pkgconfig,pkgconfiglib,python,python3,rpmlib,shebang,shell,static,symlinks,systemd-services,typelib,vala)
In file included from /usr/src/tmp/gsound-buildroot/usr/include/gsound.h:22:
/usr/src/tmp/gsound-buildroot/usr/include/gsound-context.h:22:10: fatal error: gio/gio.h: No such file or directory
22 | #include
| ^~~~~~~~~~~
compilation terminated.
cpp.req: /usr/src/tmp/gsound-buildroot/usr/include/gsound.h: cpp failed, trying c++ mode
x86_64-alt-linux-cpp: fatal error: cannot execute 'cc1plus': execvp: No such file or directory
compilation terminated.
cpp.req: WARNING: /usr/src/tmp/gsound-buildroot/usr/include/gsound.h: cpp failed
/usr/src/tmp/gsound-buildroot/usr/include/gsound-attr.h:26:10: fatal error: glib.h: No such file or directory
26 | #include
| ^~~~~~~~
compilation terminated.
cpp.req: WARNING: /usr/src/tmp/gsound-buildroot/usr/include/gsound-attr.h: cpp failed
/usr/src/tmp/gsound-buildroot/usr/include/gsound-context.h:22:10: fatal error: gio/gio.h: No such file or directory
22 | #include
| ^~~~~~~~~~~
compilation terminated.
cpp.req: WARNING: /usr/src/tmp/gsound-buildroot/usr/include/gsound-context.h: cpp failed
Provides: pkgconfig(gsound) = 1.0.2, vapi(gsound)
Requires: libgsound = 1.0.2-alt2, /usr/lib64/libgsound.so.0.0.2, /usr/lib64/pkgconfig, /usr/share/vala/vapi, vapi(gio-2.0), vapi(glib-2.0)
Finding debuginfo files (using /usr/lib/rpm/find-debuginfo-files)
Executing: /bin/sh -e /usr/src/tmp/rpm-tmp.Y9c9qq
Processing files: libgsound-devel-doc-1.0.2-alt2
Finding Provides (using /usr/lib/rpm/find-provides)
Executing: /bin/sh -e /usr/src/tmp/rpm-tmp.o3OEdr
find-provides: running scripts (alternatives,debuginfo,gir,lib,pam,perl,pkgconfig,python,python3,shell,typelib,vala)
Finding Requires (using /usr/lib/rpm/find-requires)
Executing: /bin/sh -e /usr/src/tmp/rpm-tmp.X7Bb1t
find-requires: running scripts (cpp,debuginfo,files,gir-js,gir-python,gir,lib,pam,perl,pkgconfig,pkgconfiglib,python,python3,rpmlib,shebang,shell,static,symlinks,systemd-services,typelib,vala)
Conflicts: libgsound-devel < 1.0.2
Processing files: libgsound-gir-1.0.2-alt2
Finding Provides (using /usr/lib/rpm/find-provides)
Executing: /bin/sh -e /usr/src/tmp/rpm-tmp.0bo7kr
find-provides: running scripts (alternatives,debuginfo,gir,lib,pam,perl,pkgconfig,python,python3,shell,typelib,vala)
Finding Requires (using /usr/lib/rpm/find-requires)
Executing: /bin/sh -e /usr/src/tmp/rpm-tmp.0dDUts
find-requires: running scripts (cpp,debuginfo,files,gir-js,gir-python,gir,lib,pam,perl,pkgconfig,pkgconfiglib,python,python3,rpmlib,shebang,shell,static,symlinks,systemd-services,typelib,vala)
Provides: typelib(GSound) = 1.0
Requires: libgsound = 1.0.2-alt2, typelib(GObject) = 2.0, typelib(Gio) = 2.0
Finding debuginfo files (using /usr/lib/rpm/find-debuginfo-files)
Executing: /bin/sh -e /usr/src/tmp/rpm-tmp.weqIJp
Processing files: libgsound-gir-devel-1.0.2-alt2
Finding Provides (using /usr/lib/rpm/find-provides)
Executing: /bin/sh -e /usr/src/tmp/rpm-tmp.2H5qFp
find-provides: running scripts (alternatives,debuginfo,gir,lib,pam,perl,pkgconfig,python,python3,shell,typelib,vala)
Finding Requires (using /usr/lib/rpm/find-requires)
Executing: /bin/sh -e /usr/src/tmp/rpm-tmp.n4ftEs
find-requires: running scripts (cpp,debuginfo,files,gir-js,gir-python,gir,lib,pam,perl,pkgconfig,pkgconfiglib,python,python3,rpmlib,shebang,shell,static,symlinks,systemd-services,typelib,vala)
Provides: gir(GSound) = 1.0
Requires: libgsound-gir = 1.0.2-alt2, libgsound-devel = 1.0.2-alt2, gir(GObject) = 2.0, gir(Gio) = 2.0
Processing files: gsound-debuginfo-1.0.2-alt2
Finding Provides (using /usr/lib/rpm/find-provides)
Executing: /bin/sh -e /usr/src/tmp/rpm-tmp.6Q5Twt
find-provides: running scripts (debuginfo)
Finding Requires (using /usr/lib/rpm/find-requires)
Executing: /bin/sh -e /usr/src/tmp/rpm-tmp.bv2Yfq
find-requires: running scripts (debuginfo)
Requires: gsound = 1.0.2-alt2, /usr/lib/debug/lib64/ld-linux-x86-64.so.2.debug, debug64(libc.so.6), debug64(libgio-2.0.so.0), debug64(libglib-2.0.so.0), debug64(libgobject-2.0.so.0), debug64(libgsound.so.0)
Processing files: libgsound-debuginfo-1.0.2-alt2
Finding Provides (using /usr/lib/rpm/find-provides)
Executing: /bin/sh -e /usr/src/tmp/rpm-tmp.4VAmgq
find-provides: running scripts (debuginfo)
Finding Requires (using /usr/lib/rpm/find-requires)
Executing: /bin/sh -e /usr/src/tmp/rpm-tmp.vJZVIp
find-requires: running scripts (debuginfo)
Provides: debug64(libgsound.so.0)
Requires: libgsound = 1.0.2-alt2, debug64(libc.so.6), debug64(libcanberra.so.0), debug64(libgio-2.0.so.0), debug64(libglib-2.0.so.0), debug64(libgobject-2.0.so.0)
Adding to gsound a strict dependency on libgsound
Adding to gsound-debuginfo a strict dependency on gsound
Adding to libgsound-devel a strict dependency on libgsound
Adding to libgsound-gir a strict dependency on libgsound
Adding to libgsound-debuginfo a strict dependency on libgsound
Adding to libgsound-gir-devel a strict dependency on libgsound-devel
Adding to libgsound-gir-devel a strict dependency on libgsound-gir
Adding to gsound-debuginfo a strict dependency on libgsound-debuginfo
Removing from gsound-debuginfo 1 sources provided by libgsound-debuginfo
also prunning dir /usr/src/debug/gsound-1.0.2/gsound
Removing 1 extra deps from gsound due to dependency on libgsound
Removing 1 extra deps from libgsound-devel due to dependency on libgsound
Removing 1 extra deps from gsound-debuginfo due to dependency on libgsound-debuginfo
Removing 5 extra deps from gsound due to repentancy on libgsound
Removing 4 extra deps from gsound-debuginfo due to repentancy on libgsound-debuginfo
Wrote: /usr/src/RPM/RPMS/x86_64/gsound-1.0.2-alt2.x86_64.rpm (w2.lzdio)
Wrote: /usr/src/RPM/RPMS/x86_64/libgsound-1.0.2-alt2.x86_64.rpm (w2.lzdio)
Wrote: /usr/src/RPM/RPMS/x86_64/libgsound-devel-1.0.2-alt2.x86_64.rpm (w2.lzdio)
Wrote: /usr/src/RPM/RPMS/noarch/libgsound-devel-doc-1.0.2-alt2.noarch.rpm (w2.lzdio)
Wrote: /usr/src/RPM/RPMS/x86_64/libgsound-gir-1.0.2-alt2.x86_64.rpm (w2.lzdio)
Wrote: /usr/src/RPM/RPMS/noarch/libgsound-gir-devel-1.0.2-alt2.noarch.rpm (w2.lzdio)
Wrote: /usr/src/RPM/RPMS/x86_64/gsound-debuginfo-1.0.2-alt2.x86_64.rpm (w2.lzdio)
Wrote: /usr/src/RPM/RPMS/x86_64/libgsound-debuginfo-1.0.2-alt2.x86_64.rpm (w2.lzdio)
51.29user 10.92system 1:17.49elapsed 80%CPU (0avgtext+0avgdata 64328maxresident)k
0inputs+0outputs (0major+1804301minor)pagefaults 0swaps
68.31user 20.86system 1:42.87elapsed 86%CPU (0avgtext+0avgdata 105320maxresident)k
40inputs+0outputs (0major+2464038minor)pagefaults 0swaps
--- gsound-1.0.2-alt2.x86_64.rpm.repo 2020-11-20 13:40:45.000000000 +0000
+++ gsound-1.0.2-alt2.x86_64.rpm.hasher 2021-07-03 07:30:30.264509035 +0000
@@ -9,2 +9,2 @@
Provides: gsound = 1.0.2-alt2:sisyphus+262191.100.1.1
-RPMIdentity: bbd154ab7f552eb2678fefad5ab39e26
+RPMIdentity: c247d48a1926901b608c79b6b0dadf8c
--- gsound-debuginfo-1.0.2-alt2.x86_64.rpm.repo 2020-11-20 13:40:45.000000000 +0000
+++ gsound-debuginfo-1.0.2-alt2.x86_64.rpm.hasher 2021-07-03 07:30:30.419503540 +0000
@@ -8,2 +8,2 @@
Provides: gsound-debuginfo = 1.0.2-alt2:sisyphus+262191.100.1.1
-RPMIdentity: 56d60ef26ba3d7ed62f4af0d82d75ad2
+RPMIdentity: 5789035ab34ff1e7da3e8dd71c2ae422
--- libgsound-1.0.2-alt2.x86_64.rpm.repo 2020-11-20 13:40:45.000000000 +0000
+++ libgsound-1.0.2-alt2.x86_64.rpm.hasher 2021-07-03 07:30:30.551498861 +0000
@@ -12,2 +12,2 @@
Provides: libgsound = 1.0.2-alt2:sisyphus+262191.100.1.1
-RPMIdentity: 8390dbe8615d063c231456741c9a3387
+RPMIdentity: e9e4196215601aa5c35863244a48a0a8
--- libgsound-debuginfo-1.0.2-alt2.x86_64.rpm.repo 2020-11-20 13:40:45.000000000 +0000
+++ libgsound-debuginfo-1.0.2-alt2.x86_64.rpm.hasher 2021-07-03 07:30:30.682494217 +0000
@@ -14,2 +14,2 @@
Provides: libgsound-debuginfo = 1.0.2-alt2:sisyphus+262191.100.1.1
-RPMIdentity: 8828a963e52139522375b34e2ddbbd43
+RPMIdentity: 72fe461ce29e027a46cca17e063816a8
--- libgsound-devel-1.0.2-alt2.x86_64.rpm.repo 2020-11-20 13:40:45.000000000 +0000
+++ libgsound-devel-1.0.2-alt2.x86_64.rpm.hasher 2021-07-03 07:30:30.808489751 +0000
@@ -15,2 +15,2 @@
Provides: libgsound-devel = 1.0.2-alt2:sisyphus+262191.100.1.1
-RPMIdentity: b37069fb7a4e7d874f1b8b52cbbafa73
+RPMIdentity: 46e4d5ef1e2ac1f707900519ef3a4108
--- libgsound-devel-doc-1.0.2-alt2.noarch.rpm.repo 2020-11-20 13:40:45.000000000 +0000
+++ libgsound-devel-doc-1.0.2-alt2.noarch.rpm.hasher 2021-07-03 07:30:30.958484434 +0000
@@ -20,2 +20,2 @@
Conflicts: libgsound-devel < 1.0.2
-RPMIdentity: 63be9a547a72c80ffb9875eb97063370
+RPMIdentity: b8b824fcfbd51fee69bb8cb3bad45097