<86>May  4 03:03:28 userdel[3222707]: delete user 'rooter'
<86>May  4 03:03:28 userdel[3222707]: removed group 'rooter' owned by 'rooter'
<86>May  4 03:03:28 userdel[3222707]: removed shadow group 'rooter' owned by 'rooter'
<86>May  4 03:03:28 groupadd[3222724]: group added to /etc/group: name=rooter, GID=702
<86>May  4 03:03:28 groupadd[3222724]: group added to /etc/gshadow: name=rooter
<86>May  4 03:03:28 groupadd[3222724]: new group: name=rooter, GID=702
<86>May  4 03:03:28 useradd[3222732]: new user: name=rooter, UID=702, GID=702, home=/root, shell=/bin/bash
<86>May  4 03:03:28 userdel[3222738]: delete user 'builder'
<86>May  4 03:03:28 userdel[3222738]: removed group 'builder' owned by 'builder'
<86>May  4 03:03:28 userdel[3222738]: removed shadow group 'builder' owned by 'builder'
<86>May  4 03:03:28 groupadd[3222753]: group added to /etc/group: name=builder, GID=703
<86>May  4 03:03:28 groupadd[3222753]: group added to /etc/gshadow: name=builder
<86>May  4 03:03:28 groupadd[3222753]: new group: name=builder, GID=703
<86>May  4 03:03:28 useradd[3222761]: new user: name=builder, UID=703, GID=703, home=/usr/src, shell=/bin/bash
warning: Macro %kernel_srcdir not found
<13>May  4 03:03:30 rpmi: udev-rules-1:247.3-alt2 sisyphus+266129.100.1.3 1613012524 installed
<13>May  4 03:03:30 rpmi: msulogin-1.0-alt1 1366288481 installed
<13>May  4 03:03:30 rpmi: mount-2.36.1-alt2 sisyphus+264757.100.1.1 1610726582 installed
<13>May  4 03:03:30 rpmi: sysvinit-2.88-alt6 sisyphus+240403.100.2.1 1573520131 installed
<13>May  4 03:03:30 rpmi: rpmquery-strictdep-1-alt1 sisyphus+227992.440.11.1 1556321045 installed
<13>May  4 03:03:30 rpmi: make-initrd-busybox-1.32.1-alt3 sisyphus+268673.100.1.1 1617125754 installed
<13>May  4 03:03:30 rpmi: pciids-20210426-alt1 sisyphus+270747.100.1.1 1619478420 installed
<13>May  4 03:03:30 rpmi: chrooted-0.3.11-alt1 sisyphus+249336.100.1.1 1585959537 installed
<13>May  4 03:03:30 rpmi: chrooted-resolv-0.3.1-alt2 1176155257 installed
<13>May  4 03:03:30 rpmi: libpci-3.7.0-alt1 sisyphus+253474.100.1.1 1592227050 installed
<13>May  4 03:03:30 rpmi: pciutils-3.7.0-alt1 sisyphus+253474.100.1.1 1592227050 installed
<13>May  4 03:03:30 rpmi: libdevmapper-1.02.175-alt1 sisyphus+266305.100.1.1 1613318577 installed
<13>May  4 03:03:30 rpmi: udev-hwdb-1:247.3-alt2 sisyphus+266129.100.1.3 1613012524 installed
<13>May  4 03:03:30 rpmi: liblz4-1:1.9.3-alt1 sisyphus+262305.100.1.1 1606099128 installed
<13>May  4 03:03:30 rpmi: libiptables-1.8.6-alt1 sisyphus+262268.100.1.1 1606080655 installed
<13>May  4 03:03:30 rpmi: libgpg-error-1.41-alt4 sisyphus+264254.200.1.1 1609440105 installed
<13>May  4 03:03:30 rpmi: libgcrypt20-1.9.2-alt1 sisyphus+266496.100.1.1 1613559130 installed
<13>May  4 03:03:30 rpmi: systemd-tmpfiles-standalone-1:247.3-alt2 sisyphus+266129.100.1.3 1613012524 installed
<13>May  4 03:03:30 rpmi: systemd-sysctl-standalone-1:247.3-alt2 sisyphus+266129.100.1.3 1613012524 installed
<13>May  4 03:03:30 rpmi: hwclock-1:2.36.1-alt2 sisyphus+264757.100.1.1 1610726582 installed
<13>May  4 03:03:30 rpmi: hashalot-0.3-alt1.qa1 1366323553 installed
<13>May  4 03:03:30 rpmi: losetup-2.36.1-alt2 sisyphus+264757.100.1.1 1610726582 installed
<13>May  4 03:03:30 rpmi: lsblk-2.36.1-alt2 sisyphus+264757.100.1.1 1610726582 installed
<13>May  4 03:03:30 rpmi: libp11-kit-0.23.15-alt2 sisyphus+252784.100.2.2 1591274915 installed
<13>May  4 03:03:30 rpmi: libtasn1-4.16.0-alt1 sisyphus+245480.100.1.1 1580825069 installed
<13>May  4 03:03:30 rpmi: rpm-macros-alternatives-0.5.1-alt1 sisyphus+226946.100.1.1 1554830426 installed
<13>May  4 03:03:30 rpmi: alternatives-0.5.1-alt1 sisyphus+226946.100.1.1 1554830426 installed
<13>May  4 03:03:30 rpmi: ca-certificates-2021.03.24-alt1 sisyphus+268304.300.1.1 1616591829 installed
<13>May  4 03:03:30 rpmi: ca-trust-0.1.2-alt1 sisyphus+233348.100.1.1 1561653823 installed
<13>May  4 03:03:30 rpmi: p11-kit-trust-0.23.15-alt2 sisyphus+252784.100.2.2 1591274915 installed
<13>May  4 03:03:31 rpmi: libcrypto1.1-1.1.1k-alt1 sisyphus+268375.100.1.1 1616684123 installed
<13>May  4 03:03:31 rpmi: libkmod-27.0.9.f5434cf-alt1 sisyphus+253982.100.1.1 1593076942 installed
<13>May  4 03:03:31 rpmi: kmod-27.0.9.f5434cf-alt1 sisyphus+253982.100.1.1 1593076942 installed
<13>May  4 03:03:31 rpmi: systemd-modules-load-standalone-1:247.3-alt2 sisyphus+266129.100.1.3 1613012524 installed
<13>May  4 03:03:31 rpmi: startup-0.9.9.11-alt1 sisyphus+265313.200.3.1 1612018510 installed
<13>May  4 03:03:31 rpmi: systemd-utils-1:247.3-alt2 sisyphus+266129.100.1.3 1613012524 installed
<13>May  4 03:03:31 rpmi: dmsetup-1.02.175-alt1 sisyphus+266305.100.1.1 1613318577 installed
<86>May  4 03:03:31 groupadd[3229577]: group added to /etc/group: name=tape, GID=499
<86>May  4 03:03:31 groupadd[3229577]: group added to /etc/gshadow: name=tape
<86>May  4 03:03:31 groupadd[3229577]: new group: name=tape, GID=499
<86>May  4 03:03:31 groupadd[3229587]: group added to /etc/group: name=dialout, GID=498
<86>May  4 03:03:31 groupadd[3229587]: group added to /etc/gshadow: name=dialout
<86>May  4 03:03:31 groupadd[3229587]: new group: name=dialout, GID=498
<86>May  4 03:03:31 groupadd[3229601]: group added to /etc/group: name=input, GID=497
<86>May  4 03:03:31 groupadd[3229601]: group added to /etc/gshadow: name=input
<86>May  4 03:03:31 groupadd[3229601]: new group: name=input, GID=497
<86>May  4 03:03:31 groupadd[3229615]: group added to /etc/group: name=video, GID=496
<86>May  4 03:03:31 groupadd[3229615]: group added to /etc/gshadow: name=video
<86>May  4 03:03:31 groupadd[3229615]: new group: name=video, GID=496
<86>May  4 03:03:31 groupadd[3229625]: group added to /etc/group: name=render, GID=495
<86>May  4 03:03:31 groupadd[3229625]: group added to /etc/gshadow: name=render
<86>May  4 03:03:31 groupadd[3229625]: new group: name=render, GID=495
<13>May  4 03:03:31 rpmi: udev-1:247.3-alt2 sisyphus+266129.100.1.3 1613012524 installed
<13>May  4 03:03:31 rpmi: make-initrd-2.16.0-alt1 sisyphus+269737.100.1.1 1618225198 installed
<13>May  4 03:03:31 rpmi: bootloader-utils-0.5.3-alt1 sisyphus+242547.100.1.1 1575763999 installed
<13>May  4 03:03:31 rpmi: rpm-build-kernel-0.114-alt1 sisyphus+267655.40.12.1 1615819987 installed
Building target platforms: x86_64
Building for target x86_64
Wrote: /usr/src/in/nosrpm/scst-3.4.0-alt1.nosrc.rpm (w1.gzdio)
Installing scst-3.4.0-alt1.src.rpm
Building target platforms: x86_64
Building for target x86_64
Executing(%prep): /bin/sh -e /usr/src/tmp/rpm-tmp.11073
+ umask 022
+ /bin/mkdir -p /usr/src/RPM/BUILD
+ cd /usr/src/RPM/BUILD
+ cd /usr/src/RPM/BUILD
+ rm -rf scst-3.4.0
+ echo 'Source #0 (scst-3.4.0.tar.bz2):'
Source #0 (scst-3.4.0.tar.bz2):
+ /bin/tar -xf -
+ /bin/bzip2 -dc /usr/src/RPM/SOURCES/scst-3.4.0.tar.bz2
+ cd scst-3.4.0
+ /bin/chmod -c -Rf u+rwX,go-w .
+ tar -cJf scst-3.4.0.tar.xz scst/src scst/README scst/README.dlm scst/README.drbd
+ exit 0
Executing(%install): /bin/sh -e /usr/src/tmp/rpm-tmp.74115
+ umask 022
+ /bin/mkdir -p /usr/src/RPM/BUILD
+ cd /usr/src/RPM/BUILD
+ /bin/chmod -Rf u+rwX -- /usr/src/tmp/scst-buildroot
+ :
+ /bin/rm -rf -- /usr/src/tmp/scst-buildroot
+ PATH=/usr/libexec/rpm-build:/usr/src/bin:/bin:/usr/bin:/usr/X11R6/bin:/usr/games
+ cd scst-3.4.0
+ install -pD -m0644 scst-3.4.0.tar.xz /usr/src/tmp/scst-buildroot/usr/src/kernel/sources/scst-3.4.0.tar.xz
+ mkdir -p /usr/src/tmp/scst-buildroot/usr/include/scst
+ install -m0644 scst/include/backport.h scst/include/scst.h scst/include/scst_const.h scst/include/scst_debug.h scst/include/scst_event.h scst/include/scst_sgv.h scst/include/scst_user.h /usr/src/tmp/scst-buildroot/usr/include/scst/
+ /usr/lib/rpm/brp-alt
Cleaning files in /usr/src/tmp/scst-buildroot (auto)
Verifying and fixing files in /usr/src/tmp/scst-buildroot (binconfig,pkgconfig,libtool,desktop,gnuconfig)
Checking contents of files in /usr/src/tmp/scst-buildroot/ (default)
Compressing files in /usr/src/tmp/scst-buildroot (auto)
Verifying ELF objects in /usr/src/tmp/scst-buildroot (arch=normal,fhs=normal,lfs=relaxed,lint=relaxed,rpath=normal,stack=normal,textrel=normal,unresolved=normal)
Processing files: scst-devel-3.4.0-alt1
Executing(%doc): /bin/sh -e /usr/src/tmp/rpm-tmp.27701
+ umask 022
+ /bin/mkdir -p /usr/src/RPM/BUILD
+ cd /usr/src/RPM/BUILD
+ cd scst-3.4.0
+ DOCDIR=/usr/src/tmp/scst-buildroot/usr/share/doc/scst-devel-3.4.0
+ export DOCDIR
+ rm -rf /usr/src/tmp/scst-buildroot/usr/share/doc/scst-devel-3.4.0
+ /bin/mkdir -p /usr/src/tmp/scst-buildroot/usr/share/doc/scst-devel-3.4.0
+ cp -prL scst/README scst/README.dlm scst/README.drbd /usr/src/tmp/scst-buildroot/usr/share/doc/scst-devel-3.4.0
+ chmod -R go-w /usr/src/tmp/scst-buildroot/usr/share/doc/scst-devel-3.4.0
+ chmod -R a+rX /usr/src/tmp/scst-buildroot/usr/share/doc/scst-devel-3.4.0
+ exit 0
Finding Provides (using /usr/lib/rpm/find-provides)
Executing: /bin/sh -e /usr/src/tmp/rpm-tmp.CIwQ2Y
find-provides: running scripts (alternatives,debuginfo,lib,pam,perl,pkgconfig,python,python3,shell)
Finding Requires (using /usr/lib/rpm/find-requires)
Executing: /bin/sh -e /usr/src/tmp/rpm-tmp.a3I8nY
find-requires: running scripts (cpp,debuginfo,files,kernel,lib,pam,perl,pkgconfig,pkgconfiglib,python,python3,rpmlib,shebang,shell,static,symlinks,systemd-services)
/usr/src/tmp/scst-buildroot/usr/include/scst/scst.h:38:10: fatal error: linux/blkdev.h: No such file or directory
   38 | #include <linux/blkdev.h>
      |          ^~~~~~~~~~~~~~~~
compilation terminated.
cpp.req: /usr/src/tmp/scst-buildroot/usr/include/scst/scst.h: cpp failed, trying c++ mode
x86_64-alt-linux-cpp: fatal error: cannot execute 'cc1plus': execvp: No such file or directory
compilation terminated.
cpp.req: WARNING: /usr/src/tmp/scst-buildroot/usr/include/scst/scst.h: cpp failed
/usr/src/tmp/scst-buildroot/usr/include/scst/backport.h:24:10: fatal error: linux/bio.h: No such file or directory
   24 | #include <linux/bio.h>
      |          ^~~~~~~~~~~~~
compilation terminated.
cpp.req: WARNING: /usr/src/tmp/scst-buildroot/usr/include/scst/backport.h: cpp failed
In file included from /usr/src/tmp/scst-buildroot/usr/include/scst/scst_user.h:28:
/usr/src/tmp/scst-buildroot/usr/include/scst/scst_const.h:38:10: fatal error: scst_itf_ver.h: No such file or directory
   38 | #include "scst_itf_ver.h"
      |          ^~~~~~~~~~~~~~~~
compilation terminated.
cpp.req: WARNING: /usr/src/tmp/scst-buildroot/usr/include/scst/scst_user.h: cpp failed
/usr/src/tmp/scst-buildroot/usr/include/scst/scst_const.h:38:10: fatal error: scst_itf_ver.h: No such file or directory
   38 | #include "scst_itf_ver.h"
      |          ^~~~~~~~~~~~~~~~
compilation terminated.
cpp.req: WARNING: /usr/src/tmp/scst-buildroot/usr/include/scst/scst_const.h: cpp failed
/usr/src/tmp/scst-buildroot/usr/include/scst/scst_debug.h:24:41: error: missing binary operator before token "("
   24 | #if LINUX_VERSION_CODE <= KERNEL_VERSION(2, 6, 32)
      |                                         ^
/usr/src/tmp/scst-buildroot/usr/include/scst/scst_debug.h:27:10: fatal error: generated/autoconf.h: No such file or directory
   27 | #include <generated/autoconf.h> /* for CONFIG_* */
      |          ^~~~~~~~~~~~~~~~~~~~~~
compilation terminated.
cpp.req: WARNING: /usr/src/tmp/scst-buildroot/usr/include/scst/scst_debug.h: cpp failed
In file included from /usr/src/tmp/scst-buildroot/usr/include/scst/scst_event.h:19:
/usr/src/tmp/scst-buildroot/usr/include/scst/scst_const.h:38:10: fatal error: scst_itf_ver.h: No such file or directory
   38 | #include "scst_itf_ver.h"
      |          ^~~~~~~~~~~~~~~~
compilation terminated.
cpp.req: WARNING: /usr/src/tmp/scst-buildroot/usr/include/scst/scst_event.h: cpp failed
Finding debuginfo files (using /usr/lib/rpm/find-debuginfo-files)
Executing: /bin/sh -e /usr/src/tmp/rpm-tmp.SqeRSV
Processing files: kernel-source-scst-3.4.0-alt1
Finding Provides (using /usr/lib/rpm/find-provides)
Executing: /bin/sh -e /usr/src/tmp/rpm-tmp.7IbkpX
find-provides: running scripts (alternatives,debuginfo,lib,pam,perl,pkgconfig,python,python3,shell)
Finding Requires (using /usr/lib/rpm/find-requires)
Executing: /bin/sh -e /usr/src/tmp/rpm-tmp.FvVvkW
find-requires: running scripts (cpp,debuginfo,files,kernel,lib,pam,perl,pkgconfig,pkgconfiglib,python,python3,rpmlib,shebang,shell,static,symlinks,systemd-services)
Provides: kernel-src-scst = 3.4.0-alt1
Wrote: /usr/src/RPM/RPMS/x86_64/scst-devel-3.4.0-alt1.x86_64.rpm (w2.lzdio)
Wrote: /usr/src/RPM/RPMS/noarch/kernel-source-scst-3.4.0-alt1.noarch.rpm (w2.lzdio)
1.86user 0.31system 0:06.81elapsed 31%CPU (0avgtext+0avgdata 37992maxresident)k
0inputs+0outputs (0major+124253minor)pagefaults 0swaps
6.69user 3.24system 0:14.66elapsed 67%CPU (0avgtext+0avgdata 114020maxresident)k
9496inputs+0outputs (0major+517312minor)pagefaults 0swaps