<86>Apr  2 06:04:50 userdel[879834]: delete user 'rooter'
<86>Apr  2 06:04:50 groupadd[879851]: group added to /etc/group: name=rooter, GID=615
<86>Apr  2 06:04:50 groupadd[879851]: group added to /etc/gshadow: name=rooter
<86>Apr  2 06:04:50 groupadd[879851]: new group: name=rooter, GID=615
<86>Apr  2 06:04:50 useradd[879868]: new user: name=rooter, UID=615, GID=615, home=/root, shell=/bin/bash
<86>Apr  2 06:04:50 userdel[879896]: delete user 'builder'
<86>Apr  2 06:04:50 userdel[879896]: removed group 'builder' owned by 'builder'
<86>Apr  2 06:04:50 userdel[879896]: removed shadow group 'builder' owned by 'builder'
<86>Apr  2 06:04:50 groupadd[879928]: group added to /etc/group: name=builder, GID=616
<86>Apr  2 06:04:50 groupadd[879928]: group added to /etc/gshadow: name=builder
<86>Apr  2 06:04:50 groupadd[879928]: new group: name=builder, GID=616
<86>Apr  2 06:04:50 useradd[879967]: new user: name=builder, UID=616, GID=616, home=/usr/src, shell=/bin/bash
warning: Macro %python3_sitelibdir not found
<13>Apr  2 06:04:53 rpmi: xorg-proto-devel-2020.1-alt1 sisyphus+250406.100.1.1 1587554810 installed
<13>Apr  2 06:04:53 rpmi: libjpeg-2:2.0.6-alt1 sisyphus+266888.100.1.1 1614172364 installed
<13>Apr  2 06:04:53 rpmi: libpng16-1.6.37-alt1 sisyphus+236677.100.2.1 1566917982 installed
<13>Apr  2 06:04:53 rpmi: libexpat-2.2.10-alt1 sisyphus+259966.100.1.1 1602824514 installed
<13>Apr  2 06:04:53 rpmi: libxkbcommon-1.1.0-alt1 sisyphus+267202.300.3.1 1615309343 installed
<13>Apr  2 06:04:53 rpmi: libwayland-client-1.19.0-alt1 sisyphus+265427.100.1.1 1611852852 installed
<13>Apr  2 06:04:53 rpmi: libICE-1.0.10-alt1 sisyphus+247690.100.1.1 1584000383 installed
<13>Apr  2 06:04:53 rpmi: libSM-1.2.3-alt1 sisyphus+226734.100.2.1 1554586157 installed
<13>Apr  2 06:04:53 rpmi: liblcms2-2.12-alt1 sisyphus+265911.100.2.1 1613037760 installed
<13>Apr  2 06:04:53 rpmi: libgomp1-10.2.1-alt3 sisyphus+267829.100.1.1 1615807924 installed
<13>Apr  2 06:04:53 rpmi: libglvnd-7:1.3.2-alt1 sisyphus+254610.100.1.1 1594124262 installed
<13>Apr  2 06:04:53 rpmi: perl-HTTP-Date-6.05-alt1 sisyphus+258981.100.1.1 1601542386 installed
<13>Apr  2 06:04:53 rpmi: xml-utils-1:2.9.10-alt6 sisyphus+265234.30740.49.1 1613762093 installed
<13>Apr  2 06:04:53 rpmi: qt5-base-common-5.15.2-alt2 sisyphus+267350.100.1.1 1614868112 installed
<13>Apr  2 06:04:53 rpmi: udev-rules-1:247.3-alt2 sisyphus+266129.100.1.3 1613012524 installed
<13>Apr  2 06:04:53 rpmi: libfribidi-1.0.10-alt1 sisyphus+254557.100.1.1 1594020354 installed
<13>Apr  2 06:04:53 rpmi: perl-XML-NamespaceSupport-1.12-alt1 1491296348 installed
<13>Apr  2 06:04:54 rpmi: libwebp7-1.2.0-alt1 sisyphus+265504.100.2.1 1612122043 installed
<13>Apr  2 06:04:54 rpmi: libicu67-1:6.7.1-alt2 sisyphus+252432.100.2.2 1590796031 installed
<13>Apr  2 06:04:54 rpmi: libts0-1.22-alt3 sisyphus+259302.100.1.1 1601981876 installed
<13>Apr  2 06:04:54 rpmi: libmtdev-1.1.6-alt1 sisyphus+250141.100.1.1 1587131323 installed
<13>Apr  2 06:04:54 rpmi: libsqlite3-3.35.3-alt1 sisyphus+268601.100.1.1 1617030257 installed
<13>Apr  2 06:04:54 rpmi: libgudev-1:236-alt1 sisyphus+267915.300.3.1 1615901416 installed
<13>Apr  2 06:04:54 rpmi: zlib-devel-1.2.11-alt1 sisyphus+221902.6000.4.1 1550600768 installed
<13>Apr  2 06:04:54 rpmi: libltdl7-2.4.6-alt2 sisyphus+263722.100.1.1 1608561796 installed
<13>Apr  2 06:04:54 rpmi: libpaper-1.1.28-alt1 sisyphus+259176.100.1.1 1601738991 installed
<13>Apr  2 06:04:54 rpmi: libopenjpeg2.0-2.4.0-alt1 sisyphus+264173.100.1.1 1609245154 installed
<13>Apr  2 06:04:54 rpmi: libnettle8-3.7.2-alt1 sisyphus+268184.100.1.1 1616430247 installed
<13>Apr  2 06:04:54 rpmi: libwayland-server-1.19.0-alt1 sisyphus+265427.100.1.1 1611852852 installed
<13>Apr  2 06:04:54 rpmi: ilmbase25-common-2.5.3-alt1 sisyphus+260406.100.1.1 1603706855 installed
<13>Apr  2 06:04:54 rpmi: libiex25-2.5.3-alt1 sisyphus+260406.100.1.1 1603706855 installed
<13>Apr  2 06:04:54 rpmi: perl-LWP-MediaTypes-6.04-alt1 sisyphus+225468.100.1.1 1553186684 installed
<13>Apr  2 06:04:54 rpmi: perl-Compress-Raw-Zlib-2.101-alt1 sisyphus+266765.100.1.2 1614138847 installed
<13>Apr  2 06:04:54 rpmi: perl-libnet-1:3.13-alt1 sisyphus+266120.100.1.1 1612961310 installed
<13>Apr  2 06:04:54 rpmi: perl-XML-SAX-Base-1.09-alt1 1494364363 installed
<13>Apr  2 06:04:54 rpmi: libjbig-2.1-alt1 1401380921 installed
<13>Apr  2 06:04:54 rpmi: libtiff5-4.2.0-alt1 sisyphus+266365.100.2.1 1613478686 installed
<13>Apr  2 06:04:54 rpmi: libgraphite2-1.3.14-alt2 sisyphus+250009.100.1.1 1586943071 installed
<13>Apr  2 06:04:54 rpmi: libp11-kit-0.23.15-alt2 sisyphus+252784.100.2.2 1591274915 installed
<13>Apr  2 06:04:54 rpmi: libtasn1-4.16.0-alt1 sisyphus+245480.100.1.1 1580825069 installed
<13>Apr  2 06:04:54 rpmi: libXdmcp-1.1.3-alt1 sisyphus+225206.600.1.2 1552949347 installed
<13>Apr  2 06:04:54 rpmi: libXau-1.0.9-alt1 sisyphus+223149.200.2.1 1551268156 installed
<13>Apr  2 06:04:54 rpmi: libxcb-1.14-alt1 sisyphus+247358.200.1.3 1583854223 installed
<13>Apr  2 06:04:56 rpmi: libxcb-devel-1.14-alt1 sisyphus+247358.200.1.3 1583854223 installed
<13>Apr  2 06:04:56 rpmi: libxcbutil-keysyms-0.4.0-alt1 1446204121 installed
<13>Apr  2 06:04:56 rpmi: libxcbutil-keysyms-devel-0.4.0-alt1 1446204121 installed
<13>Apr  2 06:04:56 rpmi: libxcbutil-icccm-0.4.1-alt2 sisyphus+229000.100.1.1 1557152218 installed
<13>Apr  2 06:04:56 rpmi: libxcbutil-1:0.4.0-alt1 1413392888 installed
<13>Apr  2 06:04:56 rpmi: libxcbutil-image-0.4.0-alt1 1446204177 installed
<13>Apr  2 06:04:56 rpmi: libxcb-render-util-0.3.9-alt3 sisyphus+222674.100.1.1 1550989885 installed
<13>Apr  2 06:04:56 rpmi: libxkbcommon-x11-1.1.0-alt1 sisyphus+267202.300.3.1 1615309343 installed
<13>Apr  2 06:04:56 rpmi: libXau-devel-1.0.9-alt1 sisyphus+223149.200.2.1 1551268156 installed
<13>Apr  2 06:04:56 rpmi: libXdmcp-devel-1.1.3-alt1 sisyphus+225206.600.1.2 1552949347 installed
<13>Apr  2 06:04:56 rpmi: libgraphite2-devel-1.3.14-alt2 sisyphus+250009.100.1.1 1586943071 installed
<13>Apr  2 06:04:56 rpmi: libilmthread25-2.5.3-alt1 sisyphus+260406.100.1.1 1603706855 installed
<13>Apr  2 06:04:56 rpmi: libimath25-2.5.3-alt1 sisyphus+260406.100.1.1 1603706855 installed
<13>Apr  2 06:04:56 rpmi: libhalf25-2.5.3-alt1 sisyphus+260406.100.1.1 1603706855 installed
<13>Apr  2 06:04:56 rpmi: libhogweed6-3.7.2-alt1 sisyphus+268184.100.1.1 1616430247 installed
<13>Apr  2 06:04:56 rpmi: libpng-devel-1.6.37-alt1 sisyphus+236677.100.2.1 1566917982 installed
<13>Apr  2 06:04:56 rpmi: icu-utils-1:6.7.1-alt2 sisyphus+252432.100.2.2 1590796031 installed
<13>Apr  2 06:04:56 rpmi: libicu-devel-1:6.7.1-alt2 sisyphus+252432.100.2.2 1590796031 installed
<13>Apr  2 06:04:56 rpmi: qt5-x11extras-common-5.15.2-alt1 sisyphus+264725.1600.3.2 1612981128 installed
<13>Apr  2 06:04:56 rpmi: rpm-macros-qt5-5.15.2-alt2 sisyphus+267350.100.1.1 1614868112 installed
<13>Apr  2 06:04:56 rpmi: rpm-build-gir-0.7.3-alt3 sisyphus+242150.100.1.1 1575312005 installed
<13>Apr  2 06:04:56 rpmi: perl-File-Listing-6.14-alt1 sisyphus+262735.100.1.1 1606813544 installed
<13>Apr  2 06:04:56 rpmi: libOpenGL-7:1.3.2-alt1 sisyphus+254610.100.1.1 1594124262 installed
<13>Apr  2 06:04:56 rpmi: libGLES-7:1.3.2-alt1 sisyphus+254610.100.1.1 1594124262 installed
<13>Apr  2 06:04:56 rpmi: libgomp10-devel-10.2.1-alt3 sisyphus+267829.100.1.1 1615807924 installed
<13>Apr  2 06:04:56 rpmi: libgomp-devel-10-alt1 sisyphus+263054.200.3.1 1607517515 installed
<13>Apr  2 06:04:56 rpmi: libICE-devel-1.0.10-alt1 sisyphus+247690.100.1.1 1584000383 installed
<13>Apr  2 06:04:56 rpmi: libSM-devel-1.2.3-alt1 sisyphus+226734.100.2.1 1554586157 installed
<13>Apr  2 06:04:56 rpmi: libwayland-cursor-1.19.0-alt1 sisyphus+265427.100.1.1 1611852852 installed
<13>Apr  2 06:04:56 rpmi: libwayland-egl-4:18.1.0-alt1 sisyphus+265427.100.1.1 1611852852 installed
<13>Apr  2 06:04:56 rpmi: libxkbcommon-devel-1.1.0-alt1 sisyphus+267202.300.3.1 1615309343 installed
<13>Apr  2 06:04:56 rpmi: wayland-devel-1.19.0-alt1 sisyphus+265427.100.1.1 1611852852 installed
<13>Apr  2 06:04:56 rpmi: libwayland-client-devel-1.19.0-alt1 sisyphus+265427.100.1.1 1611852852 installed
<13>Apr  2 06:04:56 rpmi: libflif-0.3-alt3 sisyphus+248230.100.1.1 1584818777 installed
<13>Apr  2 06:04:56 rpmi: libjasper-2.0.27-alt1 sisyphus+268170.100.2.1 1616580947 installed
<13>Apr  2 06:04:56 rpmi: libraw-0.20.2-alt1 sisyphus+258819.40.9.1 1604414257 installed
<13>Apr  2 06:04:56 rpmi: libv4l-1.20.0-alt1 sisyphus+252084.100.1.1 1590156519 installed
<13>Apr  2 06:04:56 rpmi: sgml-common-0.6.3-alt15 1423664786 installed
<13>Apr  2 06:04:56 rpmi: docbook-dtds-4.5-alt1 1223476557 installed
<13>Apr  2 06:04:56 rpmi: docbook-style-xsl-1.79.1-alt4 sisyphus+232871.100.1.1 1561238010 installed
<13>Apr  2 06:04:56 rpmi: xxd-4:8.2.0011-alt2 sisyphus+265234.21600.49.1 1613755220 installed
<13>Apr  2 06:04:56 rpmi: vulkan-filesystem-1.2.152-alt1 sisyphus+257666.300.3.1 1599632436 installed
<13>Apr  2 06:04:56 rpmi: libvulkan1-1.2.152-alt1 sisyphus+257666.300.3.1 1599632436 installed
<13>Apr  2 06:04:56 rpmi: libudev-devel-1:247.3-alt2 sisyphus+266129.100.1.3 1613012524 installed
<13>Apr  2 06:04:56 rpmi: libverto-0.3.2-alt1_1 sisyphus+268398.100.1.1 1616717436 installed
<13>Apr  2 06:04:56 rpmi: libproxy-0.4.17-alt1 sisyphus+264902.100.1.1 1611078497 installed
<13>Apr  2 06:04:56 rpmi: libpcre2-10.36-alt1 sisyphus+262985.100.2.1 1607423135 installed
<13>Apr  2 06:04:57 rpmi: libqt5-core-5.15.2-alt2 sisyphus+267350.100.1.1 1614868112 installed
<13>Apr  2 06:04:57 rpmi: libqt5-concurrent-5.15.2-alt2 sisyphus+267350.100.1.1 1614868112 installed
<13>Apr  2 06:04:57 rpmi: libqt5-sql-5.15.2-alt2 sisyphus+267350.100.1.1 1614868112 installed
<13>Apr  2 06:04:57 rpmi: libqt5-test-5.15.2-alt2 sisyphus+267350.100.1.1 1614868112 installed
<13>Apr  2 06:04:57 rpmi: libqt5-xml-5.15.2-alt2 sisyphus+267350.100.1.1 1614868112 installed
<13>Apr  2 06:04:57 rpmi: libtinfo-devel-6.2.20210123-alt1 sisyphus+265425.100.1.1 1611851422 installed
<13>Apr  2 06:04:57 rpmi: libncurses-devel-6.2.20210123-alt1 sisyphus+265425.100.1.1 1611851422 installed
<13>Apr  2 06:04:57 rpmi: liblmdb-0.9.23-alt1 sisyphus+225277.100.2.1 1553001689 installed
<13>Apr  2 06:04:57 rpmi: libkeyutils-1.6.3-alt1 sisyphus+266061.100.1.1 1612919566 installed
<13>Apr  2 06:04:57 rpmi: libwacom-data-1.9-alt1 sisyphus+266853.140.1.1 1614171050 installed
<13>Apr  2 06:04:57 rpmi: libevdev-1.11.0-alt1 sisyphus+265566.100.1.1 1612165510 installed
<13>Apr  2 06:04:57 rpmi: libepoxy-1.5.5-alt1 sisyphus+263785.100.1.1 1608657813 installed
<13>Apr  2 06:04:57 rpmi: libcom_err-1.45.6.0.24.af1a-alt1 sisyphus+262279.100.1.1 1606088191 installed
<13>Apr  2 06:04:57 rpmi: libusb-1.0.23-alt1 sisyphus+237317.100.1.1 1568059904 installed
<13>Apr  2 06:04:57 rpmi: xorg-xf86miscproto-devel-0.9.3-alt1 1303464883 installed
<13>Apr  2 06:04:57 rpmi: libSDL2-2.0.14-alt4 sisyphus+268543.100.1.1 1616885488 installed
<13>Apr  2 06:04:57 rpmi: tslib-1.22-alt3 sisyphus+259302.100.1.1 1601981876 installed
<13>Apr  2 06:04:57 rpmi: libImageMagick6-common-6.9.12.3-alt1 sisyphus+267485.100.1.1 1615275928 installed
<13>Apr  2 06:04:57 rpmi: libwmflite-0.2.8.4-alt13 1506519334 installed
<13>Apr  2 06:04:57 rpmi: liblqr-0.4.2-alt1 1383038436 installed
<13>Apr  2 06:04:57 rpmi: libfftw3-common-3.3.8-alt1 sisyphus+247390.100.1.1 1583426835 installed
<13>Apr  2 06:04:57 rpmi: libfftw3-3.3.8-alt1 sisyphus+247390.100.1.1 1583426835 installed
<13>Apr  2 06:04:57 rpmi: libgts-0.7.6-alt2.drc20130205.1 sisyphus+225727.500.8.1 1553672625 installed
<13>Apr  2 06:04:57 rpmi: libidn2-2.3.0-alt1 sisyphus+240846.100.1.2 1573870464 installed
<13>Apr  2 06:04:57 rpmi: libgnutls30-3.6.15-alt2 sisyphus+268189.200.4.1 1616495067 installed
<13>Apr  2 06:04:57 rpmi: libgtk+2-locales-2.24.33-alt1 sisyphus+263711.100.20.1 1609407991 installed
<13>Apr  2 06:04:57 rpmi: libx265-192-3.4-alt1 sisyphus+254160.100.7.1 1593756032 installed
<13>Apr  2 06:04:57 rpmi: libde265-1.0.7-alt1 sisyphus+258615.100.1.1 1600957226 installed
<13>Apr  2 06:04:57 rpmi: libaom2-2.0.2-alt1 sisyphus+267934.100.2.1 1615993479 installed
<13>Apr  2 06:04:57 rpmi: libdatrie-0.2.9-alt1_6 1511686677 installed
<13>Apr  2 06:04:57 rpmi: libthai-0.1.28-alt1_1 sisyphus+226107.100.1.1 1554123079 installed
<13>Apr  2 06:04:57 rpmi: libpixman-3:0.40.0-alt1 sisyphus+250700.100.1.1 1587970807 installed
<13>Apr  2 06:04:57 rpmi: openexr25-common-2.5.3-alt1 sisyphus+260406.200.2.1 1603719714 installed
<13>Apr  2 06:04:57 rpmi: libilmimf25-2.5.3-alt1 sisyphus+260406.200.2.1 1603719714 installed
<13>Apr  2 06:04:57 rpmi: libxshmfence-1.3-alt1 sisyphus+223149.1000.2.1 1551268594 installed
<13>Apr  2 06:04:57 rpmi: libpciaccess-1:0.16-alt1 sisyphus+234814.100.1.1 1563438297 installed
<13>Apr  2 06:04:57 rpmi: libdrm-1:2.4.104-alt1 sisyphus+264662.100.1.1 1610612816 installed
<13>Apr  2 06:04:57 rpmi: libgbm-4:21.0.1-alt1 sisyphus+268341.100.1.1 1616653950 installed
<13>Apr  2 06:04:57 rpmi: icon-theme-hicolor-0.17-alt2 sisyphus+248343.100.1.1 1584979043 installed
<13>Apr  2 06:04:57 rpmi: perl-Try-Tiny-0.30-alt1 1514318058 installed
<13>Apr  2 06:04:57 rpmi: perl-IO-Socket-IP-0.41-alt1 sisyphus+259012.100.1.2 1601553446 installed
<13>Apr  2 06:04:57 rpmi: perl-Compress-Raw-Bzip2-2.101-alt1 sisyphus+266764.100.1.2 1614138565 installed
<13>Apr  2 06:04:57 rpmi: perl-HTML-Tagset-3.20-alt2 1317725093 installed
<13>Apr  2 06:04:57 rpmi: perl-Term-ANSIColor-5.01-alt1 sisyphus+244783.100.1.2 1579747505 installed
<13>Apr  2 06:04:57 rpmi: perl-Data-Dump-1.23-alt1 1444601978 installed
<13>Apr  2 06:04:57 rpmi: perl-Filter-1.60-alt1 sisyphus+258375.300.14.2 1600903930 installed
<13>Apr  2 06:04:57 rpmi: perl-Encode-3.08-alt1 sisyphus+263440.100.1.1 1607955880 installed
<13>Apr  2 06:04:57 rpmi: perl-URI-5.09-alt1 sisyphus+267398.100.1.1 1614944505 installed
<13>Apr  2 06:04:57 rpmi: perl-IO-Compress-2.102-alt1 sisyphus+267295.100.1.1 1614764488 installed
<13>Apr  2 06:04:57 rpmi: perl-Net-HTTP-6.21-alt1 sisyphus+268278.100.1.1 1616563972 installed
<13>Apr  2 06:04:58 rpmi: perl-HTML-Parser-3.76-alt1 sisyphus+267397.100.1.3 1614945692 installed
<13>Apr  2 06:04:58 rpmi: perl-WWW-RobotRules-6.02-alt1 1329756211 installed
<13>Apr  2 06:04:58 rpmi: perl-Encode-Locale-1.05-alt1 1444608613 installed
<13>Apr  2 06:04:58 rpmi: perl-IO-HTML-1.004-alt1 sisyphus+258983.100.1.1 1601542619 installed
<13>Apr  2 06:04:58 rpmi: perl-HTTP-Message-6.29-alt1 sisyphus+267426.100.1.1 1615033749 installed
<13>Apr  2 06:04:58 rpmi: perl-HTTP-Cookies-6.10-alt1 sisyphus+264349.100.1.1 1609891183 installed
<13>Apr  2 06:04:58 rpmi: perl-HTTP-Negotiate-6.01-alt1 1329760563 installed
<13>Apr  2 06:04:58 rpmi: perl-libwww-6.53-alt1 sisyphus+267863.100.1.1 1615828994 installed
<13>Apr  2 06:04:58 rpmi: perl-XML-LibXML-2.0206-alt1 sisyphus+263441.100.1.1 1607955956 installed
<13>Apr  2 06:04:58 rpmi: perl-XML-SAX-1.02-alt1 sisyphus+232322.100.1.1 1560758406 installed
<13>Apr  2 06:04:58 rpmi: perl-XML-Simple-2.25-alt2 sisyphus+257498.100.1.1 1599324034 installed
<13>Apr  2 06:04:58 rpmi: icon-naming-utils-0.8.90-alt1 1236573102 installed
<13>Apr  2 06:04:58 rpmi: icon-theme-adwaita-40-alt0.8.rc sisyphus+268501.740.4.2 1617043517 installed
<13>Apr  2 06:04:58 rpmi: libgdk-pixbuf-locales-2.42.4-alt1 sisyphus+268149.100.1.1 1616358213 installed
<13>Apr  2 06:04:58 rpmi: gtk+3-themes-incompatible-3.20-alt3 1461944560 installed
<13>Apr  2 06:04:58 rpmi: gcc-c++-common-1.4.27-alt1 sisyphus+262033.600.7.2 1607340230 installed
<13>Apr  2 06:04:59 rpmi: libstdc++10-devel-10.2.1-alt3 sisyphus+267829.100.1.1 1615807924 installed
<13>Apr  2 06:05:00 rpmi: gcc10-c++-10.2.1-alt3 sisyphus+267829.100.1.1 1615807924 installed
<13>Apr  2 06:05:00 rpmi: gcc-c++-10-alt1 sisyphus+263054.200.3.1 1607517515 installed
<13>Apr  2 06:05:00 rpmi: libbrotlicommon-1.0.9-alt2 sisyphus+257777.100.1.1 1599688015 installed
<13>Apr  2 06:05:00 rpmi: libbrotlidec-1.0.9-alt2 sisyphus+257777.100.1.1 1599688015 installed
<13>Apr  2 06:05:00 rpmi: libharfbuzz-2.6.8-alt1 sisyphus+254028.100.1.1 1593106819 installed
<13>Apr  2 06:05:00 rpmi: libfreetype-2.10.4-alt2 sisyphus+260293.100.2.1 1604479495 installed
<13>Apr  2 06:05:00 rpmi: fontconfig-2.13.1-alt1 sisyphus+257555.100.1.1 1599475143 installed
Updating fonts cache: <29>Apr  2 06:05:01 fontconfig: Updating fonts cache: succeeded
[ DONE ]
<13>Apr  2 06:05:01 rpmi: libraqm-0.7.0-alt1 sisyphus+235164.100.2.1 1564651522 installed
<13>Apr  2 06:05:01 rpmi: libharfbuzz-icu-2.6.8-alt1 sisyphus+254028.100.1.1 1593106819 installed
<13>Apr  2 06:05:01 rpmi: libharfbuzz-gobject-2.6.8-alt1 sisyphus+254028.100.1.1 1593106819 installed
<13>Apr  2 06:05:01 rpmi: libgdbm-1.8.3-alt10 1454943313 installed
<13>Apr  2 06:05:01 rpmi: djvu-common-3.5.27-alt1 sisyphus+252709.100.1.1 1591173068 installed
<13>Apr  2 06:05:01 rpmi: libdjvu-3.5.27-alt1 sisyphus+252709.100.1.1 1591173068 installed
<13>Apr  2 06:05:01 rpmi: libatk-locales-2.36.0-alt1 sisyphus+249208.100.1.1 1585840405 installed
<13>Apr  2 06:05:01 rpmi: libatk-2.36.0-alt1 sisyphus+249208.100.1.1 1585840405 installed
<13>Apr  2 06:05:01 rpmi: shared-mime-info-2.1-alt1 sisyphus+264261.100.1.1 1609507718 installed
<13>Apr  2 06:05:01 rpmi: gsettings-desktop-schemas-data-40.0-alt1 sisyphus+268501.300.4.2 1617041783 installed
<13>Apr  2 06:05:01 rpmi: libgio-2.68.0-alt1 sisyphus+268501.100.4.2 1617041548 installed
<13>Apr  2 06:05:01 rpmi: gsettings-desktop-schemas-40.0-alt1 sisyphus+268501.300.4.2 1617041783 installed
<13>Apr  2 06:05:01 rpmi: libgdk-pixbuf-2.42.4-alt1 sisyphus+268149.100.1.1 1616358213 installed
<13>Apr  2 06:05:01 rpmi: gtk-update-icon-cache-3.24.28-alt1 sisyphus+268501.600.4.2 1617043246 installed
<13>Apr  2 06:05:01 rpmi: libheif-1.9.0-alt1 sisyphus+258615.200.1.1 1600957289 installed
<13>Apr  2 06:05:01 rpmi: libgusb-0.3.6-alt1 sisyphus+267753.100.1.1 1615620747 installed
<13>Apr  2 06:05:01 rpmi: libcolord-1.4.5-alt2 sisyphus+264292.100.1.1 1609619006 installed
<13>Apr  2 06:05:01 rpmi: libdconf-0.40.0-alt1 sisyphus+268501.700.4.2 1617043420 installed
<13>Apr  2 06:05:01 rpmi: liblz4-1:1.9.3-alt1 sisyphus+262305.100.1.1 1606099128 installed
<13>Apr  2 06:05:01 rpmi: libgpg-error-1.41-alt4 sisyphus+264254.200.1.1 1609440105 installed
<13>Apr  2 06:05:01 rpmi: libgcrypt20-1.9.2-alt1 sisyphus+266496.100.1.1 1613559130 installed
<13>Apr  2 06:05:01 rpmi: libsystemd-1:247.3-alt2 sisyphus+266129.100.1.3 1613012524 installed
<13>Apr  2 06:05:01 rpmi: libdbus-1.12.18-alt1 sisyphus+252758.100.1.1 1591203684 installed
<13>Apr  2 06:05:01 rpmi: dbus-tools-1.12.18-alt1 sisyphus+252758.100.1.1 1591203684 installed
<86>Apr  2 06:05:01 groupadd[906987]: group added to /etc/group: name=messagebus, GID=499
<86>Apr  2 06:05:01 groupadd[906987]: group added to /etc/gshadow: name=messagebus
<86>Apr  2 06:05:01 groupadd[906987]: new group: name=messagebus, GID=499
<86>Apr  2 06:05:01 useradd[907171]: new user: name=messagebus, UID=499, GID=499, home=/run/dbus, shell=/dev/null
<13>Apr  2 06:05:01 rpmi: dbus-1.12.18-alt1 sisyphus+252758.100.1.1 1591203684 installed
<13>Apr  2 06:05:01 rpmi: dconf-0.40.0-alt1 sisyphus+268501.700.4.2 1617043420 installed
<13>Apr  2 06:05:01 rpmi: libgtk+3-schemas-3.24.28-alt1 sisyphus+268501.600.4.2 1617043246 installed
<13>Apr  2 06:05:01 rpmi: libavahi-0.8-alt1 sisyphus+255349.240.4.1 1595604500 installed
<13>Apr  2 06:05:01 rpmi: libcups-2.3.3-alt3.op2 sisyphus+268789.100.1.1 1617267110 installed
<13>Apr  2 06:05:04 rpmi: libgs-9.53.3-alt1 sisyphus+260366.100.1.1 1603614495 installed
<13>Apr  2 06:05:04 rpmi: libqt5-dbus-5.15.2-alt2 sisyphus+267350.100.1.1 1614868112 installed
<13>Apr  2 06:05:04 rpmi: libpolkit-0.118-alt2 sisyphus+263041.200.3.1 1611694155 installed
<86>Apr  2 06:05:04 groupadd[915656]: group added to /etc/group: name=colord, GID=498
<86>Apr  2 06:05:04 groupadd[915656]: group added to /etc/gshadow: name=colord
<86>Apr  2 06:05:04 groupadd[915656]: new group: name=colord, GID=498
<86>Apr  2 06:05:04 useradd[915890]: new user: name=colord, UID=498, GID=498, home=/var/colord, shell=/dev/null
<13>Apr  2 06:05:04 rpmi: colord-1.4.5-alt2 sisyphus+264292.100.1.1 1609619006 installed
<13>Apr  2 06:05:04 rpmi: libxslt-1.1.34-alt2 sisyphus+248264.100.1.1 1584829787 installed
<13>Apr  2 06:05:04 rpmi: xsltproc-1.1.34-alt2 sisyphus+248264.100.1.1 1584829787 installed
<13>Apr  2 06:05:04 rpmi: libX11-locales-3:1.7.0-alt1 sisyphus+264667.100.1.2 1610655150 installed
<13>Apr  2 06:05:04 rpmi: libX11-3:1.7.0-alt1 sisyphus+264667.100.1.2 1610655150 installed
<13>Apr  2 06:05:04 rpmi: libXext-1.3.4-alt1 sisyphus+225206.700.1.2 1552949422 installed
<13>Apr  2 06:05:04 rpmi: libX11-devel-3:1.7.0-alt1 sisyphus+264667.100.1.2 1610655150 installed
<13>Apr  2 06:05:04 rpmi: libXrender-0.9.10-alt1 sisyphus+261890.100.1.1 1605595144 installed
<13>Apr  2 06:05:04 rpmi: libXfixes-5.0.3-alt1 sisyphus+226736.100.2.2 1554614842 installed
<13>Apr  2 06:05:04 rpmi: libXi-1.7.10-alt1 sisyphus+232786.300.1.1 1561106975 installed
<13>Apr  2 06:05:04 rpmi: libXcursor-1.2.0-alt1 sisyphus+225206.400.1.2 1552949214 installed
<13>Apr  2 06:05:04 rpmi: libXfixes-devel-5.0.3-alt1 sisyphus+226736.100.2.2 1554614842 installed
<13>Apr  2 06:05:04 rpmi: libXrandr-1.5.2-alt1 sisyphus+225206.1300.1.2 1552949698 installed
<13>Apr  2 06:05:04 rpmi: libXrender-devel-0.9.10-alt1 sisyphus+261890.100.1.1 1605595144 installed
<13>Apr  2 06:05:04 rpmi: libXext-devel-1.3.4-alt1 sisyphus+225206.700.1.2 1552949422 installed
<13>Apr  2 06:05:04 rpmi: libXinerama-1.1.4-alt1 sisyphus+223149.300.2.1 1551268223 installed
<13>Apr  2 06:05:04 rpmi: libXt-1.2.1-alt1 sisyphus+265202.200.1.1 1611565457 installed
<13>Apr  2 06:05:04 rpmi: libXcomposite-0.4.5-alt1 sisyphus+225206.300.1.2 1552949136 installed
<13>Apr  2 06:05:04 rpmi: libXdamage-1.1.5-alt1 sisyphus+225206.500.1.2 1552949282 installed
<13>Apr  2 06:05:04 rpmi: libXpm-3.5.13-alt1 sisyphus+247690.300.1.1 1584000502 installed
<13>Apr  2 06:05:04 rpmi: libat-spi2-core-2.40.0-alt1 sisyphus+268501.1400.4.2 1617043895 installed
<13>Apr  2 06:05:04 rpmi: libXft-2.3.3-alt1 sisyphus+225206.1000.3.2 1552987714 installed
<13>Apr  2 06:05:04 rpmi: libXtst-1.2.3-alt1 sisyphus+261890.200.1.1 1605595188 installed
<13>Apr  2 06:05:04 rpmi: libXxf86vm-1.1.4-alt2 1527672159 installed
<13>Apr  2 06:05:04 rpmi: libGLX-mesa-4:21.0.1-alt1 sisyphus+268341.100.1.1 1616653950 installed
<13>Apr  2 06:05:04 rpmi: libEGL-mesa-4:21.0.1-alt1 sisyphus+268341.100.1.1 1616653950 installed
<13>Apr  2 06:05:04 rpmi: libEGL-7:1.3.2-alt1 sisyphus+254610.100.1.1 1594124262 installed
<13>Apr  2 06:05:04 rpmi: libGLX-7:1.3.2-alt1 sisyphus+254610.100.1.1 1594124262 installed
<13>Apr  2 06:05:05 rpmi: libGL-7:1.3.2-alt1 sisyphus+254610.100.1.1 1594124262 installed
<13>Apr  2 06:05:05 rpmi: libcairo-1:1.16.0-alt1 sisyphus+226534.100.2.3 1554515520 installed
<13>Apr  2 06:05:05 rpmi: libpango-1.48.4-alt1 sisyphus+268501.500.4.2 1617042951 installed
<13>Apr  2 06:05:05 rpmi: libglvnd-devel-7:1.3.2-alt1 sisyphus+254610.100.1.1 1594124262 installed
<13>Apr  2 06:05:05 rpmi: libcairo-gobject-1:1.16.0-alt1 sisyphus+226534.100.2.3 1554515520 installed
<13>Apr  2 06:05:05 rpmi: librsvg-1:2.50.3-alt1 sisyphus+265438.100.1.1 1611858681 installed
<13>Apr  2 06:05:05 rpmi: libEGL-devel-4:21.0.1-alt1 sisyphus+268341.100.1.1 1616653950 installed
<13>Apr  2 06:05:05 rpmi: libGL-devel-4:21.0.1-alt1 sisyphus+268341.100.1.1 1616653950 installed
<13>Apr  2 06:05:05 rpmi: liblasi-1.1.3-alt2 sisyphus+239300.100.1.1 1571209619 installed
<13>Apr  2 06:05:05 rpmi: libgtk+2-2.24.33-alt1 sisyphus+263711.100.20.1 1609407991 installed
<13>Apr  2 06:05:06 rpmi: libXxf86vm-devel-1.1.4-alt2 1527672159 installed
<13>Apr  2 06:05:06 rpmi: libgd3-2.3.2-alt1 sisyphus+267489.100.1.1 1615277776 installed
<13>Apr  2 06:05:06 rpmi: libgraphviz-2.41.2-alt4 sisyphus+265234.25500.49.1 1613757808 installed
<13>Apr  2 06:05:06 rpmi: libImageMagick6.7-6.9.12.3-alt1 sisyphus+267485.100.1.1 1615275928 installed
<13>Apr  2 06:05:06 rpmi: libImageMagick++6.9-6.9.12.3-alt1 sisyphus+267485.100.1.1 1615275928 installed
<13>Apr  2 06:05:06 rpmi: libXpm-devel-3.5.13-alt1 sisyphus+247690.300.1.1 1584000502 installed
<13>Apr  2 06:05:06 rpmi: libXdamage-devel-1.1.5-alt1 sisyphus+225206.500.1.2 1552949282 installed
<13>Apr  2 06:05:06 rpmi: libXcomposite-devel-0.4.5-alt1 sisyphus+225206.300.1.2 1552949136 installed
<13>Apr  2 06:05:06 rpmi: libXmu-1.1.3-alt1 sisyphus+225206.1200.1.2 1552949629 installed
<13>Apr  2 06:05:06 rpmi: libXt-devel-1.2.1-alt1 sisyphus+265202.200.1.1 1611565457 installed
<13>Apr  2 06:05:06 rpmi: libXmu-devel-1.1.3-alt1 sisyphus+225206.1200.1.2 1552949629 installed
<13>Apr  2 06:05:06 rpmi: libXinerama-devel-1.1.4-alt1 sisyphus+223149.300.2.1 1551268223 installed
<13>Apr  2 06:05:06 rpmi: libXi-devel-1.7.10-alt1 sisyphus+232786.300.1.1 1561106975 installed
<13>Apr  2 06:05:06 rpmi: libXtst-devel-1.2.3-alt1 sisyphus+261890.200.1.1 1605595188 installed
<13>Apr  2 06:05:06 rpmi: libXrandr-devel-1.5.2-alt1 sisyphus+225206.1300.1.2 1552949698 installed
<13>Apr  2 06:05:06 rpmi: libXcursor-devel-1.2.0-alt1 sisyphus+225206.400.1.2 1552949214 installed
<13>Apr  2 06:05:06 rpmi: libXScrnSaver-1.2.3-alt1 sisyphus+223149.500.2.1 1551268370 installed
<13>Apr  2 06:05:07 rpmi: libXScrnSaver-devel-1.2.3-alt1 sisyphus+223149.500.2.1 1551268370 installed
<13>Apr  2 06:05:07 rpmi: libXv-1.0.11-alt1 1527685497 installed
<13>Apr  2 06:05:07 rpmi: libXv-devel-1.0.11-alt1 1527685497 installed
<13>Apr  2 06:05:07 rpmi: libXxf86misc-1.0.4-alt1 sisyphus+223149.600.2.1 1551268437 installed
<13>Apr  2 06:05:07 rpmi: libXxf86misc-devel-1.0.4-alt1 sisyphus+223149.600.2.1 1551268437 installed
<13>Apr  2 06:05:07 rpmi: dbus-tools-gui-1.12.18-alt1 sisyphus+252758.100.1.1 1591203684 installed
<13>Apr  2 06:05:07 rpmi: at-spi2-core-2.40.0-alt1 sisyphus+268501.1400.4.2 1617043895 installed
<13>Apr  2 06:05:07 rpmi: at-spi2-atk-2.38.0-alt1 sisyphus+258314.1500.14.2 1600844365 installed
<13>Apr  2 06:05:07 rpmi: libgtk+3-3.24.28-alt1 sisyphus+268501.600.4.2 1617043246 installed
<13>Apr  2 06:05:07 rpmi: libxkbfile-1.1.0-alt1 sisyphus+225206.1100.1.2 1552949559 installed
<13>Apr  2 06:05:07 rpmi: libxkbfile-devel-1.1.0-alt1 sisyphus+225206.1100.1.2 1552949559 installed
<13>Apr  2 06:05:07 rpmi: rpm-macros-alternatives-0.5.1-alt1 sisyphus+226946.100.1.1 1554830426 installed
<13>Apr  2 06:05:07 rpmi: ca-certificates-2021.03.24-alt1 sisyphus+268304.300.1.1 1616591829 installed
<13>Apr  2 06:05:07 rpmi: ca-trust-0.1.2-alt1 sisyphus+233348.100.1.1 1561653823 installed
<13>Apr  2 06:05:07 rpmi: p11-kit-trust-0.23.15-alt2 sisyphus+252784.100.2.2 1591274915 installed
<13>Apr  2 06:05:07 rpmi: libcrypto1.1-1.1.1k-alt1 sisyphus+268375.100.1.1 1616684123 installed
<13>Apr  2 06:05:07 rpmi: libssl1.1-1.1.1k-alt1 sisyphus+268375.100.1.1 1616684123 installed
<13>Apr  2 06:05:07 rpmi: libpython3-3.9.2-alt1 sisyphus+267062.100.1.1 1614381488 installed
<13>Apr  2 06:05:07 rpmi: python3-3.9.2-alt1 sisyphus+267062.100.1.1 1614381488 installed
<13>Apr  2 06:05:08 rpmi: python3-base-3.9.2-alt1 sisyphus+267062.100.1.1 1614381488 installed
<13>Apr  2 06:05:08 rpmi: glib2-devel-2.68.0-alt1 sisyphus+268501.100.4.2 1617041548 installed
<13>Apr  2 06:05:08 rpmi: libfreetype-devel-2.10.4-alt2 sisyphus+260293.100.2.1 1604479495 installed
<13>Apr  2 06:05:08 rpmi: libharfbuzz-devel-2.6.8-alt1 sisyphus+254028.100.1.1 1593106819 installed
<13>Apr  2 06:05:09 rpmi: fontconfig-devel-2.13.1-alt1 sisyphus+257555.100.1.1 1599475143 installed
<13>Apr  2 06:05:09 rpmi: libcairo-devel-1:1.16.0-alt1 sisyphus+226534.100.2.3 1554515520 installed
<13>Apr  2 06:05:09 rpmi: libXft-devel-2.3.3-alt1 sisyphus+225206.1000.3.2 1552987714 installed
<13>Apr  2 06:05:09 rpmi: libgio-devel-2.68.0-alt1 sisyphus+268501.100.4.2 1617041548 installed
<13>Apr  2 06:05:09 rpmi: libgdk-pixbuf-devel-2.42.4-alt1 sisyphus+268149.100.1.1 1616358213 installed
<13>Apr  2 06:05:09 rpmi: libpango-devel-1.48.4-alt1 sisyphus+268501.500.4.2 1617042951 installed
<13>Apr  2 06:05:09 rpmi: libcairo-gobject-devel-1:1.16.0-alt1 sisyphus+226534.100.2.3 1554515520 installed
<13>Apr  2 06:05:09 rpmi: libatk-devel-2.36.0-alt1 sisyphus+249208.100.1.1 1585840405 installed
<13>Apr  2 06:05:09 rpmi: gtk-builder-convert-2.24.33-alt1 sisyphus+263711.100.20.1 1609407991 installed
<13>Apr  2 06:05:09 rpmi: libvulkan-devel-1.2.152-alt1 sisyphus+257666.300.3.1 1599632436 installed
<13>Apr  2 06:05:09 rpmi: libwacom-1.9-alt1 sisyphus+266853.140.1.1 1614171050 installed
<13>Apr  2 06:05:09 rpmi: libinput-1.17.1-alt1 sisyphus+268291.100.1.1 1616571004 installed
<13>Apr  2 06:05:09 rpmi: tests-for-installed-python3-pkgs-0.1.13.1-alt2 1535450458 installed
<13>Apr  2 06:05:09 rpmi: rpm-build-python3-0.1.13.1-alt2 1535450458 installed
<86>Apr  2 06:05:09 groupadd[935237]: group added to /etc/group: name=_keytab, GID=497
<86>Apr  2 06:05:09 groupadd[935237]: group added to /etc/gshadow: name=_keytab
<86>Apr  2 06:05:09 groupadd[935237]: new group: name=_keytab, GID=497
<13>Apr  2 06:05:09 rpmi: libkrb5-1.19.1-alt2 sisyphus+267847.100.1.1 1615814479 installed
<13>Apr  2 06:05:09 rpmi: libqt5-network-5.15.2-alt2 sisyphus+267350.100.1.1 1614868112 installed
<13>Apr  2 06:05:09 rpmi: libqt5-xcbqpa-5.15.2-alt2 sisyphus+267350.100.1.1 1614868112 installed
<13>Apr  2 06:05:09 rpmi: libqt5-eglfskmssupport-5.15.2-alt2 sisyphus+267350.100.1.1 1614868112 installed
<13>Apr  2 06:05:09 rpmi: libqt5-eglfsdeviceintegration-5.15.2-alt2 sisyphus+267350.100.1.1 1614868112 installed
<13>Apr  2 06:05:09 rpmi: libqt5-gui-5.15.2-alt2 sisyphus+267350.100.1.1 1614868112 installed
<13>Apr  2 06:05:10 rpmi: libqt5-widgets-5.15.2-alt2 sisyphus+267350.100.1.1 1614868112 installed
<13>Apr  2 06:05:10 rpmi: libqt5-opengl-5.15.2-alt2 sisyphus+267350.100.1.1 1614868112 installed
<13>Apr  2 06:05:10 rpmi: libqt5-printsupport-5.15.2-alt2 sisyphus+267350.100.1.1 1614868112 installed
<13>Apr  2 06:05:10 rpmi: libqt5-x11extras-5.15.2-alt1 sisyphus+264725.1600.3.2 1612981128 installed
<13>Apr  2 06:05:10 rpmi: libssl-devel-1.1.1k-alt1 sisyphus+268375.100.1.1 1616684123 installed
<13>Apr  2 06:05:10 rpmi: qt5-base-devel-5.15.2-alt2 sisyphus+267350.100.1.1 1614868112 installed
<13>Apr  2 06:05:10 rpmi: qt5-x11extras-devel-5.15.2-alt1 sisyphus+264725.1600.3.2 1612981128 installed
<13>Apr  2 06:05:10 rpmi: python3-dev-3.9.2-alt1 sisyphus+267062.100.1.1 1614381488 installed
<13>Apr  2 06:05:10 rpmi: libgtk+3-devel-3.24.28-alt1 sisyphus+268501.600.4.2 1617043246 installed
<13>Apr  2 06:05:10 rpmi: libImageMagick-devel-6.9.12.3-alt1 sisyphus+267485.100.1.1 1615275928 installed
<13>Apr  2 06:05:10 rpmi: xmlto-0.0.28-alt2 1518213369 installed
<13>Apr  2 06:05:10 rpmi: libdbus-devel-1.12.18-alt1 sisyphus+252758.100.1.1 1591203684 installed
<13>Apr  2 06:05:10 rpmi: libv4l-devel-1.20.0-alt1 sisyphus+252084.100.1.1 1590156519 installed
<13>Apr  2 06:05:10 rpmi: libjpeg-devel-2:2.0.6-alt1 sisyphus+266888.100.1.1 1614172364 installed
<13>Apr  2 06:05:11 rpmi: glibc-devel-static-6:2.32-alt2 sisyphus+263623.100.1.1 1608292020 installed
Building target platforms: x86_64
Building for target x86_64
Wrote: /usr/src/in/nosrpm/zbar-0.23.1-alt2.nosrc.rpm (w1.gzdio)
Installing zbar-0.23.1-alt2.src.rpm
Building target platforms: x86_64
Building for target x86_64
Executing(%prep): /bin/sh -e /usr/src/tmp/rpm-tmp.13915
+ umask 022
+ /bin/mkdir -p /usr/src/RPM/BUILD
+ cd /usr/src/RPM/BUILD
+ cd /usr/src/RPM/BUILD
+ rm -rf zbar-0.23.1
+ echo 'Source #0 (zbar-0.23.1.tar.gz):'
Source #0 (zbar-0.23.1.tar.gz):
+ /bin/gzip -dc /usr/src/RPM/SOURCES/zbar-0.23.1.tar.gz
+ /bin/tar -xf -
+ cd zbar-0.23.1
+ /bin/chmod -c -Rf u+rwX,go-w .
+ echo 'Patch #0 (938d39716488b545b92c28f48acc94a7b8fc9138.patch):'
Patch #0 (938d39716488b545b92c28f48acc94a7b8fc9138.patch):
+ /usr/bin/patch -p1
patching file python/enum.c
+ sed -i s/gtk+-2.0/gtk+-3.0/ zbar-gtk.pc.in
+ sed -i 's/Qt/Qt5/g;s/Qt54/Qt5/g' zbar-qt.pc.in
+ exit 0
Executing(%build): /bin/sh -e /usr/src/tmp/rpm-tmp.13915
+ umask 022
+ /bin/mkdir -p /usr/src/RPM/BUILD
+ cd /usr/src/RPM/BUILD
+ cd zbar-0.23.1
+ autoreconf -fisv
autoreconf-default: Entering directory `.'
autoreconf-default: running: autopoint --force
autopoint: using AM_GNU_GETTEXT_REQUIRE_VERSION instead of AM_GNU_GETTEXT_VERSION
Copying file ABOUT-NLS
Copying file config/config.rpath
Copying file config/gettext.m4
Copying file config/host-cpu-c-abi.m4
Copying file config/iconv.m4
Copying file config/intlmacosx.m4
Copying file config/lib-ld.m4
Copying file config/lib-link.m4
Copying file config/lib-prefix.m4
Copying file config/nls.m4
Copying file config/po.m4
Copying file config/progtest.m4
Copying file po/Makefile.in.in
Copying file po/Makevars.template
Copying file po/Rules-quot
Copying file po/boldquot.sed
Copying file po/en@boldquot.header
Copying file po/en@quot.header
Copying file po/insert-header.sin
Copying file po/quot.sed
Copying file po/remove-potcdate.sin
autoreconf-default: running: aclocal --force -I config
autoreconf-default: configure.ac: tracing
autoreconf-default: running: libtoolize --force --install
libtoolize-default: putting auxiliary files in AC_CONFIG_AUX_DIR, 'config'.
libtoolize-default: linking file 'config/config.guess'
libtoolize-default: linking file 'config/config.sub'
libtoolize-default: linking file 'config/install-sh'
libtoolize-default: linking file 'config/ltmain.sh'
libtoolize-default: putting macros in AC_CONFIG_MACRO_DIRS, 'config'.
libtoolize-default: linking file 'config/libtool.m4'
libtoolize-default: linking file 'config/ltoptions.m4'
libtoolize-default: linking file 'config/ltsugar.m4'
libtoolize-default: linking file 'config/ltversion.m4'
libtoolize-default: linking file 'config/lt~obsolete.m4'
autoreconf-default: configure.ac: not using Intltool
autoreconf-default: configure.ac: not using gtk-doc
autoreconf-default: running: /usr/bin/autoconf-2.60 --force
autoreconf-default: running: /usr/bin/autoheader-2.60 --force
autoreconf-default: running: automake --add-missing --force-missing
configure.ac:13: installing 'config/compile'
configure.ac:8: installing 'config/missing'
Makefile.am: installing 'config/depcomp'
autoreconf-default: Leaving directory `.'
+ export LIBS=-lm
+ LIBS=-lm
+ CFLAGS='-pipe -frecord-gcc-switches -Wall -g -O2'
+ export CFLAGS
+ CXXFLAGS='-pipe -frecord-gcc-switches -Wall -g -O2'
+ export CXXFLAGS
+ FFLAGS='-pipe -frecord-gcc-switches -Wall -g -O2'
+ export FFLAGS
+ FCFLAGS='-pipe -frecord-gcc-switches -Wall -g -O2'
+ export FCFLAGS
+ '[' -n '' ']'
++ sed -r 's/(^|[[:space:]]+)-[^m][^[:space:]]*//g'
++ printf %s '-pipe -frecord-gcc-switches -Wall -g -O2'
+ ASFLAGS=
+ export ASFLAGS
+ export lt_cv_deplibs_check_method=pass_all
+ lt_cv_deplibs_check_method=pass_all
+ xargs -rn1 install -pm755 -- /usr/share/gnu-config/config.sub /usr/share/gnu-config/config.guess
+ readlink -e -- ./configure
+ xargs -ri dirname -- '{}'
+ xargs -ri find '{}' -type f '(' -name config.sub -or -name config.guess ')' -printf '%h/\n'
+ sort -u
+ ./configure --build=x86_64-alt-linux --host=x86_64-alt-linux --prefix=/usr --exec-prefix=/usr --bindir=/usr/bin --sbindir=/usr/sbin --sysconfdir=/etc --datadir=/usr/share --includedir=/usr/include --libdir=/usr/lib64 --libexecdir=/usr/lib --localstatedir=/var/lib --sharedstatedir=/var/lib --mandir=/usr/share/man --infodir=/usr/share/info --disable-dependency-tracking --disable-silent-rules --without-included-gettext --with-qt --with-qt5 --without-java --with-python=python3 --with-gtk=gtk3 --with-gir=yes
configure: WARNING: unrecognized options: --without-included-gettext
checking for a BSD-compatible install... /bin/install -c
checking whether build environment is sane... yes
checking for a thread-safe mkdir -p... /bin/mkdir -p
checking for gawk... gawk
checking whether make sets $(MAKE)... yes
checking whether make supports nested variables... yes
checking build system type... x86_64-alt-linux-gnu
checking host system type... x86_64-alt-linux-gnu
checking how to print strings... printf
checking whether make supports the include directive... yes (GNU style)
checking for x86_64-alt-linux-gcc... x86_64-alt-linux-gcc
checking whether the C compiler works... yes
checking for C compiler default output file name... a.out
checking for suffix of executables... 
checking whether we are cross compiling... no
checking for suffix of object files... o
checking whether we are using the GNU C compiler... yes
checking whether x86_64-alt-linux-gcc accepts -g... yes
checking for x86_64-alt-linux-gcc option to accept ISO C89... none needed
checking whether x86_64-alt-linux-gcc understands -c and -o together... yes
checking dependency style of x86_64-alt-linux-gcc... none
checking for a sed that does not truncate output... /bin/sed
checking for grep that handles long lines and -e... /bin/grep
checking for egrep... /bin/grep -E
checking for fgrep... /bin/grep -F
checking for ld used by x86_64-alt-linux-gcc... /usr/bin/ld
checking if the linker (/usr/bin/ld) is GNU ld... yes
checking for BSD- or MS-compatible name lister (nm)... /usr/bin/nm -B
checking the name lister (/usr/bin/nm -B) interface... BSD nm
checking whether ln -s works... yes
checking the maximum length of command line arguments... 1572864
checking how to convert x86_64-alt-linux-gnu file names to x86_64-alt-linux-gnu format... func_convert_file_noop
checking how to convert x86_64-alt-linux-gnu file names to toolchain format... func_convert_file_noop
checking for /usr/bin/ld option to reload object files... -r
checking for x86_64-alt-linux-objdump... no
checking for objdump... objdump
checking how to recognize dependent libraries... (cached) pass_all
checking for x86_64-alt-linux-dlltool... no
checking for dlltool... no
checking how to associate runtime and link libraries... printf %s\n
checking for x86_64-alt-linux-ar... no
checking for ar... ar
checking for archiver @FILE support... @
checking for x86_64-alt-linux-strip... no
checking for strip... strip
checking for x86_64-alt-linux-ranlib... no
checking for ranlib... ranlib
checking command to parse /usr/bin/nm -B output from x86_64-alt-linux-gcc object... ok
checking for sysroot... no
checking for a working dd... /bin/dd
checking how to truncate binary pipes... /bin/dd bs=4096 count=1
checking for x86_64-alt-linux-mt... no
checking for mt... no
checking if : is a manifest tool... no
checking how to run the C preprocessor... x86_64-alt-linux-gcc -E
checking for ANSI C header files... yes
checking for sys/types.h... yes
checking for sys/stat.h... yes
checking for stdlib.h... yes
checking for string.h... yes
checking for memory.h... yes
checking for strings.h... yes
checking for inttypes.h... yes
checking for stdint.h... yes
checking for unistd.h... yes
checking for dlfcn.h... yes
checking for objdir... .libs
checking if x86_64-alt-linux-gcc supports -fno-rtti -fno-exceptions... no
checking for x86_64-alt-linux-gcc option to produce PIC... -fPIC -DPIC
checking if x86_64-alt-linux-gcc PIC flag -fPIC -DPIC works... yes
checking if x86_64-alt-linux-gcc static flag -static works... yes
checking if x86_64-alt-linux-gcc supports -c -o file.o... yes
checking if x86_64-alt-linux-gcc supports -c -o file.o... (cached) yes
checking whether the x86_64-alt-linux-gcc linker (/usr/bin/ld -m elf_x86_64) supports shared libraries... yes
checking whether -lc should be explicitly linked in... no
checking dynamic linker characteristics... GNU/Linux ld.so
checking how to hardcode library paths into programs... immediate
checking for shl_load... no
checking for shl_load in -ldld... no
checking for dlopen... no
checking for dlopen in -ldl... yes
checking whether a program can dlopen itself... yes
checking whether a statically linked program can dlopen itself... no
checking whether stripping libraries is possible... yes
checking if libtool supports shared libraries... yes
checking whether to build shared libraries... yes
checking whether to build static libraries... yes
checking for x86_64-alt-linux-windres... no
checking for windres... no
checking whether make supports nested variables... (cached) yes
checking for x86_64-alt-linux-gcc... (cached) x86_64-alt-linux-gcc
checking whether we are using the GNU C compiler... (cached) yes
checking whether x86_64-alt-linux-gcc accepts -g... (cached) yes
checking for x86_64-alt-linux-gcc option to accept ISO C89... (cached) none needed
checking whether x86_64-alt-linux-gcc understands -c and -o together... (cached) yes
checking dependency style of x86_64-alt-linux-gcc... (cached) none
checking for x86_64-alt-linux-g++... x86_64-alt-linux-g++
checking whether we are using the GNU C++ compiler... yes
checking whether x86_64-alt-linux-g++ accepts -g... yes
checking dependency style of x86_64-alt-linux-g++... none
checking how to run the C++ preprocessor... x86_64-alt-linux-g++ -E
checking for ld used by x86_64-alt-linux-g++... /usr/bin/ld -m elf_x86_64
checking if the linker (/usr/bin/ld -m elf_x86_64) is GNU ld... yes
checking whether the x86_64-alt-linux-g++ linker (/usr/bin/ld -m elf_x86_64) supports shared libraries... yes
checking for x86_64-alt-linux-g++ option to produce PIC... -fPIC -DPIC
checking if x86_64-alt-linux-g++ PIC flag -fPIC -DPIC works... yes
checking if x86_64-alt-linux-g++ static flag -static works... no
checking if x86_64-alt-linux-g++ supports -c -o file.o... yes
checking if x86_64-alt-linux-g++ supports -c -o file.o... (cached) yes
checking whether the x86_64-alt-linux-g++ linker (/usr/bin/ld -m elf_x86_64) supports shared libraries... yes
checking dynamic linker characteristics... (cached) GNU/Linux ld.so
checking how to hardcode library paths into programs... immediate
checking for x86_64-alt-linux-gcc option to accept ISO C99... none needed
checking for x86_64-alt-linux-gcc option to accept ISO Standard C... (cached) none needed
checking for x86_64-alt-linux-pkg-config... no
checking for pkg-config... /usr/bin/pkg-config
checking pkg-config is at least version 0.9.0... yes
checking for xmlto... xmlto
checking whether to build EAN symbologies... yes
checking whether to build DataBar symbology... yes
checking whether to build Code 128 symbology... yes
checking whether to build Code 93 symbology... yes
checking whether to build Code 39 symbology... yes
checking whether to build Codabar symbology... yes
checking whether to build Interleaved 2 of 5 symbology... yes
checking whether to build QR Code... yes
checking whether to build SQ Code... yes
checking whether to build PDF417 symbology (incomplete)... no
checking for library containing clock_gettime... none required
checking for ld... /usr/bin/ld -m elf_x86_64
checking if the linker (/usr/bin/ld -m elf_x86_64) is GNU ld... yes
checking for shared library run path origin... done
checking 32-bit host C ABI... no
checking for ELF binary format... yes
checking for the common suffixes of directories in the library search path... lib,lib,lib64
checking for iconv... yes
checking for working iconv... yes
checking for iconv declaration... 
         extern size_t iconv (iconv_t cd, char * *inbuf, size_t *inbytesleft, char * *outbuf, size_t *outbytesleft);
checking whether NLS is requested... yes
checking for msgfmt... /usr/bin/msgfmt
checking for gmsgfmt... /usr/bin/msgfmt
checking for xgettext... /usr/bin/xgettext
checking for msgmerge... /usr/bin/msgmerge
checking for CFPreferencesCopyAppValue... no
checking for CFLocaleCopyPreferredLanguages... no
checking for GNU gettext in libc... yes
checking whether to use NLS... yes
checking where the gettext function comes from... libc
checking poll.h usability... yes
checking poll.h presence... yes
checking for poll.h... yes
checking pthread.h usability... yes
checking pthread.h presence... yes
checking for pthread.h... yes
checking for pthread_create in -lpthread... yes
checking linux/videodev.h usability... no
checking linux/videodev.h presence... no
checking for linux/videodev.h... no
checking linux/videodev2.h usability... yes
checking linux/videodev2.h presence... yes
checking for linux/videodev2.h... yes
checking libv4l2.h usability... yes
checking libv4l2.h presence... yes
checking for libv4l2.h... yes
checking for libv4l2... yes
checking for X... libraries , headers 
checking for gethostbyname... yes
checking for connect... yes
checking for remove... yes
checking for shmat... yes
checking for IceConnectionNumber in -lICE... yes
checking for X11/extensions/XShm.h... yes
checking for XShmQueryVersion in -lXext... yes
checking for X11/extensions/Xvlib.h... yes
checking for XvQueryExtension in -lXv... yes
checking for dbus-1 >= 1.0... yes
checking jpeglib.h usability... yes
checking jpeglib.h presence... yes
checking for jpeglib.h... yes
checking jerror.h usability... yes
checking jerror.h presence... yes
checking for jerror.h... yes
checking for jpeg_read_header in -ljpeg... yes
checking for MagickWand >= 6.2.6... yes
configure: trying ImageMagick version 6.9.12
checking wand/MagickWand.h usability... yes
checking wand/MagickWand.h presence... yes
checking for wand/MagickWand.h... yes
configure: using ImageMagick version 6.9.12
checking for gtk+-3.0... yes
configure: using GTK+ version 3.24.28
checking for python3... /usr/bin/python3
checking whether /usr/bin/python3 version is >= 2.7.0... yes
checking for /usr/bin/python3 version... 3.9
checking for /usr/bin/python3 platform... linux
checking for /usr/bin/python3 script directory... ${prefix}/lib/python3/site-packages
checking for /usr/bin/python3 extension module directory... ${exec_prefix}/lib64/python3/site-packages
checking Python.h usability... yes
checking Python.h presence... yes
checking for Python.h... yes
checking for Qt5Core >= 5 Qt5Gui >= 5 Qt5Widgets >= 5.0 Qt5X11Extras >= 5.0... yes
checking for moc-qt5... moc-qt5
configure: using moc from moc-qt5
configure: using Qt version 5.15.2
checking for javac... no
checking for jikes... no
checking for ecj... no
checking for gcj... no
checking for javah... no
checking for jar... no
checking for java... no
checking whether to enable assertions... yes
checking errno.h usability... yes
checking errno.h presence... yes
checking for errno.h... yes
checking fcntl.h usability... yes
checking fcntl.h presence... yes
checking for fcntl.h... yes
checking features.h usability... yes
checking features.h presence... yes
checking for features.h... yes
checking for inttypes.h... (cached) yes
checking float.h usability... yes
checking float.h presence... yes
checking for float.h... yes
checking limits.h usability... yes
checking limits.h presence... yes
checking for limits.h... yes
checking locale.h usability... yes
checking locale.h presence... yes
checking for locale.h... yes
checking stddef.h usability... yes
checking stddef.h presence... yes
checking for stddef.h... yes
checking for stdlib.h... (cached) yes
checking for string.h... (cached) yes
checking for unistd.h... (cached) yes
checking for sys/types.h... (cached) yes
checking for sys/stat.h... (cached) yes
checking sys/ioctl.h usability... yes
checking sys/ioctl.h presence... yes
checking for sys/ioctl.h... yes
checking sys/time.h usability... yes
checking sys/time.h presence... yes
checking for sys/time.h... yes
checking sys/times.h usability... yes
checking sys/times.h presence... yes
checking for sys/times.h... yes
checking sys/ipc.h usability... yes
checking sys/ipc.h presence... yes
checking for sys/ipc.h... yes
checking sys/shm.h usability... yes
checking sys/shm.h presence... yes
checking for sys/shm.h... yes
checking sys/mman.h usability... yes
checking sys/mman.h presence... yes
checking for sys/mman.h... yes
checking whether sys/types.h defines makedev... no
checking sys/mkdev.h usability... no
checking sys/mkdev.h presence... no
checking for sys/mkdev.h... no
checking sys/sysmacros.h usability... yes
checking sys/sysmacros.h presence... yes
checking for sys/sysmacros.h... yes
checking for stdbool.h that conforms to C99... yes
checking for _Bool... yes
checking for int32_t... yes
checking for uint32_t... yes
checking for uint8_t... yes
checking for uintptr_t... yes
checking for uid_t in sys/types.h... yes
checking for int32_t... (cached) yes
checking for int64_t... yes
checking for off_t... yes
checking for size_t... yes
checking for uint16_t... yes
checking for uint32_t... (cached) yes
checking for uint64_t... yes
checking for uint8_t... (cached) yes
checking for struct stat.st_rdev... yes
checking for an ANSI C-conforming const... yes
checking for inline... inline
checking for stdlib.h... (cached) yes
checking for unistd.h... (cached) yes
checking for sys/param.h... yes
checking for getpagesize... yes
checking for working mmap... yes
checking for alarm... yes
checking for clock_gettime... yes
checking for floor... yes
checking for getcwd... yes
checking for gettimeofday... yes
checking for localeconv... yes
checking for memchr... yes
checking for memmove... yes
checking for memset... yes
checking for modf... yes
checking for munmap... yes
checking for pow... yes
checking for select... yes
checking for setenv... yes
checking for sqrt... yes
checking for strcasecmp... yes
checking for strchr... yes
checking for strdup... yes
checking for strerror... yes
checking for strrchr... yes
checking for strstr... yes
checking for strtol... yes
checking for strtoul... yes
checking for malloc... yes
checking for realloc... yes
Generating config files
checking that generated files are newer than configure... done
configure: creating ./config.status
config.status: creating zbar-qt.pc
config.status: creating Makefile
config.status: creating gtk/Makefile
config.status: creating java/Makefile
config.status: creating po/Makefile.in
config.status: creating zbar/Makefile
config.status: creating zbar.pc
config.status: creating zbar-gtk.pc
config.status: creating doc/doxygen.conf
config.status: creating test/test_examples.sh
config.status: creating test/check_dbus.sh
config.status: creating include/config.h
config.status: executing depfiles commands
config.status: executing libtool commands
config.status: executing po-directories commands
config.status: creating po/POTFILES
config.status: creating po/Makefile
config.status: executing doc/version.xml commands
writing new doc/version.xml
config.status: executing doc/reldate.xml commands
writing new doc/reldate.xml
configure: WARNING: unrecognized options: --without-included-gettext

please verify that the detected configuration matches your expectations:
------------------------------------------------------------------------
gettext                yes
X                      --with-x=yes
pthreads               --enable-pthread=yes
doc                    --enable-doc=yes
v4l                    --enable-video=yes
jpeg                   --with-jpeg=yes
Python                 --with-python=python3 	python3.9
GTK                    --with-gtk=gtk3       	Gtk3.24.28
GObject introspection  --with-gir=no
Qt                     --with-qt=yes         	Qt5.15.2
Java                   --with-java=no
Dbus                   --with-dbus=yes
ImageMagick            --with-imagemagick=check
Enabled codes:         ean databar code128 code93 code39 codabar i25 qrcode sqcode
Disabled codes:        pdf417

        => the Java interface will *NOT* be built
        => the Java unit test will *NOT* be enabled
+ make -j8
make: Entering directory '/usr/src/RPM/BUILD/zbar-0.23.1'
moc-qt5 -i -Izbarcam -DQT_WIDGETS_LIB -DQT_X11EXTRAS_LIB -DQT_GUI_LIB -DQT_CORE_LIB -I/usr/include/qt5/QtWidgets -I/usr/include/qt5 -I/usr/include/qt5/QtX11Extras -I/usr/include/qt5 -I/usr/include/qt5/QtGui -I/usr/include/qt5 -I/usr/include/qt5/QtCore -I/usr/include/qt5 -I./include zbarcam/zbarcam-qt.cpp -o zbarcam/moc_zbarcam_qt.h
make: Leaving directory '/usr/src/RPM/BUILD/zbar-0.23.1'
make: Entering directory '/usr/src/RPM/BUILD/zbar-0.23.1'
moc-qt5 -Iqt -DQT_WIDGETS_LIB -DQT_X11EXTRAS_LIB -DQT_GUI_LIB -DQT_CORE_LIB -I/usr/include/qt5/QtWidgets -I/usr/include/qt5 -I/usr/include/qt5/QtX11Extras -I/usr/include/qt5 -I/usr/include/qt5/QtGui -I/usr/include/qt5 -I/usr/include/qt5/QtCore -I/usr/include/qt5 -I./include include/zbar/QZBar.h -o qt/moc_QZBar.cpp
make: Leaving directory '/usr/src/RPM/BUILD/zbar-0.23.1'
make: Entering directory '/usr/src/RPM/BUILD/zbar-0.23.1'
moc-qt5 -Iqt -DQT_WIDGETS_LIB -DQT_X11EXTRAS_LIB -DQT_GUI_LIB -DQT_CORE_LIB -I/usr/include/qt5/QtWidgets -I/usr/include/qt5 -I/usr/include/qt5/QtX11Extras -I/usr/include/qt5 -I/usr/include/qt5/QtGui -I/usr/include/qt5 -I/usr/include/qt5/QtCore -I/usr/include/qt5 -I./include qt/QZBarThread.h -o qt/moc_QZBarThread.cpp
make: Leaving directory '/usr/src/RPM/BUILD/zbar-0.23.1'
make  all-recursive
Making all in zbar
make[2]: Entering directory '/usr/src/RPM/BUILD/zbar-0.23.1/zbar'
/bin/sh ../libtool  --tag=CC   --mode=compile x86_64-alt-linux-gcc -DHAVE_CONFIG_H -I. -I../include  -I../include    -I/usr/include/dbus-1.0 -I/usr/lib64/dbus-1.0/include  -fPIC -Wall -Wno-parentheses -pipe -frecord-gcc-switches -Wall -g -O2 -c -o libzbar_la-refcnt.lo `test -f 'refcnt.c' || echo './'`refcnt.c
libtool: compile:  x86_64-alt-linux-gcc -DHAVE_CONFIG_H -I. -I../include -I../include -I/usr/include/dbus-1.0 -I/usr/lib64/dbus-1.0/include -fPIC -Wall -Wno-parentheses -pipe -frecord-gcc-switches -Wall -g -O2 -c refcnt.c  -fPIC -DPIC -o .libs/libzbar_la-refcnt.o
libtool: compile:  x86_64-alt-linux-gcc -DHAVE_CONFIG_H -I. -I../include -I../include -I/usr/include/dbus-1.0 -I/usr/lib64/dbus-1.0/include -fPIC -Wall -Wno-parentheses -pipe -frecord-gcc-switches -Wall -g -O2 -c refcnt.c -o libzbar_la-refcnt.o >/dev/null 2>&1
make[2]: Leaving directory '/usr/src/RPM/BUILD/zbar-0.23.1/zbar'
make[2]: Entering directory '/usr/src/RPM/BUILD/zbar-0.23.1/zbar'
/bin/sh ../libtool  --tag=CC   --mode=compile x86_64-alt-linux-gcc -DHAVE_CONFIG_H -I. -I../include  -I../include    -I/usr/include/dbus-1.0 -I/usr/lib64/dbus-1.0/include  -fPIC -Wall -Wno-parentheses -pipe -frecord-gcc-switches -Wall -g -O2 -c -o libzbar_la-config.lo `test -f 'config.c' || echo './'`config.c
libtool: compile:  x86_64-alt-linux-gcc -DHAVE_CONFIG_H -I. -I../include -I../include -I/usr/include/dbus-1.0 -I/usr/lib64/dbus-1.0/include -fPIC -Wall -Wno-parentheses -pipe -frecord-gcc-switches -Wall -g -O2 -c config.c  -fPIC -DPIC -o .libs/libzbar_la-config.o
libtool: compile:  x86_64-alt-linux-gcc -DHAVE_CONFIG_H -I. -I../include -I../include -I/usr/include/dbus-1.0 -I/usr/lib64/dbus-1.0/include -fPIC -Wall -Wno-parentheses -pipe -frecord-gcc-switches -Wall -g -O2 -c config.c -o libzbar_la-config.o >/dev/null 2>&1
make[2]: Leaving directory '/usr/src/RPM/BUILD/zbar-0.23.1/zbar'
make[2]: Entering directory '/usr/src/RPM/BUILD/zbar-0.23.1/zbar'
/bin/sh ../libtool  --tag=CC   --mode=compile x86_64-alt-linux-gcc -DHAVE_CONFIG_H -I. -I../include  -I../include    -I/usr/include/dbus-1.0 -I/usr/lib64/dbus-1.0/include  -fPIC -Wall -Wno-parentheses -pipe -frecord-gcc-switches -Wall -g -O2 -c -o libzbar_la-image.lo `test -f 'image.c' || echo './'`image.c
libtool: compile:  x86_64-alt-linux-gcc -DHAVE_CONFIG_H -I. -I../include -I../include -I/usr/include/dbus-1.0 -I/usr/lib64/dbus-1.0/include -fPIC -Wall -Wno-parentheses -pipe -frecord-gcc-switches -Wall -g -O2 -c image.c  -fPIC -DPIC -o .libs/libzbar_la-image.o
libtool: compile:  x86_64-alt-linux-gcc -DHAVE_CONFIG_H -I. -I../include -I../include -I/usr/include/dbus-1.0 -I/usr/lib64/dbus-1.0/include -fPIC -Wall -Wno-parentheses -pipe -frecord-gcc-switches -Wall -g -O2 -c image.c -o libzbar_la-image.o >/dev/null 2>&1
make[2]: Leaving directory '/usr/src/RPM/BUILD/zbar-0.23.1/zbar'
make[2]: Entering directory '/usr/src/RPM/BUILD/zbar-0.23.1/zbar'
/bin/sh ../libtool  --tag=CC   --mode=compile x86_64-alt-linux-gcc -DHAVE_CONFIG_H -I. -I../include  -I../include    -I/usr/include/dbus-1.0 -I/usr/lib64/dbus-1.0/include  -fPIC -Wall -Wno-parentheses -pipe -frecord-gcc-switches -Wall -g -O2 -c -o libzbar_la-symbol.lo `test -f 'symbol.c' || echo './'`symbol.c
libtool: compile:  x86_64-alt-linux-gcc -DHAVE_CONFIG_H -I. -I../include -I../include -I/usr/include/dbus-1.0 -I/usr/lib64/dbus-1.0/include -fPIC -Wall -Wno-parentheses -pipe -frecord-gcc-switches -Wall -g -O2 -c symbol.c  -fPIC -DPIC -o .libs/libzbar_la-symbol.o
libtool: compile:  x86_64-alt-linux-gcc -DHAVE_CONFIG_H -I. -I../include -I../include -I/usr/include/dbus-1.0 -I/usr/lib64/dbus-1.0/include -fPIC -Wall -Wno-parentheses -pipe -frecord-gcc-switches -Wall -g -O2 -c symbol.c -o libzbar_la-symbol.o >/dev/null 2>&1
make[2]: Leaving directory '/usr/src/RPM/BUILD/zbar-0.23.1/zbar'
make[2]: Entering directory '/usr/src/RPM/BUILD/zbar-0.23.1/zbar'
/bin/sh ../libtool  --tag=CC   --mode=compile x86_64-alt-linux-gcc -DHAVE_CONFIG_H -I. -I../include  -I../include    -I/usr/include/dbus-1.0 -I/usr/lib64/dbus-1.0/include  -fPIC -Wall -Wno-parentheses -pipe -frecord-gcc-switches -Wall -g -O2 -c -o libzbar_la-error.lo `test -f 'error.c' || echo './'`error.c
libtool: compile:  x86_64-alt-linux-gcc -DHAVE_CONFIG_H -I. -I../include -I../include -I/usr/include/dbus-1.0 -I/usr/lib64/dbus-1.0/include -fPIC -Wall -Wno-parentheses -pipe -frecord-gcc-switches -Wall -g -O2 -c error.c  -fPIC -DPIC -o .libs/libzbar_la-error.o
libtool: compile:  x86_64-alt-linux-gcc -DHAVE_CONFIG_H -I. -I../include -I../include -I/usr/include/dbus-1.0 -I/usr/lib64/dbus-1.0/include -fPIC -Wall -Wno-parentheses -pipe -frecord-gcc-switches -Wall -g -O2 -c error.c -o libzbar_la-error.o >/dev/null 2>&1
make[2]: Leaving directory '/usr/src/RPM/BUILD/zbar-0.23.1/zbar'
make[2]: Entering directory '/usr/src/RPM/BUILD/zbar-0.23.1/zbar'
/bin/sh ../libtool  --tag=CC   --mode=compile x86_64-alt-linux-gcc -DHAVE_CONFIG_H -I. -I../include  -I../include    -I/usr/include/dbus-1.0 -I/usr/lib64/dbus-1.0/include  -fPIC -Wall -Wno-parentheses -pipe -frecord-gcc-switches -Wall -g -O2 -c -o libzbar_la-processor.lo `test -f 'processor.c' || echo './'`processor.c
libtool: compile:  x86_64-alt-linux-gcc -DHAVE_CONFIG_H -I. -I../include -I../include -I/usr/include/dbus-1.0 -I/usr/lib64/dbus-1.0/include -fPIC -Wall -Wno-parentheses -pipe -frecord-gcc-switches -Wall -g -O2 -c processor.c  -fPIC -DPIC -o .libs/libzbar_la-processor.o
libtool: compile:  x86_64-alt-linux-gcc -DHAVE_CONFIG_H -I. -I../include -I../include -I/usr/include/dbus-1.0 -I/usr/lib64/dbus-1.0/include -fPIC -Wall -Wno-parentheses -pipe -frecord-gcc-switches -Wall -g -O2 -c processor.c -o libzbar_la-processor.o >/dev/null 2>&1
make[2]: Leaving directory '/usr/src/RPM/BUILD/zbar-0.23.1/zbar'
make[2]: Entering directory '/usr/src/RPM/BUILD/zbar-0.23.1/zbar'
/bin/sh ../libtool  --tag=CC   --mode=compile x86_64-alt-linux-gcc -DHAVE_CONFIG_H -I. -I../include  -I../include    -I/usr/include/dbus-1.0 -I/usr/lib64/dbus-1.0/include  -fPIC -Wall -Wno-parentheses -pipe -frecord-gcc-switches -Wall -g -O2 -c -o libzbar_la-scanner.lo `test -f 'scanner.c' || echo './'`scanner.c
libtool: compile:  x86_64-alt-linux-gcc -DHAVE_CONFIG_H -I. -I../include -I../include -I/usr/include/dbus-1.0 -I/usr/lib64/dbus-1.0/include -fPIC -Wall -Wno-parentheses -pipe -frecord-gcc-switches -Wall -g -O2 -c scanner.c  -fPIC -DPIC -o .libs/libzbar_la-scanner.o
libtool: compile:  x86_64-alt-linux-gcc -DHAVE_CONFIG_H -I. -I../include -I../include -I/usr/include/dbus-1.0 -I/usr/lib64/dbus-1.0/include -fPIC -Wall -Wno-parentheses -pipe -frecord-gcc-switches -Wall -g -O2 -c scanner.c -o libzbar_la-scanner.o >/dev/null 2>&1
make[2]: Leaving directory '/usr/src/RPM/BUILD/zbar-0.23.1/zbar'
make[2]: Entering directory '/usr/src/RPM/BUILD/zbar-0.23.1/zbar'
/bin/sh ../libtool  --tag=CC   --mode=compile x86_64-alt-linux-gcc -DHAVE_CONFIG_H -I. -I../include  -I../include    -I/usr/include/dbus-1.0 -I/usr/lib64/dbus-1.0/include  -fPIC -Wall -Wno-parentheses -pipe -frecord-gcc-switches -Wall -g -O2 -c -o libzbar_la-window.lo `test -f 'window.c' || echo './'`window.c
libtool: compile:  x86_64-alt-linux-gcc -DHAVE_CONFIG_H -I. -I../include -I../include -I/usr/include/dbus-1.0 -I/usr/lib64/dbus-1.0/include -fPIC -Wall -Wno-parentheses -pipe -frecord-gcc-switches -Wall -g -O2 -c window.c  -fPIC -DPIC -o .libs/libzbar_la-window.o
libtool: compile:  x86_64-alt-linux-gcc -DHAVE_CONFIG_H -I. -I../include -I../include -I/usr/include/dbus-1.0 -I/usr/lib64/dbus-1.0/include -fPIC -Wall -Wno-parentheses -pipe -frecord-gcc-switches -Wall -g -O2 -c window.c -o libzbar_la-window.o >/dev/null 2>&1
make[2]: Leaving directory '/usr/src/RPM/BUILD/zbar-0.23.1/zbar'
make[2]: Entering directory '/usr/src/RPM/BUILD/zbar-0.23.1/zbar'
/bin/sh ../libtool  --tag=CC   --mode=compile x86_64-alt-linux-gcc -DHAVE_CONFIG_H -I. -I../include  -I../include    -I/usr/include/dbus-1.0 -I/usr/lib64/dbus-1.0/include  -fPIC -Wall -Wno-parentheses -pipe -frecord-gcc-switches -Wall -g -O2 -c -o libzbar_la-misc.lo `test -f 'misc.c' || echo './'`misc.c
libtool: compile:  x86_64-alt-linux-gcc -DHAVE_CONFIG_H -I. -I../include -I../include -I/usr/include/dbus-1.0 -I/usr/lib64/dbus-1.0/include -fPIC -Wall -Wno-parentheses -pipe -frecord-gcc-switches -Wall -g -O2 -c misc.c  -fPIC -DPIC -o .libs/libzbar_la-misc.o
libtool: compile:  x86_64-alt-linux-gcc -DHAVE_CONFIG_H -I. -I../include -I../include -I/usr/include/dbus-1.0 -I/usr/lib64/dbus-1.0/include -fPIC -Wall -Wno-parentheses -pipe -frecord-gcc-switches -Wall -g -O2 -c misc.c -o libzbar_la-misc.o >/dev/null 2>&1
make[2]: Leaving directory '/usr/src/RPM/BUILD/zbar-0.23.1/zbar'
make[2]: Entering directory '/usr/src/RPM/BUILD/zbar-0.23.1/zbar'
/bin/sh ../libtool  --tag=CC   --mode=compile x86_64-alt-linux-gcc -DHAVE_CONFIG_H -I. -I../include  -I../include    -I/usr/include/dbus-1.0 -I/usr/lib64/dbus-1.0/include  -fPIC -Wall -Wno-parentheses -pipe -frecord-gcc-switches -Wall -g -O2 -c -o libzbar_la-video.lo `test -f 'video.c' || echo './'`video.c
libtool: compile:  x86_64-alt-linux-gcc -DHAVE_CONFIG_H -I. -I../include -I../include -I/usr/include/dbus-1.0 -I/usr/lib64/dbus-1.0/include -fPIC -Wall -Wno-parentheses -pipe -frecord-gcc-switches -Wall -g -O2 -c video.c  -fPIC -DPIC -o .libs/libzbar_la-video.o
libtool: compile:  x86_64-alt-linux-gcc -DHAVE_CONFIG_H -I. -I../include -I../include -I/usr/include/dbus-1.0 -I/usr/lib64/dbus-1.0/include -fPIC -Wall -Wno-parentheses -pipe -frecord-gcc-switches -Wall -g -O2 -c video.c -o libzbar_la-video.o >/dev/null 2>&1
make[2]: Leaving directory '/usr/src/RPM/BUILD/zbar-0.23.1/zbar'
make[2]: Entering directory '/usr/src/RPM/BUILD/zbar-0.23.1/zbar'
/bin/sh ../libtool  --tag=CC   --mode=compile x86_64-alt-linux-gcc -DHAVE_CONFIG_H -I. -I../include  -I../include    -I/usr/include/dbus-1.0 -I/usr/lib64/dbus-1.0/include  -fPIC -Wall -Wno-parentheses -pipe -frecord-gcc-switches -Wall -g -O2 -c -o decoder/libzbar_la-sq_finder.lo `test -f 'decoder/sq_finder.c' || echo './'`decoder/sq_finder.c
libtool: compile:  x86_64-alt-linux-gcc -DHAVE_CONFIG_H -I. -I../include -I../include -I/usr/include/dbus-1.0 -I/usr/lib64/dbus-1.0/include -fPIC -Wall -Wno-parentheses -pipe -frecord-gcc-switches -Wall -g -O2 -c decoder/sq_finder.c  -fPIC -DPIC -o decoder/.libs/libzbar_la-sq_finder.o
libtool: compile:  x86_64-alt-linux-gcc -DHAVE_CONFIG_H -I. -I../include -I../include -I/usr/include/dbus-1.0 -I/usr/lib64/dbus-1.0/include -fPIC -Wall -Wno-parentheses -pipe -frecord-gcc-switches -Wall -g -O2 -c decoder/sq_finder.c -o decoder/libzbar_la-sq_finder.o >/dev/null 2>&1
make[2]: Leaving directory '/usr/src/RPM/BUILD/zbar-0.23.1/zbar'
make[2]: Entering directory '/usr/src/RPM/BUILD/zbar-0.23.1/zbar'
/bin/sh ../libtool  --tag=CC   --mode=compile x86_64-alt-linux-gcc -DHAVE_CONFIG_H -I. -I../include  -I../include    -I/usr/include/dbus-1.0 -I/usr/lib64/dbus-1.0/include  -fPIC -Wall -Wno-parentheses -pipe -frecord-gcc-switches -Wall -g -O2 -c -o libzbar_la-decoder.lo `test -f 'decoder.c' || echo './'`decoder.c
libtool: compile:  x86_64-alt-linux-gcc -DHAVE_CONFIG_H -I. -I../include -I../include -I/usr/include/dbus-1.0 -I/usr/lib64/dbus-1.0/include -fPIC -Wall -Wno-parentheses -pipe -frecord-gcc-switches -Wall -g -O2 -c decoder.c  -fPIC -DPIC -o .libs/libzbar_la-decoder.o
libtool: compile:  x86_64-alt-linux-gcc -DHAVE_CONFIG_H -I. -I../include -I../include -I/usr/include/dbus-1.0 -I/usr/lib64/dbus-1.0/include -fPIC -Wall -Wno-parentheses -pipe -frecord-gcc-switches -Wall -g -O2 -c decoder.c -o libzbar_la-decoder.o >/dev/null 2>&1
make[2]: Leaving directory '/usr/src/RPM/BUILD/zbar-0.23.1/zbar'
make[2]: Entering directory '/usr/src/RPM/BUILD/zbar-0.23.1/zbar'
/bin/sh ../libtool  --tag=CC   --mode=compile x86_64-alt-linux-gcc -DHAVE_CONFIG_H -I. -I../include  -I../include    -I/usr/include/dbus-1.0 -I/usr/lib64/dbus-1.0/include  -fPIC -Wall -Wno-parentheses -pipe -frecord-gcc-switches -Wall -g -O2 -c -o libzbar_la-jpeg.lo `test -f 'jpeg.c' || echo './'`jpeg.c
libtool: compile:  x86_64-alt-linux-gcc -DHAVE_CONFIG_H -I. -I../include -I../include -I/usr/include/dbus-1.0 -I/usr/lib64/dbus-1.0/include -fPIC -Wall -Wno-parentheses -pipe -frecord-gcc-switches -Wall -g -O2 -c jpeg.c  -fPIC -DPIC -o .libs/libzbar_la-jpeg.o
libtool: compile:  x86_64-alt-linux-gcc -DHAVE_CONFIG_H -I. -I../include -I../include -I/usr/include/dbus-1.0 -I/usr/lib64/dbus-1.0/include -fPIC -Wall -Wno-parentheses -pipe -frecord-gcc-switches -Wall -g -O2 -c jpeg.c -o libzbar_la-jpeg.o >/dev/null 2>&1
make[2]: Leaving directory '/usr/src/RPM/BUILD/zbar-0.23.1/zbar'
make[2]: Entering directory '/usr/src/RPM/BUILD/zbar-0.23.1/zbar'
/bin/sh ../libtool  --tag=CC   --mode=compile x86_64-alt-linux-gcc -DHAVE_CONFIG_H -I. -I../include  -I../include    -I/usr/include/dbus-1.0 -I/usr/lib64/dbus-1.0/include  -fPIC -Wall -Wno-parentheses -pipe -frecord-gcc-switches -Wall -g -O2 -c -o libzbar_la-img_scanner.lo `test -f 'img_scanner.c' || echo './'`img_scanner.c
libtool: compile:  x86_64-alt-linux-gcc -DHAVE_CONFIG_H -I. -I../include -I../include -I/usr/include/dbus-1.0 -I/usr/lib64/dbus-1.0/include -fPIC -Wall -Wno-parentheses -pipe -frecord-gcc-switches -Wall -g -O2 -c img_scanner.c  -fPIC -DPIC -o .libs/libzbar_la-img_scanner.o
libtool: compile:  x86_64-alt-linux-gcc -DHAVE_CONFIG_H -I. -I../include -I../include -I/usr/include/dbus-1.0 -I/usr/lib64/dbus-1.0/include -fPIC -Wall -Wno-parentheses -pipe -frecord-gcc-switches -Wall -g -O2 -c img_scanner.c -o libzbar_la-img_scanner.o >/dev/null 2>&1
make[2]: Leaving directory '/usr/src/RPM/BUILD/zbar-0.23.1/zbar'
make[2]: Entering directory '/usr/src/RPM/BUILD/zbar-0.23.1/zbar'
/bin/sh ../libtool  --tag=CC   --mode=compile x86_64-alt-linux-gcc -DHAVE_CONFIG_H -I. -I../include  -I../include    -I/usr/include/dbus-1.0 -I/usr/lib64/dbus-1.0/include  -fPIC -Wall -Wno-parentheses -pipe -frecord-gcc-switches -Wall -g -O2 -c -o processor/libzbar_la-posix.lo `test -f 'processor/posix.c' || echo './'`processor/posix.c
libtool: compile:  x86_64-alt-linux-gcc -DHAVE_CONFIG_H -I. -I../include -I../include -I/usr/include/dbus-1.0 -I/usr/lib64/dbus-1.0/include -fPIC -Wall -Wno-parentheses -pipe -frecord-gcc-switches -Wall -g -O2 -c processor/posix.c  -fPIC -DPIC -o processor/.libs/libzbar_la-posix.o
libtool: compile:  x86_64-alt-linux-gcc -DHAVE_CONFIG_H -I. -I../include -I../include -I/usr/include/dbus-1.0 -I/usr/lib64/dbus-1.0/include -fPIC -Wall -Wno-parentheses -pipe -frecord-gcc-switches -Wall -g -O2 -c processor/posix.c -o processor/libzbar_la-posix.o >/dev/null 2>&1
make[2]: Leaving directory '/usr/src/RPM/BUILD/zbar-0.23.1/zbar'
make[2]: Entering directory '/usr/src/RPM/BUILD/zbar-0.23.1/zbar'
/bin/sh ../libtool  --tag=CC   --mode=compile x86_64-alt-linux-gcc -DHAVE_CONFIG_H -I. -I../include  -I../include    -I/usr/include/dbus-1.0 -I/usr/lib64/dbus-1.0/include  -fPIC -Wall -Wno-parentheses -pipe -frecord-gcc-switches -Wall -g -O2 -c -o libzbar_la-convert.lo `test -f 'convert.c' || echo './'`convert.c
libtool: compile:  x86_64-alt-linux-gcc -DHAVE_CONFIG_H -I. -I../include -I../include -I/usr/include/dbus-1.0 -I/usr/lib64/dbus-1.0/include -fPIC -Wall -Wno-parentheses -pipe -frecord-gcc-switches -Wall -g -O2 -c convert.c  -fPIC -DPIC -o .libs/libzbar_la-convert.o
libtool: compile:  x86_64-alt-linux-gcc -DHAVE_CONFIG_H -I. -I../include -I../include -I/usr/include/dbus-1.0 -I/usr/lib64/dbus-1.0/include -fPIC -Wall -Wno-parentheses -pipe -frecord-gcc-switches -Wall -g -O2 -c convert.c -o libzbar_la-convert.o >/dev/null 2>&1
make[2]: Leaving directory '/usr/src/RPM/BUILD/zbar-0.23.1/zbar'
make[2]: Entering directory '/usr/src/RPM/BUILD/zbar-0.23.1/zbar'
/bin/sh ../libtool  --tag=CC   --mode=compile x86_64-alt-linux-gcc -DHAVE_CONFIG_H -I. -I../include  -I../include    -I/usr/include/dbus-1.0 -I/usr/lib64/dbus-1.0/include  -fPIC -Wall -Wno-parentheses -pipe -frecord-gcc-switches -Wall -g -O2 -c -o processor/libzbar_la-lock.lo `test -f 'processor/lock.c' || echo './'`processor/lock.c
libtool: compile:  x86_64-alt-linux-gcc -DHAVE_CONFIG_H -I. -I../include -I../include -I/usr/include/dbus-1.0 -I/usr/lib64/dbus-1.0/include -fPIC -Wall -Wno-parentheses -pipe -frecord-gcc-switches -Wall -g -O2 -c processor/lock.c  -fPIC -DPIC -o processor/.libs/libzbar_la-lock.o
libtool: compile:  x86_64-alt-linux-gcc -DHAVE_CONFIG_H -I. -I../include -I../include -I/usr/include/dbus-1.0 -I/usr/lib64/dbus-1.0/include -fPIC -Wall -Wno-parentheses -pipe -frecord-gcc-switches -Wall -g -O2 -c processor/lock.c -o processor/libzbar_la-lock.o >/dev/null 2>&1
make[2]: Leaving directory '/usr/src/RPM/BUILD/zbar-0.23.1/zbar'
make[2]: Entering directory '/usr/src/RPM/BUILD/zbar-0.23.1/zbar'
/bin/sh ../libtool  --tag=CC   --mode=compile x86_64-alt-linux-gcc -DHAVE_CONFIG_H -I. -I../include  -I../include    -I/usr/include/dbus-1.0 -I/usr/lib64/dbus-1.0/include  -fPIC -Wall -Wno-parentheses -pipe -frecord-gcc-switches -Wall -g -O2 -c -o libzbar_la-sqcode.lo `test -f 'sqcode.c' || echo './'`sqcode.c
libtool: compile:  x86_64-alt-linux-gcc -DHAVE_CONFIG_H -I. -I../include -I../include -I/usr/include/dbus-1.0 -I/usr/lib64/dbus-1.0/include -fPIC -Wall -Wno-parentheses -pipe -frecord-gcc-switches -Wall -g -O2 -c sqcode.c  -fPIC -DPIC -o .libs/libzbar_la-sqcode.o
libtool: compile:  x86_64-alt-linux-gcc -DHAVE_CONFIG_H -I. -I../include -I../include -I/usr/include/dbus-1.0 -I/usr/lib64/dbus-1.0/include -fPIC -Wall -Wno-parentheses -pipe -frecord-gcc-switches -Wall -g -O2 -c sqcode.c -o libzbar_la-sqcode.o >/dev/null 2>&1
make[2]: Leaving directory '/usr/src/RPM/BUILD/zbar-0.23.1/zbar'
make[2]: Entering directory '/usr/src/RPM/BUILD/zbar-0.23.1/zbar'
/bin/sh ../libtool  --tag=CC   --mode=compile x86_64-alt-linux-gcc -DHAVE_CONFIG_H -I. -I../include  -I../include    -I/usr/include/dbus-1.0 -I/usr/lib64/dbus-1.0/include  -fPIC -Wall -Wno-parentheses -pipe -frecord-gcc-switches -Wall -g -O2 -c -o processor/libzbar_la-x.lo `test -f 'processor/x.c' || echo './'`processor/x.c
libtool: compile:  x86_64-alt-linux-gcc -DHAVE_CONFIG_H -I. -I../include -I../include -I/usr/include/dbus-1.0 -I/usr/lib64/dbus-1.0/include -fPIC -Wall -Wno-parentheses -pipe -frecord-gcc-switches -Wall -g -O2 -c processor/x.c  -fPIC -DPIC -o processor/.libs/libzbar_la-x.o
libtool: compile:  x86_64-alt-linux-gcc -DHAVE_CONFIG_H -I. -I../include -I../include -I/usr/include/dbus-1.0 -I/usr/lib64/dbus-1.0/include -fPIC -Wall -Wno-parentheses -pipe -frecord-gcc-switches -Wall -g -O2 -c processor/x.c -o processor/libzbar_la-x.o >/dev/null 2>&1
make[2]: Leaving directory '/usr/src/RPM/BUILD/zbar-0.23.1/zbar'
make[2]: Entering directory '/usr/src/RPM/BUILD/zbar-0.23.1/zbar'
/bin/sh ../libtool  --tag=CC   --mode=compile x86_64-alt-linux-gcc -DHAVE_CONFIG_H -I. -I../include  -I../include    -I/usr/include/dbus-1.0 -I/usr/lib64/dbus-1.0/include  -fPIC -Wall -Wno-parentheses -pipe -frecord-gcc-switches -Wall -g -O2 -c -o decoder/libzbar_la-code39.lo `test -f 'decoder/code39.c' || echo './'`decoder/code39.c
libtool: compile:  x86_64-alt-linux-gcc -DHAVE_CONFIG_H -I. -I../include -I../include -I/usr/include/dbus-1.0 -I/usr/lib64/dbus-1.0/include -fPIC -Wall -Wno-parentheses -pipe -frecord-gcc-switches -Wall -g -O2 -c decoder/code39.c  -fPIC -DPIC -o decoder/.libs/libzbar_la-code39.o
libtool: compile:  x86_64-alt-linux-gcc -DHAVE_CONFIG_H -I. -I../include -I../include -I/usr/include/dbus-1.0 -I/usr/lib64/dbus-1.0/include -fPIC -Wall -Wno-parentheses -pipe -frecord-gcc-switches -Wall -g -O2 -c decoder/code39.c -o decoder/libzbar_la-code39.o >/dev/null 2>&1
make[2]: Leaving directory '/usr/src/RPM/BUILD/zbar-0.23.1/zbar'
make[2]: Entering directory '/usr/src/RPM/BUILD/zbar-0.23.1/zbar'
/bin/sh ../libtool  --tag=CC   --mode=compile x86_64-alt-linux-gcc -DHAVE_CONFIG_H -I. -I../include  -I../include    -I/usr/include/dbus-1.0 -I/usr/lib64/dbus-1.0/include  -fPIC -Wall -Wno-parentheses -pipe -frecord-gcc-switches -Wall -g -O2 -c -o decoder/libzbar_la-code93.lo `test -f 'decoder/code93.c' || echo './'`decoder/code93.c
libtool: compile:  x86_64-alt-linux-gcc -DHAVE_CONFIG_H -I. -I../include -I../include -I/usr/include/dbus-1.0 -I/usr/lib64/dbus-1.0/include -fPIC -Wall -Wno-parentheses -pipe -frecord-gcc-switches -Wall -g -O2 -c decoder/code93.c  -fPIC -DPIC -o decoder/.libs/libzbar_la-code93.o
libtool: compile:  x86_64-alt-linux-gcc -DHAVE_CONFIG_H -I. -I../include -I../include -I/usr/include/dbus-1.0 -I/usr/lib64/dbus-1.0/include -fPIC -Wall -Wno-parentheses -pipe -frecord-gcc-switches -Wall -g -O2 -c decoder/code93.c -o decoder/libzbar_la-code93.o >/dev/null 2>&1
make[2]: Leaving directory '/usr/src/RPM/BUILD/zbar-0.23.1/zbar'
make[2]: Entering directory '/usr/src/RPM/BUILD/zbar-0.23.1/zbar'
/bin/sh ../libtool  --tag=CC   --mode=compile x86_64-alt-linux-gcc -DHAVE_CONFIG_H -I. -I../include  -I../include    -I/usr/include/dbus-1.0 -I/usr/lib64/dbus-1.0/include  -fPIC -Wall -Wno-parentheses -pipe -frecord-gcc-switches -Wall -g -O2 -c -o decoder/libzbar_la-codabar.lo `test -f 'decoder/codabar.c' || echo './'`decoder/codabar.c
libtool: compile:  x86_64-alt-linux-gcc -DHAVE_CONFIG_H -I. -I../include -I../include -I/usr/include/dbus-1.0 -I/usr/lib64/dbus-1.0/include -fPIC -Wall -Wno-parentheses -pipe -frecord-gcc-switches -Wall -g -O2 -c decoder/codabar.c  -fPIC -DPIC -o decoder/.libs/libzbar_la-codabar.o
libtool: compile:  x86_64-alt-linux-gcc -DHAVE_CONFIG_H -I. -I../include -I../include -I/usr/include/dbus-1.0 -I/usr/lib64/dbus-1.0/include -fPIC -Wall -Wno-parentheses -pipe -frecord-gcc-switches -Wall -g -O2 -c decoder/codabar.c -o decoder/libzbar_la-codabar.o >/dev/null 2>&1
make[2]: Leaving directory '/usr/src/RPM/BUILD/zbar-0.23.1/zbar'
make[2]: Entering directory '/usr/src/RPM/BUILD/zbar-0.23.1/zbar'
/bin/sh ../libtool  --tag=CC   --mode=compile x86_64-alt-linux-gcc -DHAVE_CONFIG_H -I. -I../include  -I../include    -I/usr/include/dbus-1.0 -I/usr/lib64/dbus-1.0/include  -fPIC -Wall -Wno-parentheses -pipe -frecord-gcc-switches -Wall -g -O2 -c -o decoder/libzbar_la-i25.lo `test -f 'decoder/i25.c' || echo './'`decoder/i25.c
libtool: compile:  x86_64-alt-linux-gcc -DHAVE_CONFIG_H -I. -I../include -I../include -I/usr/include/dbus-1.0 -I/usr/lib64/dbus-1.0/include -fPIC -Wall -Wno-parentheses -pipe -frecord-gcc-switches -Wall -g -O2 -c decoder/i25.c  -fPIC -DPIC -o decoder/.libs/libzbar_la-i25.o
libtool: compile:  x86_64-alt-linux-gcc -DHAVE_CONFIG_H -I. -I../include -I../include -I/usr/include/dbus-1.0 -I/usr/lib64/dbus-1.0/include -fPIC -Wall -Wno-parentheses -pipe -frecord-gcc-switches -Wall -g -O2 -c decoder/i25.c -o decoder/libzbar_la-i25.o >/dev/null 2>&1
make[2]: Leaving directory '/usr/src/RPM/BUILD/zbar-0.23.1/zbar'
make[2]: Entering directory '/usr/src/RPM/BUILD/zbar-0.23.1/zbar'
/bin/sh ../libtool  --tag=CC   --mode=compile x86_64-alt-linux-gcc -DHAVE_CONFIG_H -I. -I../include  -I../include    -I/usr/include/dbus-1.0 -I/usr/lib64/dbus-1.0/include  -fPIC -Wall -Wno-parentheses -pipe -frecord-gcc-switches -Wall -g -O2 -c -o decoder/libzbar_la-qr_finder.lo `test -f 'decoder/qr_finder.c' || echo './'`decoder/qr_finder.c
libtool: compile:  x86_64-alt-linux-gcc -DHAVE_CONFIG_H -I. -I../include -I../include -I/usr/include/dbus-1.0 -I/usr/lib64/dbus-1.0/include -fPIC -Wall -Wno-parentheses -pipe -frecord-gcc-switches -Wall -g -O2 -c decoder/qr_finder.c  -fPIC -DPIC -o decoder/.libs/libzbar_la-qr_finder.o
libtool: compile:  x86_64-alt-linux-gcc -DHAVE_CONFIG_H -I. -I../include -I../include -I/usr/include/dbus-1.0 -I/usr/lib64/dbus-1.0/include -fPIC -Wall -Wno-parentheses -pipe -frecord-gcc-switches -Wall -g -O2 -c decoder/qr_finder.c -o decoder/libzbar_la-qr_finder.o >/dev/null 2>&1
make[2]: Leaving directory '/usr/src/RPM/BUILD/zbar-0.23.1/zbar'
make[2]: Entering directory '/usr/src/RPM/BUILD/zbar-0.23.1/zbar'
/bin/sh ../libtool  --tag=CC   --mode=compile x86_64-alt-linux-gcc -DHAVE_CONFIG_H -I. -I../include  -I../include    -I/usr/include/dbus-1.0 -I/usr/lib64/dbus-1.0/include  -fPIC -Wall -Wno-parentheses -pipe -frecord-gcc-switches -Wall -g -O2 -c -o decoder/libzbar_la-code128.lo `test -f 'decoder/code128.c' || echo './'`decoder/code128.c
libtool: compile:  x86_64-alt-linux-gcc -DHAVE_CONFIG_H -I. -I../include -I../include -I/usr/include/dbus-1.0 -I/usr/lib64/dbus-1.0/include -fPIC -Wall -Wno-parentheses -pipe -frecord-gcc-switches -Wall -g -O2 -c decoder/code128.c  -fPIC -DPIC -o decoder/.libs/libzbar_la-code128.o
libtool: compile:  x86_64-alt-linux-gcc -DHAVE_CONFIG_H -I. -I../include -I../include -I/usr/include/dbus-1.0 -I/usr/lib64/dbus-1.0/include -fPIC -Wall -Wno-parentheses -pipe -frecord-gcc-switches -Wall -g -O2 -c decoder/code128.c -o decoder/libzbar_la-code128.o >/dev/null 2>&1
make[2]: Leaving directory '/usr/src/RPM/BUILD/zbar-0.23.1/zbar'
make[2]: Entering directory '/usr/src/RPM/BUILD/zbar-0.23.1/zbar'
/bin/sh ../libtool  --tag=CC   --mode=compile x86_64-alt-linux-gcc -DHAVE_CONFIG_H -I. -I../include  -I../include    -I/usr/include/dbus-1.0 -I/usr/lib64/dbus-1.0/include  -fPIC -Wall -Wno-parentheses -pipe -frecord-gcc-switches -Wall -g -O2 -c -o decoder/libzbar_la-ean.lo `test -f 'decoder/ean.c' || echo './'`decoder/ean.c
libtool: compile:  x86_64-alt-linux-gcc -DHAVE_CONFIG_H -I. -I../include -I../include -I/usr/include/dbus-1.0 -I/usr/lib64/dbus-1.0/include -fPIC -Wall -Wno-parentheses -pipe -frecord-gcc-switches -Wall -g -O2 -c decoder/ean.c  -fPIC -DPIC -o decoder/.libs/libzbar_la-ean.o
libtool: compile:  x86_64-alt-linux-gcc -DHAVE_CONFIG_H -I. -I../include -I../include -I/usr/include/dbus-1.0 -I/usr/lib64/dbus-1.0/include -fPIC -Wall -Wno-parentheses -pipe -frecord-gcc-switches -Wall -g -O2 -c decoder/ean.c -o decoder/libzbar_la-ean.o >/dev/null 2>&1
make[2]: Leaving directory '/usr/src/RPM/BUILD/zbar-0.23.1/zbar'
make[2]: Entering directory '/usr/src/RPM/BUILD/zbar-0.23.1/zbar'
/bin/sh ../libtool  --tag=CC   --mode=compile x86_64-alt-linux-gcc -DHAVE_CONFIG_H -I. -I../include  -I../include    -I/usr/include/dbus-1.0 -I/usr/lib64/dbus-1.0/include  -fPIC -Wall -Wno-parentheses -pipe -frecord-gcc-switches -Wall -g -O2 -c -o qrcode/libzbar_la-bch15_5.lo `test -f 'qrcode/bch15_5.c' || echo './'`qrcode/bch15_5.c
libtool: compile:  x86_64-alt-linux-gcc -DHAVE_CONFIG_H -I. -I../include -I../include -I/usr/include/dbus-1.0 -I/usr/lib64/dbus-1.0/include -fPIC -Wall -Wno-parentheses -pipe -frecord-gcc-switches -Wall -g -O2 -c qrcode/bch15_5.c  -fPIC -DPIC -o qrcode/.libs/libzbar_la-bch15_5.o
libtool: compile:  x86_64-alt-linux-gcc -DHAVE_CONFIG_H -I. -I../include -I../include -I/usr/include/dbus-1.0 -I/usr/lib64/dbus-1.0/include -fPIC -Wall -Wno-parentheses -pipe -frecord-gcc-switches -Wall -g -O2 -c qrcode/bch15_5.c -o qrcode/libzbar_la-bch15_5.o >/dev/null 2>&1
make[2]: Leaving directory '/usr/src/RPM/BUILD/zbar-0.23.1/zbar'
make[2]: Entering directory '/usr/src/RPM/BUILD/zbar-0.23.1/zbar'
/bin/sh ../libtool  --tag=CC   --mode=compile x86_64-alt-linux-gcc -DHAVE_CONFIG_H -I. -I../include  -I../include    -I/usr/include/dbus-1.0 -I/usr/lib64/dbus-1.0/include  -fPIC -Wall -Wno-parentheses -pipe -frecord-gcc-switches -Wall -g -O2 -c -o qrcode/libzbar_la-isaac.lo `test -f 'qrcode/isaac.c' || echo './'`qrcode/isaac.c
libtool: compile:  x86_64-alt-linux-gcc -DHAVE_CONFIG_H -I. -I../include -I../include -I/usr/include/dbus-1.0 -I/usr/lib64/dbus-1.0/include -fPIC -Wall -Wno-parentheses -pipe -frecord-gcc-switches -Wall -g -O2 -c qrcode/isaac.c  -fPIC -DPIC -o qrcode/.libs/libzbar_la-isaac.o
libtool: compile:  x86_64-alt-linux-gcc -DHAVE_CONFIG_H -I. -I../include -I../include -I/usr/include/dbus-1.0 -I/usr/lib64/dbus-1.0/include -fPIC -Wall -Wno-parentheses -pipe -frecord-gcc-switches -Wall -g -O2 -c qrcode/isaac.c -o qrcode/libzbar_la-isaac.o >/dev/null 2>&1
make[2]: Leaving directory '/usr/src/RPM/BUILD/zbar-0.23.1/zbar'
make[2]: Entering directory '/usr/src/RPM/BUILD/zbar-0.23.1/zbar'
/bin/sh ../libtool  --tag=CC   --mode=compile x86_64-alt-linux-gcc -DHAVE_CONFIG_H -I. -I../include  -I../include    -I/usr/include/dbus-1.0 -I/usr/lib64/dbus-1.0/include  -fPIC -Wall -Wno-parentheses -pipe -frecord-gcc-switches -Wall -g -O2 -c -o qrcode/libzbar_la-binarize.lo `test -f 'qrcode/binarize.c' || echo './'`qrcode/binarize.c
libtool: compile:  x86_64-alt-linux-gcc -DHAVE_CONFIG_H -I. -I../include -I../include -I/usr/include/dbus-1.0 -I/usr/lib64/dbus-1.0/include -fPIC -Wall -Wno-parentheses -pipe -frecord-gcc-switches -Wall -g -O2 -c qrcode/binarize.c  -fPIC -DPIC -o qrcode/.libs/libzbar_la-binarize.o
libtool: compile:  x86_64-alt-linux-gcc -DHAVE_CONFIG_H -I. -I../include -I../include -I/usr/include/dbus-1.0 -I/usr/lib64/dbus-1.0/include -fPIC -Wall -Wno-parentheses -pipe -frecord-gcc-switches -Wall -g -O2 -c qrcode/binarize.c -o qrcode/libzbar_la-binarize.o >/dev/null 2>&1
make[2]: Leaving directory '/usr/src/RPM/BUILD/zbar-0.23.1/zbar'
make[2]: Entering directory '/usr/src/RPM/BUILD/zbar-0.23.1/zbar'
/bin/sh ../libtool  --tag=CC   --mode=compile x86_64-alt-linux-gcc -DHAVE_CONFIG_H -I. -I../include  -I../include    -I/usr/include/dbus-1.0 -I/usr/lib64/dbus-1.0/include  -fPIC -Wall -Wno-parentheses -pipe -frecord-gcc-switches -Wall -g -O2 -c -o qrcode/libzbar_la-util.lo `test -f 'qrcode/util.c' || echo './'`qrcode/util.c
libtool: compile:  x86_64-alt-linux-gcc -DHAVE_CONFIG_H -I. -I../include -I../include -I/usr/include/dbus-1.0 -I/usr/lib64/dbus-1.0/include -fPIC -Wall -Wno-parentheses -pipe -frecord-gcc-switches -Wall -g -O2 -c qrcode/util.c  -fPIC -DPIC -o qrcode/.libs/libzbar_la-util.o
libtool: compile:  x86_64-alt-linux-gcc -DHAVE_CONFIG_H -I. -I../include -I../include -I/usr/include/dbus-1.0 -I/usr/lib64/dbus-1.0/include -fPIC -Wall -Wno-parentheses -pipe -frecord-gcc-switches -Wall -g -O2 -c qrcode/util.c -o qrcode/libzbar_la-util.o >/dev/null 2>&1
make[2]: Leaving directory '/usr/src/RPM/BUILD/zbar-0.23.1/zbar'
make[2]: Entering directory '/usr/src/RPM/BUILD/zbar-0.23.1/zbar'
/bin/sh ../libtool  --tag=CC   --mode=compile x86_64-alt-linux-gcc -DHAVE_CONFIG_H -I. -I../include  -I../include    -I/usr/include/dbus-1.0 -I/usr/lib64/dbus-1.0/include  -fPIC -Wall -Wno-parentheses -pipe -frecord-gcc-switches -Wall -g -O2 -c -o decoder/libzbar_la-databar.lo `test -f 'decoder/databar.c' || echo './'`decoder/databar.c
libtool: compile:  x86_64-alt-linux-gcc -DHAVE_CONFIG_H -I. -I../include -I../include -I/usr/include/dbus-1.0 -I/usr/lib64/dbus-1.0/include -fPIC -Wall -Wno-parentheses -pipe -frecord-gcc-switches -Wall -g -O2 -c decoder/databar.c  -fPIC -DPIC -o decoder/.libs/libzbar_la-databar.o
libtool: compile:  x86_64-alt-linux-gcc -DHAVE_CONFIG_H -I. -I../include -I../include -I/usr/include/dbus-1.0 -I/usr/lib64/dbus-1.0/include -fPIC -Wall -Wno-parentheses -pipe -frecord-gcc-switches -Wall -g -O2 -c decoder/databar.c -o decoder/libzbar_la-databar.o >/dev/null 2>&1
make[2]: Leaving directory '/usr/src/RPM/BUILD/zbar-0.23.1/zbar'
make[2]: Entering directory '/usr/src/RPM/BUILD/zbar-0.23.1/zbar'
/bin/sh ../libtool  --tag=CC   --mode=compile x86_64-alt-linux-gcc -DHAVE_CONFIG_H -I. -I../include  -I../include    -I/usr/include/dbus-1.0 -I/usr/lib64/dbus-1.0/include  -fPIC -Wall -Wno-parentheses -pipe -frecord-gcc-switches -Wall -g -O2 -c -o qrcode/libzbar_la-rs.lo `test -f 'qrcode/rs.c' || echo './'`qrcode/rs.c
libtool: compile:  x86_64-alt-linux-gcc -DHAVE_CONFIG_H -I. -I../include -I../include -I/usr/include/dbus-1.0 -I/usr/lib64/dbus-1.0/include -fPIC -Wall -Wno-parentheses -pipe -frecord-gcc-switches -Wall -g -O2 -c qrcode/rs.c  -fPIC -DPIC -o qrcode/.libs/libzbar_la-rs.o
libtool: compile:  x86_64-alt-linux-gcc -DHAVE_CONFIG_H -I. -I../include -I../include -I/usr/include/dbus-1.0 -I/usr/lib64/dbus-1.0/include -fPIC -Wall -Wno-parentheses -pipe -frecord-gcc-switches -Wall -g -O2 -c qrcode/rs.c -o qrcode/libzbar_la-rs.o >/dev/null 2>&1
make[2]: Leaving directory '/usr/src/RPM/BUILD/zbar-0.23.1/zbar'
make[2]: Entering directory '/usr/src/RPM/BUILD/zbar-0.23.1/zbar'
/bin/sh ../libtool  --tag=CC   --mode=compile x86_64-alt-linux-gcc -DHAVE_CONFIG_H -I. -I../include  -I../include    -I/usr/include/dbus-1.0 -I/usr/lib64/dbus-1.0/include  -fPIC -Wall -Wno-parentheses -pipe -frecord-gcc-switches -Wall -g -O2 -c -o video/libzbar_la-v4l.lo `test -f 'video/v4l.c' || echo './'`video/v4l.c
libtool: compile:  x86_64-alt-linux-gcc -DHAVE_CONFIG_H -I. -I../include -I../include -I/usr/include/dbus-1.0 -I/usr/lib64/dbus-1.0/include -fPIC -Wall -Wno-parentheses -pipe -frecord-gcc-switches -Wall -g -O2 -c video/v4l.c  -fPIC -DPIC -o video/.libs/libzbar_la-v4l.o
libtool: compile:  x86_64-alt-linux-gcc -DHAVE_CONFIG_H -I. -I../include -I../include -I/usr/include/dbus-1.0 -I/usr/lib64/dbus-1.0/include -fPIC -Wall -Wno-parentheses -pipe -frecord-gcc-switches -Wall -g -O2 -c video/v4l.c -o video/libzbar_la-v4l.o >/dev/null 2>&1
make[2]: Leaving directory '/usr/src/RPM/BUILD/zbar-0.23.1/zbar'
make[2]: Entering directory '/usr/src/RPM/BUILD/zbar-0.23.1/zbar'
/bin/sh ../libtool  --tag=CC   --mode=compile x86_64-alt-linux-gcc -DHAVE_CONFIG_H -I. -I../include  -I../include    -I/usr/include/dbus-1.0 -I/usr/lib64/dbus-1.0/include  -fPIC -Wall -Wno-parentheses -pipe -frecord-gcc-switches -Wall -g -O2 -c -o qrcode/libzbar_la-qrdectxt.lo `test -f 'qrcode/qrdectxt.c' || echo './'`qrcode/qrdectxt.c
libtool: compile:  x86_64-alt-linux-gcc -DHAVE_CONFIG_H -I. -I../include -I../include -I/usr/include/dbus-1.0 -I/usr/lib64/dbus-1.0/include -fPIC -Wall -Wno-parentheses -pipe -frecord-gcc-switches -Wall -g -O2 -c qrcode/qrdectxt.c  -fPIC -DPIC -o qrcode/.libs/libzbar_la-qrdectxt.o
libtool: compile:  x86_64-alt-linux-gcc -DHAVE_CONFIG_H -I. -I../include -I../include -I/usr/include/dbus-1.0 -I/usr/lib64/dbus-1.0/include -fPIC -Wall -Wno-parentheses -pipe -frecord-gcc-switches -Wall -g -O2 -c qrcode/qrdectxt.c -o qrcode/libzbar_la-qrdectxt.o >/dev/null 2>&1
make[2]: Leaving directory '/usr/src/RPM/BUILD/zbar-0.23.1/zbar'
make[2]: Entering directory '/usr/src/RPM/BUILD/zbar-0.23.1/zbar'
/bin/sh ../libtool  --tag=CC   --mode=compile x86_64-alt-linux-gcc -DHAVE_CONFIG_H -I. -I../include  -I../include    -I/usr/include/dbus-1.0 -I/usr/lib64/dbus-1.0/include  -fPIC -Wall -Wno-parentheses -pipe -frecord-gcc-switches -Wall -g -O2 -c -o window/libzbar_la-ximage.lo `test -f 'window/ximage.c' || echo './'`window/ximage.c
libtool: compile:  x86_64-alt-linux-gcc -DHAVE_CONFIG_H -I. -I../include -I../include -I/usr/include/dbus-1.0 -I/usr/lib64/dbus-1.0/include -fPIC -Wall -Wno-parentheses -pipe -frecord-gcc-switches -Wall -g -O2 -c window/ximage.c  -fPIC -DPIC -o window/.libs/libzbar_la-ximage.o
libtool: compile:  x86_64-alt-linux-gcc -DHAVE_CONFIG_H -I. -I../include -I../include -I/usr/include/dbus-1.0 -I/usr/lib64/dbus-1.0/include -fPIC -Wall -Wno-parentheses -pipe -frecord-gcc-switches -Wall -g -O2 -c window/ximage.c -o window/libzbar_la-ximage.o >/dev/null 2>&1
make[2]: Leaving directory '/usr/src/RPM/BUILD/zbar-0.23.1/zbar'
make[2]: Entering directory '/usr/src/RPM/BUILD/zbar-0.23.1/zbar'
/bin/sh ../libtool  --tag=CC   --mode=compile x86_64-alt-linux-gcc -DHAVE_CONFIG_H -I. -I../include  -I../include    -I/usr/include/dbus-1.0 -I/usr/lib64/dbus-1.0/include  -fPIC -Wall -Wno-parentheses -pipe -frecord-gcc-switches -Wall -g -O2 -c -o window/libzbar_la-x.lo `test -f 'window/x.c' || echo './'`window/x.c
libtool: compile:  x86_64-alt-linux-gcc -DHAVE_CONFIG_H -I. -I../include -I../include -I/usr/include/dbus-1.0 -I/usr/lib64/dbus-1.0/include -fPIC -Wall -Wno-parentheses -pipe -frecord-gcc-switches -Wall -g -O2 -c window/x.c  -fPIC -DPIC -o window/.libs/libzbar_la-x.o
libtool: compile:  x86_64-alt-linux-gcc -DHAVE_CONFIG_H -I. -I../include -I../include -I/usr/include/dbus-1.0 -I/usr/lib64/dbus-1.0/include -fPIC -Wall -Wno-parentheses -pipe -frecord-gcc-switches -Wall -g -O2 -c window/x.c -o window/libzbar_la-x.o >/dev/null 2>&1
make[2]: Leaving directory '/usr/src/RPM/BUILD/zbar-0.23.1/zbar'
make[2]: Entering directory '/usr/src/RPM/BUILD/zbar-0.23.1/zbar'
/bin/sh ../libtool  --tag=CC   --mode=compile x86_64-alt-linux-gcc -DHAVE_CONFIG_H -I. -I../include  -I../include    -I/usr/include/dbus-1.0 -I/usr/lib64/dbus-1.0/include  -fPIC -Wall -Wno-parentheses -pipe -frecord-gcc-switches -Wall -g -O2 -c -o window/libzbar_la-xv.lo `test -f 'window/xv.c' || echo './'`window/xv.c
libtool: compile:  x86_64-alt-linux-gcc -DHAVE_CONFIG_H -I. -I../include -I../include -I/usr/include/dbus-1.0 -I/usr/lib64/dbus-1.0/include -fPIC -Wall -Wno-parentheses -pipe -frecord-gcc-switches -Wall -g -O2 -c window/xv.c  -fPIC -DPIC -o window/.libs/libzbar_la-xv.o
libtool: compile:  x86_64-alt-linux-gcc -DHAVE_CONFIG_H -I. -I../include -I../include -I/usr/include/dbus-1.0 -I/usr/lib64/dbus-1.0/include -fPIC -Wall -Wno-parentheses -pipe -frecord-gcc-switches -Wall -g -O2 -c window/xv.c -o window/libzbar_la-xv.o >/dev/null 2>&1
make[2]: Leaving directory '/usr/src/RPM/BUILD/zbar-0.23.1/zbar'
make[2]: Entering directory '/usr/src/RPM/BUILD/zbar-0.23.1/zbar'
/bin/sh ../libtool  --tag=CC   --mode=compile x86_64-alt-linux-gcc -DHAVE_CONFIG_H -I. -I../include  -I../include    -I/usr/include/dbus-1.0 -I/usr/lib64/dbus-1.0/include  -fPIC -Wall -Wno-parentheses -pipe -frecord-gcc-switches -Wall -g -O2 -c -o video/libzbar_la-v4l2.lo `test -f 'video/v4l2.c' || echo './'`video/v4l2.c
libtool: compile:  x86_64-alt-linux-gcc -DHAVE_CONFIG_H -I. -I../include -I../include -I/usr/include/dbus-1.0 -I/usr/lib64/dbus-1.0/include -fPIC -Wall -Wno-parentheses -pipe -frecord-gcc-switches -Wall -g -O2 -c video/v4l2.c  -fPIC -DPIC -o video/.libs/libzbar_la-v4l2.o
libtool: compile:  x86_64-alt-linux-gcc -DHAVE_CONFIG_H -I. -I../include -I../include -I/usr/include/dbus-1.0 -I/usr/lib64/dbus-1.0/include -fPIC -Wall -Wno-parentheses -pipe -frecord-gcc-switches -Wall -g -O2 -c video/v4l2.c -o video/libzbar_la-v4l2.o >/dev/null 2>&1
make[2]: Leaving directory '/usr/src/RPM/BUILD/zbar-0.23.1/zbar'
make[2]: Entering directory '/usr/src/RPM/BUILD/zbar-0.23.1/zbar'
/bin/sh ../libtool  --tag=CC   --mode=compile x86_64-alt-linux-gcc -DHAVE_CONFIG_H -I. -I../include  -I../include    -I/usr/include/dbus-1.0 -I/usr/lib64/dbus-1.0/include  -fPIC -Wall -Wno-parentheses -pipe -frecord-gcc-switches -Wall -g -O2 -c -o qrcode/libzbar_la-qrdec.lo `test -f 'qrcode/qrdec.c' || echo './'`qrcode/qrdec.c
libtool: compile:  x86_64-alt-linux-gcc -DHAVE_CONFIG_H -I. -I../include -I../include -I/usr/include/dbus-1.0 -I/usr/lib64/dbus-1.0/include -fPIC -Wall -Wno-parentheses -pipe -frecord-gcc-switches -Wall -g -O2 -c qrcode/qrdec.c  -fPIC -DPIC -o qrcode/.libs/libzbar_la-qrdec.o
libtool: compile:  x86_64-alt-linux-gcc -DHAVE_CONFIG_H -I. -I../include -I../include -I/usr/include/dbus-1.0 -I/usr/lib64/dbus-1.0/include -fPIC -Wall -Wno-parentheses -pipe -frecord-gcc-switches -Wall -g -O2 -c qrcode/qrdec.c -o qrcode/libzbar_la-qrdec.o >/dev/null 2>&1
make[2]: Leaving directory '/usr/src/RPM/BUILD/zbar-0.23.1/zbar'
make[2]: Entering directory '/usr/src/RPM/BUILD/zbar-0.23.1/zbar'
/bin/sh ../libtool  --tag=CC   --mode=link x86_64-alt-linux-gcc -Wall -Wno-parentheses -pipe -frecord-gcc-switches -Wall -g -O2 -no-undefined -version-info 3:0:3 -export-symbols-regex "^(zbar|_zbar.*_error)_.*"    -ldbus-1   -o libzbar.la -rpath /usr/lib64 libzbar_la-config.lo libzbar_la-error.lo libzbar_la-symbol.lo libzbar_la-image.lo libzbar_la-convert.lo libzbar_la-processor.lo processor/libzbar_la-lock.lo libzbar_la-refcnt.lo libzbar_la-window.lo libzbar_la-video.lo libzbar_la-img_scanner.lo libzbar_la-scanner.lo libzbar_la-decoder.lo libzbar_la-misc.lo decoder/libzbar_la-ean.lo decoder/libzbar_la-databar.lo decoder/libzbar_la-code128.lo decoder/libzbar_la-code93.lo decoder/libzbar_la-code39.lo decoder/libzbar_la-codabar.lo decoder/libzbar_la-i25.lo  decoder/libzbar_la-qr_finder.lo qrcode/libzbar_la-qrdec.lo qrcode/libzbar_la-qrdectxt.lo qrcode/libzbar_la-rs.lo qrcode/libzbar_la-isaac.lo qrcode/libzbar_la-bch15_5.lo qrcode/libzbar_la-binarize.lo qrcode/libzbar_la-util.lo libzbar_la-sqcode.lo decoder/libzbar_la-sq_finder.lo  processor/libzbar_la-posix.lo video/libzbar_la-v4l.lo video/libzbar_la-v4l2.lo      libzbar_la-jpeg.lo processor/libzbar_la-x.lo window/libzbar_la-x.lo window/libzbar_la-ximage.lo window/libzbar_la-xv.lo       -lv4l2 -lSM -lICE -lX11  -lXv   -ljpeg -lpthread -lm
libtool: link: /usr/bin/nm -B  .libs/libzbar_la-config.o .libs/libzbar_la-error.o .libs/libzbar_la-symbol.o .libs/libzbar_la-image.o .libs/libzbar_la-convert.o .libs/libzbar_la-processor.o processor/.libs/libzbar_la-lock.o .libs/libzbar_la-refcnt.o .libs/libzbar_la-window.o .libs/libzbar_la-video.o .libs/libzbar_la-img_scanner.o .libs/libzbar_la-scanner.o .libs/libzbar_la-decoder.o .libs/libzbar_la-misc.o decoder/.libs/libzbar_la-ean.o decoder/.libs/libzbar_la-databar.o decoder/.libs/libzbar_la-code128.o decoder/.libs/libzbar_la-code93.o decoder/.libs/libzbar_la-code39.o decoder/.libs/libzbar_la-codabar.o decoder/.libs/libzbar_la-i25.o decoder/.libs/libzbar_la-qr_finder.o qrcode/.libs/libzbar_la-qrdec.o qrcode/.libs/libzbar_la-qrdectxt.o qrcode/.libs/libzbar_la-rs.o qrcode/.libs/libzbar_la-isaac.o qrcode/.libs/libzbar_la-bch15_5.o qrcode/.libs/libzbar_la-binarize.o qrcode/.libs/libzbar_la-util.o .libs/libzbar_la-sqcode.o decoder/.libs/libzbar_la-sq_finder.o processor/.libs/libzbar_la-posix.o video/.libs/libzbar_la-v4l.o video/.libs/libzbar_la-v4l2.o .libs/libzbar_la-jpeg.o processor/.libs/libzbar_la-x.o window/.libs/libzbar_la-x.o window/.libs/libzbar_la-ximage.o window/.libs/libzbar_la-xv.o   | sed -n -e 's/^.*[	 ]\([ABCDGIRSTW][ABCDGIRSTW]*\)[	 ][	 ]*\([_A-Za-z][_A-Za-z0-9]*\)$/\1 \2 \2/p' | sed '/ __gnu_lto/d' | /bin/sed 's/.* //' | sort | uniq > .libs/libzbar.exp
libtool: link: /bin/grep -E -e "^(zbar|_zbar.*_error)_.*" ".libs/libzbar.exp" > ".libs/libzbar.expT"
libtool: link: mv -f ".libs/libzbar.expT" ".libs/libzbar.exp"
libtool: link: echo "{ global:" > .libs/libzbar.ver
libtool: link:  cat .libs/libzbar.exp | sed -e "s/\(.*\)/\1;/" >> .libs/libzbar.ver
libtool: link:  echo "local: *; };" >> .libs/libzbar.ver
libtool: link:  	 if test -r libzbar-altlinux.ver; then cp libzbar-altlinux.ver .libs/libzbar.ver; fi
libtool: link:  x86_64-alt-linux-gcc -shared  -fPIC -DPIC  .libs/libzbar_la-config.o .libs/libzbar_la-error.o .libs/libzbar_la-symbol.o .libs/libzbar_la-image.o .libs/libzbar_la-convert.o .libs/libzbar_la-processor.o processor/.libs/libzbar_la-lock.o .libs/libzbar_la-refcnt.o .libs/libzbar_la-window.o .libs/libzbar_la-video.o .libs/libzbar_la-img_scanner.o .libs/libzbar_la-scanner.o .libs/libzbar_la-decoder.o .libs/libzbar_la-misc.o decoder/.libs/libzbar_la-ean.o decoder/.libs/libzbar_la-databar.o decoder/.libs/libzbar_la-code128.o decoder/.libs/libzbar_la-code93.o decoder/.libs/libzbar_la-code39.o decoder/.libs/libzbar_la-codabar.o decoder/.libs/libzbar_la-i25.o decoder/.libs/libzbar_la-qr_finder.o qrcode/.libs/libzbar_la-qrdec.o qrcode/.libs/libzbar_la-qrdectxt.o qrcode/.libs/libzbar_la-rs.o qrcode/.libs/libzbar_la-isaac.o qrcode/.libs/libzbar_la-bch15_5.o qrcode/.libs/libzbar_la-binarize.o qrcode/.libs/libzbar_la-util.o .libs/libzbar_la-sqcode.o decoder/.libs/libzbar_la-sq_finder.o processor/.libs/libzbar_la-posix.o video/.libs/libzbar_la-v4l.o video/.libs/libzbar_la-v4l2.o .libs/libzbar_la-jpeg.o processor/.libs/libzbar_la-x.o window/.libs/libzbar_la-x.o window/.libs/libzbar_la-ximage.o window/.libs/libzbar_la-xv.o   -ldbus-1 -lv4l2 -lSM -lICE -lX11 -lXv -ljpeg -lpthread -lm  -g -O2   -Wl,-soname -Wl,libzbar.so.0 -Wl,-version-script -Wl,.libs/libzbar.ver -o .libs/libzbar.so.0.3.0
libtool: link: (cd ".libs" && rm -f "libzbar.so.0" && ln -s "libzbar.so.0.3.0" "libzbar.so.0")
libtool: link: (cd ".libs" && rm -f "libzbar.so" && ln -s "libzbar.so.0.3.0" "libzbar.so")
copying selected object files to avoid basename conflicts...
libtool: link: ln window/libzbar_la-x.o .libs/libzbar.lax/lt1-libzbar_la-x.o || cp window/libzbar_la-x.o .libs/libzbar.lax/lt1-libzbar_la-x.o
libtool: link: ar cr .libs/libzbar.a libzbar_la-config.o libzbar_la-error.o libzbar_la-symbol.o libzbar_la-image.o libzbar_la-convert.o libzbar_la-processor.o processor/libzbar_la-lock.o libzbar_la-refcnt.o libzbar_la-window.o libzbar_la-video.o libzbar_la-img_scanner.o libzbar_la-scanner.o libzbar_la-decoder.o libzbar_la-misc.o decoder/libzbar_la-ean.o decoder/libzbar_la-databar.o decoder/libzbar_la-code128.o decoder/libzbar_la-code93.o decoder/libzbar_la-code39.o decoder/libzbar_la-codabar.o decoder/libzbar_la-i25.o decoder/libzbar_la-qr_finder.o qrcode/libzbar_la-qrdec.o qrcode/libzbar_la-qrdectxt.o qrcode/libzbar_la-rs.o qrcode/libzbar_la-isaac.o qrcode/libzbar_la-bch15_5.o qrcode/libzbar_la-binarize.o qrcode/libzbar_la-util.o libzbar_la-sqcode.o decoder/libzbar_la-sq_finder.o processor/libzbar_la-posix.o video/libzbar_la-v4l.o video/libzbar_la-v4l2.o libzbar_la-jpeg.o processor/libzbar_la-x.o .libs/libzbar.lax/lt1-libzbar_la-x.o window/libzbar_la-ximage.o window/libzbar_la-xv.o
libtool: link: ranlib .libs/libzbar.a
libtool: link: rm -fr .libs/libzbar.lax
libtool: link: ( cd ".libs" && rm -f "libzbar.la" && ln -s "../libzbar.la" "libzbar.la" )
make[2]: Leaving directory '/usr/src/RPM/BUILD/zbar-0.23.1/zbar'
Making all in po
make zbar.pot-update
make[3]: Entering directory '/usr/src/RPM/BUILD/zbar-0.23.1/po'
sed -e '/^#/d' remove-potcdate.sin > t-remove-potcdate.sed
mv t-remove-potcdate.sed remove-potcdate.sed
make[3]: Leaving directory '/usr/src/RPM/BUILD/zbar-0.23.1/po'
make[3]: Entering directory '/usr/src/RPM/BUILD/zbar-0.23.1/po'
package_gnu=""; \
test -n "$package_gnu" || { \
  if { if (LC_ALL=C find --version) 2>/dev/null | grep GNU >/dev/null; then \
         LC_ALL=C find -L .. -maxdepth 1 -type f -size -10000000c -exec grep -i 'GNU zbar' /dev/null '{}' ';' 2>/dev/null; \
       else \
         LC_ALL=C grep -i 'GNU zbar' ../* 2>/dev/null; \
       fi; \
     } | grep -v 'libtool:' >/dev/null; then \
     package_gnu=yes; \
   else \
     package_gnu=no; \
   fi; \
}; \
if test "$package_gnu" = "yes"; then \
  package_prefix='GNU '; \
else \
  package_prefix=''; \
fi; \
if test -n 'https://github.com/mchehab/zbar/issues' || test 'mchehab+samsung@kernel.org' = '@'PACKAGE_BUGREPORT'@'; then \
  msgid_bugs_address='https://github.com/mchehab/zbar/issues'; \
else \
  msgid_bugs_address='mchehab+samsung@kernel.org'; \
fi; \
case `/usr/bin/xgettext --version | sed 1q | sed -e 's,^[^0-9]*,,'` in \
  '' | 0.[0-9] | 0.[0-9].* | 0.1[0-5] | 0.1[0-5].* | 0.16 | 0.16.[0-1]*) \
    /usr/bin/xgettext --default-domain=zbar --directory=.. \
      --add-comments=TRANSLATORS: \
      --files-from=./POTFILES.in \
      --copyright-holder='Mauro Carvalho Chehab' \
      --msgid-bugs-address="$msgid_bugs_address" \
      --keyword=_ --keyword=N_ --keyword=P_:1,2  \
    ;; \
  *) \
    /usr/bin/xgettext --default-domain=zbar --directory=.. \
      --add-comments=TRANSLATORS: \
      --files-from=./POTFILES.in \
      --copyright-holder='Mauro Carvalho Chehab' \
      --package-name="${package_prefix}zbar" \
      --package-version='0.23.1' \
      --msgid-bugs-address="$msgid_bugs_address" \
      --keyword=_ --keyword=N_ --keyword=P_:1,2  \
    ;; \
esac
test ! -f zbar.po || { \
  if test -f ./zbar.pot-header; then \
    sed -e '1,/^#$/d' < zbar.po > zbar.1po && \
    cat ./zbar.pot-header zbar.1po > zbar.po && \
    rm -f zbar.1po \
    || exit 1; \
  fi; \
  if test -f ./zbar.pot; then \
    sed -f remove-potcdate.sed < ./zbar.pot > zbar.1po && \
    sed -f remove-potcdate.sed < zbar.po > zbar.2po && \
    if cmp zbar.1po zbar.2po >/dev/null 2>&1; then \
      rm -f zbar.1po zbar.2po zbar.po; \
    else \
      rm -f zbar.1po zbar.2po ./zbar.pot && \
      mv zbar.po ./zbar.pot; \
    fi; \
  else \
    mv zbar.po ./zbar.pot; \
  fi; \
}
make[3]: Leaving directory '/usr/src/RPM/BUILD/zbar-0.23.1/po'
test ! -f ./zbar.pot || \
  test -z "pt_BR.gmo" || make pt_BR.gmo
/usr/bin/msgmerge --update  --lang=pt_BR --previous pt_BR.po zbar.pot
.. done.
make[3]: Entering directory '/usr/src/RPM/BUILD/zbar-0.23.1/po'
rm -f pt_BR.gmo && /usr/bin/msgmerge --for-msgfmt -o pt_BR.1po pt_BR.po zbar.pot && /usr/bin/msgfmt -c --statistics --verbose -o pt_BR.gmo pt_BR.1po && rm -f pt_BR.1po
pt_BR.1po: 15 translated messages.
make[3]: Leaving directory '/usr/src/RPM/BUILD/zbar-0.23.1/po'
make[2]: Entering directory '/usr/src/RPM/BUILD/zbar-0.23.1/po'
touch ./stamp-po
make[2]: Leaving directory '/usr/src/RPM/BUILD/zbar-0.23.1/po'
Making all in gtk
make[2]: Entering directory '/usr/src/RPM/BUILD/zbar-0.23.1/gtk'
/usr/bin/glib-genmarshal --g-fatal-warnings --prefix=zbar_marshal \
    --header zbarmarshal.list > zbarmarshal.h
INFO: Reading zbarmarshal.list...
make[2]: Leaving directory '/usr/src/RPM/BUILD/zbar-0.23.1/gtk'
make[2]: Entering directory '/usr/src/RPM/BUILD/zbar-0.23.1/gtk'
/usr/bin/glib-genmarshal --g-fatal-warnings --prefix=zbar_marshal \
    --body zbarmarshal.list > zbarmarshal.c
INFO: Reading zbarmarshal.list...
make[2]: Leaving directory '/usr/src/RPM/BUILD/zbar-0.23.1/gtk'
make  all-am
make[3]: Entering directory '/usr/src/RPM/BUILD/zbar-0.23.1/gtk'
/bin/sh ../libtool  --tag=CC   --mode=compile x86_64-alt-linux-gcc -DHAVE_CONFIG_H -I. -I../include  -pthread -I/usr/include/gtk-3.0 -I/usr/include/gio-unix-2.0 -I/usr/include/cairo -I/usr/include/pango-1.0 -I/usr/include/harfbuzz -I/usr/include/pango-1.0 -I/usr/include/atk-1.0 -I/usr/include/cairo -I/usr/include/freetype2 -I/usr/include/harfbuzz -I/usr/include/libpng16 -I/usr/include/gdk-pixbuf-2.0 -I/usr/include/libpng16 -I/usr/include/glib-2.0 -I/usr/lib64/glib-2.0/include -I../include -DHAVE_X -I/usr/include/dbus-1.0 -I/usr/lib64/dbus-1.0/include  -fPIC -Wall -Wno-parentheses -pipe -frecord-gcc-switches -Wall -g -O2 -c -o libzbargtk_la-zbarmarshal.lo `test -f 'zbarmarshal.c' || echo './'`zbarmarshal.c
libtool: compile:  x86_64-alt-linux-gcc -DHAVE_CONFIG_H -I. -I../include -pthread -I/usr/include/gtk-3.0 -I/usr/include/gio-unix-2.0 -I/usr/include/cairo -I/usr/include/pango-1.0 -I/usr/include/harfbuzz -I/usr/include/pango-1.0 -I/usr/include/atk-1.0 -I/usr/include/cairo -I/usr/include/freetype2 -I/usr/include/harfbuzz -I/usr/include/libpng16 -I/usr/include/gdk-pixbuf-2.0 -I/usr/include/libpng16 -I/usr/include/glib-2.0 -I/usr/lib64/glib-2.0/include -I../include -DHAVE_X -I/usr/include/dbus-1.0 -I/usr/lib64/dbus-1.0/include -fPIC -Wall -Wno-parentheses -pipe -frecord-gcc-switches -Wall -g -O2 -c zbarmarshal.c  -fPIC -DPIC -o .libs/libzbargtk_la-zbarmarshal.o
libtool: compile:  x86_64-alt-linux-gcc -DHAVE_CONFIG_H -I. -I../include -pthread -I/usr/include/gtk-3.0 -I/usr/include/gio-unix-2.0 -I/usr/include/cairo -I/usr/include/pango-1.0 -I/usr/include/harfbuzz -I/usr/include/pango-1.0 -I/usr/include/atk-1.0 -I/usr/include/cairo -I/usr/include/freetype2 -I/usr/include/harfbuzz -I/usr/include/libpng16 -I/usr/include/gdk-pixbuf-2.0 -I/usr/include/libpng16 -I/usr/include/glib-2.0 -I/usr/lib64/glib-2.0/include -I../include -DHAVE_X -I/usr/include/dbus-1.0 -I/usr/lib64/dbus-1.0/include -fPIC -Wall -Wno-parentheses -pipe -frecord-gcc-switches -Wall -g -O2 -c zbarmarshal.c -o libzbargtk_la-zbarmarshal.o >/dev/null 2>&1
make[3]: Leaving directory '/usr/src/RPM/BUILD/zbar-0.23.1/gtk'
make[3]: Entering directory '/usr/src/RPM/BUILD/zbar-0.23.1/gtk'
/bin/sh ../libtool  --tag=CC   --mode=compile x86_64-alt-linux-gcc -DHAVE_CONFIG_H -I. -I../include  -pthread -I/usr/include/gtk-3.0 -I/usr/include/gio-unix-2.0 -I/usr/include/cairo -I/usr/include/pango-1.0 -I/usr/include/harfbuzz -I/usr/include/pango-1.0 -I/usr/include/atk-1.0 -I/usr/include/cairo -I/usr/include/freetype2 -I/usr/include/harfbuzz -I/usr/include/libpng16 -I/usr/include/gdk-pixbuf-2.0 -I/usr/include/libpng16 -I/usr/include/glib-2.0 -I/usr/lib64/glib-2.0/include -I../include -DHAVE_X -I/usr/include/dbus-1.0 -I/usr/lib64/dbus-1.0/include  -fPIC -Wall -Wno-parentheses -pipe -frecord-gcc-switches -Wall -g -O2 -c -o libzbargtk_la-zbargtk.lo `test -f 'zbargtk.c' || echo './'`zbargtk.c
libtool: compile:  x86_64-alt-linux-gcc -DHAVE_CONFIG_H -I. -I../include -pthread -I/usr/include/gtk-3.0 -I/usr/include/gio-unix-2.0 -I/usr/include/cairo -I/usr/include/pango-1.0 -I/usr/include/harfbuzz -I/usr/include/pango-1.0 -I/usr/include/atk-1.0 -I/usr/include/cairo -I/usr/include/freetype2 -I/usr/include/harfbuzz -I/usr/include/libpng16 -I/usr/include/gdk-pixbuf-2.0 -I/usr/include/libpng16 -I/usr/include/glib-2.0 -I/usr/lib64/glib-2.0/include -I../include -DHAVE_X -I/usr/include/dbus-1.0 -I/usr/lib64/dbus-1.0/include -fPIC -Wall -Wno-parentheses -pipe -frecord-gcc-switches -Wall -g -O2 -c zbargtk.c  -fPIC -DPIC -o .libs/libzbargtk_la-zbargtk.o
libtool: compile:  x86_64-alt-linux-gcc -DHAVE_CONFIG_H -I. -I../include -pthread -I/usr/include/gtk-3.0 -I/usr/include/gio-unix-2.0 -I/usr/include/cairo -I/usr/include/pango-1.0 -I/usr/include/harfbuzz -I/usr/include/pango-1.0 -I/usr/include/atk-1.0 -I/usr/include/cairo -I/usr/include/freetype2 -I/usr/include/harfbuzz -I/usr/include/libpng16 -I/usr/include/gdk-pixbuf-2.0 -I/usr/include/libpng16 -I/usr/include/glib-2.0 -I/usr/lib64/glib-2.0/include -I../include -DHAVE_X -I/usr/include/dbus-1.0 -I/usr/lib64/dbus-1.0/include -fPIC -Wall -Wno-parentheses -pipe -frecord-gcc-switches -Wall -g -O2 -c zbargtk.c -o libzbargtk_la-zbargtk.o >/dev/null 2>&1
make[3]: Leaving directory '/usr/src/RPM/BUILD/zbar-0.23.1/gtk'
make[3]: Entering directory '/usr/src/RPM/BUILD/zbar-0.23.1/gtk'
/bin/sh ../libtool  --tag=CC   --mode=link x86_64-alt-linux-gcc -Wall -Wno-parentheses -pipe -frecord-gcc-switches -Wall -g -O2 -version-info 0:2:0 -export-symbols-regex "^zbar_.*"  -no-undefined  -o libzbargtk.la -rpath /usr/lib64 libzbargtk_la-zbargtk.lo libzbargtk_la-zbarmarshal.lo -lgtk-3 -lgdk-3 -lpangocairo-1.0 -lpango-1.0 -lharfbuzz -latk-1.0 -lcairo-gobject -lcairo -lgdk_pixbuf-2.0 -lgio-2.0 -lgobject-2.0 -lglib-2.0 ../zbar/libzbar.la  -ljpeg -lpthread -lm
libtool: link: /usr/bin/nm -B  .libs/libzbargtk_la-zbargtk.o .libs/libzbargtk_la-zbarmarshal.o   | sed -n -e 's/^.*[	 ]\([ABCDGIRSTW][ABCDGIRSTW]*\)[	 ][	 ]*\([_A-Za-z][_A-Za-z0-9]*\)$/\1 \2 \2/p' | sed '/ __gnu_lto/d' | /bin/sed 's/.* //' | sort | uniq > .libs/libzbargtk.exp
libtool: link: /bin/grep -E -e "^zbar_.*" ".libs/libzbargtk.exp" > ".libs/libzbargtk.expT"
libtool: link: mv -f ".libs/libzbargtk.expT" ".libs/libzbargtk.exp"
libtool: link: echo "{ global:" > .libs/libzbargtk.ver
libtool: link:  cat .libs/libzbargtk.exp | sed -e "s/\(.*\)/\1;/" >> .libs/libzbargtk.ver
libtool: link:  echo "local: *; };" >> .libs/libzbargtk.ver
libtool: link:  	 if test -r libzbargtk-altlinux.ver; then cp libzbargtk-altlinux.ver .libs/libzbargtk.ver; fi
libtool: link:  x86_64-alt-linux-gcc -shared  -fPIC -DPIC  .libs/libzbargtk_la-zbargtk.o .libs/libzbargtk_la-zbarmarshal.o   -Wl,-rpath -Wl,/usr/src/RPM/BUILD/zbar-0.23.1/zbar/.libs -lgtk-3 -lgdk-3 -lpangocairo-1.0 -lpango-1.0 -lharfbuzz -latk-1.0 -lcairo-gobject -lcairo -lgdk_pixbuf-2.0 -lgio-2.0 -lgobject-2.0 -lglib-2.0 ../zbar/.libs/libzbar.so -ljpeg -lpthread -lm  -g -O2   -Wl,-soname -Wl,libzbargtk.so.0 -Wl,-version-script -Wl,.libs/libzbargtk.ver -o .libs/libzbargtk.so.0.0.2
libtool: link: (cd ".libs" && rm -f "libzbargtk.so.0" && ln -s "libzbargtk.so.0.0.2" "libzbargtk.so.0")
libtool: link: (cd ".libs" && rm -f "libzbargtk.so" && ln -s "libzbargtk.so.0.0.2" "libzbargtk.so")
libtool: link: ar cr .libs/libzbargtk.a  libzbargtk_la-zbargtk.o libzbargtk_la-zbarmarshal.o
libtool: link: ranlib .libs/libzbargtk.a
libtool: link: ( cd ".libs" && rm -f "libzbargtk.la" && ln -s "../libzbargtk.la" "libzbargtk.la" )
make[3]: Leaving directory '/usr/src/RPM/BUILD/zbar-0.23.1/gtk'
Making all in .
make[2]: Entering directory '/usr/src/RPM/BUILD/zbar-0.23.1'
x86_64-alt-linux-gcc -DHAVE_CONFIG_H -I. -I./include  -fopenmp -DMAGICKCORE_HDRI_ENABLE=0 -DMAGICKCORE_QUANTUM_DEPTH=16 -fopenmp -DMAGICKCORE_HDRI_ENABLE=0 -DMAGICKCORE_QUANTUM_DEPTH=16 -I/usr/include/ImageMagick-6 -I./include -I/usr/include/dbus-1.0 -I/usr/lib64/dbus-1.0/include  -fPIC -Wall -Wno-parentheses -DLOCALEDIR=\"/usr/share/locale\" -pipe -frecord-gcc-switches -Wall -g -O2 -c -o zbarimg/zbarimg-zbarimg.o `test -f 'zbarimg/zbarimg.c' || echo './'`zbarimg/zbarimg.c
make[2]: Leaving directory '/usr/src/RPM/BUILD/zbar-0.23.1'
make[2]: Entering directory '/usr/src/RPM/BUILD/zbar-0.23.1'
/bin/sh ./libtool  --tag=CC   --mode=link x86_64-alt-linux-gcc -Wall -Wno-parentheses -DLOCALEDIR=\"/usr/share/locale\" -pipe -frecord-gcc-switches -Wall -g -O2   -o zbarimg/zbarimg zbarimg/zbarimg-zbarimg.o  zbar/libzbar.la -lMagickWand-6.Q16 -lMagickCore-6.Q16  -ljpeg -lpthread -lm
libtool: link: x86_64-alt-linux-gcc -Wall -Wno-parentheses -DLOCALEDIR=\"/usr/share/locale\" -pipe -frecord-gcc-switches -Wall -g -O2 -o zbarimg/.libs/zbarimg zbarimg/zbarimg-zbarimg.o  zbar/.libs/libzbar.so -lMagickWand-6.Q16 -lMagickCore-6.Q16 -ljpeg -lpthread -lm
make[2]: Leaving directory '/usr/src/RPM/BUILD/zbar-0.23.1'
make[2]: Entering directory '/usr/src/RPM/BUILD/zbar-0.23.1'
x86_64-alt-linux-gcc -DHAVE_CONFIG_H -I. -I./include  -I./include  -I/usr/include/dbus-1.0 -I/usr/lib64/dbus-1.0/include  -fPIC -Wall -Wno-parentheses -DLOCALEDIR=\"/usr/share/locale\" -pipe -frecord-gcc-switches -Wall -g -O2 -c -o zbarcam/zbarcam-zbarcam.o `test -f 'zbarcam/zbarcam.c' || echo './'`zbarcam/zbarcam.c
make[2]: Leaving directory '/usr/src/RPM/BUILD/zbar-0.23.1'
make[2]: Entering directory '/usr/src/RPM/BUILD/zbar-0.23.1'
/bin/sh ./libtool  --tag=CC   --mode=link x86_64-alt-linux-gcc -Wall -Wno-parentheses -DLOCALEDIR=\"/usr/share/locale\" -pipe -frecord-gcc-switches -Wall -g -O2   -o zbarcam/zbarcam zbarcam/zbarcam-zbarcam.o  zbar/libzbar.la  -ljpeg -lpthread -lm
libtool: link: x86_64-alt-linux-gcc -Wall -Wno-parentheses -DLOCALEDIR=\"/usr/share/locale\" -pipe -frecord-gcc-switches -Wall -g -O2 -o zbarcam/.libs/zbarcam zbarcam/zbarcam-zbarcam.o  zbar/.libs/libzbar.so -ljpeg -lpthread -lm
make[2]: Leaving directory '/usr/src/RPM/BUILD/zbar-0.23.1'
make[2]: Entering directory '/usr/src/RPM/BUILD/zbar-0.23.1'
x86_64-alt-linux-gcc -DHAVE_CONFIG_H -I. -I./include  -pthread -I/usr/include/gtk-3.0 -I/usr/include/gio-unix-2.0 -I/usr/include/cairo -I/usr/include/pango-1.0 -I/usr/include/harfbuzz -I/usr/include/pango-1.0 -I/usr/include/atk-1.0 -I/usr/include/cairo -I/usr/include/freetype2 -I/usr/include/harfbuzz -I/usr/include/libpng16 -I/usr/include/gdk-pixbuf-2.0 -I/usr/include/libpng16 -I/usr/include/glib-2.0 -I/usr/lib64/glib-2.0/include -I./include -I/usr/include/dbus-1.0 -I/usr/lib64/dbus-1.0/include  -fPIC -Wall -Wno-parentheses -DLOCALEDIR=\"/usr/share/locale\" -pipe -frecord-gcc-switches -Wall -g -O2 -c -o zbarcam/zbarcam_gtk-zbarcam-gtk.o `test -f 'zbarcam/zbarcam-gtk.c' || echo './'`zbarcam/zbarcam-gtk.c
make[2]: Leaving directory '/usr/src/RPM/BUILD/zbar-0.23.1'
make[2]: Entering directory '/usr/src/RPM/BUILD/zbar-0.23.1'
x86_64-alt-linux-gcc -DHAVE_CONFIG_H -I. -I./include  -pthread -I/usr/include/gtk-3.0 -I/usr/include/gio-unix-2.0 -I/usr/include/cairo -I/usr/include/pango-1.0 -I/usr/include/harfbuzz -I/usr/include/pango-1.0 -I/usr/include/atk-1.0 -I/usr/include/cairo -I/usr/include/freetype2 -I/usr/include/harfbuzz -I/usr/include/libpng16 -I/usr/include/gdk-pixbuf-2.0 -I/usr/include/libpng16 -I/usr/include/glib-2.0 -I/usr/lib64/glib-2.0/include -I./include -I/usr/include/dbus-1.0 -I/usr/lib64/dbus-1.0/include  -fPIC -Wall -Wno-parentheses -DLOCALEDIR=\"/usr/share/locale\" -pipe -frecord-gcc-switches -Wall -g -O2 -c -o zbarcam/zbarcam_gtk-scan_video.o `test -f 'zbarcam/scan_video.c' || echo './'`zbarcam/scan_video.c
make[2]: Leaving directory '/usr/src/RPM/BUILD/zbar-0.23.1'
make[2]: Entering directory '/usr/src/RPM/BUILD/zbar-0.23.1'
/bin/sh ./libtool  --tag=CC   --mode=link x86_64-alt-linux-gcc -Wall -Wno-parentheses -DLOCALEDIR=\"/usr/share/locale\" -pipe -frecord-gcc-switches -Wall -g -O2   -o zbarcam/zbarcam-gtk zbarcam/zbarcam_gtk-zbarcam-gtk.o zbarcam/zbarcam_gtk-scan_video.o -lgtk-3 -lgdk-3 -lpangocairo-1.0 -lpango-1.0 -lharfbuzz -latk-1.0 -lcairo-gobject -lcairo -lgdk_pixbuf-2.0 -lgio-2.0 -lgobject-2.0 -lglib-2.0 gtk/libzbargtk.la zbar/libzbar.la  -ljpeg -lpthread -lm
libtool: link: x86_64-alt-linux-gcc -Wall -Wno-parentheses -DLOCALEDIR=\"/usr/share/locale\" -pipe -frecord-gcc-switches -Wall -g -O2 -o zbarcam/.libs/zbarcam-gtk zbarcam/zbarcam_gtk-zbarcam-gtk.o zbarcam/zbarcam_gtk-scan_video.o  -lgtk-3 -lgdk-3 -lpangocairo-1.0 -lpango-1.0 -lharfbuzz -latk-1.0 -lcairo-gobject -lcairo -lgdk_pixbuf-2.0 -lgio-2.0 -lgobject-2.0 -lglib-2.0 gtk/.libs/libzbargtk.so zbar/.libs/libzbar.so -ljpeg -lpthread -lm
make[2]: Leaving directory '/usr/src/RPM/BUILD/zbar-0.23.1'
make[2]: Entering directory '/usr/src/RPM/BUILD/zbar-0.23.1'
x86_64-alt-linux-g++ -DHAVE_CONFIG_H -I. -I./include  -Izbarcam -DQT_WIDGETS_LIB -DQT_X11EXTRAS_LIB -DQT_GUI_LIB -DQT_CORE_LIB -I/usr/include/qt5/QtWidgets -I/usr/include/qt5 -I/usr/include/qt5/QtX11Extras -I/usr/include/qt5 -I/usr/include/qt5/QtGui -I/usr/include/qt5 -I/usr/include/qt5/QtCore -I/usr/include/qt5 -I./include -I/usr/include/dbus-1.0 -I/usr/lib64/dbus-1.0/include  -fPIC -Wall -Wno-parentheses -DLOCALEDIR=\"/usr/share/locale\" -pipe -frecord-gcc-switches -Wall -g -O2 -c -o zbarcam/zbarcam_qt-zbarcam-qt.o `test -f 'zbarcam/zbarcam-qt.cpp' || echo './'`zbarcam/zbarcam-qt.cpp
zbarcam/zbarcam-qt.cpp: In member function 'void ZbarcamQZBar::setEnabled(bool)':
zbarcam/zbarcam-qt.cpp:702:44: warning: 'QString& QString::sprintf(const char*, ...)' is deprecated: Use asprintf(), arg() or QTextStream instead [-Wdeprecated-declarations]
  702 |                             cur_res.max_fps);
      |                                            ^
In file included from /usr/include/qt5/QtCore/qcoreapplication.h:44,
                 from /usr/include/qt5/QtWidgets/qapplication.h:44,
                 from /usr/include/qt5/QtWidgets/QApplication:1,
                 from zbarcam/zbarcam-qt.cpp:25:
/usr/include/qt5/QtCore/qstring.h:393:14: note: declared here
  393 |     QString &sprintf(const char *format, ...) Q_ATTRIBUTE_FORMAT_PRINTF(2, 3);
      |              ^~~~~~~
make[2]: Leaving directory '/usr/src/RPM/BUILD/zbar-0.23.1'
make[2]: Entering directory '/usr/src/RPM/BUILD/zbar-0.23.1'
x86_64-alt-linux-gcc -DHAVE_CONFIG_H -I. -I./include  -Izbarcam -DQT_WIDGETS_LIB -DQT_X11EXTRAS_LIB -DQT_GUI_LIB -DQT_CORE_LIB -I/usr/include/qt5/QtWidgets -I/usr/include/qt5 -I/usr/include/qt5/QtX11Extras -I/usr/include/qt5 -I/usr/include/qt5/QtGui -I/usr/include/qt5 -I/usr/include/qt5/QtCore -I/usr/include/qt5 -I./include -I/usr/include/dbus-1.0 -I/usr/lib64/dbus-1.0/include  -fPIC -Wall -Wno-parentheses -DLOCALEDIR=\"/usr/share/locale\" -pipe -frecord-gcc-switches -Wall -g -O2 -c -o zbarcam/zbarcam_qt-scan_video.o `test -f 'zbarcam/scan_video.c' || echo './'`zbarcam/scan_video.c
make[2]: Leaving directory '/usr/src/RPM/BUILD/zbar-0.23.1'
make[2]: Entering directory '/usr/src/RPM/BUILD/zbar-0.23.1'
/bin/sh ./libtool  --tag=CXX   --mode=compile x86_64-alt-linux-g++ -DHAVE_CONFIG_H -I. -I./include  -Iqt -DQT_WIDGETS_LIB -DQT_X11EXTRAS_LIB -DQT_GUI_LIB -DQT_CORE_LIB -I/usr/include/qt5/QtWidgets -I/usr/include/qt5 -I/usr/include/qt5/QtX11Extras -I/usr/include/qt5 -I/usr/include/qt5/QtGui -I/usr/include/qt5 -I/usr/include/qt5/QtCore -I/usr/include/qt5 -I./include -I/usr/include/dbus-1.0 -I/usr/lib64/dbus-1.0/include  -fPIC -Wall -Wno-parentheses -DLOCALEDIR=\"/usr/share/locale\" -pipe -frecord-gcc-switches -Wall -g -O2 -c -o qt/libzbarqt_la-QZBar.lo `test -f 'qt/QZBar.cpp' || echo './'`qt/QZBar.cpp
libtool: compile:  x86_64-alt-linux-g++ -DHAVE_CONFIG_H -I. -I./include -Iqt -DQT_WIDGETS_LIB -DQT_X11EXTRAS_LIB -DQT_GUI_LIB -DQT_CORE_LIB -I/usr/include/qt5/QtWidgets -I/usr/include/qt5 -I/usr/include/qt5/QtX11Extras -I/usr/include/qt5 -I/usr/include/qt5/QtGui -I/usr/include/qt5 -I/usr/include/qt5/QtCore -I/usr/include/qt5 -I./include -I/usr/include/dbus-1.0 -I/usr/lib64/dbus-1.0/include -fPIC -Wall -Wno-parentheses -DLOCALEDIR=\"/usr/share/locale\" -pipe -frecord-gcc-switches -Wall -g -O2 -c qt/QZBar.cpp  -fPIC -DPIC -o qt/.libs/libzbarqt_la-QZBar.o
libtool: compile:  x86_64-alt-linux-g++ -DHAVE_CONFIG_H -I. -I./include -Iqt -DQT_WIDGETS_LIB -DQT_X11EXTRAS_LIB -DQT_GUI_LIB -DQT_CORE_LIB -I/usr/include/qt5/QtWidgets -I/usr/include/qt5 -I/usr/include/qt5/QtX11Extras -I/usr/include/qt5 -I/usr/include/qt5/QtGui -I/usr/include/qt5 -I/usr/include/qt5/QtCore -I/usr/include/qt5 -I./include -I/usr/include/dbus-1.0 -I/usr/lib64/dbus-1.0/include -fPIC -Wall -Wno-parentheses -DLOCALEDIR=\"/usr/share/locale\" -pipe -frecord-gcc-switches -Wall -g -O2 -c qt/QZBar.cpp -o qt/libzbarqt_la-QZBar.o >/dev/null 2>&1
make[2]: Leaving directory '/usr/src/RPM/BUILD/zbar-0.23.1'
make[2]: Entering directory '/usr/src/RPM/BUILD/zbar-0.23.1'
/bin/sh ./libtool  --tag=CXX   --mode=compile x86_64-alt-linux-g++ -DHAVE_CONFIG_H -I. -I./include  -Iqt -DQT_WIDGETS_LIB -DQT_X11EXTRAS_LIB -DQT_GUI_LIB -DQT_CORE_LIB -I/usr/include/qt5/QtWidgets -I/usr/include/qt5 -I/usr/include/qt5/QtX11Extras -I/usr/include/qt5 -I/usr/include/qt5/QtGui -I/usr/include/qt5 -I/usr/include/qt5/QtCore -I/usr/include/qt5 -I./include -I/usr/include/dbus-1.0 -I/usr/lib64/dbus-1.0/include  -fPIC -Wall -Wno-parentheses -DLOCALEDIR=\"/usr/share/locale\" -pipe -frecord-gcc-switches -Wall -g -O2 -c -o qt/libzbarqt_la-QZBarThread.lo `test -f 'qt/QZBarThread.cpp' || echo './'`qt/QZBarThread.cpp
libtool: compile:  x86_64-alt-linux-g++ -DHAVE_CONFIG_H -I. -I./include -Iqt -DQT_WIDGETS_LIB -DQT_X11EXTRAS_LIB -DQT_GUI_LIB -DQT_CORE_LIB -I/usr/include/qt5/QtWidgets -I/usr/include/qt5 -I/usr/include/qt5/QtX11Extras -I/usr/include/qt5 -I/usr/include/qt5/QtGui -I/usr/include/qt5 -I/usr/include/qt5/QtCore -I/usr/include/qt5 -I./include -I/usr/include/dbus-1.0 -I/usr/lib64/dbus-1.0/include -fPIC -Wall -Wno-parentheses -DLOCALEDIR=\"/usr/share/locale\" -pipe -frecord-gcc-switches -Wall -g -O2 -c qt/QZBarThread.cpp  -fPIC -DPIC -o qt/.libs/libzbarqt_la-QZBarThread.o
libtool: compile:  x86_64-alt-linux-g++ -DHAVE_CONFIG_H -I. -I./include -Iqt -DQT_WIDGETS_LIB -DQT_X11EXTRAS_LIB -DQT_GUI_LIB -DQT_CORE_LIB -I/usr/include/qt5/QtWidgets -I/usr/include/qt5 -I/usr/include/qt5/QtX11Extras -I/usr/include/qt5 -I/usr/include/qt5/QtGui -I/usr/include/qt5 -I/usr/include/qt5/QtCore -I/usr/include/qt5 -I./include -I/usr/include/dbus-1.0 -I/usr/lib64/dbus-1.0/include -fPIC -Wall -Wno-parentheses -DLOCALEDIR=\"/usr/share/locale\" -pipe -frecord-gcc-switches -Wall -g -O2 -c qt/QZBarThread.cpp -o qt/libzbarqt_la-QZBarThread.o >/dev/null 2>&1
make[2]: Leaving directory '/usr/src/RPM/BUILD/zbar-0.23.1'
make[2]: Entering directory '/usr/src/RPM/BUILD/zbar-0.23.1'
/bin/sh ./libtool  --tag=CXX   --mode=compile x86_64-alt-linux-g++ -DHAVE_CONFIG_H -I. -I./include  -Iqt -DQT_WIDGETS_LIB -DQT_X11EXTRAS_LIB -DQT_GUI_LIB -DQT_CORE_LIB -I/usr/include/qt5/QtWidgets -I/usr/include/qt5 -I/usr/include/qt5/QtX11Extras -I/usr/include/qt5 -I/usr/include/qt5/QtGui -I/usr/include/qt5 -I/usr/include/qt5/QtCore -I/usr/include/qt5 -I./include -I/usr/include/dbus-1.0 -I/usr/lib64/dbus-1.0/include  -fPIC -Wall -Wno-parentheses -DLOCALEDIR=\"/usr/share/locale\" -pipe -frecord-gcc-switches -Wall -g -O2 -c -o qt/libzbarqt_la-moc_QZBar.lo `test -f 'qt/moc_QZBar.cpp' || echo './'`qt/moc_QZBar.cpp
libtool: compile:  x86_64-alt-linux-g++ -DHAVE_CONFIG_H -I. -I./include -Iqt -DQT_WIDGETS_LIB -DQT_X11EXTRAS_LIB -DQT_GUI_LIB -DQT_CORE_LIB -I/usr/include/qt5/QtWidgets -I/usr/include/qt5 -I/usr/include/qt5/QtX11Extras -I/usr/include/qt5 -I/usr/include/qt5/QtGui -I/usr/include/qt5 -I/usr/include/qt5/QtCore -I/usr/include/qt5 -I./include -I/usr/include/dbus-1.0 -I/usr/lib64/dbus-1.0/include -fPIC -Wall -Wno-parentheses -DLOCALEDIR=\"/usr/share/locale\" -pipe -frecord-gcc-switches -Wall -g -O2 -c qt/moc_QZBar.cpp  -fPIC -DPIC -o qt/.libs/libzbarqt_la-moc_QZBar.o
libtool: compile:  x86_64-alt-linux-g++ -DHAVE_CONFIG_H -I. -I./include -Iqt -DQT_WIDGETS_LIB -DQT_X11EXTRAS_LIB -DQT_GUI_LIB -DQT_CORE_LIB -I/usr/include/qt5/QtWidgets -I/usr/include/qt5 -I/usr/include/qt5/QtX11Extras -I/usr/include/qt5 -I/usr/include/qt5/QtGui -I/usr/include/qt5 -I/usr/include/qt5/QtCore -I/usr/include/qt5 -I./include -I/usr/include/dbus-1.0 -I/usr/lib64/dbus-1.0/include -fPIC -Wall -Wno-parentheses -DLOCALEDIR=\"/usr/share/locale\" -pipe -frecord-gcc-switches -Wall -g -O2 -c qt/moc_QZBar.cpp -o qt/libzbarqt_la-moc_QZBar.o >/dev/null 2>&1
make[2]: Leaving directory '/usr/src/RPM/BUILD/zbar-0.23.1'
make[2]: Entering directory '/usr/src/RPM/BUILD/zbar-0.23.1'
/bin/sh ./libtool  --tag=CXX   --mode=compile x86_64-alt-linux-g++ -DHAVE_CONFIG_H -I. -I./include  -Iqt -DQT_WIDGETS_LIB -DQT_X11EXTRAS_LIB -DQT_GUI_LIB -DQT_CORE_LIB -I/usr/include/qt5/QtWidgets -I/usr/include/qt5 -I/usr/include/qt5/QtX11Extras -I/usr/include/qt5 -I/usr/include/qt5/QtGui -I/usr/include/qt5 -I/usr/include/qt5/QtCore -I/usr/include/qt5 -I./include -I/usr/include/dbus-1.0 -I/usr/lib64/dbus-1.0/include  -fPIC -Wall -Wno-parentheses -DLOCALEDIR=\"/usr/share/locale\" -pipe -frecord-gcc-switches -Wall -g -O2 -c -o qt/libzbarqt_la-moc_QZBarThread.lo `test -f 'qt/moc_QZBarThread.cpp' || echo './'`qt/moc_QZBarThread.cpp
libtool: compile:  x86_64-alt-linux-g++ -DHAVE_CONFIG_H -I. -I./include -Iqt -DQT_WIDGETS_LIB -DQT_X11EXTRAS_LIB -DQT_GUI_LIB -DQT_CORE_LIB -I/usr/include/qt5/QtWidgets -I/usr/include/qt5 -I/usr/include/qt5/QtX11Extras -I/usr/include/qt5 -I/usr/include/qt5/QtGui -I/usr/include/qt5 -I/usr/include/qt5/QtCore -I/usr/include/qt5 -I./include -I/usr/include/dbus-1.0 -I/usr/lib64/dbus-1.0/include -fPIC -Wall -Wno-parentheses -DLOCALEDIR=\"/usr/share/locale\" -pipe -frecord-gcc-switches -Wall -g -O2 -c qt/moc_QZBarThread.cpp  -fPIC -DPIC -o qt/.libs/libzbarqt_la-moc_QZBarThread.o
libtool: compile:  x86_64-alt-linux-g++ -DHAVE_CONFIG_H -I. -I./include -Iqt -DQT_WIDGETS_LIB -DQT_X11EXTRAS_LIB -DQT_GUI_LIB -DQT_CORE_LIB -I/usr/include/qt5/QtWidgets -I/usr/include/qt5 -I/usr/include/qt5/QtX11Extras -I/usr/include/qt5 -I/usr/include/qt5/QtGui -I/usr/include/qt5 -I/usr/include/qt5/QtCore -I/usr/include/qt5 -I./include -I/usr/include/dbus-1.0 -I/usr/lib64/dbus-1.0/include -fPIC -Wall -Wno-parentheses -DLOCALEDIR=\"/usr/share/locale\" -pipe -frecord-gcc-switches -Wall -g -O2 -c qt/moc_QZBarThread.cpp -o qt/libzbarqt_la-moc_QZBarThread.o >/dev/null 2>&1
make[2]: Leaving directory '/usr/src/RPM/BUILD/zbar-0.23.1'
make[2]: Entering directory '/usr/src/RPM/BUILD/zbar-0.23.1'
/bin/sh ./libtool  --tag=CXX   --mode=link x86_64-alt-linux-g++ -Wall -Wno-parentheses -DLOCALEDIR=\"/usr/share/locale\" -pipe -frecord-gcc-switches -Wall -g -O2 -version-info 1:2:1    -o qt/libzbarqt.la -rpath /usr/lib64 qt/libzbarqt_la-QZBar.lo qt/libzbarqt_la-QZBarThread.lo qt/libzbarqt_la-moc_QZBar.lo qt/libzbarqt_la-moc_QZBarThread.lo -lQt5Widgets -lQt5X11Extras -lQt5Gui -lQt5Core zbar/libzbar.la  -ljpeg -lpthread -lm
libtool: link: x86_64-alt-linux-g++  -fPIC -DPIC -shared -nostdlib /usr/lib64/gcc/x86_64-alt-linux/10/../../../../lib64/crti.o /usr/lib64/gcc/x86_64-alt-linux/10/crtbeginS.o  qt/.libs/libzbarqt_la-QZBar.o qt/.libs/libzbarqt_la-QZBarThread.o qt/.libs/libzbarqt_la-moc_QZBar.o qt/.libs/libzbarqt_la-moc_QZBarThread.o   -Wl,-rpath -Wl,/usr/src/RPM/BUILD/zbar-0.23.1/zbar/.libs -lQt5Widgets -lQt5X11Extras -lQt5Gui -lQt5Core zbar/.libs/libzbar.so -ljpeg -lpthread -L/usr/lib64/gcc/x86_64-alt-linux/10 -L/usr/lib64/gcc/x86_64-alt-linux/10/../../../../lib64 -L/lib/../lib64 -L/usr/lib/../lib64 -L/usr/lib64/gcc/x86_64-alt-linux/10/../../.. -lstdc++ -lm -lc -lgcc_s /usr/lib64/gcc/x86_64-alt-linux/10/crtendS.o /usr/lib64/gcc/x86_64-alt-linux/10/../../../../lib64/crtn.o  -g -O2   -Wl,-soname -Wl,libzbarqt.so.0 -o qt/.libs/libzbarqt.so.0.1.2
libtool: link: (cd "qt/.libs" && rm -f "libzbarqt.so.0" && ln -s "libzbarqt.so.0.1.2" "libzbarqt.so.0")
libtool: link: (cd "qt/.libs" && rm -f "libzbarqt.so" && ln -s "libzbarqt.so.0.1.2" "libzbarqt.so")
libtool: link: ar cr qt/.libs/libzbarqt.a  qt/libzbarqt_la-QZBar.o qt/libzbarqt_la-QZBarThread.o qt/libzbarqt_la-moc_QZBar.o qt/libzbarqt_la-moc_QZBarThread.o
libtool: link: ranlib qt/.libs/libzbarqt.a
libtool: link: ( cd "qt/.libs" && rm -f "libzbarqt.la" && ln -s "../libzbarqt.la" "libzbarqt.la" )
make[2]: Leaving directory '/usr/src/RPM/BUILD/zbar-0.23.1'
make[2]: Entering directory '/usr/src/RPM/BUILD/zbar-0.23.1'
/bin/sh ./libtool  --tag=CXX   --mode=link x86_64-alt-linux-g++ -Wall -Wno-parentheses -DLOCALEDIR=\"/usr/share/locale\" -pipe -frecord-gcc-switches -Wall -g -O2   -o zbarcam/zbarcam-qt zbarcam/zbarcam_qt-zbarcam-qt.o zbarcam/zbarcam_qt-scan_video.o  -lQt5Widgets -lQt5X11Extras -lQt5Gui -lQt5Core qt/libzbarqt.la  -ljpeg -lpthread -lm
libtool: link: x86_64-alt-linux-g++ -Wall -Wno-parentheses -DLOCALEDIR=\"/usr/share/locale\" -pipe -frecord-gcc-switches -Wall -g -O2 -o zbarcam/.libs/zbarcam-qt zbarcam/zbarcam_qt-zbarcam-qt.o zbarcam/zbarcam_qt-scan_video.o  -lQt5Widgets -lQt5X11Extras -lQt5Gui -lQt5Core qt/.libs/libzbarqt.so -ljpeg -lpthread -lm
make[2]: Leaving directory '/usr/src/RPM/BUILD/zbar-0.23.1'
make[2]: Entering directory '/usr/src/RPM/BUILD/zbar-0.23.1'
/bin/sh ./libtool  --tag=CC   --mode=compile x86_64-alt-linux-gcc -DHAVE_CONFIG_H -I. -I./include  -I/usr/include/python3.9 -I/usr/include/python3.9 -Wno-unused-result -Wsign-compare -DNDEBUG -g -fwrapv -O3 -Wall -pipe -frecord-gcc-switches -Wall -g -O3 -I./include -I/usr/include/dbus-1.0 -I/usr/lib64/dbus-1.0/include  -fPIC -Wall -Wno-parentheses -DLOCALEDIR=\"/usr/share/locale\" -pipe -frecord-gcc-switches -Wall -g -O2 -c -o python/zbar_la-zbarmodule.lo `test -f 'python/zbarmodule.c' || echo './'`python/zbarmodule.c
libtool: compile:  x86_64-alt-linux-gcc -DHAVE_CONFIG_H -I. -I./include -I/usr/include/python3.9 -I/usr/include/python3.9 -Wno-unused-result -Wsign-compare -DNDEBUG -g -fwrapv -O3 -Wall -pipe -frecord-gcc-switches -Wall -g -O3 -I./include -I/usr/include/dbus-1.0 -I/usr/lib64/dbus-1.0/include -fPIC -Wall -Wno-parentheses -DLOCALEDIR=\"/usr/share/locale\" -pipe -frecord-gcc-switches -Wall -g -O2 -c python/zbarmodule.c  -fPIC -DPIC -o python/.libs/zbar_la-zbarmodule.o
libtool: compile:  x86_64-alt-linux-gcc -DHAVE_CONFIG_H -I. -I./include -I/usr/include/python3.9 -I/usr/include/python3.9 -Wno-unused-result -Wsign-compare -DNDEBUG -g -fwrapv -O3 -Wall -pipe -frecord-gcc-switches -Wall -g -O3 -I./include -I/usr/include/dbus-1.0 -I/usr/lib64/dbus-1.0/include -fPIC -Wall -Wno-parentheses -DLOCALEDIR=\"/usr/share/locale\" -pipe -frecord-gcc-switches -Wall -g -O2 -c python/zbarmodule.c -o python/zbar_la-zbarmodule.o >/dev/null 2>&1
make[2]: Leaving directory '/usr/src/RPM/BUILD/zbar-0.23.1'
make[2]: Entering directory '/usr/src/RPM/BUILD/zbar-0.23.1'
/bin/sh ./libtool  --tag=CC   --mode=compile x86_64-alt-linux-gcc -DHAVE_CONFIG_H -I. -I./include  -I/usr/include/python3.9 -I/usr/include/python3.9 -Wno-unused-result -Wsign-compare -DNDEBUG -g -fwrapv -O3 -Wall -pipe -frecord-gcc-switches -Wall -g -O3 -I./include -I/usr/include/dbus-1.0 -I/usr/lib64/dbus-1.0/include  -fPIC -Wall -Wno-parentheses -DLOCALEDIR=\"/usr/share/locale\" -pipe -frecord-gcc-switches -Wall -g -O2 -c -o python/zbar_la-enum.lo `test -f 'python/enum.c' || echo './'`python/enum.c
libtool: compile:  x86_64-alt-linux-gcc -DHAVE_CONFIG_H -I. -I./include -I/usr/include/python3.9 -I/usr/include/python3.9 -Wno-unused-result -Wsign-compare -DNDEBUG -g -fwrapv -O3 -Wall -pipe -frecord-gcc-switches -Wall -g -O3 -I./include -I/usr/include/dbus-1.0 -I/usr/lib64/dbus-1.0/include -fPIC -Wall -Wno-parentheses -DLOCALEDIR=\"/usr/share/locale\" -pipe -frecord-gcc-switches -Wall -g -O2 -c python/enum.c  -fPIC -DPIC -o python/.libs/zbar_la-enum.o
libtool: compile:  x86_64-alt-linux-gcc -DHAVE_CONFIG_H -I. -I./include -I/usr/include/python3.9 -I/usr/include/python3.9 -Wno-unused-result -Wsign-compare -DNDEBUG -g -fwrapv -O3 -Wall -pipe -frecord-gcc-switches -Wall -g -O3 -I./include -I/usr/include/dbus-1.0 -I/usr/lib64/dbus-1.0/include -fPIC -Wall -Wno-parentheses -DLOCALEDIR=\"/usr/share/locale\" -pipe -frecord-gcc-switches -Wall -g -O2 -c python/enum.c -o python/zbar_la-enum.o >/dev/null 2>&1
make[2]: Leaving directory '/usr/src/RPM/BUILD/zbar-0.23.1'
make[2]: Entering directory '/usr/src/RPM/BUILD/zbar-0.23.1'
/bin/sh ./libtool  --tag=CC   --mode=compile x86_64-alt-linux-gcc -DHAVE_CONFIG_H -I. -I./include  -I/usr/include/python3.9 -I/usr/include/python3.9 -Wno-unused-result -Wsign-compare -DNDEBUG -g -fwrapv -O3 -Wall -pipe -frecord-gcc-switches -Wall -g -O3 -I./include -I/usr/include/dbus-1.0 -I/usr/lib64/dbus-1.0/include  -fPIC -Wall -Wno-parentheses -DLOCALEDIR=\"/usr/share/locale\" -pipe -frecord-gcc-switches -Wall -g -O2 -c -o python/zbar_la-exception.lo `test -f 'python/exception.c' || echo './'`python/exception.c
libtool: compile:  x86_64-alt-linux-gcc -DHAVE_CONFIG_H -I. -I./include -I/usr/include/python3.9 -I/usr/include/python3.9 -Wno-unused-result -Wsign-compare -DNDEBUG -g -fwrapv -O3 -Wall -pipe -frecord-gcc-switches -Wall -g -O3 -I./include -I/usr/include/dbus-1.0 -I/usr/lib64/dbus-1.0/include -fPIC -Wall -Wno-parentheses -DLOCALEDIR=\"/usr/share/locale\" -pipe -frecord-gcc-switches -Wall -g -O2 -c python/exception.c  -fPIC -DPIC -o python/.libs/zbar_la-exception.o
libtool: compile:  x86_64-alt-linux-gcc -DHAVE_CONFIG_H -I. -I./include -I/usr/include/python3.9 -I/usr/include/python3.9 -Wno-unused-result -Wsign-compare -DNDEBUG -g -fwrapv -O3 -Wall -pipe -frecord-gcc-switches -Wall -g -O3 -I./include -I/usr/include/dbus-1.0 -I/usr/lib64/dbus-1.0/include -fPIC -Wall -Wno-parentheses -DLOCALEDIR=\"/usr/share/locale\" -pipe -frecord-gcc-switches -Wall -g -O2 -c python/exception.c -o python/zbar_la-exception.o >/dev/null 2>&1
make[2]: Leaving directory '/usr/src/RPM/BUILD/zbar-0.23.1'
make[2]: Entering directory '/usr/src/RPM/BUILD/zbar-0.23.1'
/bin/sh ./libtool  --tag=CC   --mode=compile x86_64-alt-linux-gcc -DHAVE_CONFIG_H -I. -I./include  -I/usr/include/python3.9 -I/usr/include/python3.9 -Wno-unused-result -Wsign-compare -DNDEBUG -g -fwrapv -O3 -Wall -pipe -frecord-gcc-switches -Wall -g -O3 -I./include -I/usr/include/dbus-1.0 -I/usr/lib64/dbus-1.0/include  -fPIC -Wall -Wno-parentheses -DLOCALEDIR=\"/usr/share/locale\" -pipe -frecord-gcc-switches -Wall -g -O2 -c -o python/zbar_la-symbol.lo `test -f 'python/symbol.c' || echo './'`python/symbol.c
libtool: compile:  x86_64-alt-linux-gcc -DHAVE_CONFIG_H -I. -I./include -I/usr/include/python3.9 -I/usr/include/python3.9 -Wno-unused-result -Wsign-compare -DNDEBUG -g -fwrapv -O3 -Wall -pipe -frecord-gcc-switches -Wall -g -O3 -I./include -I/usr/include/dbus-1.0 -I/usr/lib64/dbus-1.0/include -fPIC -Wall -Wno-parentheses -DLOCALEDIR=\"/usr/share/locale\" -pipe -frecord-gcc-switches -Wall -g -O2 -c python/symbol.c  -fPIC -DPIC -o python/.libs/zbar_la-symbol.o
libtool: compile:  x86_64-alt-linux-gcc -DHAVE_CONFIG_H -I. -I./include -I/usr/include/python3.9 -I/usr/include/python3.9 -Wno-unused-result -Wsign-compare -DNDEBUG -g -fwrapv -O3 -Wall -pipe -frecord-gcc-switches -Wall -g -O3 -I./include -I/usr/include/dbus-1.0 -I/usr/lib64/dbus-1.0/include -fPIC -Wall -Wno-parentheses -DLOCALEDIR=\"/usr/share/locale\" -pipe -frecord-gcc-switches -Wall -g -O2 -c python/symbol.c -o python/zbar_la-symbol.o >/dev/null 2>&1
make[2]: Leaving directory '/usr/src/RPM/BUILD/zbar-0.23.1'
make[2]: Entering directory '/usr/src/RPM/BUILD/zbar-0.23.1'
/bin/sh ./libtool  --tag=CC   --mode=compile x86_64-alt-linux-gcc -DHAVE_CONFIG_H -I. -I./include  -I/usr/include/python3.9 -I/usr/include/python3.9 -Wno-unused-result -Wsign-compare -DNDEBUG -g -fwrapv -O3 -Wall -pipe -frecord-gcc-switches -Wall -g -O3 -I./include -I/usr/include/dbus-1.0 -I/usr/lib64/dbus-1.0/include  -fPIC -Wall -Wno-parentheses -DLOCALEDIR=\"/usr/share/locale\" -pipe -frecord-gcc-switches -Wall -g -O2 -c -o python/zbar_la-symbolset.lo `test -f 'python/symbolset.c' || echo './'`python/symbolset.c
libtool: compile:  x86_64-alt-linux-gcc -DHAVE_CONFIG_H -I. -I./include -I/usr/include/python3.9 -I/usr/include/python3.9 -Wno-unused-result -Wsign-compare -DNDEBUG -g -fwrapv -O3 -Wall -pipe -frecord-gcc-switches -Wall -g -O3 -I./include -I/usr/include/dbus-1.0 -I/usr/lib64/dbus-1.0/include -fPIC -Wall -Wno-parentheses -DLOCALEDIR=\"/usr/share/locale\" -pipe -frecord-gcc-switches -Wall -g -O2 -c python/symbolset.c  -fPIC -DPIC -o python/.libs/zbar_la-symbolset.o
libtool: compile:  x86_64-alt-linux-gcc -DHAVE_CONFIG_H -I. -I./include -I/usr/include/python3.9 -I/usr/include/python3.9 -Wno-unused-result -Wsign-compare -DNDEBUG -g -fwrapv -O3 -Wall -pipe -frecord-gcc-switches -Wall -g -O3 -I./include -I/usr/include/dbus-1.0 -I/usr/lib64/dbus-1.0/include -fPIC -Wall -Wno-parentheses -DLOCALEDIR=\"/usr/share/locale\" -pipe -frecord-gcc-switches -Wall -g -O2 -c python/symbolset.c -o python/zbar_la-symbolset.o >/dev/null 2>&1
make[2]: Leaving directory '/usr/src/RPM/BUILD/zbar-0.23.1'
make[2]: Entering directory '/usr/src/RPM/BUILD/zbar-0.23.1'
/bin/sh ./libtool  --tag=CC   --mode=compile x86_64-alt-linux-gcc -DHAVE_CONFIG_H -I. -I./include  -I/usr/include/python3.9 -I/usr/include/python3.9 -Wno-unused-result -Wsign-compare -DNDEBUG -g -fwrapv -O3 -Wall -pipe -frecord-gcc-switches -Wall -g -O3 -I./include -I/usr/include/dbus-1.0 -I/usr/lib64/dbus-1.0/include  -fPIC -Wall -Wno-parentheses -DLOCALEDIR=\"/usr/share/locale\" -pipe -frecord-gcc-switches -Wall -g -O2 -c -o python/zbar_la-symboliter.lo `test -f 'python/symboliter.c' || echo './'`python/symboliter.c
libtool: compile:  x86_64-alt-linux-gcc -DHAVE_CONFIG_H -I. -I./include -I/usr/include/python3.9 -I/usr/include/python3.9 -Wno-unused-result -Wsign-compare -DNDEBUG -g -fwrapv -O3 -Wall -pipe -frecord-gcc-switches -Wall -g -O3 -I./include -I/usr/include/dbus-1.0 -I/usr/lib64/dbus-1.0/include -fPIC -Wall -Wno-parentheses -DLOCALEDIR=\"/usr/share/locale\" -pipe -frecord-gcc-switches -Wall -g -O2 -c python/symboliter.c  -fPIC -DPIC -o python/.libs/zbar_la-symboliter.o
libtool: compile:  x86_64-alt-linux-gcc -DHAVE_CONFIG_H -I. -I./include -I/usr/include/python3.9 -I/usr/include/python3.9 -Wno-unused-result -Wsign-compare -DNDEBUG -g -fwrapv -O3 -Wall -pipe -frecord-gcc-switches -Wall -g -O3 -I./include -I/usr/include/dbus-1.0 -I/usr/lib64/dbus-1.0/include -fPIC -Wall -Wno-parentheses -DLOCALEDIR=\"/usr/share/locale\" -pipe -frecord-gcc-switches -Wall -g -O2 -c python/symboliter.c -o python/zbar_la-symboliter.o >/dev/null 2>&1
make[2]: Leaving directory '/usr/src/RPM/BUILD/zbar-0.23.1'
make[2]: Entering directory '/usr/src/RPM/BUILD/zbar-0.23.1'
/bin/sh ./libtool  --tag=CC   --mode=compile x86_64-alt-linux-gcc -DHAVE_CONFIG_H -I. -I./include  -I/usr/include/python3.9 -I/usr/include/python3.9 -Wno-unused-result -Wsign-compare -DNDEBUG -g -fwrapv -O3 -Wall -pipe -frecord-gcc-switches -Wall -g -O3 -I./include -I/usr/include/dbus-1.0 -I/usr/lib64/dbus-1.0/include  -fPIC -Wall -Wno-parentheses -DLOCALEDIR=\"/usr/share/locale\" -pipe -frecord-gcc-switches -Wall -g -O2 -c -o python/zbar_la-image.lo `test -f 'python/image.c' || echo './'`python/image.c
libtool: compile:  x86_64-alt-linux-gcc -DHAVE_CONFIG_H -I. -I./include -I/usr/include/python3.9 -I/usr/include/python3.9 -Wno-unused-result -Wsign-compare -DNDEBUG -g -fwrapv -O3 -Wall -pipe -frecord-gcc-switches -Wall -g -O3 -I./include -I/usr/include/dbus-1.0 -I/usr/lib64/dbus-1.0/include -fPIC -Wall -Wno-parentheses -DLOCALEDIR=\"/usr/share/locale\" -pipe -frecord-gcc-switches -Wall -g -O2 -c python/image.c  -fPIC -DPIC -o python/.libs/zbar_la-image.o
libtool: compile:  x86_64-alt-linux-gcc -DHAVE_CONFIG_H -I. -I./include -I/usr/include/python3.9 -I/usr/include/python3.9 -Wno-unused-result -Wsign-compare -DNDEBUG -g -fwrapv -O3 -Wall -pipe -frecord-gcc-switches -Wall -g -O3 -I./include -I/usr/include/dbus-1.0 -I/usr/lib64/dbus-1.0/include -fPIC -Wall -Wno-parentheses -DLOCALEDIR=\"/usr/share/locale\" -pipe -frecord-gcc-switches -Wall -g -O2 -c python/image.c -o python/zbar_la-image.o >/dev/null 2>&1
make[2]: Leaving directory '/usr/src/RPM/BUILD/zbar-0.23.1'
make[2]: Entering directory '/usr/src/RPM/BUILD/zbar-0.23.1'
/bin/sh ./libtool  --tag=CC   --mode=compile x86_64-alt-linux-gcc -DHAVE_CONFIG_H -I. -I./include  -I/usr/include/python3.9 -I/usr/include/python3.9 -Wno-unused-result -Wsign-compare -DNDEBUG -g -fwrapv -O3 -Wall -pipe -frecord-gcc-switches -Wall -g -O3 -I./include -I/usr/include/dbus-1.0 -I/usr/lib64/dbus-1.0/include  -fPIC -Wall -Wno-parentheses -DLOCALEDIR=\"/usr/share/locale\" -pipe -frecord-gcc-switches -Wall -g -O2 -c -o python/zbar_la-processor.lo `test -f 'python/processor.c' || echo './'`python/processor.c
libtool: compile:  x86_64-alt-linux-gcc -DHAVE_CONFIG_H -I. -I./include -I/usr/include/python3.9 -I/usr/include/python3.9 -Wno-unused-result -Wsign-compare -DNDEBUG -g -fwrapv -O3 -Wall -pipe -frecord-gcc-switches -Wall -g -O3 -I./include -I/usr/include/dbus-1.0 -I/usr/lib64/dbus-1.0/include -fPIC -Wall -Wno-parentheses -DLOCALEDIR=\"/usr/share/locale\" -pipe -frecord-gcc-switches -Wall -g -O2 -c python/processor.c  -fPIC -DPIC -o python/.libs/zbar_la-processor.o
python/processor.c: In function 'processor_new':
python/processor.c:50:5: warning: 'PyEval_InitThreads' is deprecated [-Wdeprecated-declarations]
   50 |     PyEval_InitThreads();
      |     ^~~~~~~~~~~~~~~~~~
In file included from /usr/include/python3.9/Python.h:145,
                 from python/zbarmodule.h:24,
                 from python/processor.c:24:
/usr/include/python3.9/ceval.h:130:37: note: declared here
  130 | Py_DEPRECATED(3.9) PyAPI_FUNC(void) PyEval_InitThreads(void);
      |                                     ^~~~~~~~~~~~~~~~~~
libtool: compile:  x86_64-alt-linux-gcc -DHAVE_CONFIG_H -I. -I./include -I/usr/include/python3.9 -I/usr/include/python3.9 -Wno-unused-result -Wsign-compare -DNDEBUG -g -fwrapv -O3 -Wall -pipe -frecord-gcc-switches -Wall -g -O3 -I./include -I/usr/include/dbus-1.0 -I/usr/lib64/dbus-1.0/include -fPIC -Wall -Wno-parentheses -DLOCALEDIR=\"/usr/share/locale\" -pipe -frecord-gcc-switches -Wall -g -O2 -c python/processor.c -o python/zbar_la-processor.o >/dev/null 2>&1
make[2]: Leaving directory '/usr/src/RPM/BUILD/zbar-0.23.1'
make[2]: Entering directory '/usr/src/RPM/BUILD/zbar-0.23.1'
/bin/sh ./libtool  --tag=CC   --mode=compile x86_64-alt-linux-gcc -DHAVE_CONFIG_H -I. -I./include  -I/usr/include/python3.9 -I/usr/include/python3.9 -Wno-unused-result -Wsign-compare -DNDEBUG -g -fwrapv -O3 -Wall -pipe -frecord-gcc-switches -Wall -g -O3 -I./include -I/usr/include/dbus-1.0 -I/usr/lib64/dbus-1.0/include  -fPIC -Wall -Wno-parentheses -DLOCALEDIR=\"/usr/share/locale\" -pipe -frecord-gcc-switches -Wall -g -O2 -c -o python/zbar_la-imagescanner.lo `test -f 'python/imagescanner.c' || echo './'`python/imagescanner.c
libtool: compile:  x86_64-alt-linux-gcc -DHAVE_CONFIG_H -I. -I./include -I/usr/include/python3.9 -I/usr/include/python3.9 -Wno-unused-result -Wsign-compare -DNDEBUG -g -fwrapv -O3 -Wall -pipe -frecord-gcc-switches -Wall -g -O3 -I./include -I/usr/include/dbus-1.0 -I/usr/lib64/dbus-1.0/include -fPIC -Wall -Wno-parentheses -DLOCALEDIR=\"/usr/share/locale\" -pipe -frecord-gcc-switches -Wall -g -O2 -c python/imagescanner.c  -fPIC -DPIC -o python/.libs/zbar_la-imagescanner.o
libtool: compile:  x86_64-alt-linux-gcc -DHAVE_CONFIG_H -I. -I./include -I/usr/include/python3.9 -I/usr/include/python3.9 -Wno-unused-result -Wsign-compare -DNDEBUG -g -fwrapv -O3 -Wall -pipe -frecord-gcc-switches -Wall -g -O3 -I./include -I/usr/include/dbus-1.0 -I/usr/lib64/dbus-1.0/include -fPIC -Wall -Wno-parentheses -DLOCALEDIR=\"/usr/share/locale\" -pipe -frecord-gcc-switches -Wall -g -O2 -c python/imagescanner.c -o python/zbar_la-imagescanner.o >/dev/null 2>&1
make[2]: Leaving directory '/usr/src/RPM/BUILD/zbar-0.23.1'
make[2]: Entering directory '/usr/src/RPM/BUILD/zbar-0.23.1'
/bin/sh ./libtool  --tag=CC   --mode=compile x86_64-alt-linux-gcc -DHAVE_CONFIG_H -I. -I./include  -I/usr/include/python3.9 -I/usr/include/python3.9 -Wno-unused-result -Wsign-compare -DNDEBUG -g -fwrapv -O3 -Wall -pipe -frecord-gcc-switches -Wall -g -O3 -I./include -I/usr/include/dbus-1.0 -I/usr/lib64/dbus-1.0/include  -fPIC -Wall -Wno-parentheses -DLOCALEDIR=\"/usr/share/locale\" -pipe -frecord-gcc-switches -Wall -g -O2 -c -o python/zbar_la-decoder.lo `test -f 'python/decoder.c' || echo './'`python/decoder.c
libtool: compile:  x86_64-alt-linux-gcc -DHAVE_CONFIG_H -I. -I./include -I/usr/include/python3.9 -I/usr/include/python3.9 -Wno-unused-result -Wsign-compare -DNDEBUG -g -fwrapv -O3 -Wall -pipe -frecord-gcc-switches -Wall -g -O3 -I./include -I/usr/include/dbus-1.0 -I/usr/lib64/dbus-1.0/include -fPIC -Wall -Wno-parentheses -DLOCALEDIR=\"/usr/share/locale\" -pipe -frecord-gcc-switches -Wall -g -O2 -c python/decoder.c  -fPIC -DPIC -o python/.libs/zbar_la-decoder.o
libtool: compile:  x86_64-alt-linux-gcc -DHAVE_CONFIG_H -I. -I./include -I/usr/include/python3.9 -I/usr/include/python3.9 -Wno-unused-result -Wsign-compare -DNDEBUG -g -fwrapv -O3 -Wall -pipe -frecord-gcc-switches -Wall -g -O3 -I./include -I/usr/include/dbus-1.0 -I/usr/lib64/dbus-1.0/include -fPIC -Wall -Wno-parentheses -DLOCALEDIR=\"/usr/share/locale\" -pipe -frecord-gcc-switches -Wall -g -O2 -c python/decoder.c -o python/zbar_la-decoder.o >/dev/null 2>&1
make[2]: Leaving directory '/usr/src/RPM/BUILD/zbar-0.23.1'
make[2]: Entering directory '/usr/src/RPM/BUILD/zbar-0.23.1'
/bin/sh ./libtool  --tag=CC   --mode=compile x86_64-alt-linux-gcc -DHAVE_CONFIG_H -I. -I./include  -I/usr/include/python3.9 -I/usr/include/python3.9 -Wno-unused-result -Wsign-compare -DNDEBUG -g -fwrapv -O3 -Wall -pipe -frecord-gcc-switches -Wall -g -O3 -I./include -I/usr/include/dbus-1.0 -I/usr/lib64/dbus-1.0/include  -fPIC -Wall -Wno-parentheses -DLOCALEDIR=\"/usr/share/locale\" -pipe -frecord-gcc-switches -Wall -g -O2 -c -o python/zbar_la-scanner.lo `test -f 'python/scanner.c' || echo './'`python/scanner.c
libtool: compile:  x86_64-alt-linux-gcc -DHAVE_CONFIG_H -I. -I./include -I/usr/include/python3.9 -I/usr/include/python3.9 -Wno-unused-result -Wsign-compare -DNDEBUG -g -fwrapv -O3 -Wall -pipe -frecord-gcc-switches -Wall -g -O3 -I./include -I/usr/include/dbus-1.0 -I/usr/lib64/dbus-1.0/include -fPIC -Wall -Wno-parentheses -DLOCALEDIR=\"/usr/share/locale\" -pipe -frecord-gcc-switches -Wall -g -O2 -c python/scanner.c  -fPIC -DPIC -o python/.libs/zbar_la-scanner.o
libtool: compile:  x86_64-alt-linux-gcc -DHAVE_CONFIG_H -I. -I./include -I/usr/include/python3.9 -I/usr/include/python3.9 -Wno-unused-result -Wsign-compare -DNDEBUG -g -fwrapv -O3 -Wall -pipe -frecord-gcc-switches -Wall -g -O3 -I./include -I/usr/include/dbus-1.0 -I/usr/lib64/dbus-1.0/include -fPIC -Wall -Wno-parentheses -DLOCALEDIR=\"/usr/share/locale\" -pipe -frecord-gcc-switches -Wall -g -O2 -c python/scanner.c -o python/zbar_la-scanner.o >/dev/null 2>&1
make[2]: Leaving directory '/usr/src/RPM/BUILD/zbar-0.23.1'
make[2]: Entering directory '/usr/src/RPM/BUILD/zbar-0.23.1'
/bin/sh ./libtool  --tag=CC   --mode=link x86_64-alt-linux-gcc -Wall -Wno-parentheses -DLOCALEDIR=\"/usr/share/locale\" -pipe -frecord-gcc-switches -Wall -g -O2 -shared -module -avoid-version -export-dynamic -export-symbols-regex '(initzbar|PyInit_zbar)'  -o python/zbar.la -rpath /usr/lib64/python3/site-packages python/zbar_la-zbarmodule.lo python/zbar_la-enum.lo python/zbar_la-exception.lo python/zbar_la-symbol.lo python/zbar_la-symbolset.lo python/zbar_la-symboliter.lo python/zbar_la-image.lo python/zbar_la-processor.lo python/zbar_la-imagescanner.lo python/zbar_la-decoder.lo python/zbar_la-scanner.lo  zbar/libzbar.la  -ljpeg -lpthread -lm
libtool: link: /usr/bin/nm -B  python/.libs/zbar_la-zbarmodule.o python/.libs/zbar_la-enum.o python/.libs/zbar_la-exception.o python/.libs/zbar_la-symbol.o python/.libs/zbar_la-symbolset.o python/.libs/zbar_la-symboliter.o python/.libs/zbar_la-image.o python/.libs/zbar_la-processor.o python/.libs/zbar_la-imagescanner.o python/.libs/zbar_la-decoder.o python/.libs/zbar_la-scanner.o   | sed -n -e 's/^.*[	 ]\([ABCDGIRSTW][ABCDGIRSTW]*\)[	 ][	 ]*\([_A-Za-z][_A-Za-z0-9]*\)$/\1 \2 \2/p' | sed '/ __gnu_lto/d' | /bin/sed 's/.* //' | sort | uniq > python/.libs/zbar.exp
libtool: link: /bin/grep -E -e "(initzbar|PyInit_zbar)" "python/.libs/zbar.exp" > "python/.libs/zbar.expT"
libtool: link: mv -f "python/.libs/zbar.expT" "python/.libs/zbar.exp"
libtool: link: echo "{ global:" > python/.libs/zbar.ver
libtool: link:  cat python/.libs/zbar.exp | sed -e "s/\(.*\)/\1;/" >> python/.libs/zbar.ver
libtool: link:  echo "local: *; };" >> python/.libs/zbar.ver
libtool: link:  	 if test -r zbar-altlinux.ver; then cp zbar-altlinux.ver python/.libs/zbar.ver; fi
libtool: link:  x86_64-alt-linux-gcc -shared  -fPIC -DPIC  python/.libs/zbar_la-zbarmodule.o python/.libs/zbar_la-enum.o python/.libs/zbar_la-exception.o python/.libs/zbar_la-symbol.o python/.libs/zbar_la-symbolset.o python/.libs/zbar_la-symboliter.o python/.libs/zbar_la-image.o python/.libs/zbar_la-processor.o python/.libs/zbar_la-imagescanner.o python/.libs/zbar_la-decoder.o python/.libs/zbar_la-scanner.o   -Wl,-rpath -Wl,/usr/src/RPM/BUILD/zbar-0.23.1/zbar/.libs zbar/.libs/libzbar.so -ljpeg -lpthread -lm  -g -O2   -Wl,-soname -Wl,zbar.so -Wl,-version-script -Wl,python/.libs/zbar.ver -o python/.libs/zbar.so
libtool: link: ( cd "python/.libs" && rm -f "zbar.la" && ln -s "../zbar.la" "zbar.la" )
make[2]: Leaving directory '/usr/src/RPM/BUILD/zbar-0.23.1'
make[2]: Entering directory '/usr/src/RPM/BUILD/zbar-0.23.1'
xmlto --searchpath /usr/src/RPM/BUILD/zbar-0.23.1/doc -m /usr/src/RPM/BUILD/zbar-0.23.1/doc/style.xsl --skip-validation  -o doc/man man doc/manual.xml
Note: Writing zbarcam.1
Note: Writing zbarimg.1
make[2]: Leaving directory '/usr/src/RPM/BUILD/zbar-0.23.1'
+ exit 0
Executing(%install): /bin/sh -e /usr/src/tmp/rpm-tmp.80752
+ umask 022
+ /bin/mkdir -p /usr/src/RPM/BUILD
+ cd /usr/src/RPM/BUILD
+ /bin/chmod -Rf u+rwX -- /usr/src/tmp/zbar-buildroot
+ :
+ /bin/rm -rf -- /usr/src/tmp/zbar-buildroot
+ PATH=/usr/libexec/rpm-build:/usr/src/bin:/bin:/usr/bin:/usr/X11R6/bin:/usr/games
+ cd zbar-0.23.1
+ make 'INSTALL=/usr/libexec/rpm-build/install -p' DESTDIR=/usr/src/tmp/zbar-buildroot install
make: Entering directory '/usr/src/RPM/BUILD/zbar-0.23.1'
make  install-recursive
make[1]: Entering directory '/usr/src/RPM/BUILD/zbar-0.23.1'
Making install in zbar
make[2]: Entering directory '/usr/src/RPM/BUILD/zbar-0.23.1/zbar'
make[3]: Entering directory '/usr/src/RPM/BUILD/zbar-0.23.1/zbar'
 /bin/mkdir -p '/usr/src/tmp/zbar-buildroot/usr/lib64'
 /bin/sh ../libtool   --mode=install /usr/libexec/rpm-build/install -p   libzbar.la '/usr/src/tmp/zbar-buildroot/usr/lib64'
libtool: install: /usr/libexec/rpm-build/install -p .libs/libzbar.so.0.3.0 /usr/src/tmp/zbar-buildroot/usr/lib64/libzbar.so.0.3.0
libtool: install: (cd /usr/src/tmp/zbar-buildroot/usr/lib64 && { ln -s -f libzbar.so.0.3.0 libzbar.so.0 || { rm -f libzbar.so.0 && ln -s libzbar.so.0.3.0 libzbar.so.0; }; })
libtool: install: (cd /usr/src/tmp/zbar-buildroot/usr/lib64 && { ln -s -f libzbar.so.0.3.0 libzbar.so || { rm -f libzbar.so && ln -s libzbar.so.0.3.0 libzbar.so; }; })
libtool: install: /usr/libexec/rpm-build/install -p .libs/libzbar.lai /usr/src/tmp/zbar-buildroot/usr/lib64/libzbar.la
libtool: install: /usr/libexec/rpm-build/install -p .libs/libzbar.a /usr/src/tmp/zbar-buildroot/usr/lib64/libzbar.a
libtool: install: chmod 644 /usr/src/tmp/zbar-buildroot/usr/lib64/libzbar.a
libtool: install: ranlib /usr/src/tmp/zbar-buildroot/usr/lib64/libzbar.a
libtool: warning: remember to run 'libtool --finish /usr/lib64'
make[3]: Nothing to be done for 'install-data-am'.
make[3]: Leaving directory '/usr/src/RPM/BUILD/zbar-0.23.1/zbar'
make[2]: Leaving directory '/usr/src/RPM/BUILD/zbar-0.23.1/zbar'
Making install in po
make[2]: Entering directory '/usr/src/RPM/BUILD/zbar-0.23.1/po'
installing pt_BR.gmo as /usr/src/tmp/zbar-buildroot/usr/share/locale/pt_BR/LC_MESSAGES/zbar.mo
if test "zbar" = "gettext-tools"; then \
  /bin/mkdir -p /usr/src/tmp/zbar-buildroot/usr/share/gettext/po; \
  for file in Makefile.in.in remove-potcdate.sin quot.sed boldquot.sed en@quot.header en@boldquot.header insert-header.sin Rules-quot   Makevars.template; do \
    /usr/libexec/rpm-build/install -p -m 644 ./$file \
		    /usr/src/tmp/zbar-buildroot/usr/share/gettext/po/$file; \
  done; \
  for file in Makevars; do \
    rm -f /usr/src/tmp/zbar-buildroot/usr/share/gettext/po/$file; \
  done; \
else \
  : ; \
fi
make[2]: Leaving directory '/usr/src/RPM/BUILD/zbar-0.23.1/po'
Making install in gtk
make[2]: Entering directory '/usr/src/RPM/BUILD/zbar-0.23.1/gtk'
make  install-am
make[3]: Entering directory '/usr/src/RPM/BUILD/zbar-0.23.1/gtk'
make[4]: Entering directory '/usr/src/RPM/BUILD/zbar-0.23.1/gtk'
 /bin/mkdir -p '/usr/src/tmp/zbar-buildroot/usr/lib64'
 /bin/sh ../libtool   --mode=install /usr/libexec/rpm-build/install -p   libzbargtk.la '/usr/src/tmp/zbar-buildroot/usr/lib64'
libtool: warning: relinking 'libzbargtk.la'
libtool: install: (cd /usr/src/RPM/BUILD/zbar-0.23.1/gtk; /bin/sh "/usr/src/RPM/BUILD/zbar-0.23.1/libtool"  --tag CC --mode=relink x86_64-alt-linux-gcc -Wall -Wno-parentheses -pipe -frecord-gcc-switches -Wall -g -O2 -version-info 0:2:0 -export-symbols-regex "^zbar_.*" -no-undefined -o libzbargtk.la -rpath /usr/lib64 libzbargtk_la-zbargtk.lo libzbargtk_la-zbarmarshal.lo -lgtk-3 -lgdk-3 -lpangocairo-1.0 -lpango-1.0 -lharfbuzz -latk-1.0 -lcairo-gobject -lcairo -lgdk_pixbuf-2.0 -lgio-2.0 -lgobject-2.0 -lglib-2.0 ../zbar/libzbar.la -ljpeg -lpthread -lm -inst-prefix-dir /usr/src/tmp/zbar-buildroot)
libtool: relink: /usr/bin/nm -B  .libs/libzbargtk_la-zbargtk.o .libs/libzbargtk_la-zbarmarshal.o   | sed -n -e 's/^.*[	 ]\([ABCDGIRSTW][ABCDGIRSTW]*\)[	 ][	 ]*\([_A-Za-z][_A-Za-z0-9]*\)$/\1 \2 \2/p' | sed '/ __gnu_lto/d' | /bin/sed 's/.* //' | sort | uniq > .libs/libzbargtk.exp
libtool: relink: /bin/grep -E -e "^zbar_.*" ".libs/libzbargtk.exp" > ".libs/libzbargtk.expT"
libtool: relink: mv -f ".libs/libzbargtk.expT" ".libs/libzbargtk.exp"
libtool: relink: echo "{ global:" > .libs/libzbargtk.ver
libtool: relink:  cat .libs/libzbargtk.exp | sed -e "s/\(.*\)/\1;/" >> .libs/libzbargtk.ver
libtool: relink:  echo "local: *; };" >> .libs/libzbargtk.ver
libtool: relink:  	 if test -r libzbargtk-altlinux.ver; then cp libzbargtk-altlinux.ver .libs/libzbargtk.ver; fi
libtool: relink:  x86_64-alt-linux-gcc -shared  -fPIC -DPIC  .libs/libzbargtk_la-zbargtk.o .libs/libzbargtk_la-zbarmarshal.o   -lgtk-3 -lgdk-3 -lpangocairo-1.0 -lpango-1.0 -lharfbuzz -latk-1.0 -lcairo-gobject -lcairo -lgdk_pixbuf-2.0 -lgio-2.0 -lgobject-2.0 -lglib-2.0 -L/usr/src/tmp/zbar-buildroot/usr/lib64 -L/usr/lib64 -lzbar -ljpeg -lpthread -lm  -g -O2   -Wl,-soname -Wl,libzbargtk.so.0 -Wl,-version-script -Wl,.libs/libzbargtk.ver -o .libs/libzbargtk.so.0.0.2
libtool: install: /usr/libexec/rpm-build/install -p .libs/libzbargtk.so.0.0.2T /usr/src/tmp/zbar-buildroot/usr/lib64/libzbargtk.so.0.0.2
libtool: install: (cd /usr/src/tmp/zbar-buildroot/usr/lib64 && { ln -s -f libzbargtk.so.0.0.2 libzbargtk.so.0 || { rm -f libzbargtk.so.0 && ln -s libzbargtk.so.0.0.2 libzbargtk.so.0; }; })
libtool: install: (cd /usr/src/tmp/zbar-buildroot/usr/lib64 && { ln -s -f libzbargtk.so.0.0.2 libzbargtk.so || { rm -f libzbargtk.so && ln -s libzbargtk.so.0.0.2 libzbargtk.so; }; })
libtool: install: /usr/libexec/rpm-build/install -p .libs/libzbargtk.lai /usr/src/tmp/zbar-buildroot/usr/lib64/libzbargtk.la
libtool: install: /usr/libexec/rpm-build/install -p .libs/libzbargtk.a /usr/src/tmp/zbar-buildroot/usr/lib64/libzbargtk.a
libtool: install: chmod 644 /usr/src/tmp/zbar-buildroot/usr/lib64/libzbargtk.a
libtool: install: ranlib /usr/src/tmp/zbar-buildroot/usr/lib64/libzbargtk.a
libtool: warning: remember to run 'libtool --finish /usr/lib64'
make[4]: Leaving directory '/usr/src/RPM/BUILD/zbar-0.23.1/gtk'
make[3]: Leaving directory '/usr/src/RPM/BUILD/zbar-0.23.1/gtk'
make[2]: Leaving directory '/usr/src/RPM/BUILD/zbar-0.23.1/gtk'
Making install in .
make[2]: Entering directory '/usr/src/RPM/BUILD/zbar-0.23.1'
make[3]: Entering directory '/usr/src/RPM/BUILD/zbar-0.23.1'
 /bin/mkdir -p '/usr/src/tmp/zbar-buildroot/usr/lib64'
 /bin/sh ./libtool   --mode=install /usr/libexec/rpm-build/install -p   qt/libzbarqt.la '/usr/src/tmp/zbar-buildroot/usr/lib64'
libtool: warning: relinking 'qt/libzbarqt.la'
libtool: install: (cd /usr/src/RPM/BUILD/zbar-0.23.1; /bin/sh "/usr/src/RPM/BUILD/zbar-0.23.1/libtool"  --tag CXX --mode=relink x86_64-alt-linux-g++ -Wall -Wno-parentheses -DLOCALEDIR=\"/usr/share/locale\" -pipe -frecord-gcc-switches -Wall -g -O2 -version-info 1:2:1 -o qt/libzbarqt.la -rpath /usr/lib64 qt/libzbarqt_la-QZBar.lo qt/libzbarqt_la-QZBarThread.lo qt/libzbarqt_la-moc_QZBar.lo qt/libzbarqt_la-moc_QZBarThread.lo -lQt5Widgets -lQt5X11Extras -lQt5Gui -lQt5Core zbar/libzbar.la -ljpeg -lpthread -lm -inst-prefix-dir /usr/src/tmp/zbar-buildroot)
libtool: relink: x86_64-alt-linux-g++  -fPIC -DPIC -shared -nostdlib /usr/lib64/gcc/x86_64-alt-linux/10/../../../../lib64/crti.o /usr/lib64/gcc/x86_64-alt-linux/10/crtbeginS.o  qt/.libs/libzbarqt_la-QZBar.o qt/.libs/libzbarqt_la-QZBarThread.o qt/.libs/libzbarqt_la-moc_QZBar.o qt/.libs/libzbarqt_la-moc_QZBarThread.o   -lQt5Widgets -lQt5X11Extras -lQt5Gui -lQt5Core -L/usr/src/tmp/zbar-buildroot/usr/lib64 -L/usr/lib64 -lzbar -ljpeg -lpthread -L/usr/lib64/gcc/x86_64-alt-linux/10 -L/usr/lib64/gcc/x86_64-alt-linux/10/../../../../lib64 -L/lib/../lib64 -L/usr/lib/../lib64 -L/usr/lib64/gcc/x86_64-alt-linux/10/../../.. -lstdc++ -lm -lc -lgcc_s /usr/lib64/gcc/x86_64-alt-linux/10/crtendS.o /usr/lib64/gcc/x86_64-alt-linux/10/../../../../lib64/crtn.o  -g -O2   -Wl,-soname -Wl,libzbarqt.so.0 -o qt/.libs/libzbarqt.so.0.1.2
libtool: install: /usr/libexec/rpm-build/install -p qt/.libs/libzbarqt.so.0.1.2T /usr/src/tmp/zbar-buildroot/usr/lib64/libzbarqt.so.0.1.2
libtool: install: (cd /usr/src/tmp/zbar-buildroot/usr/lib64 && { ln -s -f libzbarqt.so.0.1.2 libzbarqt.so.0 || { rm -f libzbarqt.so.0 && ln -s libzbarqt.so.0.1.2 libzbarqt.so.0; }; })
libtool: install: (cd /usr/src/tmp/zbar-buildroot/usr/lib64 && { ln -s -f libzbarqt.so.0.1.2 libzbarqt.so || { rm -f libzbarqt.so && ln -s libzbarqt.so.0.1.2 libzbarqt.so; }; })
libtool: install: /usr/libexec/rpm-build/install -p qt/.libs/libzbarqt.lai /usr/src/tmp/zbar-buildroot/usr/lib64/libzbarqt.la
libtool: install: /usr/libexec/rpm-build/install -p qt/.libs/libzbarqt.a /usr/src/tmp/zbar-buildroot/usr/lib64/libzbarqt.a
libtool: install: chmod 644 /usr/src/tmp/zbar-buildroot/usr/lib64/libzbarqt.a
libtool: install: ranlib /usr/src/tmp/zbar-buildroot/usr/lib64/libzbarqt.a
libtool: warning: remember to run 'libtool --finish /usr/lib64'
 /bin/mkdir -p '/usr/src/tmp/zbar-buildroot/usr/bin'
  /bin/sh ./libtool   --mode=install /usr/libexec/rpm-build/install -p zbarimg/zbarimg zbarcam/zbarcam zbarcam/zbarcam-gtk zbarcam/zbarcam-qt '/usr/src/tmp/zbar-buildroot/usr/bin'
libtool: warning: 'zbar/libzbar.la' has not been installed in '/usr/lib64'
libtool: install: /usr/libexec/rpm-build/install -p zbarimg/.libs/zbarimg /usr/src/tmp/zbar-buildroot/usr/bin/zbarimg
libtool: warning: 'zbar/libzbar.la' has not been installed in '/usr/lib64'
libtool: install: /usr/libexec/rpm-build/install -p zbarcam/.libs/zbarcam /usr/src/tmp/zbar-buildroot/usr/bin/zbarcam
libtool: warning: 'gtk/libzbargtk.la' has not been installed in '/usr/lib64'
libtool: warning: 'zbar/libzbar.la' has not been installed in '/usr/lib64'
libtool: install: /usr/libexec/rpm-build/install -p zbarcam/.libs/zbarcam-gtk /usr/src/tmp/zbar-buildroot/usr/bin/zbarcam-gtk
libtool: warning: 'qt/libzbarqt.la' has not been installed in '/usr/lib64'
libtool: install: /usr/libexec/rpm-build/install -p zbarcam/.libs/zbarcam-qt /usr/src/tmp/zbar-buildroot/usr/bin/zbarcam-qt
 /bin/mkdir -p '/usr/src/tmp/zbar-buildroot/usr/lib64/python3/site-packages'
 /bin/sh ./libtool   --mode=install /usr/libexec/rpm-build/install -p   python/zbar.la '/usr/src/tmp/zbar-buildroot/usr/lib64/python3/site-packages'
libtool: warning: relinking 'python/zbar.la'
libtool: install: (cd /usr/src/RPM/BUILD/zbar-0.23.1; /bin/sh "/usr/src/RPM/BUILD/zbar-0.23.1/libtool"  --tag CC --mode=relink x86_64-alt-linux-gcc -Wall -Wno-parentheses -DLOCALEDIR=\"/usr/share/locale\" -pipe -frecord-gcc-switches -Wall -g -O2 -shared -module -avoid-version -export-dynamic -export-symbols-regex "(initzbar|PyInit_zbar)" -o python/zbar.la -rpath /usr/lib64/python3/site-packages python/zbar_la-zbarmodule.lo python/zbar_la-enum.lo python/zbar_la-exception.lo python/zbar_la-symbol.lo python/zbar_la-symbolset.lo python/zbar_la-symboliter.lo python/zbar_la-image.lo python/zbar_la-processor.lo python/zbar_la-imagescanner.lo python/zbar_la-decoder.lo python/zbar_la-scanner.lo zbar/libzbar.la -ljpeg -lpthread -lm -inst-prefix-dir /usr/src/tmp/zbar-buildroot)
libtool: relink: /usr/bin/nm -B  python/.libs/zbar_la-zbarmodule.o python/.libs/zbar_la-enum.o python/.libs/zbar_la-exception.o python/.libs/zbar_la-symbol.o python/.libs/zbar_la-symbolset.o python/.libs/zbar_la-symboliter.o python/.libs/zbar_la-image.o python/.libs/zbar_la-processor.o python/.libs/zbar_la-imagescanner.o python/.libs/zbar_la-decoder.o python/.libs/zbar_la-scanner.o   | sed -n -e 's/^.*[	 ]\([ABCDGIRSTW][ABCDGIRSTW]*\)[	 ][	 ]*\([_A-Za-z][_A-Za-z0-9]*\)$/\1 \2 \2/p' | sed '/ __gnu_lto/d' | /bin/sed 's/.* //' | sort | uniq > python/.libs/zbar.exp
libtool: relink: /bin/grep -E -e "(initzbar|PyInit_zbar)" "python/.libs/zbar.exp" > "python/.libs/zbar.expT"
libtool: relink: mv -f "python/.libs/zbar.expT" "python/.libs/zbar.exp"
libtool: relink: echo "{ global:" > python/.libs/zbar.ver
libtool: relink:  cat python/.libs/zbar.exp | sed -e "s/\(.*\)/\1;/" >> python/.libs/zbar.ver
libtool: relink:  echo "local: *; };" >> python/.libs/zbar.ver
libtool: relink:  	 if test -r zbar-altlinux.ver; then cp zbar-altlinux.ver python/.libs/zbar.ver; fi
libtool: relink:  x86_64-alt-linux-gcc -shared  -fPIC -DPIC  python/.libs/zbar_la-zbarmodule.o python/.libs/zbar_la-enum.o python/.libs/zbar_la-exception.o python/.libs/zbar_la-symbol.o python/.libs/zbar_la-symbolset.o python/.libs/zbar_la-symboliter.o python/.libs/zbar_la-image.o python/.libs/zbar_la-processor.o python/.libs/zbar_la-imagescanner.o python/.libs/zbar_la-decoder.o python/.libs/zbar_la-scanner.o   -L/usr/src/tmp/zbar-buildroot/usr/lib64 -L/usr/lib64 -lzbar -ljpeg -lpthread -lm  -g -O2   -Wl,-soname -Wl,zbar.so -Wl,-version-script -Wl,python/.libs/zbar.ver -o python/.libs/zbar.so
libtool: install: /usr/libexec/rpm-build/install -p python/.libs/zbar.soT /usr/src/tmp/zbar-buildroot/usr/lib64/python3/site-packages/zbar.so
libtool: install: /usr/libexec/rpm-build/install -p python/.libs/zbar.lai /usr/src/tmp/zbar-buildroot/usr/lib64/python3/site-packages/zbar.la
libtool: warning: remember to run 'libtool --finish /usr/lib64/python3/site-packages'
 /bin/mkdir -p '/usr/src/tmp/zbar-buildroot/etc/dbus-1/system.d'
 /usr/libexec/rpm-build/install -p -m 644 ./dbus/org.linuxtv.Zbar.conf '/usr/src/tmp/zbar-buildroot/etc/dbus-1/system.d'
 /bin/mkdir -p '/usr/src/tmp/zbar-buildroot/usr/share/doc/zbar'
 /usr/libexec/rpm-build/install -p -m 644 COPYING HACKING.md INSTALL.md LICENSE.md NEWS.md README.md TODO.md ABOUT-NLS '/usr/src/tmp/zbar-buildroot/usr/share/doc/zbar'
 /bin/mkdir -p '/usr/src/tmp/zbar-buildroot/usr/include'
 /usr/libexec/rpm-build/install -p -m 644 include/zbar.h '/usr/src/tmp/zbar-buildroot/usr/include'
 /bin/mkdir -p '/usr/src/tmp/zbar-buildroot/usr/share/man/man1'
 /usr/libexec/rpm-build/install -p -m 644 doc/man/zbarimg.1 doc/man/zbarcam.1 '/usr/src/tmp/zbar-buildroot/usr/share/man/man1'
 /bin/mkdir -p '/usr/src/tmp/zbar-buildroot/usr/lib64/pkgconfig'
 /usr/libexec/rpm-build/install -p -m 644 zbar.pc zbar-gtk.pc zbar-qt.pc '/usr/src/tmp/zbar-buildroot/usr/lib64/pkgconfig'
 /bin/mkdir -p '/usr/src/tmp/zbar-buildroot/usr/include/zbar'
 /usr/libexec/rpm-build/install -p -m 644 include/zbar/Scanner.h include/zbar/Decoder.h include/zbar/Exception.h include/zbar/Symbol.h include/zbar/Image.h include/zbar/ImageScanner.h include/zbar/Video.h include/zbar/Window.h include/zbar/Processor.h include/zbar/zbargtk.h include/zbar/QZBar.h include/zbar/QZBarImage.h '/usr/src/tmp/zbar-buildroot/usr/include/zbar'
make[3]: Leaving directory '/usr/src/RPM/BUILD/zbar-0.23.1'
make[2]: Leaving directory '/usr/src/RPM/BUILD/zbar-0.23.1'
make[1]: Leaving directory '/usr/src/RPM/BUILD/zbar-0.23.1'
make: Leaving directory '/usr/src/RPM/BUILD/zbar-0.23.1'
+ /usr/lib/rpm/brp-alt
Cleaning files in /usr/src/tmp/zbar-buildroot (auto)
removed './usr/lib64/libzbarqt.la'
removed './usr/lib64/libzbargtk.la'
removed './usr/lib64/libzbar.la'
mode of './usr/lib64/python3/site-packages/zbar.so' changed from 0755 (rwxr-xr-x) to 0644 (rw-r--r--)
mode of './usr/lib64/libzbarqt.so.0.1.2' changed from 0755 (rwxr-xr-x) to 0644 (rw-r--r--)
mode of './usr/lib64/libzbargtk.so.0.0.2' changed from 0755 (rwxr-xr-x) to 0644 (rw-r--r--)
mode of './usr/lib64/libzbar.so.0.3.0' changed from 0755 (rwxr-xr-x) to 0644 (rw-r--r--)
Verifying and fixing files in /usr/src/tmp/zbar-buildroot (binconfig,pkgconfig,libtool,desktop,gnuconfig)
/usr/lib64/pkgconfig/zbar-qt.pc: Cflags: '-I${includedir}' --> ''
/usr/lib64/pkgconfig/zbar-qt.pc: Libs: '-L${libdir} -lzbarqt' --> '-lzbarqt'
/usr/lib64/pkgconfig/zbar-gtk.pc: Cflags: '-I${includedir}' --> ''
/usr/lib64/pkgconfig/zbar-gtk.pc: Libs: '-L${libdir} -lzbargtk' --> '-lzbargtk'
/usr/lib64/pkgconfig/zbar.pc: Cflags: '-I${includedir}' --> ''
/usr/lib64/pkgconfig/zbar.pc: Libs: '-L${libdir} -lzbar' --> '-lzbar'
/usr/lib64/python3/site-packages/zbar.la: dependency_libs: ' /usr/lib64/libzbar.la -ldbus-1 -lv4l2 -lSM -lICE -lX11 -lXv -ljpeg -lpthread -lm' --> '/usr/lib64/libzbar.la -ldbus-1 -lv4l2 -lSM -lICE -lX11 -lXv -ljpeg -lpthread -lm'
Checking contents of files in /usr/src/tmp/zbar-buildroot/ (default)
Compressing files in /usr/src/tmp/zbar-buildroot (auto)
Adjusting library links in /usr/src/tmp/zbar-buildroot
./usr/lib64: (from <cmdline>:0)
	libzbar.so.0 -> libzbar.so.0.3.0
	libzbargtk.so.0 -> libzbargtk.so.0.0.2
	libzbarqt.so.0 -> libzbarqt.so.0.1.2
Verifying ELF objects in /usr/src/tmp/zbar-buildroot (arch=normal,fhs=normal,lfs=relaxed,lint=relaxed,rpath=normal,stack=normal,textrel=normal,unresolved=normal)
Hardlinking identical .pyc and .opt-?.pyc files
Hardlinking identical .pyc and .pyo files
Processing files: zbar-0.23.1-alt2
Finding Provides (using /usr/lib/rpm/find-provides)
Executing: /bin/sh -e /usr/src/tmp/rpm-tmp.T9ER35
find-provides: running scripts (alternatives,debuginfo,gir,lib,pam,perl,pkgconfig,python,python3,shell,typelib)
Finding Requires (using /usr/lib/rpm/find-requires)
Executing: /bin/sh -e /usr/src/tmp/rpm-tmp.v2Vnu3
find-requires: running scripts (cpp,debuginfo,files,gir-js,gir-python,gir,lib,pam,perl,pkgconfig,pkgconfiglib,python,python3,rpmlib,shebang,shell,static,symlinks,systemd-services,typelib)
Requires: /lib64/ld-linux-x86-64.so.2, libMagickWand-6.Q16.so.7()(64bit) >= set:njWZv0nPSozN8trX3cQLsnuWqXnZvJIQZm34Vz1, libc.so.6(GLIBC_2.2.5)(64bit), libc.so.6(GLIBC_2.3.4)(64bit), libc.so.6(GLIBC_2.4)(64bit), libzbar.so.0()(64bit) >= set:lfPjwpRG0JlpUZ4v0UfKOdrS5oEWNy03m9g7gL9rfUo2oECJnSWf7hz5SfcaKoCRoyM8JDbc5pmHoivLpSSWPed0zckM5, rtld(GNU_HASH)
Requires(rpmlib): rpmlib(SetVersions)
Finding debuginfo files (using /usr/lib/rpm/find-debuginfo-files)
Executing: /bin/sh -e /usr/src/tmp/rpm-tmp.v1eD72
Creating zbar-debuginfo package
Processing files: libzbar-0.23.1-alt2
Finding Provides (using /usr/lib/rpm/find-provides)
Executing: /bin/sh -e /usr/src/tmp/rpm-tmp.BGkpC1
find-provides: running scripts (alternatives,debuginfo,gir,lib,pam,perl,pkgconfig,python,python3,shell,typelib)
lib.prov: /usr/src/tmp/zbar-buildroot/usr/lib64/libzbar.so.0: 143 symbols, 18 bpp
Finding Requires (using /usr/lib/rpm/find-requires)
Executing: /bin/sh -e /usr/src/tmp/rpm-tmp.MH12F5
find-requires: running scripts (cpp,debuginfo,files,gir-js,gir-python,gir,lib,pam,perl,pkgconfig,pkgconfiglib,python,python3,rpmlib,shebang,shell,static,symlinks,systemd-services,typelib)
Provides: libzbar.so.0()(64bit) = set:ldxEFBe5IsX802GPXC052uxiEExJl9UdlriBxCZxwfuZ78KZ8sQ2z5ZIyve3Z1HcYvwAMo3W5rzHHP4oYpJGMgKGPSgFpZIKauJZ7eXnZ6hwWyZvCw8vhPiSZAIvBDg4xX7fSCOm3VC8KF6yUud4cNPSPpw5mhuPNXePt6BFo3u9yJCjgAxN7M7CN0oXND0yiqzPhENmUjlTcWsZsMnnvwjMtMj4pp7BC94xlbpZwX2R8t4z7BzZ9bBRqy24ekLs36iITNn1zR1K3z9ZyWcz4DhIz2da0nVFCOsA9pgFaPtZg
Requires: libX11.so.6()(64bit) >= set:oipS1uTHp70LJjqwcig6I6hYiPo5pD4eKnFxHJtjeA4JBARkiGPRS08ldnPAIEYiI6j0kXOTcktBLUrJK5DYts5HcEaXZ4HnUkZenmEq8gHVu07cBAVzHbmegL0BznlhOYeCpg5Z8zaMunEbtgPsLeB, libXv.so.1()(64bit) >= set:ietH9rMJ82q6SuZB9li5G3aD1, libc.so.6(GLIBC_2.11)(64bit), libc.so.6(GLIBC_2.14)(64bit), libc.so.6(GLIBC_2.17)(64bit), libc.so.6(GLIBC_2.2.5)(64bit), libc.so.6(GLIBC_2.3)(64bit), libc.so.6(GLIBC_2.3.2)(64bit), libc.so.6(GLIBC_2.3.4)(64bit), libc.so.6(GLIBC_2.32)(64bit), libc.so.6(GLIBC_2.4)(64bit), libdbus-1.so.3()(64bit) >= set:njOdLDZ0IDZmZGDz6iW9buxlIhZh9trnpmiqZIraFnAQrBY1, libdbus-1.so.3(LIBDBUS_1_3)(64bit), libjpeg.so.62()(64bit) >= set:jfvZkgcUQqm1WcNFYdT6Zh, libpthread.so.0(GLIBC_2.2.5)(64bit), libpthread.so.0(GLIBC_2.3.2)(64bit), libv4l2.so.0()(64bit) >= set:heR58QvshXAqb, rtld(GNU_HASH)
Requires(rpmlib): rpmlib(SetVersions)
Finding debuginfo files (using /usr/lib/rpm/find-debuginfo-files)
Executing: /bin/sh -e /usr/src/tmp/rpm-tmp.hXqvQ2
Creating libzbar-debuginfo package
Processing files: libzbar-devel-0.23.1-alt2
Finding Provides (using /usr/lib/rpm/find-provides)
Executing: /bin/sh -e /usr/src/tmp/rpm-tmp.xUYxp5
find-provides: running scripts (alternatives,debuginfo,gir,lib,pam,perl,pkgconfig,python,python3,shell,typelib)
Finding Requires (using /usr/lib/rpm/find-requires)
Executing: /bin/sh -e /usr/src/tmp/rpm-tmp.a43TL5
find-requires: running scripts (cpp,debuginfo,files,gir-js,gir-python,gir,lib,pam,perl,pkgconfig,pkgconfiglib,python,python3,rpmlib,shebang,shell,static,symlinks,systemd-services,typelib)
/usr/src/tmp/zbar-buildroot/usr/include/zbar/Image.h:30:3: error: #error "include zbar.h in your application, **not** zbar/Image.h"
   30 | # error "include zbar.h in your application, **not** zbar/Image.h"
      |   ^~~~~
/usr/src/tmp/zbar-buildroot/usr/include/zbar/Image.h:34:10: fatal error: iterator: No such file or directory
   34 | #include <iterator>
      |          ^~~~~~~~~~
compilation terminated.
cpp.req: /usr/src/tmp/zbar-buildroot/usr/include/zbar/Image.h: cpp failed, trying c++ mode
/usr/src/tmp/zbar-buildroot/usr/include/zbar/Image.h:30:3: error: #error "include zbar.h in your application, **not** zbar/Image.h"
   30 | # error "include zbar.h in your application, **not** zbar/Image.h"
      |   ^~~~~
In file included from /usr/src/tmp/zbar-buildroot/usr/include/zbar/Image.h:35:
/usr/src/tmp/zbar-buildroot/usr/include/zbar/Symbol.h:30:3: error: #error "include zbar.h in your application, **not** zbar/Symbol.h"
   30 | # error "include zbar.h in your application, **not** zbar/Symbol.h"
      |   ^~~~~
In file included from /usr/src/tmp/zbar-buildroot/usr/include/zbar/Image.h:36:
/usr/src/tmp/zbar-buildroot/usr/include/zbar/Exception.h:30:3: error: #error "include zbar.h in your application, **not** zbar/Exception.h"
   30 | # error "include zbar.h in your application, **not** zbar/Exception.h"
      |   ^~~~~
cpp.req: WARNING: /usr/src/tmp/zbar-buildroot/usr/include/zbar/Image.h: cpp failed
/usr/src/tmp/zbar-buildroot/usr/include/zbar/Video.h:30:3: error: #error "include zbar.h in your application, **not** zbar/Video.h"
   30 | # error "include zbar.h in your application, **not** zbar/Video.h"
      |   ^~~~~
In file included from /usr/src/tmp/zbar-buildroot/usr/include/zbar/Video.h:33:
/usr/src/tmp/zbar-buildroot/usr/include/zbar/Image.h:30:3: error: #error "include zbar.h in your application, **not** zbar/Image.h"
   30 | # error "include zbar.h in your application, **not** zbar/Image.h"
      |   ^~~~~
In file included from /usr/src/tmp/zbar-buildroot/usr/include/zbar/Video.h:33:
/usr/src/tmp/zbar-buildroot/usr/include/zbar/Image.h:34:10: fatal error: iterator: No such file or directory
   34 | #include <iterator>
      |          ^~~~~~~~~~
compilation terminated.
cpp.req: /usr/src/tmp/zbar-buildroot/usr/include/zbar/Video.h: cpp failed, trying c++ mode
/usr/src/tmp/zbar-buildroot/usr/include/zbar/Video.h:30:3: error: #error "include zbar.h in your application, **not** zbar/Video.h"
   30 | # error "include zbar.h in your application, **not** zbar/Video.h"
      |   ^~~~~
In file included from /usr/src/tmp/zbar-buildroot/usr/include/zbar/Video.h:33:
/usr/src/tmp/zbar-buildroot/usr/include/zbar/Image.h:30:3: error: #error "include zbar.h in your application, **not** zbar/Image.h"
   30 | # error "include zbar.h in your application, **not** zbar/Image.h"
      |   ^~~~~
In file included from /usr/src/tmp/zbar-buildroot/usr/include/zbar/Image.h:35,
                 from /usr/src/tmp/zbar-buildroot/usr/include/zbar/Video.h:33:
/usr/src/tmp/zbar-buildroot/usr/include/zbar/Symbol.h:30:3: error: #error "include zbar.h in your application, **not** zbar/Symbol.h"
   30 | # error "include zbar.h in your application, **not** zbar/Symbol.h"
      |   ^~~~~
In file included from /usr/src/tmp/zbar-buildroot/usr/include/zbar/Image.h:36,
                 from /usr/src/tmp/zbar-buildroot/usr/include/zbar/Video.h:33:
/usr/src/tmp/zbar-buildroot/usr/include/zbar/Exception.h:30:3: error: #error "include zbar.h in your application, **not** zbar/Exception.h"
   30 | # error "include zbar.h in your application, **not** zbar/Exception.h"
      |   ^~~~~
cpp.req: WARNING: /usr/src/tmp/zbar-buildroot/usr/include/zbar/Video.h: cpp failed
/usr/src/tmp/zbar-buildroot/usr/include/zbar/Symbol.h:30:3: error: #error "include zbar.h in your application, **not** zbar/Symbol.h"
   30 | # error "include zbar.h in your application, **not** zbar/Symbol.h"
      |   ^~~~~
/usr/src/tmp/zbar-buildroot/usr/include/zbar/Symbol.h:34:10: fatal error: string: No such file or directory
   34 | #include <string>
      |          ^~~~~~~~
compilation terminated.
cpp.req: /usr/src/tmp/zbar-buildroot/usr/include/zbar/Symbol.h: cpp failed, trying c++ mode
/usr/src/tmp/zbar-buildroot/usr/include/zbar/Symbol.h:30:3: error: #error "include zbar.h in your application, **not** zbar/Symbol.h"
   30 | # error "include zbar.h in your application, **not** zbar/Symbol.h"
      |   ^~~~~
cpp.req: WARNING: /usr/src/tmp/zbar-buildroot/usr/include/zbar/Symbol.h: cpp failed
/usr/src/tmp/zbar-buildroot/usr/include/zbar/Window.h:30:3: error: #error "include zbar.h in your application, **not** zbar/Window.h"
   30 | # error "include zbar.h in your application, **not** zbar/Window.h"
      |   ^~~~~
In file included from /usr/src/tmp/zbar-buildroot/usr/include/zbar/Window.h:33:
/usr/src/tmp/zbar-buildroot/usr/include/zbar/Image.h:30:3: error: #error "include zbar.h in your application, **not** zbar/Image.h"
   30 | # error "include zbar.h in your application, **not** zbar/Image.h"
      |   ^~~~~
In file included from /usr/src/tmp/zbar-buildroot/usr/include/zbar/Window.h:33:
/usr/src/tmp/zbar-buildroot/usr/include/zbar/Image.h:34:10: fatal error: iterator: No such file or directory
   34 | #include <iterator>
      |          ^~~~~~~~~~
compilation terminated.
cpp.req: /usr/src/tmp/zbar-buildroot/usr/include/zbar/Window.h: cpp failed, trying c++ mode
/usr/src/tmp/zbar-buildroot/usr/include/zbar/Window.h:30:3: error: #error "include zbar.h in your application, **not** zbar/Window.h"
   30 | # error "include zbar.h in your application, **not** zbar/Window.h"
      |   ^~~~~
In file included from /usr/src/tmp/zbar-buildroot/usr/include/zbar/Window.h:33:
/usr/src/tmp/zbar-buildroot/usr/include/zbar/Image.h:30:3: error: #error "include zbar.h in your application, **not** zbar/Image.h"
   30 | # error "include zbar.h in your application, **not** zbar/Image.h"
      |   ^~~~~
In file included from /usr/src/tmp/zbar-buildroot/usr/include/zbar/Image.h:35,
                 from /usr/src/tmp/zbar-buildroot/usr/include/zbar/Window.h:33:
/usr/src/tmp/zbar-buildroot/usr/include/zbar/Symbol.h:30:3: error: #error "include zbar.h in your application, **not** zbar/Symbol.h"
   30 | # error "include zbar.h in your application, **not** zbar/Symbol.h"
      |   ^~~~~
In file included from /usr/src/tmp/zbar-buildroot/usr/include/zbar/Image.h:36,
                 from /usr/src/tmp/zbar-buildroot/usr/include/zbar/Window.h:33:
/usr/src/tmp/zbar-buildroot/usr/include/zbar/Exception.h:30:3: error: #error "include zbar.h in your application, **not** zbar/Exception.h"
   30 | # error "include zbar.h in your application, **not** zbar/Exception.h"
      |   ^~~~~
cpp.req: WARNING: /usr/src/tmp/zbar-buildroot/usr/include/zbar/Window.h: cpp failed
/usr/src/tmp/zbar-buildroot/usr/include/zbar/Decoder.h:30:3: error: #error "include zbar.h in your application, **not** zbar/Decoder.h"
   30 | # error "include zbar.h in your application, **not** zbar/Decoder.h"
      |   ^~~~~
/usr/src/tmp/zbar-buildroot/usr/include/zbar/Decoder.h:33:10: fatal error: string: No such file or directory
   33 | #include <string>
      |          ^~~~~~~~
compilation terminated.
cpp.req: /usr/src/tmp/zbar-buildroot/usr/include/zbar/Decoder.h: cpp failed, trying c++ mode
/usr/src/tmp/zbar-buildroot/usr/include/zbar/Decoder.h:30:3: error: #error "include zbar.h in your application, **not** zbar/Decoder.h"
   30 | # error "include zbar.h in your application, **not** zbar/Decoder.h"
      |   ^~~~~
cpp.req: WARNING: /usr/src/tmp/zbar-buildroot/usr/include/zbar/Decoder.h: cpp failed
/usr/src/tmp/zbar-buildroot/usr/include/zbar/Scanner.h:30:3: error: #error "include zbar.h in your application, **not** zbar/Scanner.h"
   30 | # error "include zbar.h in your application, **not** zbar/Scanner.h"
      |   ^~~~~
cpp.req: /usr/src/tmp/zbar-buildroot/usr/include/zbar/Scanner.h: cpp failed, trying c++ mode
/usr/src/tmp/zbar-buildroot/usr/include/zbar/Scanner.h:30:3: error: #error "include zbar.h in your application, **not** zbar/Scanner.h"
   30 | # error "include zbar.h in your application, **not** zbar/Scanner.h"
      |   ^~~~~
cpp.req: WARNING: /usr/src/tmp/zbar-buildroot/usr/include/zbar/Scanner.h: cpp failed
/usr/src/tmp/zbar-buildroot/usr/include/zbar/Exception.h:30:3: error: #error "include zbar.h in your application, **not** zbar/Exception.h"
   30 | # error "include zbar.h in your application, **not** zbar/Exception.h"
      |   ^~~~~
/usr/src/tmp/zbar-buildroot/usr/include/zbar/Exception.h:33:10: fatal error: cstddef: No such file or directory
   33 | #include <cstddef>
      |          ^~~~~~~~~
compilation terminated.
cpp.req: /usr/src/tmp/zbar-buildroot/usr/include/zbar/Exception.h: cpp failed, trying c++ mode
/usr/src/tmp/zbar-buildroot/usr/include/zbar/Exception.h:30:3: error: #error "include zbar.h in your application, **not** zbar/Exception.h"
   30 | # error "include zbar.h in your application, **not** zbar/Exception.h"
      |   ^~~~~
cpp.req: WARNING: /usr/src/tmp/zbar-buildroot/usr/include/zbar/Exception.h: cpp failed
/usr/src/tmp/zbar-buildroot/usr/include/zbar/Processor.h:30:3: error: #error "include zbar.h in your application, **not** zbar/Processor.h"
   30 | # error "include zbar.h in your application, **not** zbar/Processor.h"
      |   ^~~~~
In file included from /usr/src/tmp/zbar-buildroot/usr/include/zbar/Processor.h:33:
/usr/src/tmp/zbar-buildroot/usr/include/zbar/Exception.h:30:3: error: #error "include zbar.h in your application, **not** zbar/Exception.h"
   30 | # error "include zbar.h in your application, **not** zbar/Exception.h"
      |   ^~~~~
/usr/src/tmp/zbar-buildroot/usr/include/zbar/Exception.h:33:10: fatal error: cstddef: No such file or directory
   33 | #include <cstddef>
      |          ^~~~~~~~~
compilation terminated.
cpp.req: /usr/src/tmp/zbar-buildroot/usr/include/zbar/Processor.h: cpp failed, trying c++ mode
/usr/src/tmp/zbar-buildroot/usr/include/zbar/Processor.h:30:3: error: #error "include zbar.h in your application, **not** zbar/Processor.h"
   30 | # error "include zbar.h in your application, **not** zbar/Processor.h"
      |   ^~~~~
In file included from /usr/src/tmp/zbar-buildroot/usr/include/zbar/Processor.h:33:
/usr/src/tmp/zbar-buildroot/usr/include/zbar/Exception.h:30:3: error: #error "include zbar.h in your application, **not** zbar/Exception.h"
   30 | # error "include zbar.h in your application, **not** zbar/Exception.h"
      |   ^~~~~
In file included from /usr/src/tmp/zbar-buildroot/usr/include/zbar/Processor.h:34:
/usr/src/tmp/zbar-buildroot/usr/include/zbar/Image.h:30:3: error: #error "include zbar.h in your application, **not** zbar/Image.h"
   30 | # error "include zbar.h in your application, **not** zbar/Image.h"
      |   ^~~~~
In file included from /usr/src/tmp/zbar-buildroot/usr/include/zbar/Image.h:35,
                 from /usr/src/tmp/zbar-buildroot/usr/include/zbar/Processor.h:34:
/usr/src/tmp/zbar-buildroot/usr/include/zbar/Symbol.h:30:3: error: #error "include zbar.h in your application, **not** zbar/Symbol.h"
   30 | # error "include zbar.h in your application, **not** zbar/Symbol.h"
      |   ^~~~~
cpp.req: WARNING: /usr/src/tmp/zbar-buildroot/usr/include/zbar/Processor.h: cpp failed
/usr/src/tmp/zbar-buildroot/usr/include/zbar/ImageScanner.h:30:3: error: #error "include zbar.h in your application, **not** zbar/ImageScanner.h"
   30 | # error "include zbar.h in your application, **not** zbar/ImageScanner.h"
      |   ^~~~~
In file included from /usr/src/tmp/zbar-buildroot/usr/include/zbar/ImageScanner.h:33:
/usr/src/tmp/zbar-buildroot/usr/include/zbar/Image.h:30:3: error: #error "include zbar.h in your application, **not** zbar/Image.h"
   30 | # error "include zbar.h in your application, **not** zbar/Image.h"
      |   ^~~~~
In file included from /usr/src/tmp/zbar-buildroot/usr/include/zbar/ImageScanner.h:33:
/usr/src/tmp/zbar-buildroot/usr/include/zbar/Image.h:34:10: fatal error: iterator: No such file or directory
   34 | #include <iterator>
      |          ^~~~~~~~~~
compilation terminated.
cpp.req: /usr/src/tmp/zbar-buildroot/usr/include/zbar/ImageScanner.h: cpp failed, trying c++ mode
/usr/src/tmp/zbar-buildroot/usr/include/zbar/ImageScanner.h:30:3: error: #error "include zbar.h in your application, **not** zbar/ImageScanner.h"
   30 | # error "include zbar.h in your application, **not** zbar/ImageScanner.h"
      |   ^~~~~
In file included from /usr/src/tmp/zbar-buildroot/usr/include/zbar/ImageScanner.h:33:
/usr/src/tmp/zbar-buildroot/usr/include/zbar/Image.h:30:3: error: #error "include zbar.h in your application, **not** zbar/Image.h"
   30 | # error "include zbar.h in your application, **not** zbar/Image.h"
      |   ^~~~~
In file included from /usr/src/tmp/zbar-buildroot/usr/include/zbar/Image.h:35,
                 from /usr/src/tmp/zbar-buildroot/usr/include/zbar/ImageScanner.h:33:
/usr/src/tmp/zbar-buildroot/usr/include/zbar/Symbol.h:30:3: error: #error "include zbar.h in your application, **not** zbar/Symbol.h"
   30 | # error "include zbar.h in your application, **not** zbar/Symbol.h"
      |   ^~~~~
In file included from /usr/src/tmp/zbar-buildroot/usr/include/zbar/Image.h:36,
                 from /usr/src/tmp/zbar-buildroot/usr/include/zbar/ImageScanner.h:33:
/usr/src/tmp/zbar-buildroot/usr/include/zbar/Exception.h:30:3: error: #error "include zbar.h in your application, **not** zbar/Exception.h"
   30 | # error "include zbar.h in your application, **not** zbar/Exception.h"
      |   ^~~~~
cpp.req: WARNING: /usr/src/tmp/zbar-buildroot/usr/include/zbar/ImageScanner.h: cpp failed
Provides: pkgconfig(zbar) = 0.23.1
Requires: /usr/lib64/libzbar.so.0.3.0, /usr/lib64/pkgconfig
Finding debuginfo files (using /usr/lib/rpm/find-debuginfo-files)
Executing: /bin/sh -e /usr/src/tmp/rpm-tmp.4mX8A5
Processing files: libzbar-devel-static-0.23.1-alt2
Finding Provides (using /usr/lib/rpm/find-provides)
Executing: /bin/sh -e /usr/src/tmp/rpm-tmp.dpOV12
find-provides: running scripts (alternatives,debuginfo,gir,lib,pam,perl,pkgconfig,python,python3,shell,typelib)
Finding Requires (using /usr/lib/rpm/find-requires)
Executing: /bin/sh -e /usr/src/tmp/rpm-tmp.lViVB5
find-requires: running scripts (cpp,debuginfo,files,gir-js,gir-python,gir,lib,pam,perl,pkgconfig,pkgconfiglib,python,python3,rpmlib,shebang,shell,static,symlinks,systemd-services,typelib)
Requires: glibc-devel-static
Finding debuginfo files (using /usr/lib/rpm/find-debuginfo-files)
Executing: /bin/sh -e /usr/src/tmp/rpm-tmp.sjc8v1
Processing files: libzbar-gtk3-0.23.1-alt2
Finding Provides (using /usr/lib/rpm/find-provides)
Executing: /bin/sh -e /usr/src/tmp/rpm-tmp.XzyVy1
find-provides: running scripts (alternatives,debuginfo,gir,lib,pam,perl,pkgconfig,python,python3,shell,typelib)
lib.prov: /usr/src/tmp/zbar-buildroot/usr/lib64/libzbargtk.so.0: 12 symbols, 14 bpp
Finding Requires (using /usr/lib/rpm/find-requires)
Executing: /bin/sh -e /usr/src/tmp/rpm-tmp.qrSOS3
find-requires: running scripts (cpp,debuginfo,files,gir-js,gir-python,gir,lib,pam,perl,pkgconfig,pkgconfiglib,python,python3,rpmlib,shebang,shell,static,symlinks,systemd-services,typelib)
Provides: libzbargtk.so.0()(64bit) = set:hdLly5O9nczAt8f47XlMeWI7V1
Requires: libc.so.6(GLIBC_2.2.5)(64bit), libc.so.6(GLIBC_2.4)(64bit), libgdk-3.so.0()(64bit) >= set:njIeOlRqLs8m6qZ3d6u3wYI3htu, libgdk_pixbuf-2.0.so.0()(64bit) >= set:linLyF7lTFUi8cqP5yBtG4, libglib-2.0.so.0()(64bit) >= set:oj6v3AZH5Z1SFsqAZaR4jGlZmlUOnrejhY2Z81IaQzwowYHP4897NKE2, libgobject-2.0.so.0()(64bit) >= set:mgk2tHLZIbUpcT4HLQEp3B5oeyBGZc3PZ12hxRaxv5DYYAn3q0dTLhwZut5k5s7s5Zv3HUx1HqZ5j1EZFRpkvfZqbCV1, libgtk-3.so.0()(64bit) >= set:qmpFtQsykuwtQ8rZCtJoVNLxHz8Zw3z1ZHWj1YBX5ZLh4jZ20, libzbar.so.0()(64bit) >= set:lfPjWkpV2EpE2WNEwRGNqAAtJmfs3xmptBtWejDIxixFj9AdlnZ1o0Lr1EAox7Oo2rzZDpVEnnkdwxZaDxWjAqEZn5s1, rtld(GNU_HASH)
Requires(rpmlib): rpmlib(SetVersions)
Finding debuginfo files (using /usr/lib/rpm/find-debuginfo-files)
Executing: /bin/sh -e /usr/src/tmp/rpm-tmp.1BzzB5
Creating libzbar-gtk3-debuginfo package
Processing files: libzbar-gtk3-devel-0.23.1-alt2
Finding Provides (using /usr/lib/rpm/find-provides)
Executing: /bin/sh -e /usr/src/tmp/rpm-tmp.8zBaW4
find-provides: running scripts (alternatives,debuginfo,gir,lib,pam,perl,pkgconfig,python,python3,shell,typelib)
Finding Requires (using /usr/lib/rpm/find-requires)
Executing: /bin/sh -e /usr/src/tmp/rpm-tmp.H8FwA5
find-requires: running scripts (cpp,debuginfo,files,gir-js,gir-python,gir,lib,pam,perl,pkgconfig,pkgconfiglib,python,python3,rpmlib,shebang,shell,static,symlinks,systemd-services,typelib)
Provides: pkgconfig(zbar-gtk) = 0.23.1
Requires: /usr/include/zbar.h, /usr/lib64/libzbargtk.so.0.0.2, /usr/lib64/pkgconfig, glib2-devel, libgtk+3-devel, pkgconfig(gthread-2.0), pkgconfig(gtk+-3.0), pkgconfig(zbar)
Finding debuginfo files (using /usr/lib/rpm/find-debuginfo-files)
Executing: /bin/sh -e /usr/src/tmp/rpm-tmp.1jmD41
Processing files: libzbar-gtk3-devel-static-0.23.1-alt2
Finding Provides (using /usr/lib/rpm/find-provides)
Executing: /bin/sh -e /usr/src/tmp/rpm-tmp.jlrLm3
find-provides: running scripts (alternatives,debuginfo,gir,lib,pam,perl,pkgconfig,python,python3,shell,typelib)
Finding Requires (using /usr/lib/rpm/find-requires)
Executing: /bin/sh -e /usr/src/tmp/rpm-tmp.qU8uF3
find-requires: running scripts (cpp,debuginfo,files,gir-js,gir-python,gir,lib,pam,perl,pkgconfig,pkgconfiglib,python,python3,rpmlib,shebang,shell,static,symlinks,systemd-services,typelib)
Requires: glibc-devel-static
Finding debuginfo files (using /usr/lib/rpm/find-debuginfo-files)
Executing: /bin/sh -e /usr/src/tmp/rpm-tmp.GzkHf5
Processing files: python3-module-zbar-0.23.1-alt2
Finding Provides (using /usr/lib/rpm/find-provides)
Executing: /bin/sh -e /usr/src/tmp/rpm-tmp.jExjl2
find-provides: running scripts (alternatives,debuginfo,gir,lib,pam,perl,pkgconfig,python,python3,shell,typelib)
Finding Requires (using /usr/lib/rpm/find-requires)
Executing: /bin/sh -e /usr/src/tmp/rpm-tmp.COd3G1
find-requires: running scripts (cpp,debuginfo,files,gir-js,gir-python,gir,lib,pam,perl,pkgconfig,pkgconfiglib,python,python3,rpmlib,shebang,shell,static,symlinks,systemd-services,typelib)
/usr/lib/rpm/python3.req.py:6: DeprecationWarning: The parser module is deprecated and will be removed in future versions of Python
  import parser, symbol, token, types
/usr/lib/rpm/python3.req.py:6: DeprecationWarning: The symbol module is deprecated and will be removed in future versions of Python
  import parser, symbol, token, types
Provides: python3(zbar)
Requires: /usr/lib64/python3/site-packages, libc.so.6(GLIBC_2.2.5)(64bit), libc.so.6(GLIBC_2.4)(64bit), libzbar.so.0()(64bit) >= set:lePjoM01RPry6Y2BgHxR6V0UQT4fNdcVZjXls4CZz89oI1j7cZqTdxRqSuSGyklBZ5RPy06IALGp9XnVMjo415Cd5CEdCMLEw9fXfDzxOrfuLPMyynizw4p01EE76LbJNYvemHPVPQSLRpmzxv9X2yq4YlHBEwGDYkXtZqAO8pAbqp69KzUCuNlZkdBVh6qrOsev0, python3.9-ABI(64bit), rtld(GNU_HASH)
Requires(rpmlib): rpmlib(SetVersions)
Finding debuginfo files (using /usr/lib/rpm/find-debuginfo-files)
Executing: /bin/sh -e /usr/src/tmp/rpm-tmp.vToOu2
Creating python3-module-zbar-debuginfo package
Processing files: zbar-gtk-0.23.1-alt2
Finding Provides (using /usr/lib/rpm/find-provides)
Executing: /bin/sh -e /usr/src/tmp/rpm-tmp.QK7LE3
find-provides: running scripts (alternatives,debuginfo,gir,lib,pam,perl,pkgconfig,python,python3,shell,typelib)
Finding Requires (using /usr/lib/rpm/find-requires)
Executing: /bin/sh -e /usr/src/tmp/rpm-tmp.yFpyU3
find-requires: running scripts (cpp,debuginfo,files,gir-js,gir-python,gir,lib,pam,perl,pkgconfig,pkgconfiglib,python,python3,rpmlib,shebang,shell,static,symlinks,systemd-services,typelib)
Requires: /lib64/ld-linux-x86-64.so.2, libc.so.6(GLIBC_2.2.5)(64bit), libc.so.6(GLIBC_2.3.4)(64bit), libc.so.6(GLIBC_2.4)(64bit), libgdk_pixbuf-2.0.so.0()(64bit) >= set:lka381, libglib-2.0.so.0()(64bit) >= set:onq3tb, libgobject-2.0.so.0()(64bit) >= set:mkfqQvZK0, libgtk-3.so.0()(64bit) >= set:qkZzoQjGveX8da4yHQUNdzHTP7ixxKQtsUPZkizoDwPQrsgRUGlPyaJKmLJzuVAb2l1251WRISmtx9pQY6GhAAHf39cUBuspAPliMdg00QnNyMknv0vr2TooxDLw2Rba5vu95NoapZL9Z3UjiMXUPeTlCSZ0UbQM, libpthread.so.0(GLIBC_2.2.5)(64bit), libzbar.so.0()(64bit) >= set:lkunV0, libzbargtk.so.0()(64bit) >= set:heLly5O99M8uv7VI3, rtld(GNU_HASH)
Requires(rpmlib): rpmlib(SetVersions)
Finding debuginfo files (using /usr/lib/rpm/find-debuginfo-files)
Executing: /bin/sh -e /usr/src/tmp/rpm-tmp.E9lZC3
Creating zbar-gtk-debuginfo package
Processing files: zbar-qt5-0.23.1-alt2
Finding Provides (using /usr/lib/rpm/find-provides)
Executing: /bin/sh -e /usr/src/tmp/rpm-tmp.UDcZy3
find-provides: running scripts (alternatives,debuginfo,gir,lib,pam,perl,pkgconfig,python,python3,shell,typelib)
Finding Requires (using /usr/lib/rpm/find-requires)
Executing: /bin/sh -e /usr/src/tmp/rpm-tmp.HkY235
find-requires: running scripts (cpp,debuginfo,files,gir-js,gir-python,gir,lib,pam,perl,pkgconfig,pkgconfiglib,python,python3,rpmlib,shebang,shell,static,symlinks,systemd-services,typelib)
Requires: /lib64/ld-linux-x86-64.so.2, libQt5Core.so.5()(64bit) >= set:qjOmwbynBFcAL5ax2UJ7bHDOqO0CSHmSSBkcnGKeG7oe1pzZeFtc64Jb02jfqINhukvtx9kkbphJW0Uw1flTJFwTC8z9FjoVmxyfx2nwymYEC7dCZ6e2Ufk4W4I5hBm2zccE9SZkdjsuyUZ1sZ0HZHOiZqBkv1WJevWaLKbLWOA2kRdQacufkdV7WfTikd1MSF0IhW2QGy76JxVqkM8EKT8rpwDfWLymE2LsZx2y37jBsB10s1IiMzlAq, libQt5Core.so.5(Qt_5)(64bit), libQt5Core.so.5(Qt_5.15)(64bit), libQt5Gui.so.5()(64bit) >= set:rnScdzPXoYG1eVgU3GSZ2JkaTTMkSetYeVOkfb2, libQt5Gui.so.5(Qt_5)(64bit), libQt5Widgets.so.5()(64bit) >= set:rjUSAYbCq1lDmsY9eZ7ZyNA9y2b3gg3jwdVkIShil2oZFlu6UvzEmAsPdTw7tMsz07kvQ2lXaa8EZeefAvb1m370jgNQzCQJTpS0eEHaJyiZqZovduXkGKhgVgvZ9eEntqbCHALGmYhAeE6G3KN01WWAJxhRDRaguLSWHOEst5GGlqKG6q1fBjeiZa5docH6OGdiNjhBkWj6Outa8WOox4u3sK2Ew1oH2J3fhmGZeHM1KxxiWngZf6n9uF2vkBdzlTb5uIg8YdyeCeQtvwDDMMlZcs7PlHAeivUXpp9upDpVsIxOZu6QSo0qEVdmNEzQi4K9Lj6UiaZ5O6Tqib5EYLTzMnlamIFEbXlvLbvfBz0ucb6ftZldWpVdMBjQUTZgQ9oBNjpEI8y3E3nk0GyLmtWM1L2XZyBtmme3oHkRRRXh2D2OkOo5U5INj2zrjPv3xZCltWFgjhJMZ4X33X8HZqjr4nyNmxQ4MRYpploZGlWAie9IKVgSyXopLqzG20C7p4sGwMd4SUSDhNActMq3d1mvmKadcThN9POBtE8UFUwD8WC1d3FwZpwlfbl3DmXNLWiljmRCjECjk5jJg3P4SnaEYBDHMxf6pReikIeej6QBKjjJ84synliW0, libQt5Widgets.so.5(Qt_5)(64bit), libc.so.6(GLIBC_2.14)(64bit), libc.so.6(GLIBC_2.2.5)(64bit), libc.so.6(GLIBC_2.4)(64bit), libgcc_s.so.1(GCC_3.0)(64bit), libpthread.so.0(GLIBC_2.2.5)(64bit), libstdc++.so.6(CXXABI_1.3)(64bit), libstdc++.so.6(CXXABI_1.3.9)(64bit), libstdc++.so.6(GLIBCXX_3.4)(64bit), libzbarqt.so.0()(64bit) >= set:lgAFC0rZsQRJYXQok0diZ9Z1rFxOrZlUo3I8bQVFEfGu5, rtld(GNU_HASH)
Requires(rpmlib): rpmlib(SetVersions)
Finding debuginfo files (using /usr/lib/rpm/find-debuginfo-files)
Executing: /bin/sh -e /usr/src/tmp/rpm-tmp.jmPlW3
Creating zbar-qt5-debuginfo package
Processing files: libzbar-qt5-0.23.1-alt2
Finding Provides (using /usr/lib/rpm/find-provides)
Executing: /bin/sh -e /usr/src/tmp/rpm-tmp.Sx2mx2
find-provides: running scripts (alternatives,debuginfo,gir,lib,pam,perl,pkgconfig,python,python3,shell,typelib)
lib.prov: /usr/src/tmp/zbar-buildroot/usr/lib64/libzbarqt.so.0: 200 symbols, 18 bpp
Finding Requires (using /usr/lib/rpm/find-requires)
Executing: /bin/sh -e /usr/src/tmp/rpm-tmp.fpCbI4
find-requires: running scripts (cpp,debuginfo,files,gir-js,gir-python,gir,lib,pam,perl,pkgconfig,pkgconfiglib,python,python3,rpmlib,shebang,shell,static,symlinks,systemd-services,typelib)
Provides: libzbarqt.so.0()(64bit) = set:ld9tjEHxOj79YNyaqNFGD5QPi14jCkWZq8USKZBpvz67VXY4iHfPPExPUEYiQIpCzXWJs61KGH6hASyZgT6VifDBrSfjJZr68uYZ0mCSy5HyqaleBcB5YZkW0xsALYY6OwZkx6be2GnCU5oGbvEAA54WItC02d0AdAxMZGtkoHurZFSdHUGtBHJD9EEtsDslgETh3ZE7hfdvJCDSdzA6JCGE0XVsQg0IqgOXiY06v0IN5rXkEBIifXZFamF3Px0CT9UfcnQX5rwW5WNmnE87a2RM0svegIZACMtqeCautDrd3VDtyNhAmo42SgwMUG5UKskz5gZwCHaIWBWKSQ9aZ2P5h7Z5obCxqbLxRkVht412BZK9RZwtZ9WnFAqDEvRW8t5CK9wPcsY3sLIvII1
Requires: libQt5Core.so.5()(64bit) >= set:qkZ7tOMCr9k00g1Lxjh0J84l3xaVsvzCATCQtZ8z9J4ZdMY9Xi1AY4G2cwh0fjy3BQgRzvjIZ3Rclf0qu4N3bRWAPW4MdEjKkk8KLh70snWZpxgi1yLdYoZLeCDqYRAZxCpOCPuTMsdxapB19hHR5T9cfZiXjZ7w01HCZ92L4uoYofsUqtkc2, libQt5Core.so.5(Qt_5)(64bit), libQt5Core.so.5(Qt_5.15)(64bit), libQt5Gui.so.5()(64bit) >= set:rnkeZ7ZEt897zrwU2rZjrJZmd42F3Sl4usCaAHOA4vT0, libQt5Gui.so.5(Qt_5)(64bit), libQt5Widgets.so.5()(64bit) >= set:rlcpUJyMZkyWIZIOXq23xZHZoSl5fgA99VZFZEsFBGrQHJMEAE0td9r3uHkkjlqsq7ZLVaQM1CJZBB1LD0Yia9kxfU9FV2xU0TXwp59T93kLh0Nst4DzyGAjg2W1fBzSZpNJfJdybynRZEnruFzzQFITZ1V9hBLwgk28rwGb, libQt5Widgets.so.5(Qt_5)(64bit), libQt5X11Extras.so.5()(64bit) >= set:ihqAa, libQt5X11Extras.so.5(Qt_5)(64bit), libc.so.6(GLIBC_2.14)(64bit), libc.so.6(GLIBC_2.2.5)(64bit), libc.so.6(GLIBC_2.4)(64bit), libgcc_s.so.1(GCC_3.0)(64bit), libstdc++.so.6(CXXABI_1.3)(64bit), libstdc++.so.6(CXXABI_1.3.9)(64bit), libstdc++.so.6(GLIBCXX_3.4)(64bit), libstdc++.so.6(GLIBCXX_3.4.21)(64bit), libzbar.so.0()(64bit) >= set:lffZsO5uGUv21qWj9hpcaz5uVxJ9NqAARF93xmptBtWejDOZlVMLiTfvIuahO0zFudFHZgcY9Xe3Su0m3PKU2fXBZ9VypZs3OzYLsial3ooZAZmRpqT6BAqEZn5s1, rtld(GNU_HASH)
Requires(rpmlib): rpmlib(SetVersions)
Finding debuginfo files (using /usr/lib/rpm/find-debuginfo-files)
Executing: /bin/sh -e /usr/src/tmp/rpm-tmp.6t6ls5
Creating libzbar-qt5-debuginfo package
Processing files: libzbar-qt5-devel-0.23.1-alt2
Finding Provides (using /usr/lib/rpm/find-provides)
Executing: /bin/sh -e /usr/src/tmp/rpm-tmp.8h5sL5
find-provides: running scripts (alternatives,debuginfo,gir,lib,pam,perl,pkgconfig,python,python3,shell,typelib)
Finding Requires (using /usr/lib/rpm/find-requires)
Executing: /bin/sh -e /usr/src/tmp/rpm-tmp.lMyWJ3
find-requires: running scripts (cpp,debuginfo,files,gir-js,gir-python,gir,lib,pam,perl,pkgconfig,pkgconfiglib,python,python3,rpmlib,shebang,shell,static,symlinks,systemd-services,typelib)
In file included from /usr/include/qt5/QtCore/qatomic.h:46,
                 from /usr/include/qt5/QtCore/qrefcount.h:43,
                 from /usr/include/qt5/QtCore/qbytearray.h:44,
                 from /usr/include/qt5/QtCore/qstring.h:50,
                 from /usr/include/qt5/QtCore/qobject.h:47,
                 from /usr/include/qt5/QtGui/qabstracttextdocumentlayout.h:44,
                 from /usr/include/qt5/QtGui/QtGui:5,
                 from /usr/src/tmp/zbar-buildroot/usr/include/zbar/QZBar.h:29:
/usr/include/qt5/QtCore/qbasicatomic.h:61:4: error: #error "Qt requires C++11 support"
   61 | #  error "Qt requires C++11 support"
      |    ^~~~~
In file included from /usr/include/qt5/QtCore/qstring.h:50,
                 from /usr/include/qt5/QtCore/qobject.h:47,
                 from /usr/include/qt5/QtGui/qabstracttextdocumentlayout.h:44,
                 from /usr/include/qt5/QtGui/QtGui:5,
                 from /usr/src/tmp/zbar-buildroot/usr/include/zbar/QZBar.h:29:
/usr/include/qt5/QtCore/qbytearray.h:52:10: fatal error: string: No such file or directory
   52 | #include <string>
      |          ^~~~~~~~
compilation terminated.
cpp.req: /usr/src/tmp/zbar-buildroot/usr/include/zbar/QZBar.h: cpp failed, trying c++ mode
/usr/src/tmp/zbar-buildroot/usr/include/zbar/QZBar.h:31:12: fatal error: QtWidgets: No such file or directory
   31 | #  include <QtWidgets>
      |            ^~~~~~~~~~~
compilation terminated.
cpp.req: WARNING: /usr/src/tmp/zbar-buildroot/usr/include/zbar/QZBar.h: cpp failed
In file included from /usr/include/qt5/QtCore/qatomic.h:46,
                 from /usr/include/qt5/QtCore/qrefcount.h:43,
                 from /usr/include/qt5/QtCore/qlist.h:45,
                 from /usr/include/qt5/QtCore/qstringlist.h:41,
                 from /usr/include/qt5/QtGui/qcolor.h:46,
                 from /usr/include/qt5/QtGui/qimage.h:44,
                 from /usr/src/tmp/zbar-buildroot/usr/include/zbar/QZBarImage.h:29:
/usr/include/qt5/QtCore/qbasicatomic.h:61:4: error: #error "Qt requires C++11 support"
   61 | #  error "Qt requires C++11 support"
      |    ^~~~~
In file included from /usr/include/qt5/QtCore/qstring.h:50,
                 from /usr/include/qt5/QtCore/qhashfunctions.h:44,
                 from /usr/include/qt5/QtCore/qlist.h:47,
                 from /usr/include/qt5/QtCore/qstringlist.h:41,
                 from /usr/include/qt5/QtGui/qcolor.h:46,
                 from /usr/include/qt5/QtGui/qimage.h:44,
                 from /usr/src/tmp/zbar-buildroot/usr/include/zbar/QZBarImage.h:29:
/usr/include/qt5/QtCore/qbytearray.h:52:10: fatal error: string: No such file or directory
   52 | #include <string>
      |          ^~~~~~~~
compilation terminated.
cpp.req: /usr/src/tmp/zbar-buildroot/usr/include/zbar/QZBarImage.h: cpp failed, trying c++ mode
Provides: pkgconfig(zbar-qt) = 0.23.1
Requires: /usr/include/zbar.h, /usr/lib64/libzbarqt.so.0.1.2, /usr/lib64/pkgconfig, pkgconfig(Qt5Core) >= 5, pkgconfig(Qt5Gui) >= 5, pkgconfig(zbar), qt5-base-devel
Finding debuginfo files (using /usr/lib/rpm/find-debuginfo-files)
Executing: /bin/sh -e /usr/src/tmp/rpm-tmp.PGIJI2
Processing files: libzbar-qt5-devel-static-0.23.1-alt2
Finding Provides (using /usr/lib/rpm/find-provides)
Executing: /bin/sh -e /usr/src/tmp/rpm-tmp.6ebKm5
find-provides: running scripts (alternatives,debuginfo,gir,lib,pam,perl,pkgconfig,python,python3,shell,typelib)
Finding Requires (using /usr/lib/rpm/find-requires)
Executing: /bin/sh -e /usr/src/tmp/rpm-tmp.v7hwV5
find-requires: running scripts (cpp,debuginfo,files,gir-js,gir-python,gir,lib,pam,perl,pkgconfig,pkgconfiglib,python,python3,rpmlib,shebang,shell,static,symlinks,systemd-services,typelib)
Requires: glibc-devel-static
Finding debuginfo files (using /usr/lib/rpm/find-debuginfo-files)
Executing: /bin/sh -e /usr/src/tmp/rpm-tmp.RCKDW1
Processing files: zbar-debuginfo-0.23.1-alt2
Finding Provides (using /usr/lib/rpm/find-provides)
Executing: /bin/sh -e /usr/src/tmp/rpm-tmp.gvzns5
find-provides: running scripts (debuginfo)
Finding Requires (using /usr/lib/rpm/find-requires)
Executing: /bin/sh -e /usr/src/tmp/rpm-tmp.Fhjq03
find-requires: running scripts (debuginfo)
Requires: zbar = 0.23.1-alt2, /usr/lib/debug/lib64/ld-linux-x86-64.so.2.debug, debug64(libMagickWand-6.Q16.so.7), debug64(libc.so.6), debug64(libzbar.so.0)
Processing files: libzbar-debuginfo-0.23.1-alt2
Finding Provides (using /usr/lib/rpm/find-provides)
Executing: /bin/sh -e /usr/src/tmp/rpm-tmp.u0Msf2
find-provides: running scripts (debuginfo)
Finding Requires (using /usr/lib/rpm/find-requires)
Executing: /bin/sh -e /usr/src/tmp/rpm-tmp.24kl02
find-requires: running scripts (debuginfo)
Provides: debug64(libzbar.so.0)
Requires: libzbar = 0.23.1-alt2, debug64(libX11.so.6), debug64(libXv.so.1), debug64(libc.so.6), debug64(libdbus-1.so.3), debug64(libjpeg.so.62), debug64(libpthread.so.0), debug64(libv4l2.so.0)
Processing files: libzbar-gtk3-debuginfo-0.23.1-alt2
Finding Provides (using /usr/lib/rpm/find-provides)
Executing: /bin/sh -e /usr/src/tmp/rpm-tmp.IyU1M3
find-provides: running scripts (debuginfo)
Finding Requires (using /usr/lib/rpm/find-requires)
Executing: /bin/sh -e /usr/src/tmp/rpm-tmp.eImoI3
find-requires: running scripts (debuginfo)
Provides: debug64(libzbargtk.so.0)
Requires: libzbar-gtk3 = 0.23.1-alt2, debug64(libc.so.6), debug64(libgdk-3.so.0), debug64(libgdk_pixbuf-2.0.so.0), debug64(libglib-2.0.so.0), debug64(libgobject-2.0.so.0), debug64(libgtk-3.so.0), debug64(libzbar.so.0)
Processing files: python3-module-zbar-debuginfo-0.23.1-alt2
Finding Provides (using /usr/lib/rpm/find-provides)
Executing: /bin/sh -e /usr/src/tmp/rpm-tmp.2C0g91
find-provides: running scripts (debuginfo)
Finding Requires (using /usr/lib/rpm/find-requires)
Executing: /bin/sh -e /usr/src/tmp/rpm-tmp.7ePET5
find-requires: running scripts (debuginfo)
Requires: python3-module-zbar = 0.23.1-alt2, debug64(libc.so.6), debug64(libzbar.so.0)
Processing files: zbar-gtk-debuginfo-0.23.1-alt2
Finding Provides (using /usr/lib/rpm/find-provides)
Executing: /bin/sh -e /usr/src/tmp/rpm-tmp.yHdLQ5
find-provides: running scripts (debuginfo)
Finding Requires (using /usr/lib/rpm/find-requires)
Executing: /bin/sh -e /usr/src/tmp/rpm-tmp.ZtebS3
find-requires: running scripts (debuginfo)
Requires: zbar-gtk = 0.23.1-alt2, /usr/lib/debug/lib64/ld-linux-x86-64.so.2.debug, debug64(libc.so.6), debug64(libgdk_pixbuf-2.0.so.0), debug64(libglib-2.0.so.0), debug64(libgobject-2.0.so.0), debug64(libgtk-3.so.0), debug64(libpthread.so.0), debug64(libzbar.so.0), debug64(libzbargtk.so.0)
Processing files: zbar-qt5-debuginfo-0.23.1-alt2
Finding Provides (using /usr/lib/rpm/find-provides)
Executing: /bin/sh -e /usr/src/tmp/rpm-tmp.Fveoo3
find-provides: running scripts (debuginfo)
Finding Requires (using /usr/lib/rpm/find-requires)
Executing: /bin/sh -e /usr/src/tmp/rpm-tmp.01tSM1
find-requires: running scripts (debuginfo)
Requires: zbar-qt5 = 0.23.1-alt2, /usr/lib/debug/lib64/ld-linux-x86-64.so.2.debug, debug64(libQt5Core.so.5), debug64(libQt5Gui.so.5), debug64(libQt5Widgets.so.5), debug64(libc.so.6), debug64(libgcc_s.so.1), debug64(libpthread.so.0), debug64(libstdc++.so.6), debug64(libzbarqt.so.0)
Processing files: libzbar-qt5-debuginfo-0.23.1-alt2
Finding Provides (using /usr/lib/rpm/find-provides)
Executing: /bin/sh -e /usr/src/tmp/rpm-tmp.aJdp25
find-provides: running scripts (debuginfo)
Finding Requires (using /usr/lib/rpm/find-requires)
Executing: /bin/sh -e /usr/src/tmp/rpm-tmp.mvXaI1
find-requires: running scripts (debuginfo)
Provides: debug64(libzbarqt.so.0)
Requires: libzbar-qt5 = 0.23.1-alt2, debug64(libQt5Core.so.5), debug64(libQt5Gui.so.5), debug64(libQt5Widgets.so.5), debug64(libQt5X11Extras.so.5), debug64(libc.so.6), debug64(libgcc_s.so.1), debug64(libstdc++.so.6), debug64(libzbar.so.0)
Adding to zbar-debuginfo a strict dependency on zbar
Adding to libzbar-debuginfo a strict dependency on libzbar
Adding to libzbar-gtk3-debuginfo a strict dependency on libzbar-gtk3
Adding to python3-module-zbar-debuginfo a strict dependency on python3-module-zbar
Adding to zbar-gtk-debuginfo a strict dependency on zbar-gtk
Adding to zbar-qt5-debuginfo a strict dependency on zbar-qt5
Adding to libzbar-qt5-debuginfo a strict dependency on libzbar-qt5
Adding to zbar a strict dependency on libzbar
Adding to libzbar-devel a strict dependency on libzbar
Adding to libzbar-gtk3 a strict dependency on libzbar
Adding to libzbar-gtk3-devel a strict dependency on libzbar-devel
Adding to libzbar-gtk3-devel a strict dependency on libzbar-gtk3
Adding to python3-module-zbar a strict dependency on libzbar
Adding to zbar-gtk a strict dependency on libzbar
Adding to zbar-gtk a strict dependency on libzbar-gtk3
Adding to zbar-qt5 a strict dependency on libzbar-qt5
Adding to libzbar-qt5 a strict dependency on libzbar
Adding to libzbar-qt5-devel a strict dependency on libzbar-devel
Adding to libzbar-qt5-devel a strict dependency on libzbar-qt5
Adding to zbar-debuginfo a strict dependency on libzbar-debuginfo
Adding to libzbar-gtk3-debuginfo a strict dependency on libzbar-debuginfo
Adding to python3-module-zbar-debuginfo a strict dependency on libzbar-debuginfo
Adding to zbar-gtk-debuginfo a strict dependency on libzbar-debuginfo
Adding to zbar-gtk-debuginfo a strict dependency on libzbar-gtk3-debuginfo
Adding to zbar-qt5-debuginfo a strict dependency on libzbar-qt5-debuginfo
Adding to libzbar-qt5-debuginfo a strict dependency on libzbar-debuginfo
Removing from zbar-debuginfo 1 sources provided by libzbar-debuginfo
also prunning dir /usr/src/debug/zbar-0.23.1/include
Removing from libzbar-gtk3-debuginfo 1 sources provided by libzbar-debuginfo
Removing from python3-module-zbar-debuginfo 1 sources provided by libzbar-debuginfo
also prunning dir /usr/src/debug/zbar-0.23.1/include
Removing from zbar-gtk-debuginfo 1 sources provided by libzbar-debuginfo
Adding to zbar-qt5-debuginfo a strict dependency on libzbar-debuginfo
Removing from zbar-qt5-debuginfo 1 sources provided by libzbar-debuginfo
Removing from libzbar-qt5-debuginfo 1 sources provided by libzbar-debuginfo
Removing from zbar-gtk-debuginfo 1 sources provided by libzbar-gtk3-debuginfo
also prunning dir /usr/src/debug/zbar-0.23.1/include/zbar
also prunning dir /usr/src/debug/zbar-0.23.1/include
Removing from zbar-qt5-debuginfo 4 sources provided by libzbar-qt5-debuginfo
also prunning dir /usr/src/debug/zbar-0.23.1/include/zbar
also prunning dir /usr/src/debug/zbar-0.23.1/include
Removing 1 extra deps from zbar due to dependency on libzbar
Removing 1 extra deps from libzbar-devel due to dependency on libzbar
Removing 1 extra deps from libzbar-gtk3 due to dependency on libzbar
Removing 2 extra deps from python3-module-zbar due to dependency on libzbar
Removing 1 extra deps from zbar-gtk due to dependency on libzbar
Removing 1 extra deps from libzbar-qt5 due to dependency on libzbar
Removing 2 extra deps from libzbar-gtk3-devel due to dependency on libzbar-devel
Removing 2 extra deps from libzbar-qt5-devel due to dependency on libzbar-devel
Removing 1 extra deps from libzbar-gtk3-devel due to dependency on libzbar-gtk3
Removing 1 extra deps from zbar-gtk due to dependency on libzbar-gtk3
Removing 1 extra deps from zbar-qt5 due to dependency on libzbar-qt5
Removing 1 extra deps from libzbar-qt5-devel due to dependency on libzbar-qt5
Removing 1 extra deps from zbar-debuginfo due to dependency on libzbar-debuginfo
Removing 1 extra deps from libzbar-gtk3-debuginfo due to dependency on libzbar-debuginfo
Removing 1 extra deps from python3-module-zbar-debuginfo due to dependency on libzbar-debuginfo
Removing 1 extra deps from zbar-gtk-debuginfo due to dependency on libzbar-debuginfo
Removing 1 extra deps from libzbar-qt5-debuginfo due to dependency on libzbar-debuginfo
Removing 1 extra deps from zbar-gtk-debuginfo due to dependency on libzbar-gtk3-debuginfo
Removing 1 extra deps from zbar-qt5-debuginfo due to dependency on libzbar-qt5-debuginfo
Removing 5 extra deps from zbar due to repentancy on libzbar
Removing 4 extra deps from libzbar-gtk3 due to repentancy on libzbar
Removing 3 extra deps from python3-module-zbar due to repentancy on libzbar
Removing 6 extra deps from zbar-gtk due to repentancy on libzbar
Removing 6 extra deps from zbar-qt5 due to repentancy on libzbar
Removing 5 extra deps from libzbar-qt5 due to repentancy on libzbar
Removing 1 extra deps from libzbar-gtk3-devel due to repentancy on libzbar-devel
Removing 1 extra deps from libzbar-qt5-devel due to repentancy on libzbar-devel
Removing 2 extra deps from zbar-gtk due to repentancy on libzbar-gtk3
Removing 8 extra deps from zbar-qt5 due to repentancy on libzbar-qt5
Removing 1 extra deps from zbar-debuginfo due to repentancy on libzbar-debuginfo
Removing 1 extra deps from libzbar-gtk3-debuginfo due to repentancy on libzbar-debuginfo
Removing 1 extra deps from python3-module-zbar-debuginfo due to repentancy on libzbar-debuginfo
Removing 2 extra deps from zbar-gtk-debuginfo due to repentancy on libzbar-debuginfo
Removing 2 extra deps from zbar-qt5-debuginfo due to repentancy on libzbar-debuginfo
Removing 1 extra deps from libzbar-qt5-debuginfo due to repentancy on libzbar-debuginfo
Removing 5 extra deps from zbar-gtk-debuginfo due to repentancy on libzbar-gtk3-debuginfo
Removing 6 extra deps from zbar-qt5-debuginfo due to repentancy on libzbar-qt5-debuginfo
warning: Installed (but unpackaged) file(s) found:
    /etc/dbus-1/system.d/org.linuxtv.Zbar.conf
    /usr/lib64/python3/site-packages/zbar.la
    /usr/share/doc/zbar/ABOUT-NLS
    /usr/share/doc/zbar/COPYING
    /usr/share/locale/pt_BR/LC_MESSAGES/zbar.mo
Wrote: /usr/src/RPM/RPMS/x86_64/zbar-0.23.1-alt2.x86_64.rpm (w2.lzdio)
Wrote: /usr/src/RPM/RPMS/x86_64/libzbar-0.23.1-alt2.x86_64.rpm (w2.lzdio)
Wrote: /usr/src/RPM/RPMS/x86_64/libzbar-devel-0.23.1-alt2.x86_64.rpm (w2.lzdio)
Wrote: /usr/src/RPM/RPMS/x86_64/libzbar-devel-static-0.23.1-alt2.x86_64.rpm (w2.lzdio)
Wrote: /usr/src/RPM/RPMS/x86_64/libzbar-gtk3-0.23.1-alt2.x86_64.rpm (w2.lzdio)
Wrote: /usr/src/RPM/RPMS/x86_64/libzbar-gtk3-devel-0.23.1-alt2.x86_64.rpm (w2.lzdio)
Wrote: /usr/src/RPM/RPMS/x86_64/libzbar-gtk3-devel-static-0.23.1-alt2.x86_64.rpm (w2.lzdio)
Wrote: /usr/src/RPM/RPMS/x86_64/python3-module-zbar-0.23.1-alt2.x86_64.rpm (w2.lzdio)
Wrote: /usr/src/RPM/RPMS/x86_64/zbar-gtk-0.23.1-alt2.x86_64.rpm (w2.lzdio)
Wrote: /usr/src/RPM/RPMS/x86_64/zbar-qt5-0.23.1-alt2.x86_64.rpm (w2.lzdio)
Wrote: /usr/src/RPM/RPMS/x86_64/libzbar-qt5-0.23.1-alt2.x86_64.rpm (w2.lzdio)
Wrote: /usr/src/RPM/RPMS/x86_64/libzbar-qt5-devel-0.23.1-alt2.x86_64.rpm (w2.lzdio)
Wrote: /usr/src/RPM/RPMS/x86_64/libzbar-qt5-devel-static-0.23.1-alt2.x86_64.rpm (w2.lzdio)
Wrote: /usr/src/RPM/RPMS/x86_64/zbar-debuginfo-0.23.1-alt2.x86_64.rpm (w2.lzdio)
Wrote: /usr/src/RPM/RPMS/x86_64/libzbar-debuginfo-0.23.1-alt2.x86_64.rpm (w2.lzdio)
Wrote: /usr/src/RPM/RPMS/x86_64/libzbar-gtk3-debuginfo-0.23.1-alt2.x86_64.rpm (w2.lzdio)
Wrote: /usr/src/RPM/RPMS/x86_64/python3-module-zbar-debuginfo-0.23.1-alt2.x86_64.rpm (w2.lzdio)
Wrote: /usr/src/RPM/RPMS/x86_64/zbar-gtk-debuginfo-0.23.1-alt2.x86_64.rpm (w2.lzdio)
Wrote: /usr/src/RPM/RPMS/x86_64/zbar-qt5-debuginfo-0.23.1-alt2.x86_64.rpm (w2.lzdio)
Wrote: /usr/src/RPM/RPMS/x86_64/libzbar-qt5-debuginfo-0.23.1-alt2.x86_64.rpm (w2.lzdio)
93.91user 16.15system 2:21.76elapsed 77%CPU (0avgtext+0avgdata 465356maxresident)k
0inputs+0outputs (0major+6305159minor)pagefaults 0swaps
112.06user 21.64system 2:51.90elapsed 77%CPU (0avgtext+0avgdata 465356maxresident)k
0inputs+0outputs (0major+7237924minor)pagefaults 0swaps
--- libzbar-qt5-devel-0.23.1-alt2.x86_64.rpm.repo	2021-03-03 15:36:17.000000000 +0000
+++ libzbar-qt5-devel-0.23.1-alt2.x86_64.rpm.hasher	2021-04-02 06:07:40.115859692 +0000
@@ -6,2 +6,3 @@
 Requires: pkgconfig(Qt5Gui) >= 5
+Requires: qt5-base-devel  
 Requires: libzbar-devel = 0.23.1-alt2:sisyphus+267015.2700.7.1