<86>Mar  5 00:45:07 userdel[1812286]: delete user 'rooter'
<86>Mar  5 00:45:07 userdel[1812286]: removed group 'rooter' owned by 'rooter'
<86>Mar  5 00:45:07 userdel[1812286]: removed shadow group 'rooter' owned by 'rooter'
<86>Mar  5 00:45:07 groupadd[1812298]: group added to /etc/group: name=rooter, GID=675
<86>Mar  5 00:45:07 groupadd[1812298]: group added to /etc/gshadow: name=rooter
<86>Mar  5 00:45:07 groupadd[1812298]: new group: name=rooter, GID=675
<86>Mar  5 00:45:07 useradd[1812308]: new user: name=rooter, UID=675, GID=675, home=/root, shell=/bin/bash
<86>Mar  5 00:45:07 userdel[1812320]: delete user 'builder'
<86>Mar  5 00:45:07 userdel[1812320]: removed group 'builder' owned by 'builder'
<86>Mar  5 00:45:07 userdel[1812320]: removed shadow group 'builder' owned by 'builder'
<86>Mar  5 00:45:07 groupadd[1812330]: group added to /etc/group: name=builder, GID=676
<86>Mar  5 00:45:07 groupadd[1812330]: group added to /etc/gshadow: name=builder
<86>Mar  5 00:45:07 groupadd[1812330]: new group: name=builder, GID=676
<86>Mar  5 00:45:07 useradd[1812337]: new user: name=builder, UID=676, GID=676, home=/usr/src, shell=/bin/bash
/usr/src/in/srpm/pcc-1.0.0-alt2.src.rpm: exception not found in '/usr/share/license-exception' directory: advertising
<13>Mar  5 00:45:08 rpmi: flex-2.6.4.0.88.9801-alt1 sisyphus+221902.2300.4.1 1550596258 installed
Building target platforms: x86_64
Building for target x86_64
Wrote: /usr/src/in/nosrpm/pcc-1.0.0-alt2.nosrc.rpm (w1.gzdio)
Installing pcc-1.0.0-alt2.src.rpm
Building target platforms: x86_64
Building for target x86_64
Executing(%prep): /bin/sh -e /usr/src/tmp/rpm-tmp.86892
+ umask 022
+ /bin/mkdir -p /usr/src/RPM/BUILD
+ cd /usr/src/RPM/BUILD
+ cd /usr/src/RPM/BUILD
+ rm -rf pcc-1.0.0
+ echo 'Source #0 (pcc-1.0.0.tgz):'
Source #0 (pcc-1.0.0.tgz):
+ /bin/gzip -dc /usr/src/RPM/SOURCES/pcc-1.0.0.tgz
+ /bin/tar -xf -
+ cd pcc-1.0.0
+ echo 'Source #1 (pcc-libs-1.0.0.tgz):'
Source #1 (pcc-libs-1.0.0.tgz):
+ /bin/gzip -dc /usr/src/RPM/SOURCES/pcc-libs-1.0.0.tgz
+ /bin/tar -xf -
+ /bin/chmod -c -Rf u+rwX,go-w .
+ find . -name Makefile.in
+ xargs sed -i 's| -O | |g'
+ mv pcc-libs-1.0.0 pcc-libs
+ echo 'Patch #0 (pcc-090808-optflags.patch):'
Patch #0 (pcc-090808-optflags.patch):
+ /usr/bin/patch -p1
patching file pcc-libs/csu/linux/Makefile
Hunk #1 succeeded at 26 (offset 1 line).
+ exit 0
Executing(%build): /bin/sh -e /usr/src/tmp/rpm-tmp.86892
+ umask 022
+ /bin/mkdir -p /usr/src/RPM/BUILD
+ cd /usr/src/RPM/BUILD
+ cd pcc-1.0.0
+ export archdir=amd64
+ archdir=amd64
+ export 'FLAGS=-pipe -frecord-gcc-switches -Wall -g -O2'
+ FLAGS='-pipe -frecord-gcc-switches -Wall -g -O2'
+ export CC=gcc
+ CC=gcc
+ export 'CPP=gcc -E'
+ CPP='gcc -E'
++ echo -pipe -frecord-gcc-switches -Wall -g -O2
++ sed -e 's/\(^\| \)-g\($\| \)/ /g'
+ export 'CFLAGS_NODEBUG=-pipe -frecord-gcc-switches -Wall -O2'
+ CFLAGS_NODEBUG='-pipe -frecord-gcc-switches -Wall -O2'
+ cd pcc-libs
+ export 'CFLAGS=-pipe -frecord-gcc-switches -Wall -g -O2'
+ CFLAGS='-pipe -frecord-gcc-switches -Wall -g -O2'
+ export 'CXXFLAGS=-pipe -frecord-gcc-switches -Wall -g -O2'
+ CXXFLAGS='-pipe -frecord-gcc-switches -Wall -g -O2'
+ export 'FFLAGS=-pipe -frecord-gcc-switches -Wall -g -O2'
+ FFLAGS='-pipe -frecord-gcc-switches -Wall -g -O2'
+ ./configure --program-prefix= --prefix=/usr --exec-prefix=/usr --bindir=/usr/bin --sbindir=/usr/sbin --sysconfdir=/etc --datadir=/usr/share --includedir=/usr/include --libdir=/usr/lib64 --libexecdir=/usr/lib --localstatedir=/var/lib --sharedstatedir=/var/lib --mandir=/usr/share/man --infodir=/usr/share/info
checking whether make sets $(MAKE)... yes
checking for a BSD-compatible install... /bin/install -c
checking build system type... x86_64-unknown-linux-gnu
checking host system type... x86_64-unknown-linux-gnu
checking target system type... x86_64-unknown-linux-gnu
checking for ar... ar
checking for ranlib... ranlib
configure: creating ./config.status
config.status: creating Makefile
config.status: creating csu/Makefile
config.status: creating libsoftfloat/Makefile
config.status: creating libpcc/Makefile
+ make 'CFLAGS=-Iamd64 -Ilinux -I. -pipe -frecord-gcc-switches -Wall -g -O2' 'CFLAGS_NODEBUG=-Iamd64 -Ilinux -I. -pipe -frecord-gcc-switches -Wall -O2'
make: Entering directory '/usr/src/RPM/BUILD/pcc-1.0.0/pcc-libs'
cd libsoftfloat; make all -w -Otarget
make[1]: Entering directory '/usr/src/RPM/BUILD/pcc-1.0.0/pcc-libs/libsoftfloat'
gcc -DSOFTFLOAT_FOR_GCC -I. -I./arch/amd64 -Iamd64 -Ilinux -I. -pipe -frecord-gcc-switches -Wall -g -O2 -c bits64/softfloat.c
bits64/softfloat.c: In function 'subFloat32Sigs':
bits64/softfloat.c:1755:45: warning: comparison between 'fp_rnd' and 'enum <anonymous>' [-Wenum-compare]
 1755 |     return packFloat32( float_rounding_mode == float_round_down, 0, 0 );
      |                                             ^~
bits64/softfloat.c: In function 'subFloat64Sigs':
bits64/softfloat.c:2721:45: warning: comparison between 'fp_rnd' and 'enum <anonymous>' [-Wenum-compare]
 2721 |     return packFloat64( float_rounding_mode == float_round_down, 0, 0 );
      |                                             ^~
gcc -DSOFTFLOAT_FOR_GCC -I. -I./arch/amd64 -Iamd64 -Ilinux -I. -pipe -frecord-gcc-switches -Wall -g -O2 -c fpgetround.c
gcc -DSOFTFLOAT_FOR_GCC -I. -I./arch/amd64 -Iamd64 -Ilinux -I. -pipe -frecord-gcc-switches -Wall -g -O2 -c fpsetround.c
gcc -DSOFTFLOAT_FOR_GCC -I. -I./arch/amd64 -Iamd64 -Ilinux -I. -pipe -frecord-gcc-switches -Wall -g -O2 -c fpgetmask.c
gcc -DSOFTFLOAT_FOR_GCC -I. -I./arch/amd64 -Iamd64 -Ilinux -I. -pipe -frecord-gcc-switches -Wall -g -O2 -c fpsetmask.c
gcc -DSOFTFLOAT_FOR_GCC -I. -I./arch/amd64 -Iamd64 -Ilinux -I. -pipe -frecord-gcc-switches -Wall -g -O2 -c fpgetsticky.c
gcc -DSOFTFLOAT_FOR_GCC -I. -I./arch/amd64 -Iamd64 -Ilinux -I. -pipe -frecord-gcc-switches -Wall -g -O2 -c fpsetsticky.c
ar r libpccsoftfloat.a softfloat.o fpgetround.o fpsetround.o fpgetmask.o fpsetmask.o fpgetsticky.o fpsetsticky.o
ar: creating libpccsoftfloat.a
ranlib libpccsoftfloat.a
make[1]: Leaving directory '/usr/src/RPM/BUILD/pcc-1.0.0/pcc-libs/libsoftfloat'
cd libpcc; make all -w -Otarget
make[1]: Entering directory '/usr/src/RPM/BUILD/pcc-1.0.0/pcc-libs/libpcc'
gcc -I. -D__LITTLE_ENDIAN__=1 -Dos_linux -Iamd64 -Ilinux -I. -pipe -frecord-gcc-switches -Wall -g -O2 -c cmpdi2.c
gcc -I. -D__LITTLE_ENDIAN__=1 -Dos_linux -Iamd64 -Ilinux -I. -pipe -frecord-gcc-switches -Wall -g -O2 -c divdi3.c
gcc -I. -D__LITTLE_ENDIAN__=1 -Dos_linux -Iamd64 -Ilinux -I. -pipe -frecord-gcc-switches -Wall -g -O2 -c fixdfdi.c
gcc -I. -D__LITTLE_ENDIAN__=1 -Dos_linux -Iamd64 -Ilinux -I. -pipe -frecord-gcc-switches -Wall -g -O2 -c fixsfdi.c
gcc -I. -D__LITTLE_ENDIAN__=1 -Dos_linux -Iamd64 -Ilinux -I. -pipe -frecord-gcc-switches -Wall -g -O2 -c fixunsdfdi.c
gcc -I. -D__LITTLE_ENDIAN__=1 -Dos_linux -Iamd64 -Ilinux -I. -pipe -frecord-gcc-switches -Wall -g -O2 -c fixunssfdi.c
gcc -I. -D__LITTLE_ENDIAN__=1 -Dos_linux -Iamd64 -Ilinux -I. -pipe -frecord-gcc-switches -Wall -g -O2 -c floatdidf.c
gcc -I. -D__LITTLE_ENDIAN__=1 -Dos_linux -Iamd64 -Ilinux -I. -pipe -frecord-gcc-switches -Wall -g -O2 -c floatdisf.c
gcc -I. -D__LITTLE_ENDIAN__=1 -Dos_linux -Iamd64 -Ilinux -I. -pipe -frecord-gcc-switches -Wall -g -O2 -c floatunsdidf.c
gcc -I. -D__LITTLE_ENDIAN__=1 -Dos_linux -Iamd64 -Ilinux -I. -pipe -frecord-gcc-switches -Wall -g -O2 -c moddi3.c
gcc -I. -D__LITTLE_ENDIAN__=1 -Dos_linux -Iamd64 -Ilinux -I. -pipe -frecord-gcc-switches -Wall -g -O2 -c muldi3.c
gcc -I. -D__LITTLE_ENDIAN__=1 -Dos_linux -Iamd64 -Ilinux -I. -pipe -frecord-gcc-switches -Wall -g -O2 -c negdi2.c
gcc -I. -D__LITTLE_ENDIAN__=1 -Dos_linux -Iamd64 -Ilinux -I. -pipe -frecord-gcc-switches -Wall -g -O2 -c qdivrem.c
gcc -I. -D__LITTLE_ENDIAN__=1 -Dos_linux -Iamd64 -Ilinux -I. -pipe -frecord-gcc-switches -Wall -g -O2 -c ucmpdi2.c
gcc -I. -D__LITTLE_ENDIAN__=1 -Dos_linux -Iamd64 -Ilinux -I. -pipe -frecord-gcc-switches -Wall -g -O2 -c udivdi3.c
gcc -I. -D__LITTLE_ENDIAN__=1 -Dos_linux -Iamd64 -Ilinux -I. -pipe -frecord-gcc-switches -Wall -g -O2 -c umoddi3.c
gcc -I. -D__LITTLE_ENDIAN__=1 -Dos_linux -Iamd64 -Ilinux -I. -pipe -frecord-gcc-switches -Wall -g -O2 -c ashldi3.c
gcc -I. -D__LITTLE_ENDIAN__=1 -Dos_linux -Iamd64 -Ilinux -I. -pipe -frecord-gcc-switches -Wall -g -O2 -c ashrdi3.c
gcc -I. -D__LITTLE_ENDIAN__=1 -Dos_linux -Iamd64 -Ilinux -I. -pipe -frecord-gcc-switches -Wall -g -O2 -c lshrdi3.c
gcc -I. -D__LITTLE_ENDIAN__=1 -Dos_linux -Iamd64 -Ilinux -I. -pipe -frecord-gcc-switches -Wall -g -O2 -c bitcnt.c
gcc -I. -D__LITTLE_ENDIAN__=1 -Dos_linux -Iamd64 -Ilinux -I. -pipe -frecord-gcc-switches -Wall -g -O2 -c _alloca.c
gcc -I. -D__LITTLE_ENDIAN__=1 -Dos_linux -Iamd64 -Ilinux -I. -pipe -frecord-gcc-switches -Wall -g -O2 -c ssp.c
ssp.c: In function '__ssp_init':
ssp.c:52:7: warning: implicit declaration of function 'open' [-Wimplicit-function-declaration]
   52 |  fd = open("/dev/urandom", 0);
      |       ^~~~
ssp.c:54:8: warning: implicit declaration of function 'read' [-Wimplicit-function-declaration]
   54 |   sz = read(fd, (char *)&__stack_chk_guard,
      |        ^~~~
ssp.c:56:3: warning: implicit declaration of function 'close' [-Wimplicit-function-declaration]
   56 |   close(fd);
      |   ^~~~~
ssp.c: In function '__stack_chk_fail':
ssp.c:68:2: warning: implicit declaration of function 'write' [-Wimplicit-function-declaration]
   68 |  write(2, __progname, strlen(__progname));
      |  ^~~~~
ar r libpcc.a cmpdi2.o divdi3.o fixdfdi.o fixsfdi.o fixunsdfdi.o fixunssfdi.o floatdidf.o floatdisf.o floatunsdidf.o moddi3.o muldi3.o negdi2.o qdivrem.o ucmpdi2.o udivdi3.o umoddi3.o ashldi3.o ashrdi3.o lshrdi3.o bitcnt.o _alloca.o ssp.o
ar: creating libpcc.a
ranlib libpcc.a
make[1]: Leaving directory '/usr/src/RPM/BUILD/pcc-1.0.0/pcc-libs/libpcc'
cd csu; make all -w -Otarget
make[1]: Entering directory '/usr/src/RPM/BUILD/pcc-1.0.0/pcc-libs/csu'
if test -f ./linux/Makefile ; then make -f ./linux/Makefile -w CC=gcc MACH=amd64 PCCLIBDIR=/usr/lib64/pcc/x86_64-unknown-linux-gnu/1.0.0.RELEASE/lib VPATH=./linux SRCDIR=./linux/ all ; fi
make[2]: Entering directory '/usr/src/RPM/BUILD/pcc-1.0.0/pcc-libs/csu'
gcc -O -Iamd64 -Ilinux -I. -pipe -frecord-gcc-switches -Wall -g -O2 -c -o crt0.o ./linux/amd64/crt0.c
gcc -O -Iamd64 -Ilinux -I. -pipe -frecord-gcc-switches -Wall -g -O2 -c -o crt1.o ./linux/amd64/crt0.c
gcc -O -DPROFILE -Iamd64 -Ilinux -I. -pipe -frecord-gcc-switches -Wall -g -O2 -c -o gcrt1.o ./linux/amd64/crt0.c
gcc -O -Iamd64 -Ilinux -I. -pipe -frecord-gcc-switches -Wall -g -O2 -c -o crti.o ./linux/amd64/crti.c
gcc -O -Iamd64 -Ilinux -I. -pipe -frecord-gcc-switches -Wall -g -O2 -c -o crtn.o ./linux/amd64/crtn.c
gcc -O -Iamd64 -Ilinux -I. -pipe -frecord-gcc-switches -Wall -O2 -c -o crtbegin.o ./linux/crtbegin.c
gcc -O -Iamd64 -Ilinux -I. -pipe -frecord-gcc-switches -Wall -g -O2 -c -o crtend.o ./linux/crtend.c
make[2]: Leaving directory '/usr/src/RPM/BUILD/pcc-1.0.0/pcc-libs/csu'
make[1]: Leaving directory '/usr/src/RPM/BUILD/pcc-1.0.0/pcc-libs/csu'
make: Leaving directory '/usr/src/RPM/BUILD/pcc-1.0.0/pcc-libs'
+ cd ..
+ export 'CFLAGS=-pipe -frecord-gcc-switches -Wall -g -O2'
+ CFLAGS='-pipe -frecord-gcc-switches -Wall -g -O2'
+ export 'CXXFLAGS=-pipe -frecord-gcc-switches -Wall -g -O2'
+ CXXFLAGS='-pipe -frecord-gcc-switches -Wall -g -O2'
+ export 'FFLAGS=-pipe -frecord-gcc-switches -Wall -g -O2'
+ FFLAGS='-pipe -frecord-gcc-switches -Wall -g -O2'
+ ./configure --program-prefix= --prefix=/usr --exec-prefix=/usr --bindir=/usr/bin --sbindir=/usr/sbin --sysconfdir=/etc --datadir=/usr/share --includedir=/usr/include --libdir=/usr/lib64 --libexecdir=/usr/lib --localstatedir=/var/lib --sharedstatedir=/var/lib --mandir=/usr/share/man --infodir=/usr/share/info --with-assembler=/usr/bin/as --with-linker=/usr/bin/ld --with-libdir=/usr/lib64 --with-incdir=/usr/include --enable-tls
checking build system type... x86_64-unknown-linux-gnu
checking host system type... x86_64-unknown-linux-gnu
checking target system type... x86_64-unknown-linux-gnu
checking for gcc... gcc
checking for C compiler default output file name... a.out
checking whether the C compiler works... yes
checking whether we are cross compiling... no
checking for suffix of executables... 
checking for suffix of object files... o
checking whether we are using the GNU C compiler... yes
checking whether gcc accepts -g... yes
checking for gcc option to accept ISO C89... none needed
checking whether gcc accepts -Wall... yes
checking whether gcc accepts -Wmissing-prototypes... yes
checking whether gcc accepts -Wstrict-prototypes... yes
checking whether gcc accepts -Wshadow... yes
checking whether gcc accepts -Wsign-compare... yes
checking whether gcc accepts -Wtruncate... no
checking for a C compiler for mkext... not cross compiling
checking how to run the C preprocessor... gcc -E
checking for grep that handles long lines and -e... /bin/grep
checking for egrep... /bin/grep -E
checking for ANSI C header files... yes
checking for sys/types.h... yes
checking for sys/stat.h... yes
checking for stdlib.h... yes
checking for string.h... yes
checking for memory.h... yes
checking for strings.h... yes
checking for inttypes.h... yes
checking for stdint.h... yes
checking for unistd.h... yes
checking for C99 printf size specifiers... yes
checking for C99 variadic macro support... yes
checking whether byte ordering is bigendian... no
checking whether make sets $(MAKE)... yes
checking for a BSD-compatible install... /bin/install -c
checking for bison... bison -y
checking for strip... yes
checking for flex... flex
checking lex output file root... lex.yy
checking lex library... -lfl
checking whether yytext is a pointer... yes
checking for string.h... (cached) yes
checking malloc.h usability... yes
checking malloc.h presence... yes
checking for malloc.h... yes
checking libgen.h usability... yes
checking libgen.h presence... yes
checking for libgen.h... yes
checking for sys/wait.h that is POSIX.1 compatible... yes
checking for strtold... yes
checking for vsnprintf... yes
checking for snprintf... yes
checking for mkstemp... yes
checking for strlcat... yes
checking for strlcpy... yes
checking for basename... yes
checking for getopt... yes
checking for ffs... yes
checking for vfork... yes
configure: creating ./config.status
config.status: creating Makefile
config.status: creating cc/Makefile
config.status: creating cc/cc/Makefile
config.status: creating cc/cpp/Makefile
config.status: creating cc/ccom/Makefile
config.status: creating f77/Makefile
config.status: creating f77/f77/Makefile
config.status: creating f77/fcom/Makefile
config.status: creating config.h

Target CPU is .................... amd64
Target ABI is .................... elf
Target OS is ..................... linux
Compiler is called ............... pcc
Installing compiler into ......... /usr/bin
Installing pre-processor into .... /usr/lib
Using assembler .................. /usr/bin/as
Using linker ..................... /usr/bin/ld
Using include path ............... /usr/include
Using library path ............... /usr/lib64
Has TLS support .................. yes
Has GCC compatibility ............ yes
Type of wchar_t is ............... INT (4 chars)

Configure finished.  Do 'make && make install' to compile and install.

+ make
make: Entering directory '/usr/src/RPM/BUILD/pcc-1.0.0'
cd cc && make all -w -Otarget
make[1]: Entering directory '/usr/src/RPM/BUILD/pcc-1.0.0/cc'
cd cc; make all -w -Otarget
make[2]: Entering directory '/usr/src/RPM/BUILD/pcc-1.0.0/cc/cc'
gcc  -DLIBEXECDIR=\"/usr/lib/\" -DGCC_COMPAT -DINCLUDEDIR=\"/usr/include/\" -DPCCINCDIR=\"/usr/lib64/pcc/x86_64-unknown-linux-gnu/1.0.0.RELEASE/include/\" -DPCCLIBDIR=\"/usr/lib64/pcc/x86_64-unknown-linux-gnu/1.0.0.RELEASE/lib/\" -Dos_linux -DTARGMACH=amd64 -Dmach_amd64 -I../.. -I../../os/linux -I../../mip -I../../arch/amd64 -pipe -frecord-gcc-switches -Wall -g -O2  -Wall -Wmissing-prototypes -Wstrict-prototypes -Wshadow -Wsign-compare -c cc.c
gcc  -DLIBEXECDIR=\"/usr/lib/\" -DGCC_COMPAT -DINCLUDEDIR=\"/usr/include/\" -DPCCINCDIR=\"/usr/lib64/pcc/x86_64-unknown-linux-gnu/1.0.0.RELEASE/include/\" -DPCCLIBDIR=\"/usr/lib64/pcc/x86_64-unknown-linux-gnu/1.0.0.RELEASE/lib/\" -Dos_linux -DTARGMACH=amd64 -Dmach_amd64 -I../.. -I../../os/linux -I../../mip -I../../arch/amd64 -pipe -frecord-gcc-switches -Wall -g -O2  -Wall -Wmissing-prototypes -Wstrict-prototypes -Wshadow -Wsign-compare -c -o compat.o ../../mip/compat.c
gcc -pipe -frecord-gcc-switches -Wall -g -O2  -Wall -Wmissing-prototypes -Wstrict-prototypes -Wshadow -Wsign-compare  cc.o compat.o -o pcc
make[2]: Leaving directory '/usr/src/RPM/BUILD/pcc-1.0.0/cc/cc'
cd cpp; make all -w -Otarget
make[2]: Entering directory '/usr/src/RPM/BUILD/pcc-1.0.0/cc/cpp'
bison -y -d  cpy.y
gcc  -DGCC_COMPAT -DCPP_DEBUG -I. -I../.. -I. -I../../mip -I../../arch/amd64 -pipe -frecord-gcc-switches -Wall -g -O2  -Wall -Wmissing-prototypes -Wstrict-prototypes -Wshadow -Wsign-compare -c -o cpy.o y.tab.c
gcc  -DGCC_COMPAT -DCPP_DEBUG -I. -I../.. -I. -I../../mip -I../../arch/amd64 -pipe -frecord-gcc-switches -Wall -g -O2  -Wall -Wmissing-prototypes -Wstrict-prototypes -Wshadow -Wsign-compare -c cpp.c
cpp.c: In function 'include':
cpp.c:405:9: warning: variable 'it' set but not used [-Wunused-but-set-variable]
  405 |  int c, it;
      |         ^~
cpp.c: In function 'xwarning':
cpp.c:872:6: warning: variable 'dummy' set but not used [-Wunused-but-set-variable]
  872 |  int dummy;
      |      ^~~~~
cpp.c: In function 'xerror':
cpp.c:889:6: warning: variable 'dummy' set but not used [-Wunused-but-set-variable]
  889 |  int dummy;
      |      ^~~~~
cpp.c: In function 'lookup':
cpp.c:1865:22: warning: variable 'sm' set but not used [-Wunused-but-set-variable]
 1865 |  const usch *k, *m, *sm;
      |                      ^~
cpp.c: In function 'xwarning':
cpp.c:878:3: warning: ignoring return value of 'write' declared with attribute 'warn_unused_result' [-Wunused-result]
  878 |   write (2, t, strlen((char *)t));
      |   ^~~~~~~~~~~~~~~~~~~~~~~~~~~~~~~
gcc  -DGCC_COMPAT -DCPP_DEBUG -I. -I../.. -I. -I../../mip -I../../arch/amd64 -pipe -frecord-gcc-switches -Wall -g -O2  -Wall -Wmissing-prototypes -Wstrict-prototypes -Wshadow -Wsign-compare -c token.c
token.c: In function 'fastscan':
token.c:185:19: warning: variable 'onemore' set but not used [-Wunused-but-set-variable]
  185 |  int ch, i, ccnt, onemore;
      |                   ^~~~~~~
token.c: In function 'pushfile':
token.c:824:4: warning: ignoring return value of 'write' declared with attribute 'warn_unused_result' [-Wunused-result]
  824 |    write(ofd, ic->buffer, strlen((char *)ic->buffer));
      |    ^~~~~~~~~~~~~~~~~~~~~~~~~~~~~~~~~~~~~~~~~~~~~~~~~~
token.c: In function 'prtline':
token.c:859:4: warning: ignoring return value of 'write' declared with attribute 'warn_unused_result' [-Wunused-result]
  859 |    write(ofd, s, strlen((char *)s));
      |    ^~~~~~~~~~~~~~~~~~~~~~~~~~~~~~~~
gcc  -DGCC_COMPAT -DCPP_DEBUG -I. -I../.. -I. -I../../mip -I../../arch/amd64 -pipe -frecord-gcc-switches -Wall -g -O2  -Wall -Wmissing-prototypes -Wstrict-prototypes -Wshadow -Wsign-compare -c -o compat.o ../../mip/compat.c
gcc -pipe -frecord-gcc-switches -Wall -g -O2  -Wall -Wmissing-prototypes -Wstrict-prototypes -Wshadow -Wsign-compare  cpp.o cpy.o token.o compat.o -o cpp
ld: cpy.o:/usr/src/RPM/BUILD/pcc-1.0.0/cc/cpp/cpp.h:148: multiple definition of `slow'; cpp.o:/usr/src/RPM/BUILD/pcc-1.0.0/cc/cpp/cpp.h:148: first defined here
ld: cpy.o:/usr/src/RPM/BUILD/pcc-1.0.0/cc/cpp/cpp.h:113: multiple definition of `ifiles'; cpp.o:/usr/src/RPM/BUILD/pcc-1.0.0/cc/cpp/cpp.h:113: first defined here
ld: token.o:/usr/src/RPM/BUILD/pcc-1.0.0/cc/cpp/cpp.h:113: multiple definition of `ifiles'; cpp.o:/usr/src/RPM/BUILD/pcc-1.0.0/cc/cpp/cpp.h:113: first defined here
ld: token.o:/usr/src/RPM/BUILD/pcc-1.0.0/cc/cpp/cpp.h:148: multiple definition of `slow'; cpp.o:/usr/src/RPM/BUILD/pcc-1.0.0/cc/cpp/cpp.h:148: first defined here
collect2: error: ld returned 1 exit status
make[2]: *** [Makefile:41: cpp] Error 1
make[2]: Leaving directory '/usr/src/RPM/BUILD/pcc-1.0.0/cc/cpp'
make[1]: *** [Makefile:37: cpp] Error 2
make[1]: Leaving directory '/usr/src/RPM/BUILD/pcc-1.0.0/cc'
make: *** [Makefile:32: cc] Error 2
make: Leaving directory '/usr/src/RPM/BUILD/pcc-1.0.0'
error: Bad exit status from /usr/src/tmp/rpm-tmp.86892 (%build)


RPM build errors:
    Bad exit status from /usr/src/tmp/rpm-tmp.86892 (%build)
Command exited with non-zero status 1
5.10user 1.33system 0:06.01elapsed 107%CPU (0avgtext+0avgdata 42836maxresident)k
0inputs+0outputs (0major+576792minor)pagefaults 0swaps
hsh-rebuild: rebuild of `pcc-1.0.0-alt2.src.rpm' failed.
Command exited with non-zero status 1
8.39user 3.39system 0:11.17elapsed 105%CPU (0avgtext+0avgdata 112996maxresident)k
0inputs+0outputs (0major+817687minor)pagefaults 0swaps