<86>Jul  8 04:02:18 userdel[639421]: delete user 'rooter'
<86>Jul  8 04:02:18 groupadd[639536]: group added to /etc/group: name=rooter, GID=585
<86>Jul  8 04:02:18 groupadd[639536]: group added to /etc/gshadow: name=rooter
<86>Jul  8 04:02:18 groupadd[639536]: new group: name=rooter, GID=585
<86>Jul  8 04:02:18 useradd[639653]: new user: name=rooter, UID=585, GID=585, home=/root, shell=/bin/bash
<86>Jul  8 04:02:18 userdel[639976]: delete user 'builder'
<86>Jul  8 04:02:18 userdel[639976]: removed group 'builder' owned by 'builder'
<86>Jul  8 04:02:18 userdel[639976]: removed shadow group 'builder' owned by 'builder'
<86>Jul  8 04:02:18 groupadd[640234]: group added to /etc/group: name=builder, GID=586
<86>Jul  8 04:02:18 groupadd[640234]: group added to /etc/gshadow: name=builder
<86>Jul  8 04:02:18 groupadd[640234]: new group: name=builder, GID=586
<86>Jul  8 04:02:18 useradd[640292]: new user: name=builder, UID=586, GID=586, home=/usr/src, shell=/bin/bash
/usr/src/in/srpm/jss-4.6.2-alt2.src.rpm: license not found in '/usr/share/license' directory: MPLv1.1
<13>Jul  8 04:02:22 rpmi: rpm-macros-java-1:5.3.0-alt1_4jpp8 sisyphus+234467.100.1.1 1563037789 installed
<13>Jul  8 04:02:22 rpmi: rpm-macros-cmake-3.17.3-alt1 sisyphus+252398.100.2.1 1590762246 installed
<13>Jul  8 04:02:26 rpmi: libexpat-2.2.9-alt1 sisyphus+252464.200.2.1 1590958863 installed
<13>Jul  8 04:02:26 rpmi: libpng16-1.6.37-alt1 sisyphus+236677.100.2.1 1566917982 installed
<13>Jul  8 04:02:26 rpmi: libjpeg-2:2.0.2-alt1 sisyphus+226996.100.1.1 1554902884 installed
<13>Jul  8 04:02:26 rpmi: javapackages-filesystem-1:5.3.0-alt1_4jpp8 sisyphus+234467.100.1.1 1563037789 installed
<13>Jul  8 04:02:26 rpmi: javapackages-tools-1:5.3.0-alt1_4jpp8 sisyphus+234467.100.1.1 1563037789 installed
<13>Jul  8 04:02:26 rpmi: libnspr-1:4.26-alt1 sisyphus+254237.100.1.1 1593450631 installed
<13>Jul  8 04:02:26 rpmi: libcom_err-1.44.6-alt1 sisyphus+224154.100.1.1 1552091653 installed
<13>Jul  8 04:02:26 rpmi: xml-utils-1:2.9.10-alt3 sisyphus+245000.16400.79.1 1583229770 installed
<13>Jul  8 04:02:26 rpmi: liblksctp-1.0.17-alt2 1523113258 installed
<13>Jul  8 04:02:26 rpmi: libglvnd-7:1.3.2-alt1 sisyphus+254610.100.1.1 1594124262 installed
<13>Jul  8 04:02:26 rpmi: libffi6-1:3.2.1-alt4 sisyphus+251953.300.2.1 1589891021 installed
<13>Jul  8 04:02:26 rpmi: libwayland-server-1.18.0-alt1 sisyphus+245906.100.1.1 1581492497 installed
<13>Jul  8 04:02:26 rpmi: libuv-1.37.0-alt1 sisyphus+251308.100.1.1 1588855439 installed
<13>Jul  8 04:02:26 rpmi: libjsoncpp19-1.8.4-alt5 sisyphus+243670.100.1.1 1577521256 installed
<13>Jul  8 04:02:26 rpmi: libidn2-2.3.0-alt1 sisyphus+240846.100.1.2 1573870464 installed
<13>Jul  8 04:02:26 rpmi: libwayland-client-1.18.0-alt1 sisyphus+245906.100.1.1 1581492497 installed
<13>Jul  8 04:02:26 rpmi: lksctp-tools-1.0.17-alt2 1523113258 installed
<13>Jul  8 04:02:26 rpmi: libe2fs-1.44.6-alt1 sisyphus+224154.100.1.1 1552091653 installed
<13>Jul  8 04:02:26 rpmi: libnspr-devel-1:4.26-alt1 sisyphus+254237.100.1.1 1593450631 installed
<13>Jul  8 04:02:26 rpmi: java-common-1.6.0-alt1 sisyphus+234020.100.1.1 1562437039 installed
<13>Jul  8 04:02:26 rpmi: hamcrest-core-0:1.3-alt3_27jpp8 sisyphus+246429.100.1.1 1581833287 installed
<13>Jul  8 04:02:26 rpmi: slf4j-0:1.7.25-alt1_6jpp8 sisyphus+234787.100.1.2 1563401783 installed
<13>Jul  8 04:02:26 rpmi: libjasper-2.0.16-alt1 sisyphus+231386.100.1.1 1559568071 installed
<13>Jul  8 04:02:26 rpmi: zip-30000000:3.0-alt1 1332241778 installed
<13>Jul  8 04:02:26 rpmi: sgml-common-0.6.3-alt15 1423664786 installed
<13>Jul  8 04:02:26 rpmi: docbook-dtds-4.5-alt1 1223476557 installed
<13>Jul  8 04:02:27 rpmi: docbook-style-xsl-1.79.1-alt4 sisyphus+232871.100.1.1 1561238010 installed
<13>Jul  8 04:02:27 rpmi: libnatspec-0.3.1-alt2 1445691578 installed
<13>Jul  8 04:02:27 rpmi: unzip-6.0-alt3 sisyphus+244330.100.1.1 1579094112 installed
<13>Jul  8 04:02:27 rpmi: libgdbm-1.8.3-alt10 1454943313 installed
<13>Jul  8 04:02:27 rpmi: libpcsclite-1.9.0-alt1 sisyphus+253463.100.1.1 1592202073 installed
<13>Jul  8 04:02:27 rpmi: libsqlite3-3.32.3-alt1 sisyphus+253798.100.1.1 1592756027 installed
<13>Jul  8 04:02:27 rpmi: javazi-2020a-alt1 sisyphus+250575.200.1.1 1587740494 installed
<13>Jul  8 04:02:27 rpmi: libgif-4.1.6-alt3 1299634266 installed
<13>Jul  8 04:02:27 rpmi: liblz4-1:1.9.2-alt1 sisyphus+238585.100.2.2 1570066861 installed
<13>Jul  8 04:02:27 rpmi: libgpg-error-1.36-alt1 sisyphus+225621.300.1.1 1553521088 installed
<13>Jul  8 04:02:27 rpmi: libgcrypt20-1.8.5-alt3 sisyphus+239622.100.1.1 1571746563 installed
<13>Jul  8 04:02:27 rpmi: libsystemd-1:245.6-alt1 sisyphus+252793.100.1.1 1591265128 installed
<13>Jul  8 04:02:27 rpmi: libdbus-1.12.18-alt1 sisyphus+252758.100.1.1 1591203684 installed
<13>Jul  8 04:02:27 rpmi: libavahi-0.7-alt3 sisyphus+250384.100.2.1 1587547072 installed
<13>Jul  8 04:02:27 rpmi: libcups-2.3.1-alt1 sisyphus+247381.100.2.2 1583841503 installed
<13>Jul  8 04:02:27 rpmi: libxslt-1.1.34-alt2 sisyphus+248264.100.1.1 1584829787 installed
<13>Jul  8 04:02:28 rpmi: libgtk+2-locales-2.24.32-alt4 sisyphus+248211.200.2.1 1584869557 installed
<13>Jul  8 04:02:28 rpmi: libdatrie-0.2.9-alt1_6 1511686677 installed
<13>Jul  8 04:02:28 rpmi: libthai-0.1.28-alt1_1 sisyphus+226107.100.1.1 1554123079 installed
<13>Jul  8 04:02:28 rpmi: libfribidi-1.0.10-alt1 sisyphus+254557.100.1.1 1594020354 installed
<13>Jul  8 04:02:28 rpmi: libpixman-3:0.40.0-alt1 sisyphus+250700.100.1.1 1587970807 installed
<13>Jul  8 04:02:28 rpmi: libxshmfence-1.3-alt1 sisyphus+223149.1000.2.1 1551268594 installed
<13>Jul  8 04:02:28 rpmi: libpciaccess-1:0.16-alt1 sisyphus+234814.100.1.1 1563438297 installed
<13>Jul  8 04:02:28 rpmi: libdrm-1:2.4.102-alt1 sisyphus+252307.100.1.1 1590574831 installed
<13>Jul  8 04:02:28 rpmi: libgbm-4:20.1.2-alt1 sisyphus+254503.100.1.1 1593872935 installed
<13>Jul  8 04:02:28 rpmi: libatk-locales-2.36.0-alt1 sisyphus+249208.100.1.1 1585840405 installed
<13>Jul  8 04:02:28 rpmi: libatk-2.36.0-alt1 sisyphus+249208.100.1.1 1585840405 installed
<13>Jul  8 04:02:28 rpmi: libX11-locales-3:1.6.9-alt1 sisyphus+239210.100.1.1 1571056781 installed
<13>Jul  8 04:02:28 rpmi: libXdmcp-1.1.3-alt1 sisyphus+225206.600.1.2 1552949347 installed
<13>Jul  8 04:02:28 rpmi: libXau-1.0.9-alt1 sisyphus+223149.200.2.1 1551268156 installed
<13>Jul  8 04:02:28 rpmi: libxcb-1.14-alt1 sisyphus+247358.200.1.3 1583854223 installed
<13>Jul  8 04:02:28 rpmi: libX11-3:1.6.9-alt1 sisyphus+239210.100.1.1 1571056781 installed
<13>Jul  8 04:02:28 rpmi: libXext-1.3.4-alt1 sisyphus+225206.700.1.2 1552949422 installed
<13>Jul  8 04:02:28 rpmi: libXrender-0.9.8-alt1 1371312110 installed
<13>Jul  8 04:02:28 rpmi: libXfixes-5.0.3-alt1 sisyphus+226736.100.2.2 1554614842 installed
<13>Jul  8 04:02:28 rpmi: libXi-1.7.10-alt1 sisyphus+232786.300.1.1 1561106975 installed
<13>Jul  8 04:02:28 rpmi: libXcomposite-0.4.5-alt1 sisyphus+225206.300.1.2 1552949136 installed
<13>Jul  8 04:02:28 rpmi: libXdamage-1.1.5-alt1 sisyphus+225206.500.1.2 1552949282 installed
<13>Jul  8 04:02:28 rpmi: libXcursor-1.2.0-alt1 sisyphus+225206.400.1.2 1552949214 installed
<13>Jul  8 04:02:28 rpmi: libXrandr-1.5.2-alt1 sisyphus+225206.1300.1.2 1552949698 installed
<13>Jul  8 04:02:28 rpmi: libXxf86vm-1.1.4-alt2 1527672159 installed
<13>Jul  8 04:02:28 rpmi: libGLX-mesa-4:20.1.2-alt1 sisyphus+254503.100.1.1 1593872935 installed
<13>Jul  8 04:02:28 rpmi: libEGL-mesa-4:20.1.2-alt1 sisyphus+254503.100.1.1 1593872935 installed
<13>Jul  8 04:02:28 rpmi: libEGL-7:1.3.2-alt1 sisyphus+254610.100.1.1 1594124262 installed
<13>Jul  8 04:02:28 rpmi: libGLX-7:1.3.2-alt1 sisyphus+254610.100.1.1 1594124262 installed
<13>Jul  8 04:02:28 rpmi: libGL-7:1.3.2-alt1 sisyphus+254610.100.1.1 1594124262 installed
<13>Jul  8 04:02:28 rpmi: libXinerama-1.1.4-alt1 sisyphus+223149.300.2.1 1551268223 installed
<13>Jul  8 04:02:28 rpmi: libXtst-1.2.2-alt1 1369984880 installed
<13>Jul  8 04:02:28 rpmi: libgraphite2-1.3.14-alt2 sisyphus+250009.100.1.1 1586943071 installed
<13>Jul  8 04:02:28 rpmi: icon-theme-hicolor-0.17-alt2 sisyphus+248343.100.1.1 1584979043 installed
<13>Jul  8 04:02:28 rpmi: libwebp7-1.1.0-alt1 sisyphus+243895.100.1.1 1578410876 installed
<13>Jul  8 04:02:28 rpmi: libjbig-2.1-alt1 1401380921 installed
<13>Jul  8 04:02:28 rpmi: libtiff5-4.1.0-alt1 sisyphus+240802.100.1.1 1573743630 installed
<13>Jul  8 04:02:28 rpmi: shared-mime-info-2.0-alt1 sisyphus+251302.100.1.1 1588847587 installed
<13>Jul  8 04:02:28 rpmi: libgdk-pixbuf-locales-2.40.0-alt1 sisyphus+238952.140.2.1 1570644607 installed
<13>Jul  8 04:02:28 rpmi: gsettings-desktop-schemas-data-3.36.1-alt1 sisyphus+250870.100.1.1 1588227108 installed
<13>Jul  8 04:02:28 rpmi: libgio-2.64.4-alt1 sisyphus+254365.100.1.1 1593701005 installed
<13>Jul  8 04:02:28 rpmi: gsettings-desktop-schemas-3.36.1-alt1 sisyphus+250870.100.1.1 1588227108 installed
<13>Jul  8 04:02:28 rpmi: libgdk-pixbuf-2.40.0-alt1 sisyphus+238952.140.2.1 1570644607 installed
<13>Jul  8 04:02:28 rpmi: gtk-update-icon-cache-3.24.21-alt1 sisyphus+254255.100.1.1 1593514263 installed
<13>Jul  8 04:02:28 rpmi: gcc-c++-common-1.4.24-alt4 sisyphus+251595.200.2.1 1591096672 installed
<13>Jul  8 04:02:29 rpmi: libstdc++9-devel-9.3.1-alt1 sisyphus+251917.40.3.1 1589811833 installed
<13>Jul  8 04:02:30 rpmi: gcc9-c++-9.3.1-alt1 sisyphus+251917.40.3.1 1589811833 installed
<13>Jul  8 04:02:30 rpmi: rmt-0.4b44-alt2 sisyphus+250767.100.1.1 1588080609 installed
<13>Jul  8 04:02:30 rpmi: dump-0.4b44-alt2 sisyphus+250767.100.1.1 1588080609 installed
<13>Jul  8 04:02:30 rpmi: cmake-modules-3.17.3-alt1 sisyphus+252398.100.2.1 1590762246 installed
<13>Jul  8 04:02:30 rpmi: librhash-1.3.5-alt2 1505156277 installed
<13>Jul  8 04:02:30 rpmi: publicsuffix-list-dafsa-20200401-alt1 sisyphus+249161.100.1.1 1585815856 installed
<13>Jul  8 04:02:30 rpmi: libpsl-0.21.0-alt2 sisyphus+237083.100.1.1 1567531663 installed
<13>Jul  8 04:02:30 rpmi: libnghttp2-1.41.0-alt1 sisyphus+253680.100.1.1 1592642263 installed
<13>Jul  8 04:02:30 rpmi: libverto-0.3.0-alt1_7 sisyphus+225932.100.1.1 1553994917 installed
<13>Jul  8 04:02:30 rpmi: libkeyutils-1.6-alt2 sisyphus+226520.100.2.1 1554512088 installed
<13>Jul  8 04:02:30 rpmi: libbrotlicommon-1.0.7-alt1 sisyphus+226738.100.2.1 1554554565 installed
<13>Jul  8 04:02:30 rpmi: libbrotlidec-1.0.7-alt1 sisyphus+226738.100.2.1 1554554565 installed
<13>Jul  8 04:02:30 rpmi: libharfbuzz-2.6.8-alt1 sisyphus+254028.100.1.1 1593106819 installed
<13>Jul  8 04:02:30 rpmi: libfreetype-2.10.2-alt1 sisyphus+251736.100.1.1 1589531898 installed
<13>Jul  8 04:02:30 rpmi: fontconfig-2.13.1-alt1 sisyphus+247349.100.1.2 1583841219 installed
Updating fonts cache: [ DONE ]
<29>Jul  8 04:02:32 fontconfig: Updating fonts cache: succeeded
<13>Jul  8 04:02:32 rpmi: libcairo-1:1.16.0-alt1 sisyphus+226534.100.2.3 1554515520 installed
<13>Jul  8 04:02:32 rpmi: fonts-type1-xorg-7.0.0-alt4 1188553211 installed
<13>Jul  8 04:02:32 rpmi: libXft-2.3.3-alt1 sisyphus+225206.1000.3.2 1552987714 installed
<13>Jul  8 04:02:32 rpmi: libpango-1.44.7-alt1 sisyphus+239731.100.1.1 1571986941 installed
<13>Jul  8 04:02:32 rpmi: libgtk+2-2.24.32-alt4 sisyphus+248211.200.2.1 1584869557 installed
<13>Jul  8 04:02:32 rpmi: libgail-2.24.32-alt4 sisyphus+248211.200.2.1 1584869557 installed
<13>Jul  8 04:02:32 rpmi: libnettle8-3.6-alt1 sisyphus+251637.100.3.1 1590060224 installed
<13>Jul  8 04:02:32 rpmi: libarchive13-3.4.0-alt1 sisyphus+251637.300.3.1 1590061828 installed
<13>Jul  8 04:02:32 rpmi: libp11-kit-0.23.15-alt2 sisyphus+252784.100.2.2 1591274915 installed
<13>Jul  8 04:02:33 rpmi: libtasn1-4.16.0-alt1 sisyphus+245480.100.1.1 1580825069 installed
<13>Jul  8 04:02:33 rpmi: rpm-macros-alternatives-0.5.1-alt1 sisyphus+226946.100.1.1 1554830426 installed
<13>Jul  8 04:02:33 rpmi: alternatives-0.5.1-alt1 sisyphus+226946.100.1.1 1554830426 installed
<13>Jul  8 04:02:33 rpmi: libnss-3.54.0-alt1 sisyphus+254237.200.1.1 1593450845 installed
<13>Jul  8 04:02:33 rpmi: ca-certificates-2020.06.29-alt1 sisyphus+254237.300.1.1 1593450881 installed
<13>Jul  8 04:02:33 rpmi: ca-trust-0.1.2-alt1 sisyphus+233348.100.1.1 1561653823 installed
<13>Jul  8 04:02:33 rpmi: p11-kit-trust-0.23.15-alt2 sisyphus+252784.100.2.2 1591274915 installed
<13>Jul  8 04:02:33 rpmi: libcrypto1.1-1.1.1g-alt1 sisyphus+249982.60.8.1 1587743567 installed
<13>Jul  8 04:02:33 rpmi: libssl1.1-1.1.1g-alt1 sisyphus+249982.60.8.1 1587743567 installed
<13>Jul  8 04:02:33 rpmi: python3-3.8.3-alt1 sisyphus+251775.300.4.1 1592726188 installed
<13>Jul  8 04:02:35 rpmi: python3-base-3.8.3-alt1 sisyphus+251775.300.4.1 1592726188 installed
<13>Jul  8 04:02:35 rpmi: libpython3-3.8.3-alt1 sisyphus+251775.300.4.1 1592726188 installed
<13>Jul  8 04:02:35 rpmi: python3-module-six-1.14.0-alt1 sisyphus+251567.100.1.1 1589268039 installed
<86>Jul  8 04:02:35 groupadd[667640]: group added to /etc/group: name=_keytab, GID=499
<86>Jul  8 04:02:35 groupadd[667640]: group added to /etc/gshadow: name=_keytab
<86>Jul  8 04:02:35 groupadd[667640]: new group: name=_keytab, GID=499
<13>Jul  8 04:02:35 rpmi: libkrb5-1.17.1-alt1 sisyphus+242784.100.1.1 1576137160 installed
<86>Jul  8 04:02:35 groupadd[668278]: group added to /etc/group: name=sasl, GID=498
<86>Jul  8 04:02:35 groupadd[668278]: group added to /etc/gshadow: name=sasl
<86>Jul  8 04:02:35 groupadd[668278]: new group: name=sasl, GID=498
<13>Jul  8 04:02:35 rpmi: libsasl2-3-2.1.27-alt2 sisyphus+228101.100.1.1 1556139861 installed
<13>Jul  8 04:02:36 rpmi: libldap-2.4.48-alt3 sisyphus+238816.100.1.1 1570449061 installed
<13>Jul  8 04:02:36 rpmi: libcurl-7.71.1-alt1 sisyphus+254403.100.1.1 1593776497 installed
<13>Jul  8 04:02:37 rpmi: cmake-3.17.3-alt1 sisyphus+252398.100.2.1 1590762246 installed
<13>Jul  8 04:02:37 rpmi: python3-module-genshi-0.7-alt2 sisyphus+229363.100.1.1 1557847321 installed
<13>Jul  8 04:02:37 rpmi: python3-module-webencodings-0.5.1-alt2 sisyphus+245915.200.1.1 1581496105 installed
<13>Jul  8 04:02:37 rpmi: python3-module-html5lib-1:1.0.1-alt1 sisyphus+238807.100.2.1 1570465973 installed
<13>Jul  8 04:02:37 rpmi: python3-module-lxml-4.5.0-alt2 sisyphus+250566.2700.6.1 1588189447 installed
<13>Jul  8 04:02:37 rpmi: python3-module-cssselect-0.9.1-alt2 sisyphus+250566.2300.6.1 1588188959 installed
<13>Jul  8 04:02:37 rpmi: python3-module-javapackages-1:5.3.0-alt1_4jpp8 sisyphus+234467.100.1.1 1563037789 installed
<13>Jul  8 04:02:37 rpmi: rpm-build-java-1:5.3.0-alt1_4jpp8 sisyphus+234467.100.1.1 1563037789 installed
<13>Jul  8 04:02:37 rpmi: ca-trust-java-0.1.2-alt1 sisyphus+233348.100.1.1 1561653823 installed
<13>Jul  8 04:02:43 rpmi: java-1.8.0-openjdk-headless-0:1.8.0.212.b04-alt2_0jpp8 sisyphus+234504.100.1.1 1563097977 installed
<13>Jul  8 04:02:47 rpmi: java-stub-javadoc-0.1-alt1 1229813340 installed
<13>Jul  8 04:02:47 rpmi: alsa-ucm-conf-1.2.3-alt1 sisyphus+253139.200.1.1 1591812001 installed
<13>Jul  8 04:02:47 rpmi: alsa-topology-conf-1.2.3-alt1 sisyphus+253139.100.1.1 1591811985 installed
<13>Jul  8 04:02:47 rpmi: libalsa-1:1.2.3.1-alt1 sisyphus+253679.100.1.1 1592636972 installed
<13>Jul  8 04:02:47 rpmi: java-1.8.0-openjdk-0:1.8.0.212.b04-alt2_0jpp8 sisyphus+234504.100.1.1 1563097977 installed
<13>Jul  8 04:02:48 rpmi: java-1.8.0-openjdk-devel-0:1.8.0.212.b04-alt2_0jpp8 sisyphus+234504.100.1.1 1563097977 installed
<13>Jul  8 04:02:48 rpmi: jpackage-generic-compat-0.30-alt1 sisyphus+234288.100.1.1 1562847521 installed
<13>Jul  8 04:02:49 rpmi: ctest-3.17.3-alt1 sisyphus+252398.100.2.1 1590762246 installed
<13>Jul  8 04:02:49 rpmi: libnss-devel-3.54.0-alt1 sisyphus+254237.200.1.1 1593450845 installed
<13>Jul  8 04:02:49 rpmi: nss-utils-3.54.0-alt1 sisyphus+254237.200.1.1 1593450845 installed
<13>Jul  8 04:02:49 rpmi: gcc-c++-9-alt2 sisyphus+251923.100.2.2 1589881406 installed
<13>Jul  8 04:02:49 rpmi: slf4j-jdk14-0:1.7.25-alt1_6jpp8 sisyphus+234787.100.1.2 1563401783 installed
<13>Jul  8 04:02:49 rpmi: junit-1:4.12-alt1_13jpp8 sisyphus+246172.100.1.2 1581640927 installed
<13>Jul  8 04:02:49 rpmi: apache-commons-codec-0:1.11-alt1_6jpp8 sisyphus+230657.100.1.3 1559083228 installed
<13>Jul  8 04:02:49 rpmi: apache-commons-lang-0:2.6-alt5_24jpp8 sisyphus+230665.100.1.2 1559085370 installed
<13>Jul  8 04:02:49 rpmi: glassfish-jaxb-api-2.2.12-alt1_11jpp8 sisyphus+230694.100.1.2 1559099497 installed
Building target platforms: x86_64
Building for target x86_64
Wrote: /usr/src/in/nosrpm/jss-4.6.2-alt2.nosrc.rpm
Installing jss-4.6.2-alt2.src.rpm
Building target platforms: x86_64
Building for target x86_64
Executing(%prep): /bin/sh -e /usr/src/tmp/rpm-tmp.24018
+ umask 022
+ /bin/mkdir -p /usr/src/RPM/BUILD
+ cd /usr/src/RPM/BUILD
+ cd /usr/src/RPM/BUILD
+ rm -rf jss-4.6.2
+ echo 'Source #0 (jss-4.6.2.tar):'
Source #0 (jss-4.6.2.tar):
+ /bin/tar -xf /usr/src/RPM/SOURCES/jss-4.6.2.tar
+ cd jss-4.6.2
+ /bin/chmod -c -Rf u+rwX,go-w .
+ echo 'Patch #0 (jss-4.6.2-alt.patch):'
Patch #0 (jss-4.6.2-alt.patch):
+ /usr/bin/patch -p1
patching file org/mozilla/jss/util/NativeProxy.java
+ exit 0
Executing(%build): /bin/sh -e /usr/src/tmp/rpm-tmp.15253
+ umask 022
+ /bin/mkdir -p /usr/src/RPM/BUILD
+ cd /usr/src/RPM/BUILD
+ cd jss-4.6.2
+ export BUILD_OPT=1
+ BUILD_OPT=1
+ mkdir -p BUILD
+ __cmake -DJAVA_HOME=/usr/lib/jvm/jre ..
+ pushd BUILD
~/RPM/BUILD/jss-4.6.2/BUILD ~/RPM/BUILD/jss-4.6.2
+ cmake .. -DCMAKE_SKIP_RPATH:BOOL=ON -DCMAKE_SKIP_INSTALL_RPATH:BOOL=yes '-DCMAKE_C_FLAGS:STRING=-pipe -frecord-gcc-switches -Wall -g -O2' '-DCMAKE_CXX_FLAGS:STRING=-pipe -frecord-gcc-switches -Wall -g -O2' '-DCMAKE_Fortran_FLAGS:STRING=-pipe -frecord-gcc-switches -Wall -g -O2' -DCMAKE_INSTALL_PREFIX=/usr -DINCLUDE_INSTALL_DIR:PATH=/usr/include -DLIB_INSTALL_DIR:PATH=/usr/lib64 -DSYSCONF_INSTALL_DIR:PATH=/etc -DSHARE_INSTALL_PREFIX:PATH=/usr/share -DLIB_DESTINATION=lib64 -DLIB_SUFFIX=64 -DJAVA_HOME=/usr/lib/jvm/jre ..
-- The C compiler identification is GNU 9.3.1
-- The CXX compiler identification is GNU 9.3.1
-- Check for working C compiler: /usr/bin/cc
-- Check for working C compiler: /usr/bin/cc - works
-- Detecting C compiler ABI info
-- Detecting C compiler ABI info - done
-- Detecting C compile features
-- Detecting C compile features - done
-- Check for working CXX compiler: /usr/bin/c++
-- Check for working CXX compiler: /usr/bin/c++ - works
-- Detecting CXX compiler ABI info
-- Detecting CXX compiler ABI info - done
-- Detecting CXX compile features
-- Detecting CXX compile features - done
-- Found PkgConfig: /usr/bin/pkg-config (found version "0.29.2") 
-- Checking for module 'nspr'
--   Found nspr, version 4.26.0
-- Found NSPR: /usr/lib64/libplds4.so;/usr/lib64/libplc4.so;/usr/lib64/libnspr4.so  
-- Checking for module 'nss'
--   Found nss, version 3.54.0
-- Found NSS: /usr/lib64/libssl3.so;/usr/lib64/libsmime3.so;/usr/lib64/libnss3.so;/usr/lib64/libnssutil3.so  
-- Found Java: /usr/lib/jvm/jre/bin/java (found version "1.8.0_212") 
-- Found JNI: /usr/lib/jvm/jre/lib/amd64/libjawt.so  
-- Performing Test HAVE_C_FLAG
-- Performing Test HAVE_C_FLAG - Success
-- JSS C FLAGS: -O2;-g;-Wall;-frecord-gcc-switches;-pipe;-O2;-Wall;-std=gnu99;-Wno-cast-function-type;-Wno-unused-parameter;-Wno-unknown-warning-option;-Werror-implicit-function-declaration;-Wno-switch;-I/usr/src/RPM/BUILD/jss-4.6.2/BUILD/include/jss;-I/usr/lib/jvm/java/include;-I/usr/lib/jvm/java/include/linux;-I/usr/lib/jvm/java/include;-I/usr/include/nspr;-I/usr/include/nss;-L/usr/lib64/libplds4.so;-L/usr/lib64/libplc4.so;-L/usr/lib64/libnspr4.so;-L/usr/lib64/libssl3.so;-L/usr/lib64/libsmime3.so;-L/usr/lib64/libnss3.so;-L/usr/lib64/libnssutil3.so
-- JSS LD FLAGS: -lsmime3;-lssl3;-lnss3;-lnssutil3;-lplc4;-lplds4;-lnspr4;-lpthread;-ldl
-- JSS LIBRARY FLAGS: -shared;-Wl,-z,defs;-Wl,-soname;-Wl,libjss4.so
-- javac classpath: /usr/share/java/slf4j/api.jar:/usr/share/java/apache-commons-codec.jar:/usr/share/java/apache-commons-lang.jar:/usr/share/java/jaxb-api.jar
-- tests classpath: /usr/src/RPM/BUILD/jss-4.6.2/BUILD/jss4.jar:/usr/src/RPM/BUILD/jss-4.6.2/BUILD/tests-jss4.jar:/usr/share/java/slf4j/api.jar:/usr/share/java/apache-commons-codec.jar:/usr/share/java/apache-commons-lang.jar:/usr/share/java/jaxb-api.jar:/usr/share/java/slf4j/jdk14.jar:/usr/share/java/junit.jar:/usr/share/java/hamcrest/core.jar
-- JSS JAVAC FLAGS: -classpath;/usr/share/java/slf4j/api.jar:/usr/share/java/apache-commons-codec.jar:/usr/share/java/apache-commons-lang.jar:/usr/share/java/jaxb-api.jar;-sourcepath;/usr/src/RPM/BUILD/jss-4.6.2;-target;1.8;-source;1.8;-O
-- JSS TEST JAVAC FLAGS: -classpath;/usr/share/java/slf4j/api.jar:/usr/share/java/apache-commons-codec.jar:/usr/share/java/apache-commons-lang.jar:/usr/share/java/jaxb-api.jar:/usr/share/java/junit.jar;-sourcepath;/usr/src/RPM/BUILD/jss-4.6.2;-target;1.8;-source;1.8;-O
-- Looking for CKM_AES_CMAC
-- Looking for CKM_AES_CMAC - found
-- Configuring done
-- Generating done
CMake Warning:
  Manually-specified variables were not used by the project:

    CMAKE_Fortran_FLAGS
    CMAKE_SKIP_INSTALL_RPATH
    CMAKE_SKIP_RPATH
    INCLUDE_INSTALL_DIR
    LIB_DESTINATION
    LIB_INSTALL_DIR
    LIB_SUFFIX
    SHARE_INSTALL_PREFIX
    SYSCONF_INSTALL_DIR


-- Build files have been written to: /usr/src/RPM/BUILD/jss-4.6.2/BUILD
+ popd
~/RPM/BUILD/jss-4.6.2
+ make -j8 -C BUILD all javadoc
make[2]: Entering directory '/usr/src/RPM/BUILD/jss-4.6.2/BUILD'
Scanning dependencies of target generate_includes
make[2]: Leaving directory '/usr/src/RPM/BUILD/jss-4.6.2/BUILD'
make[2]: Entering directory '/usr/src/RPM/BUILD/jss-4.6.2/BUILD'
Scanning dependencies of target generate_java
make[2]: Leaving directory '/usr/src/RPM/BUILD/jss-4.6.2/BUILD'
make[1]: Entering directory '/usr/src/RPM/BUILD/jss-4.6.2/BUILD'
[  1%] Built target generate_includes
make[1]: Leaving directory '/usr/src/RPM/BUILD/jss-4.6.2/BUILD'
make[2]: Entering directory '/usr/src/RPM/BUILD/jss-4.6.2/BUILD'
[  3%] Generating .targets/finished_tests_generate_java
Note: Some input files use or override a deprecated API.
Note: Recompile with -Xlint:deprecation for details.
make[2]: Leaving directory '/usr/src/RPM/BUILD/jss-4.6.2/BUILD'
make[2]: Entering directory '/usr/src/RPM/BUILD/jss-4.6.2/BUILD'
[  1%] Generating .targets/finished_generate_java
Note: Some input files use or override a deprecated API.
Note: Recompile with -Xlint:deprecation for details.
make[2]: Leaving directory '/usr/src/RPM/BUILD/jss-4.6.2/BUILD'
make[1]: Entering directory '/usr/src/RPM/BUILD/jss-4.6.2/BUILD'
[  3%] Built target generate_java
make[1]: Leaving directory '/usr/src/RPM/BUILD/jss-4.6.2/BUILD'
make[2]: Entering directory '/usr/src/RPM/BUILD/jss-4.6.2/BUILD'
Scanning dependencies of target generate_c
make[2]: Leaving directory '/usr/src/RPM/BUILD/jss-4.6.2/BUILD'
make[2]: Entering directory '/usr/src/RPM/BUILD/jss-4.6.2/BUILD'
Scanning dependencies of target generate_build_jar
make[2]: Leaving directory '/usr/src/RPM/BUILD/jss-4.6.2/BUILD'
make[2]: Entering directory '/usr/src/RPM/BUILD/jss-4.6.2/BUILD'
[ 17%] Generating lib/SecretDecoderRing.o
make[2]: Leaving directory '/usr/src/RPM/BUILD/jss-4.6.2/BUILD'
make[2]: Entering directory '/usr/src/RPM/BUILD/jss-4.6.2/BUILD'
[ 14%] Generating lib/Algorithm.o
make[2]: Leaving directory '/usr/src/RPM/BUILD/jss-4.6.2/BUILD'
make[2]: Entering directory '/usr/src/RPM/BUILD/jss-4.6.2/BUILD'
[ 12%] Generating lib/ASN1Util.o
make[2]: Leaving directory '/usr/src/RPM/BUILD/jss-4.6.2/BUILD'
make[2]: Entering directory '/usr/src/RPM/BUILD/jss-4.6.2/BUILD'
[ 10%] Generating lib/KeyManager.o
make[2]: Leaving directory '/usr/src/RPM/BUILD/jss-4.6.2/BUILD'
make[2]: Entering directory '/usr/src/RPM/BUILD/jss-4.6.2/BUILD'
[ 25%] Generating lib/PRErrors.o
make[2]: Leaving directory '/usr/src/RPM/BUILD/jss-4.6.2/BUILD'
make[2]: Entering directory '/usr/src/RPM/BUILD/jss-4.6.2/BUILD'
[  5%] Generating lib/CryptoManager.o
make[2]: Leaving directory '/usr/src/RPM/BUILD/jss-4.6.2/BUILD'
make[2]: Entering directory '/usr/src/RPM/BUILD/jss-4.6.2/BUILD'
[ 19%] Generating lib/Buffer.o
make[2]: Leaving directory '/usr/src/RPM/BUILD/jss-4.6.2/BUILD'
make[2]: Entering directory '/usr/src/RPM/BUILD/jss-4.6.2/BUILD'
[ 21%] Generating lib/BufferProxy.o
make[2]: Leaving directory '/usr/src/RPM/BUILD/jss-4.6.2/BUILD'
make[2]: Entering directory '/usr/src/RPM/BUILD/jss-4.6.2/BUILD'
[ 16%] Generating lib/PQGParams.o
make[2]: Leaving directory '/usr/src/RPM/BUILD/jss-4.6.2/BUILD'
make[2]: Entering directory '/usr/src/RPM/BUILD/jss-4.6.2/BUILD'
[ 23%] Generating lib/PR.o
make[2]: Leaving directory '/usr/src/RPM/BUILD/jss-4.6.2/BUILD'
make[2]: Entering directory '/usr/src/RPM/BUILD/jss-4.6.2/BUILD'
[ 26%] Generating lib/PRFDProxy.o
make[2]: Leaving directory '/usr/src/RPM/BUILD/jss-4.6.2/BUILD'
make[2]: Entering directory '/usr/src/RPM/BUILD/jss-4.6.2/BUILD'
[ 30%] Generating lib/SSLFDProxy.o
make[2]: Leaving directory '/usr/src/RPM/BUILD/jss-4.6.2/BUILD'
make[2]: Entering directory '/usr/src/RPM/BUILD/jss-4.6.2/BUILD'
[ 35%] Generating lib/PK11KeyGenerator.o
make[2]: Leaving directory '/usr/src/RPM/BUILD/jss-4.6.2/BUILD'
make[2]: Entering directory '/usr/src/RPM/BUILD/jss-4.6.2/BUILD'
[ 28%] Generating lib/SSL.o
make[2]: Leaving directory '/usr/src/RPM/BUILD/jss-4.6.2/BUILD'
make[2]: Entering directory '/usr/src/RPM/BUILD/jss-4.6.2/BUILD'
[  8%] Generating staging.jar
make[2]: Leaving directory '/usr/src/RPM/BUILD/jss-4.6.2/BUILD'
make[1]: Entering directory '/usr/src/RPM/BUILD/jss-4.6.2/BUILD'
[ 42%] Built target generate_build_jar
make[1]: Leaving directory '/usr/src/RPM/BUILD/jss-4.6.2/BUILD'
make[2]: Entering directory '/usr/src/RPM/BUILD/jss-4.6.2/BUILD'
Scanning dependencies of target generate_jar
make[2]: Leaving directory '/usr/src/RPM/BUILD/jss-4.6.2/BUILD'
make[2]: Entering directory '/usr/src/RPM/BUILD/jss-4.6.2/BUILD'
[ 32%] Generating lib/PK11Cert.o
make[2]: Leaving directory '/usr/src/RPM/BUILD/jss-4.6.2/BUILD'
make[2]: Entering directory '/usr/src/RPM/BUILD/jss-4.6.2/BUILD'
[ 33%] Generating lib/PK11Cipher.o
make[2]: Leaving directory '/usr/src/RPM/BUILD/jss-4.6.2/BUILD'
make[2]: Entering directory '/usr/src/RPM/BUILD/jss-4.6.2/BUILD'
[ 37%] Generating lib/PK11KeyPairGenerator.o
make[2]: Leaving directory '/usr/src/RPM/BUILD/jss-4.6.2/BUILD'
make[2]: Entering directory '/usr/src/RPM/BUILD/jss-4.6.2/BUILD'
[  7%] Generating lib/PK11Finder.o
make[2]: Leaving directory '/usr/src/RPM/BUILD/jss-4.6.2/BUILD'
make[2]: Entering directory '/usr/src/RPM/BUILD/jss-4.6.2/BUILD'
[ 50%] Generating lib/PK11SecureRandom.o
make[2]: Leaving directory '/usr/src/RPM/BUILD/jss-4.6.2/BUILD'
make[2]: Entering directory '/usr/src/RPM/BUILD/jss-4.6.2/BUILD'
[ 48%] Generating lib/PK11PubKey.o
make[2]: Leaving directory '/usr/src/RPM/BUILD/jss-4.6.2/BUILD'
make[2]: Entering directory '/usr/src/RPM/BUILD/jss-4.6.2/BUILD'
[ 41%] Generating lib/PK11MessageDigest.o
make[2]: Leaving directory '/usr/src/RPM/BUILD/jss-4.6.2/BUILD'
make[2]: Entering directory '/usr/src/RPM/BUILD/jss-4.6.2/BUILD'
[ 51%] Generating lib/PK11Signature.o
make[2]: Leaving directory '/usr/src/RPM/BUILD/jss-4.6.2/BUILD'
make[2]: Entering directory '/usr/src/RPM/BUILD/jss-4.6.2/BUILD'
[ 42%] Generating lib/PK11Module.o
make[2]: Leaving directory '/usr/src/RPM/BUILD/jss-4.6.2/BUILD'
make[2]: Entering directory '/usr/src/RPM/BUILD/jss-4.6.2/BUILD'
[ 55%] Generating lib/PK11SymKey.o
/usr/src/RPM/BUILD/jss-4.6.2/org/mozilla/jss/pkcs11/PK11SymKey.c: In function 'Java_org_mozilla_jss_pkcs11_PK11SymKey_getKeyType':
/usr/src/RPM/BUILD/jss-4.6.2/org/mozilla/jss/pkcs11/PK11SymKey.c:265:12: error: 'CKM_NETSCAPE_PBE_SHA1_DES_CBC' undeclared (first use in this function); did you mean 'CKM_NSS_PBE_SHA1_DES_CBC'?
  265 |       case CKM_NETSCAPE_PBE_SHA1_DES_CBC:
      |            ^~~~~~~~~~~~~~~~~~~~~~~~~~~~~
      |            CKM_NSS_PBE_SHA1_DES_CBC
/usr/src/RPM/BUILD/jss-4.6.2/org/mozilla/jss/pkcs11/PK11SymKey.c:265:12: note: each undeclared identifier is reported only once for each function it appears in
/usr/src/RPM/BUILD/jss-4.6.2/org/mozilla/jss/pkcs11/PK11SymKey.c: At top level:
cc1: warning: unrecognized command line option '-Wno-unknown-warning-option'
make[2]: *** [CMakeFiles/generate_c.dir/build.make:226: lib/PK11SymKey.o] Error 1
make[2]: Leaving directory '/usr/src/RPM/BUILD/jss-4.6.2/BUILD'
make[2]: *** Waiting for unfinished jobs....
make[2]: Entering directory '/usr/src/RPM/BUILD/jss-4.6.2/BUILD'
[ 53%] Generating lib/PK11Store.o
make[2]: Leaving directory '/usr/src/RPM/BUILD/jss-4.6.2/BUILD'
make[2]: Entering directory '/usr/src/RPM/BUILD/jss-4.6.2/BUILD'
[ 57%] Generating lib/PK11SymmetricKeyDeriver.o
make[2]: Leaving directory '/usr/src/RPM/BUILD/jss-4.6.2/BUILD'
make[2]: Entering directory '/usr/src/RPM/BUILD/jss-4.6.2/BUILD'
[ 46%] Generating lib/PK11PrivKey.o
make[2]: Leaving directory '/usr/src/RPM/BUILD/jss-4.6.2/BUILD'
make[2]: Entering directory '/usr/src/RPM/BUILD/jss-4.6.2/BUILD'
[ 60%] Generating lib/JSSKeyStoreSpi.o
make[2]: Leaving directory '/usr/src/RPM/BUILD/jss-4.6.2/BUILD'
make[2]: Entering directory '/usr/src/RPM/BUILD/jss-4.6.2/BUILD'
[ 39%] Generating lib/PK11KeyWrapper.o
make[2]: Leaving directory '/usr/src/RPM/BUILD/jss-4.6.2/BUILD'
make[2]: Entering directory '/usr/src/RPM/BUILD/jss-4.6.2/BUILD'
[ 58%] Generating lib/PK11Token.o
make[2]: Leaving directory '/usr/src/RPM/BUILD/jss-4.6.2/BUILD'
make[1]: *** [CMakeFiles/Makefile2:1667: CMakeFiles/generate_c.dir/all] Error 2
make[1]: *** Waiting for unfinished jobs....
make[2]: Entering directory '/usr/src/RPM/BUILD/jss-4.6.2/BUILD'
[ 62%] Generating tests-jss4.jar
make[2]: Leaving directory '/usr/src/RPM/BUILD/jss-4.6.2/BUILD'
make[2]: Entering directory '/usr/src/RPM/BUILD/jss-4.6.2/BUILD'
[ 44%] Generating jss4.jar
make[2]: Leaving directory '/usr/src/RPM/BUILD/jss-4.6.2/BUILD'
make[1]: Entering directory '/usr/src/RPM/BUILD/jss-4.6.2/BUILD'
[ 62%] Built target generate_jar
make[1]: Leaving directory '/usr/src/RPM/BUILD/jss-4.6.2/BUILD'
make: *** [Makefile:115: all] Error 2
error: Bad exit status from /usr/src/tmp/rpm-tmp.15253 (%build)


RPM build errors:
    Bad exit status from /usr/src/tmp/rpm-tmp.15253 (%build)
Command exited with non-zero status 1
38.19user 2.19system 0:47.00elapsed 85%CPU (0avgtext+0avgdata 206220maxresident)k
0inputs+0outputs (0major+544985minor)pagefaults 0swaps
hsh-rebuild: rebuild of `jss-4.6.2-alt2.src.rpm' failed.
Command exited with non-zero status 1
53.16user 5.21system 1:35.07elapsed 61%CPU (0avgtext+0avgdata 206220maxresident)k
0inputs+0outputs (0major+1104890minor)pagefaults 0swaps