<86>Mar 25 04:24:23 userdel[1853713]: delete user 'rooter'
<86>Mar 25 04:24:23 userdel[1853713]: removed group 'rooter' owned by 'rooter'
<86>Mar 25 04:24:23 userdel[1853713]: removed shadow group 'rooter' owned by 'rooter'
<86>Mar 25 04:24:23 groupadd[1853731]: group added to /etc/group: name=rooter, GID=615
<86>Mar 25 04:24:23 groupadd[1853731]: group added to /etc/gshadow: name=rooter
<86>Mar 25 04:24:23 groupadd[1853731]: new group: name=rooter, GID=615
<86>Mar 25 04:24:23 useradd[1853845]: new user: name=rooter, UID=615, GID=615, home=/root, shell=/bin/bash
<86>Mar 25 04:24:23 userdel[1853944]: delete user 'builder'
<86>Mar 25 04:24:23 userdel[1853944]: removed group 'builder' owned by 'builder'
<86>Mar 25 04:24:23 userdel[1853944]: removed shadow group 'builder' owned by 'builder'
<86>Mar 25 04:24:23 groupadd[1854010]: group added to /etc/group: name=builder, GID=616
<86>Mar 25 04:24:23 groupadd[1854010]: group added to /etc/gshadow: name=builder
<86>Mar 25 04:24:23 groupadd[1854010]: new group: name=builder, GID=616
<86>Mar 25 04:24:23 useradd[1854039]: new user: name=builder, UID=616, GID=616, home=/usr/src, shell=/bin/bash
/usr/src/in/srpm/origin-3.11.0-alt2.src.rpm: license not found in '/usr/share/license' directory: ASL
/usr/src/in/srpm/origin-3.11.0-alt2.src.rpm: license not found in '/usr/share/license' directory: 2.0
<13>Mar 25 04:24:43 rpmi: libidn2-2.3.0-alt1 sisyphus+240846.100.1.2 1573870464 installed
<13>Mar 25 04:24:43 rpmi: rpm-macros-golang-1.0.7-alt1 sisyphus+247106.100.1.1 1582836153 installed
<13>Mar 25 04:24:43 rpmi: libsepol-1:3.0-alt1 sisyphus+247912.100.1.1 1584361446 installed
<13>Mar 25 04:24:43 rpmi: libselinux-utils-1:3.0-alt1 sisyphus+247912.200.1.1 1584361540 installed
<13>Mar 25 04:24:43 rpmi: libexpat-2.2.4-alt1 1503305341 installed
<13>Mar 25 04:24:43 rpmi: publicsuffix-list-dafsa-20200106-alt1 sisyphus+244007.100.1.1 1578588044 installed
<13>Mar 25 04:24:43 rpmi: libpsl-0.21.0-alt2 sisyphus+237083.100.1.1 1567531663 installed
<13>Mar 25 04:24:43 rpmi: libnghttp2-1.40.0-alt1 sisyphus+244416.100.1.1 1579241975 installed
<13>Mar 25 04:24:43 rpmi: libbrotlicommon-1.0.7-alt1 sisyphus+226738.100.2.1 1554554565 installed
<13>Mar 25 04:24:43 rpmi: libbrotlidec-1.0.7-alt1 sisyphus+226738.100.2.1 1554554565 installed
<13>Mar 25 04:24:43 rpmi: rsync-3.1.3-alt1 1518721083 installed
<13>Mar 25 04:24:43 rpmi: libverto-0.3.0-alt1_7 sisyphus+225932.100.1.1 1553994917 installed
<13>Mar 25 04:24:43 rpmi: libkeyutils-1.6-alt2 sisyphus+226520.100.2.1 1554512088 installed
<13>Mar 25 04:24:43 rpmi: libcom_err-1.44.6-alt1 sisyphus+224154.100.1.1 1552091653 installed
<13>Mar 25 04:24:43 rpmi: libedit3-3.1.20190324-alt1 sisyphus+236523.100.1.1 1566578246 installed
<13>Mar 25 04:24:43 rpmi: less-530-alt1 sisyphus+226367.200.2.2 1554151813 installed
<13>Mar 25 04:24:43 rpmi: diffstat-1.63-alt1 sisyphus+243663.100.1.1 1577480059 installed
<13>Mar 25 04:24:43 rpmi: libp11-kit-0.23.15-alt1 sisyphus+226408.100.2.1 1554288187 installed
<13>Mar 25 04:24:43 rpmi: libtasn1-4.16.0-alt1 sisyphus+245480.100.1.1 1580825069 installed
<13>Mar 25 04:24:43 rpmi: rpm-macros-alternatives-0.5.1-alt1 sisyphus+226946.100.1.1 1554830426 installed
<13>Mar 25 04:24:43 rpmi: alternatives-0.5.1-alt1 sisyphus+226946.100.1.1 1554830426 installed
<13>Mar 25 04:24:43 rpmi: ca-certificates-2020.01.23-alt1 sisyphus+244791.300.2.1 1580285500 installed
<13>Mar 25 04:24:43 rpmi: ca-trust-0.1.2-alt1 sisyphus+233348.100.1.1 1561653823 installed
<13>Mar 25 04:24:43 rpmi: p11-kit-trust-0.23.15-alt1 sisyphus+226408.100.2.1 1554288187 installed
<13>Mar 25 04:24:43 rpmi: libcrypto1.1-1.1.1d-alt1.1 sisyphus+237931.100.2.1 1569235630 installed
<13>Mar 25 04:24:43 rpmi: libssl1.1-1.1.1d-alt1.1 sisyphus+237931.100.2.1 1569235630 installed
<86>Mar 25 04:24:43 groupadd[1881140]: group added to /etc/group: name=_keytab, GID=499
<86>Mar 25 04:24:43 groupadd[1881140]: group added to /etc/gshadow: name=_keytab
<86>Mar 25 04:24:43 groupadd[1881140]: new group: name=_keytab, GID=499
<13>Mar 25 04:24:43 rpmi: libkrb5-1.17.1-alt1 sisyphus+242784.100.1.1 1576137160 installed
<86>Mar 25 04:24:43 groupadd[1881227]: group added to /etc/group: name=sasl, GID=498
<86>Mar 25 04:24:43 groupadd[1881227]: group added to /etc/gshadow: name=sasl
<86>Mar 25 04:24:43 groupadd[1881227]: new group: name=sasl, GID=498
<13>Mar 25 04:24:43 rpmi: libsasl2-3-2.1.27-alt2 sisyphus+228101.100.1.1 1556139861 installed
<13>Mar 25 04:24:43 rpmi: libldap-2.4.48-alt3 sisyphus+238816.100.1.1 1570449061 installed
<13>Mar 25 04:24:43 rpmi: libcurl-7.69.1-alt1 sisyphus+247613.100.1.1 1583913866 installed
<13>Mar 25 04:24:43 rpmi: openssh-common-7.9p1-alt1 sisyphus+233206.100.1.1 1561507815 installed
<86>Mar 25 04:24:43 groupadd[1881317]: group added to /etc/group: name=sshagent, GID=497
<86>Mar 25 04:24:43 groupadd[1881317]: group added to /etc/gshadow: name=sshagent
<86>Mar 25 04:24:43 groupadd[1881317]: new group: name=sshagent, GID=497
<13>Mar 25 04:24:43 rpmi: openssh-clients-7.9p1-alt1 sisyphus+233206.100.1.1 1561507815 installed
<13>Mar 25 04:24:44 rpmi: git-core-2.25.2-alt1 sisyphus+248069.100.1.1 1584572598 installed
<13>Mar 25 04:24:56 rpmi: golang-1.14-alt1 sisyphus+247106.200.1.1 1582836347 installed
<13>Mar 25 04:24:56 rpmi: rpm-build-golang-1.0.7-alt1 sisyphus+247106.100.1.1 1582836153 installed
warning: Macro %ubt not found
<13>Mar 25 04:25:04 rpmi: msulogin-1.0-alt1 1366288481 installed
<13>Mar 25 04:25:04 rpmi: chrooted-0.3.10-alt1 sisyphus+247660.200.4.2 1584237901 installed
<13>Mar 25 04:25:04 rpmi: libseccomp-2.4.2-alt2 sisyphus+245295.100.1.1 1580406862 installed
<13>Mar 25 04:25:04 rpmi: libkmod-26-alt1 sisyphus+226359.100.1.1 1554129988 installed
<13>Mar 25 04:25:04 rpmi: liblz4-1:1.9.2-alt1 sisyphus+238585.100.2.2 1570066861 installed
<13>Mar 25 04:25:04 rpmi: kmod-26-alt1 sisyphus+226359.100.1.1 1554129988 installed
<13>Mar 25 04:25:04 rpmi: chrooted-resolv-0.3.1-alt2 1176155257 installed
<13>Mar 25 04:25:05 rpmi: libnss-myhostname-1:245.2-alt1 sisyphus+248437.100.1.1 1585068108 installed
<13>Mar 25 04:25:05 rpmi: sysvinit-2.88-alt6 sisyphus+240403.100.2.1 1573520131 installed
<13>Mar 25 04:25:05 rpmi: udev-rules-1:245.2-alt1 sisyphus+248437.100.1.1 1585068108 installed
<13>Mar 25 04:25:05 rpmi: mount-2.33.2-alt1 sisyphus+227076.100.1.1 1555076778 installed
<13>Mar 25 04:25:05 rpmi: libpcre2-10.34-alt1 sisyphus+241619.100.1.1 1574686792 installed
<13>Mar 25 04:25:05 rpmi: libkrb5-ldap-1.17.1-alt1 sisyphus+242784.100.1.1 1576137160 installed
<13>Mar 25 04:25:05 rpmi: libverto-devel-0.3.0-alt1_7 sisyphus+225932.100.1.1 1553994917 installed
<13>Mar 25 04:25:05 rpmi: libiptables-1.8.4-alt1 sisyphus+246876.100.1.1 1582593434 installed
<13>Mar 25 04:25:05 rpmi: libfdisk-2.33.2-alt1 sisyphus+227076.100.1.1 1555076778 installed
<13>Mar 25 04:25:05 rpmi: libjson-c4-0.13.1-alt1 sisyphus+226468.100.8.1 1554723265 installed
<13>Mar 25 04:25:05 rpmi: libdevmapper-1.02.169-alt1 sisyphus+246686.100.1.1 1582206061 installed
<13>Mar 25 04:25:05 rpmi: libcom_err-devel-1.44.6-alt1 sisyphus+224154.100.1.1 1552091653 installed
<13>Mar 25 04:25:05 rpmi: libargon2-20190702-alt1 sisyphus+235300.100.1.1 1564606506 installed
<13>Mar 25 04:25:05 rpmi: hwclock-1:2.33.2-alt1 sisyphus+227076.100.1.1 1555076778 installed
<13>Mar 25 04:25:05 rpmi: libgpg-error-1.36-alt1 sisyphus+225621.300.1.1 1553521088 installed
<13>Mar 25 04:25:05 rpmi: libgcrypt20-1.8.5-alt3 sisyphus+239622.100.1.1 1571746563 installed
<13>Mar 25 04:25:05 rpmi: libsystemd-1:245.2-alt1 sisyphus+248437.100.1.1 1585068108 installed
<13>Mar 25 04:25:05 rpmi: libcryptsetup-2.2.2-alt1 sisyphus+242851.300.2.1 1576248417 installed
<13>Mar 25 04:25:05 rpmi: startup-0.9.9.9-alt1 sisyphus+242122.100.1.1 1575282386 installed
<13>Mar 25 04:25:05 rpmi: systemd-utils-1:245.2-alt1 sisyphus+248437.100.1.1 1585068108 installed
<13>Mar 25 04:25:05 rpmi: libdbus-1.12.16-alt2 sisyphus+240566.100.2.1 1573547688 installed
<86>Mar 25 04:25:05 groupadd[1911879]: group added to /etc/group: name=messagebus, GID=496
<86>Mar 25 04:25:05 groupadd[1911879]: group added to /etc/gshadow: name=messagebus
<86>Mar 25 04:25:05 groupadd[1911879]: new group: name=messagebus, GID=496
<86>Mar 25 04:25:05 useradd[1911900]: new user: name=messagebus, UID=499, GID=496, home=/run/dbus, shell=/dev/null
<13>Mar 25 04:25:05 rpmi: dbus-1.12.16-alt2 sisyphus+240566.100.2.1 1573547688 installed
<13>Mar 25 04:25:05 rpmi: dbus-tools-1.12.16-alt2 sisyphus+240566.100.2.1 1573547688 installed
<13>Mar 25 04:25:05 rpmi: pam_systemd-1:245.2-alt1 sisyphus+248437.100.1.1 1585068108 installed
<13>Mar 25 04:25:05 rpmi: systemd-services-1:245.2-alt1 sisyphus+248437.100.1.1 1585068108 installed
<13>Mar 25 04:25:05 rpmi: libnettle7-3.5.1-alt1 sisyphus+235265.40.6.1 1566223043 installed
<13>Mar 25 04:25:06 rpmi: libarchive13-3.4.0-alt1 sisyphus+235265.640.9.1 1566482445 installed
<13>Mar 25 04:25:06 rpmi: login-0.60-alt35 1484567251 installed
<13>Mar 25 04:25:06 rpmi: agetty-2.33.2-alt1 sisyphus+227076.100.1.1 1555076778 installed
<13>Mar 25 04:25:06 rpmi: acl-2.2.53-alt1 sisyphus+221902.200.4.1 1550587056 installed
<86>Mar 25 04:25:06 groupadd[1912522]: group added to /etc/group: name=systemd-journal, GID=495
<86>Mar 25 04:25:06 groupadd[1912522]: group added to /etc/gshadow: name=systemd-journal
<86>Mar 25 04:25:06 groupadd[1912522]: new group: name=systemd-journal, GID=495
<13>Mar 25 04:25:06 rpmi: systemd-1:245.2-alt1 sisyphus+248437.100.1.1 1585068108 installed
<13>Mar 25 04:25:06 rpmi: bsdtar-3.4.0-alt1 sisyphus+235265.640.9.1 1566482445 installed
<13>Mar 25 04:25:06 rpmi: libkrb5-devel-1.17.1-alt1 sisyphus+242784.100.1.1 1576137160 installed
warning: Macro %ubt not found
Building target platforms: x86_64
Building for target x86_64
Wrote: /usr/src/in/nosrpm/origin-3.11.0-alt2.nosrc.rpm
warning: Macro %ubt not found
Installing origin-3.11.0-alt2.src.rpm
Building target platforms: x86_64
Building for target x86_64
Executing(%prep): /bin/sh -e /usr/src/tmp/rpm-tmp.96076
+ umask 022
+ /bin/mkdir -p /usr/src/RPM/BUILD
+ cd /usr/src/RPM/BUILD
+ cd /usr/src/RPM/BUILD
+ rm -rf origin-3.11.0
+ echo 'Source #0 (origin-3.11.0.tar):'
Source #0 (origin-3.11.0.tar):
+ /bin/tar -xf /usr/src/RPM/SOURCES/origin-3.11.0.tar
+ cd origin-3.11.0
+ /bin/chmod -c -Rf u+rwX,go-w .
+ exit 0
Executing(%build): /bin/sh -e /usr/src/tmp/rpm-tmp.85451
+ umask 022
+ /bin/mkdir -p /usr/src/RPM/BUILD
+ cd /usr/src/RPM/BUILD
+ cd origin-3.11.0
+ BUILD_PLATFORM=linux/amd64
+ GOMAXPROCS=10
+ OS_ONLY_BUILD_PLATFORMS=linux/amd64
+ OS_GIT_VERSION=v3.11.0
+ OS_GIT_MINOR=11+
+ OS_GIT_COMMIT=0cbc58b
+ OS_GIT_MAJOR=3
+ OS_GIT_TREE_STATE=clean
+ KUBE_GIT_VERSION=v1.11.0+d4cacc0
+ KUBE_GIT_MAJOR=1
+ KUBE_GIT_MINOR=11+
+ KUBE_GIT_COMMIT=d4cacc0
+ ETCD_GIT_COMMIT=121edf0
+ ETCD_GIT_VERSION=v3.2.16
+ OS_BUILD_RELEASE_ARCHIVES=n
+ make build-cross
make: Entering directory '/usr/src/RPM/BUILD/origin-3.11.0'
hack/build-cross.sh
++ Building go targets for linux/amd64: images/pod
++ Building go targets for linux/amd64: cmd/sdn-cni-plugin vendor/github.com/containernetworking/plugins/plugins/ipam/host-local vendor/github.com/containernetworking/plugins/plugins/main/loopback
++ Building go targets for linux/amd64: cmd/hypershift cmd/openshift cmd/oc cmd/oadm cmd/template-service-broker cmd/openshift-node-config vendor/k8s.io/kubernetes/cmd/hyperkube
pkg/apps/apiserver/registry/deployconfig/etcd/etcd.go:21:2: code in directory /usr/src/RPM/BUILD/origin-3.11.0/_output/local/go/src/github.com/openshift/origin/vendor/k8s.io/kubernetes/staging/src/k8s.io/apimachinery/pkg/labels expects import "k8s.io/apimachinery/pkg/labels"
[ERROR] PID 1990567: hack/lib/build/binaries.sh:236: `GOOS=${platform%/*} GOARCH=${platform##*/} go install -pkgdir "${pkgdir}/${platform}" -tags "${OS_GOFLAGS_TAGS-} ${!platform_gotags_envvar:-}" -ldflags="${local_ldflags}" "${goflags[@]:+${goflags[@]}}" -gcflags "${gogcflags}" "${nonstatics[@]}"` exited with status 1.
[INFO] 		Stack Trace: 
[INFO] 		  1: hack/lib/build/binaries.sh:236: `GOOS=${platform%/*} GOARCH=${platform##*/} go install -pkgdir "${pkgdir}/${platform}" -tags "${OS_GOFLAGS_TAGS-} ${!platform_gotags_envvar:-}" -ldflags="${local_ldflags}" "${goflags[@]:+${goflags[@]}}" -gcflags "${gogcflags}" "${nonstatics[@]}"`
[INFO] 		  2: hack/lib/build/binaries.sh:156: os::build::internal::build_binaries
[INFO] 		  3: hack/build-cross.sh:76: os::build::build_binaries
[INFO]   Exiting with code 1.
[ERROR] PID 1947692: hack/lib/build/binaries.sh:150: `( os::build::internal::build_binaries "${binaries[@]+"${binaries[@]}"}" )` exited with status 1.
[INFO] 		Stack Trace: 
[INFO] 		  1: hack/lib/build/binaries.sh:150: `( os::build::internal::build_binaries "${binaries[@]+"${binaries[@]}"}" )`
[INFO] 		  2: hack/build-cross.sh:76: os::build::build_binaries
[INFO]   Exiting with code 1.
make: *** [Makefile:282: build-cross] Error 1
make: Leaving directory '/usr/src/RPM/BUILD/origin-3.11.0'
error: Bad exit status from /usr/src/tmp/rpm-tmp.85451 (%build)


RPM build errors:
    Macro %ubt not found
    Bad exit status from /usr/src/tmp/rpm-tmp.85451 (%build)
Command exited with non-zero status 1
43.65user 12.77system 0:34.16elapsed 165%CPU (0avgtext+0avgdata 171392maxresident)k
0inputs+0outputs (0major+369387minor)pagefaults 0swaps
hsh-rebuild: rebuild of `origin-3.11.0-alt2.src.rpm' failed.
Command exited with non-zero status 1
73.86user 19.37system 1:27.88elapsed 106%CPU (0avgtext+0avgdata 171392maxresident)k
80inputs+0outputs (0major+812847minor)pagefaults 0swaps