<86>Mar  3 05:10:27 userdel[3472811]: delete user 'rooter'
<86>Mar  3 05:10:27 userdel[3472811]: removed group 'rooter' owned by 'rooter'
<86>Mar  3 05:10:27 userdel[3472811]: removed shadow group 'rooter' owned by 'rooter'
<86>Mar  3 05:10:27 groupadd[3472986]: group added to /etc/group: name=rooter, GID=549
<86>Mar  3 05:10:27 groupadd[3472986]: group added to /etc/gshadow: name=rooter
<86>Mar  3 05:10:27 groupadd[3472986]: new group: name=rooter, GID=549
<86>Mar  3 05:10:27 useradd[3473047]: new user: name=rooter, UID=549, GID=549, home=/root, shell=/bin/bash
<86>Mar  3 05:10:27 userdel[3473160]: delete user 'builder'
<86>Mar  3 05:10:27 userdel[3473160]: removed group 'builder' owned by 'builder'
<86>Mar  3 05:10:27 userdel[3473160]: removed shadow group 'builder' owned by 'builder'
<86>Mar  3 05:10:27 groupadd[3473266]: group added to /etc/group: name=builder, GID=550
<86>Mar  3 05:10:27 groupadd[3473266]: group added to /etc/gshadow: name=builder
<86>Mar  3 05:10:27 groupadd[3473266]: new group: name=builder, GID=550
<86>Mar  3 05:10:27 useradd[3473310]: new user: name=builder, UID=550, GID=550, home=/usr/src, shell=/bin/bash
warning: Macro %_tcllibdir not found
warning: Macro %_tcllibdir not found
warning: Macro %_tcllibdir not found
<13>Mar  3 05:10:31 rpmi: rpm-build-tcl-0.5.1-alt1 1519671307 installed
<13>Mar  3 05:10:31 rpmi: libxml2-devel-1:2.9.10-alt3 sisyphus+243434.100.1.1 1577103644 installed
<13>Mar  3 05:10:31 rpmi: libtcl-8.6.10-alt1 sisyphus+241485.100.1.1 1574408296 installed
<13>Mar  3 05:10:31 rpmi: tcl-8.6.10-alt1 sisyphus+241485.100.1.1 1574408296 installed
<13>Mar  3 05:10:31 rpmi: tcl-udp-1.0.11-alt1 sisyphus+241399.100.1.1 1574324613 installed
<13>Mar  3 05:10:31 rpmi: libpng16-1.6.37-alt1 sisyphus+236677.100.2.1 1566917982 installed
<13>Mar  3 05:10:31 rpmi: libjpeg-2:2.0.2-alt1 sisyphus+226996.100.1.1 1554902884 installed
<13>Mar  3 05:10:31 rpmi: libgumbo-0.10.1-alt2 sisyphus+236955.100.1.1 1567255668 installed
<13>Mar  3 05:10:31 rpmi: libgpg-error-1.36-alt1 sisyphus+225621.300.1.1 1553521088 installed
<13>Mar  3 05:10:31 rpmi: libgcrypt20-1.8.5-alt3 sisyphus+239622.100.1.1 1571746563 installed
<13>Mar  3 05:10:31 rpmi: libxslt-1.1.34-alt1 sisyphus+240826.100.1.1 1573801838 installed
<13>Mar  3 05:10:31 rpmi: libexpat-2.2.4-alt1 1503305341 installed
<13>Mar  3 05:10:31 rpmi: tcl-tdom-0.9.1-alt2 sisyphus+238173.100.2.2 1569431222 installed
<13>Mar  3 05:10:31 rpmi: libXdmcp-1.1.3-alt1 sisyphus+225206.600.1.2 1552949347 installed
<13>Mar  3 05:10:31 rpmi: libXau-1.0.9-alt1 sisyphus+223149.200.2.1 1551268156 installed
<13>Mar  3 05:10:31 rpmi: libxcb-1.13.1-alt1 sisyphus+226527.100.2.2 1554593799 installed
<13>Mar  3 05:10:31 rpmi: libX11-locales-3:1.6.9-alt1 sisyphus+239210.100.1.1 1571056781 installed
<13>Mar  3 05:10:31 rpmi: libX11-3:1.6.9-alt1 sisyphus+239210.100.1.1 1571056781 installed
<13>Mar  3 05:10:31 rpmi: tcl-img-1.4.9-alt1 sisyphus+237638.400.4.1 1568675372 installed
<13>Mar  3 05:10:31 rpmi: libp11-kit-0.23.15-alt1 sisyphus+226408.100.2.1 1554288187 installed
<13>Mar  3 05:10:31 rpmi: libtasn1-4.16.0-alt1 sisyphus+245480.100.1.1 1580825069 installed
<13>Mar  3 05:10:31 rpmi: rpm-macros-alternatives-0.5.1-alt1 sisyphus+226946.100.1.1 1554830426 installed
<13>Mar  3 05:10:31 rpmi: alternatives-0.5.1-alt1 sisyphus+226946.100.1.1 1554830426 installed
<13>Mar  3 05:10:31 rpmi: ca-certificates-2020.01.23-alt1 sisyphus+244791.300.2.1 1580285500 installed
<13>Mar  3 05:10:31 rpmi: ca-trust-0.1.2-alt1 sisyphus+233348.100.1.1 1561653823 installed
<13>Mar  3 05:10:31 rpmi: p11-kit-trust-0.23.15-alt1 sisyphus+226408.100.2.1 1554288187 installed
<13>Mar  3 05:10:31 rpmi: libcrypto1.1-1.1.1d-alt1.1 sisyphus+237931.100.2.1 1569235630 installed
<13>Mar  3 05:10:31 rpmi: libssl1.1-1.1.1d-alt1.1 sisyphus+237931.100.2.1 1569235630 installed
<13>Mar  3 05:10:31 rpmi: tcl-tls-1.7.19-alt1 sisyphus+239277.100.1.1 1571161109 installed
<13>Mar  3 05:10:31 rpmi: tcl-trf-2.1.4-alt2 sisyphus+240159.100.1.1 1572742933 installed
<13>Mar  3 05:10:32 rpmi: tcllib-1:1.20-alt1 sisyphus+242142.100.1.1 1575300559 installed
<13>Mar  3 05:10:32 rpmi: libxslt-devel-1.1.34-alt1 sisyphus+240826.100.1.1 1573801838 installed
<13>Mar  3 05:10:32 rpmi: tcl-devel-8.6.10-alt1 sisyphus+241485.100.1.1 1574408296 installed
Building target platforms: x86_64
Building for target x86_64
Wrote: /usr/src/in/nosrpm/tcl-xml-3.2-alt2.nosrc.rpm
Installing tcl-xml-3.2-alt2.src.rpm
Building target platforms: x86_64
Building for target x86_64
Executing(%prep): /bin/sh -e /usr/src/tmp/rpm-tmp.50424
+ umask 022
+ /bin/mkdir -p /usr/src/RPM/BUILD
+ cd /usr/src/RPM/BUILD
+ cd /usr/src/RPM/BUILD
+ rm -rf tclxml-3.2
+ echo 'Source #0 (tclxml-3.2.tar):'
Source #0 (tclxml-3.2.tar):
+ /bin/tar -xf /usr/src/RPM/SOURCES/tclxml-3.2.tar
+ cd tclxml-3.2
+ /bin/chmod -c -Rf u+rwX,go-w .
+ echo 'Patch #1 (0001-reverted-fix-for-sf-bug-596959-seems-unneeded.patch):'
Patch #1 (0001-reverted-fix-for-sf-bug-596959-seems-unneeded.patch):
+ /usr/bin/patch -p2
patching file tclxml-tcl/sgmlparser.tcl
+ echo 'Patch #2 (0002-ALT-TEA.patch):'
Patch #2 (0002-ALT-TEA.patch):
+ /usr/bin/patch -p2
patching file Makefile.in
+ echo 'Patch #3 (0003-FEDORA-sgmlparser.patch):'
Patch #3 (0003-FEDORA-sgmlparser.patch):
+ /usr/bin/patch -p2
patching file tclxml-tcl/sgmlparser.tcl
+ echo 'Patch #4 (0004-FEDORA-xmlGenericError.patch):'
Patch #4 (0004-FEDORA-xmlGenericError.patch):
+ /usr/bin/patch -p2
patching file tclxslt-libxslt.c
+ exit 0
Executing(%build): /bin/sh -e /usr/src/tmp/rpm-tmp.50424
+ umask 022
+ /bin/mkdir -p /usr/src/RPM/BUILD
+ cd /usr/src/RPM/BUILD
+ cd tclxml-3.2
+ autoreconf -fisv
autoreconf-default: Entering directory `.'
autoreconf-default: configure.in: not using Gettext
autoreconf-default: configure.in: not using aclocal
autoreconf-default: configure.in: tracing
autoreconf-default: configure.in: not using Libtool
autoreconf-default: configure.in: not using Intltool
autoreconf-default: configure.in: not using gtk-doc
autoreconf-default: running: /usr/bin/autoconf-2.60 --force
autoreconf-default: configure.in: not using Autoheader
autoreconf-default: configure.in: not using Automake
autoreconf-default: Leaving directory `.'
+ CFLAGS='-pipe -frecord-gcc-switches -Wall -g -O2'
+ export CFLAGS
+ CXXFLAGS='-pipe -frecord-gcc-switches -Wall -g -O2'
+ export CXXFLAGS
+ FFLAGS='-pipe -frecord-gcc-switches -Wall -g -O2'
+ export FFLAGS
+ '[' -n '' ']'
++ sed -r 's/(^|[[:space:]]+)-[^m][^[:space:]]*//g'
++ printf %s '-pipe -frecord-gcc-switches -Wall -g -O2'
+ ASFLAGS=
+ export ASFLAGS
+ export lt_cv_deplibs_check_method=pass_all
+ lt_cv_deplibs_check_method=pass_all
+ readlink -e -- ./configure
+ xargs -ri dirname -- '{}'
+ xargs -ri find '{}' -type f '(' -name config.sub -or -name config.guess ')' -printf '%h/\n'
+ sort -u
+ xargs -rn1 install -pm755 -- /usr/share/gnu-config/config.sub /usr/share/gnu-config/config.guess
+ ./configure --build=x86_64-alt-linux --host=x86_64-alt-linux --prefix=/usr --exec-prefix=/usr --bindir=/usr/bin --sbindir=/usr/sbin --sysconfdir=/etc --datadir=/usr/share --includedir=/usr/include --libdir=/usr/lib64 --libexecdir=/usr/lib --localstatedir=/var/lib --sharedstatedir=/var/lib --mandir=/usr/share/man --infodir=/usr/share/info --disable-dependency-tracking --disable-silent-rules --without-included-gettext --disable-static --enable-stub
configure: WARNING: unrecognized options: --disable-dependency-tracking, --disable-silent-rules, --without-included-gettext, --disable-static, --enable-stub
checking for correct TEA configuration... ok (TEA 3.6)
checking for Tcl configuration... found /usr/lib64/tclConfig.sh
checking for existence of /usr/lib64/tclConfig.sh... loading
checking for a BSD-compatible install... /bin/install -c
checking for x86_64-alt-linux-gcc... x86_64-alt-linux-gcc
checking whether the C compiler works... yes
checking for C compiler default output file name... a.out
checking for suffix of executables... 
checking whether we are cross compiling... no
checking for suffix of object files... o
checking whether we are using the GNU C compiler... yes
checking whether x86_64-alt-linux-gcc accepts -g... yes
checking for x86_64-alt-linux-gcc option to accept ISO C89... none needed
checking how to run the C preprocessor... x86_64-alt-linux-gcc -E
checking whether make sets $(MAKE)... yes
checking for x86_64-alt-linux-ranlib... no
checking for ranlib... ranlib
checking for grep that handles long lines and -e... /bin/grep
checking for egrep... /bin/grep -E
checking for ANSI C header files... yes
checking for sys/types.h... yes
checking for sys/stat.h... yes
checking for stdlib.h... yes
checking for string.h... yes
checking for memory.h... yes
checking for strings.h... yes
checking for inttypes.h... yes
checking for stdint.h... yes
checking for unistd.h... yes
checking if the compiler understands -pipe... yes
checking whether byte ordering is bigendian... no
checking for sin... no
checking for main in -lieee... no
checking for main in -linet... no
checking net/errno.h usability... no
checking net/errno.h presence... no
checking for net/errno.h... no
checking for connect... yes
checking for gethostbyname... yes
checking dirent.h... yes
checking errno.h usability... yes
checking errno.h presence... yes
checking for errno.h... yes
checking float.h usability... yes
checking float.h presence... yes
checking for float.h... yes
checking values.h usability... yes
checking values.h presence... yes
checking for values.h... yes
checking limits.h usability... yes
checking limits.h presence... yes
checking for limits.h... yes
checking for stdlib.h... (cached) yes
checking for string.h... (cached) yes
checking sys/wait.h usability... yes
checking sys/wait.h presence... yes
checking for sys/wait.h... yes
checking dlfcn.h usability... yes
checking dlfcn.h presence... yes
checking for dlfcn.h... yes
checking sys/param.h usability... yes
checking sys/param.h presence... yes
checking for sys/param.h... yes
checking for Tcl public headers... /usr/include
checking for pthread_mutex_init in -lpthread... yes
checking for building with threads... yes (default)
checking how to build libraries... shared
checking if 64bit support is requested... no
checking if 64bit Sparc VIS support is requested... no
checking system version... Linux-4.19.97-std-def-alt1
checking for dlopen in -ldl... yes
checking for ar... ar
checking for required early compiler flags...  _LARGEFILE64_SOURCE
checking for 64-bit integer type... using long
checking for build with symbols... no
checking for xml2-config script... /usr/bin/xml2-config
checking for xslt-config script... /usr/bin/xslt-config
checking for static linking of XML/XSLT libraries... use dynamic linking
setting up dynamic linking
checking for tclsh... /usr/bin/tclsh8.6
configure: creating ./config.status
config.status: creating Makefile
config.status: creating Makefile.macosx
config.status: creating pkgIndex.tcl
config.status: creating TclxmlConfig.sh
config.status: creating include/tclxml/tclxml.h
config.status: creating doc/tclxml.xml
config.status: creating doc/tcldom.xml
config.status: creating doc/tclxslt.xml
config.status: creating doc/README.xml
configure: WARNING: unrecognized options: --disable-dependency-tracking, --disable-silent-rules, --without-included-gettext, --disable-static, --enable-stub
+ make -j8
make: Entering directory '/usr/src/RPM/BUILD/tclxml-3.2'
x86_64-alt-linux-gcc -DPACKAGE_NAME=\"Tclxml\" -DPACKAGE_TARNAME=\"tclxml\" -DPACKAGE_VERSION=\"3.2\" -DPACKAGE_STRING=\"Tclxml\ 3.2\" -DPACKAGE_BUGREPORT=\"\" -DPACKAGE_URL=\"\" -DSTDC_HEADERS=1 -DHAVE_SYS_TYPES_H=1 -DHAVE_SYS_STAT_H=1 -DHAVE_STDLIB_H=1 -DHAVE_STRING_H=1 -DHAVE_MEMORY_H=1 -DHAVE_STRINGS_H=1 -DHAVE_INTTYPES_H=1 -DHAVE_STDINT_H=1 -DHAVE_UNISTD_H=1 -DHAVE_LIMITS_H=1 -DHAVE_SYS_PARAM_H=1 -DUSE_THREAD_ALLOC=1 -D_REENTRANT=1 -D_THREAD_SAFE=1 -DTCL_THREADS=1 -D_LARGEFILE64_SOURCE=1 -DTCL_WIDE_INT_IS_LONG=1 -DUSE_TCL_STUBS=1 -I/usr/include/libxml2 -I/usr/include/libxml2 -Iinclude -I"/usr/include"    -pipe -frecord-gcc-switches -Wall -g -O2 -pipe -O2 -fomit-frame-pointer -Wall -Wno-implicit-int -fPIC  -c `echo tclxmlStubInit.c` -o tclxmlStubInit.o
make: Leaving directory '/usr/src/RPM/BUILD/tclxml-3.2'
make: Entering directory '/usr/src/RPM/BUILD/tclxml-3.2'
x86_64-alt-linux-gcc -DPACKAGE_NAME=\"Tclxml\" -DPACKAGE_TARNAME=\"tclxml\" -DPACKAGE_VERSION=\"3.2\" -DPACKAGE_STRING=\"Tclxml\ 3.2\" -DPACKAGE_BUGREPORT=\"\" -DPACKAGE_URL=\"\" -DSTDC_HEADERS=1 -DHAVE_SYS_TYPES_H=1 -DHAVE_SYS_STAT_H=1 -DHAVE_STDLIB_H=1 -DHAVE_STRING_H=1 -DHAVE_MEMORY_H=1 -DHAVE_STRINGS_H=1 -DHAVE_INTTYPES_H=1 -DHAVE_STDINT_H=1 -DHAVE_UNISTD_H=1 -DHAVE_LIMITS_H=1 -DHAVE_SYS_PARAM_H=1 -DUSE_THREAD_ALLOC=1 -D_REENTRANT=1 -D_THREAD_SAFE=1 -DTCL_THREADS=1 -D_LARGEFILE64_SOURCE=1 -DTCL_WIDE_INT_IS_LONG=1 -DUSE_TCL_STUBS=1 -I/usr/include/libxml2 -I/usr/include/libxml2 -Iinclude -I"/usr/include"    -pipe -frecord-gcc-switches -Wall -g -O2 -pipe -O2 -fomit-frame-pointer -Wall -Wno-implicit-int -fPIC  -c `echo tclxmlStubLib.c` -o tclxmlStubLib.o
make: Leaving directory '/usr/src/RPM/BUILD/tclxml-3.2'
make: Entering directory '/usr/src/RPM/BUILD/tclxml-3.2'
rm -f libTclxmlstub3.2.a
ar cr libTclxmlstub3.2.a tclxmlStubInit.o tclxmlStubLib.o
ranlib libTclxmlstub3.2.a
make: Leaving directory '/usr/src/RPM/BUILD/tclxml-3.2'
make: Entering directory '/usr/src/RPM/BUILD/tclxml-3.2'
x86_64-alt-linux-gcc -DPACKAGE_NAME=\"Tclxml\" -DPACKAGE_TARNAME=\"tclxml\" -DPACKAGE_VERSION=\"3.2\" -DPACKAGE_STRING=\"Tclxml\ 3.2\" -DPACKAGE_BUGREPORT=\"\" -DPACKAGE_URL=\"\" -DSTDC_HEADERS=1 -DHAVE_SYS_TYPES_H=1 -DHAVE_SYS_STAT_H=1 -DHAVE_STDLIB_H=1 -DHAVE_STRING_H=1 -DHAVE_MEMORY_H=1 -DHAVE_STRINGS_H=1 -DHAVE_INTTYPES_H=1 -DHAVE_STDINT_H=1 -DHAVE_UNISTD_H=1 -DHAVE_LIMITS_H=1 -DHAVE_SYS_PARAM_H=1 -DUSE_THREAD_ALLOC=1 -D_REENTRANT=1 -D_THREAD_SAFE=1 -DTCL_THREADS=1 -D_LARGEFILE64_SOURCE=1 -DTCL_WIDE_INT_IS_LONG=1 -DUSE_TCL_STUBS=1 -I/usr/include/libxml2 -I/usr/include/libxml2 -Iinclude -I"/usr/include"    -pipe -frecord-gcc-switches -Wall -g -O2 -pipe -O2 -fomit-frame-pointer -Wall -Wno-implicit-int -fPIC  -c `echo nodeObj.c` -o nodeObj.o
make: Leaving directory '/usr/src/RPM/BUILD/tclxml-3.2'
make: Entering directory '/usr/src/RPM/BUILD/tclxml-3.2'
x86_64-alt-linux-gcc -DPACKAGE_NAME=\"Tclxml\" -DPACKAGE_TARNAME=\"tclxml\" -DPACKAGE_VERSION=\"3.2\" -DPACKAGE_STRING=\"Tclxml\ 3.2\" -DPACKAGE_BUGREPORT=\"\" -DPACKAGE_URL=\"\" -DSTDC_HEADERS=1 -DHAVE_SYS_TYPES_H=1 -DHAVE_SYS_STAT_H=1 -DHAVE_STDLIB_H=1 -DHAVE_STRING_H=1 -DHAVE_MEMORY_H=1 -DHAVE_STRINGS_H=1 -DHAVE_INTTYPES_H=1 -DHAVE_STDINT_H=1 -DHAVE_UNISTD_H=1 -DHAVE_LIMITS_H=1 -DHAVE_SYS_PARAM_H=1 -DUSE_THREAD_ALLOC=1 -D_REENTRANT=1 -D_THREAD_SAFE=1 -DTCL_THREADS=1 -D_LARGEFILE64_SOURCE=1 -DTCL_WIDE_INT_IS_LONG=1 -DUSE_TCL_STUBS=1 -I/usr/include/libxml2 -I/usr/include/libxml2 -Iinclude -I"/usr/include"    -pipe -frecord-gcc-switches -Wall -g -O2 -pipe -O2 -fomit-frame-pointer -Wall -Wno-implicit-int -fPIC  -c `echo tclxml-libxml2.c` -o tclxml-libxml2.o
tclxml-libxml2.c: In function 'TclXMLlibxml2Configure':
tclxml-libxml2.c:748:9: warning: variable 'value' set but not used [-Wunused-but-set-variable]
  748 |   char *value;
      |         ^~~~~
make: Leaving directory '/usr/src/RPM/BUILD/tclxml-3.2'
make: Entering directory '/usr/src/RPM/BUILD/tclxml-3.2'
x86_64-alt-linux-gcc -DPACKAGE_NAME=\"Tclxml\" -DPACKAGE_TARNAME=\"tclxml\" -DPACKAGE_VERSION=\"3.2\" -DPACKAGE_STRING=\"Tclxml\ 3.2\" -DPACKAGE_BUGREPORT=\"\" -DPACKAGE_URL=\"\" -DSTDC_HEADERS=1 -DHAVE_SYS_TYPES_H=1 -DHAVE_SYS_STAT_H=1 -DHAVE_STDLIB_H=1 -DHAVE_STRING_H=1 -DHAVE_MEMORY_H=1 -DHAVE_STRINGS_H=1 -DHAVE_INTTYPES_H=1 -DHAVE_STDINT_H=1 -DHAVE_UNISTD_H=1 -DHAVE_LIMITS_H=1 -DHAVE_SYS_PARAM_H=1 -DUSE_THREAD_ALLOC=1 -D_REENTRANT=1 -D_THREAD_SAFE=1 -DTCL_THREADS=1 -D_LARGEFILE64_SOURCE=1 -DTCL_WIDE_INT_IS_LONG=1 -DUSE_TCL_STUBS=1 -I/usr/include/libxml2 -I/usr/include/libxml2 -Iinclude -I"/usr/include"    -pipe -frecord-gcc-switches -Wall -g -O2 -pipe -O2 -fomit-frame-pointer -Wall -Wno-implicit-int -fPIC  -c `echo tclxslt-libxslt.c` -o tclxslt-libxslt.o
make: Leaving directory '/usr/src/RPM/BUILD/tclxml-3.2'
make: Entering directory '/usr/src/RPM/BUILD/tclxml-3.2'
x86_64-alt-linux-gcc -DPACKAGE_NAME=\"Tclxml\" -DPACKAGE_TARNAME=\"tclxml\" -DPACKAGE_VERSION=\"3.2\" -DPACKAGE_STRING=\"Tclxml\ 3.2\" -DPACKAGE_BUGREPORT=\"\" -DPACKAGE_URL=\"\" -DSTDC_HEADERS=1 -DHAVE_SYS_TYPES_H=1 -DHAVE_SYS_STAT_H=1 -DHAVE_STDLIB_H=1 -DHAVE_STRING_H=1 -DHAVE_MEMORY_H=1 -DHAVE_STRINGS_H=1 -DHAVE_INTTYPES_H=1 -DHAVE_STDINT_H=1 -DHAVE_UNISTD_H=1 -DHAVE_LIMITS_H=1 -DHAVE_SYS_PARAM_H=1 -DUSE_THREAD_ALLOC=1 -D_REENTRANT=1 -D_THREAD_SAFE=1 -DTCL_THREADS=1 -D_LARGEFILE64_SOURCE=1 -DTCL_WIDE_INT_IS_LONG=1 -DUSE_TCL_STUBS=1 -I/usr/include/libxml2 -I/usr/include/libxml2 -Iinclude -I"/usr/include"    -pipe -frecord-gcc-switches -Wall -g -O2 -pipe -O2 -fomit-frame-pointer -Wall -Wno-implicit-int -fPIC  -c `echo docObj.c` -o docObj.o
make: Leaving directory '/usr/src/RPM/BUILD/tclxml-3.2'
make: Entering directory '/usr/src/RPM/BUILD/tclxml-3.2'
x86_64-alt-linux-gcc -DPACKAGE_NAME=\"Tclxml\" -DPACKAGE_TARNAME=\"tclxml\" -DPACKAGE_VERSION=\"3.2\" -DPACKAGE_STRING=\"Tclxml\ 3.2\" -DPACKAGE_BUGREPORT=\"\" -DPACKAGE_URL=\"\" -DSTDC_HEADERS=1 -DHAVE_SYS_TYPES_H=1 -DHAVE_SYS_STAT_H=1 -DHAVE_STDLIB_H=1 -DHAVE_STRING_H=1 -DHAVE_MEMORY_H=1 -DHAVE_STRINGS_H=1 -DHAVE_INTTYPES_H=1 -DHAVE_STDINT_H=1 -DHAVE_UNISTD_H=1 -DHAVE_LIMITS_H=1 -DHAVE_SYS_PARAM_H=1 -DUSE_THREAD_ALLOC=1 -D_REENTRANT=1 -D_THREAD_SAFE=1 -DTCL_THREADS=1 -D_LARGEFILE64_SOURCE=1 -DTCL_WIDE_INT_IS_LONG=1 -DUSE_TCL_STUBS=1 -I/usr/include/libxml2 -I/usr/include/libxml2 -Iinclude -I"/usr/include"    -pipe -frecord-gcc-switches -Wall -g -O2 -pipe -O2 -fomit-frame-pointer -Wall -Wno-implicit-int -fPIC  -c `echo tclxml.c` -o tclxml.o
tclxml.c: In function 'Tclxml_Init':
tclxml.c:252:7: warning: implicit declaration of function 'Tcldom_libxml2_Init'; did you mean 'Tclxml_libxml2_Init'? [-Wimplicit-function-declaration]
  252 |   if (Tcldom_libxml2_Init(interp) != TCL_OK) {
      |       ^~~~~~~~~~~~~~~~~~~
      |       Tclxml_libxml2_Init
make: Leaving directory '/usr/src/RPM/BUILD/tclxml-3.2'
make: Entering directory '/usr/src/RPM/BUILD/tclxml-3.2'
x86_64-alt-linux-gcc -DPACKAGE_NAME=\"Tclxml\" -DPACKAGE_TARNAME=\"tclxml\" -DPACKAGE_VERSION=\"3.2\" -DPACKAGE_STRING=\"Tclxml\ 3.2\" -DPACKAGE_BUGREPORT=\"\" -DPACKAGE_URL=\"\" -DSTDC_HEADERS=1 -DHAVE_SYS_TYPES_H=1 -DHAVE_SYS_STAT_H=1 -DHAVE_STDLIB_H=1 -DHAVE_STRING_H=1 -DHAVE_MEMORY_H=1 -DHAVE_STRINGS_H=1 -DHAVE_INTTYPES_H=1 -DHAVE_STDINT_H=1 -DHAVE_UNISTD_H=1 -DHAVE_LIMITS_H=1 -DHAVE_SYS_PARAM_H=1 -DUSE_THREAD_ALLOC=1 -D_REENTRANT=1 -D_THREAD_SAFE=1 -DTCL_THREADS=1 -D_LARGEFILE64_SOURCE=1 -DTCL_WIDE_INT_IS_LONG=1 -DUSE_TCL_STUBS=1 -I/usr/include/libxml2 -I/usr/include/libxml2 -Iinclude -I"/usr/include"    -pipe -frecord-gcc-switches -Wall -g -O2 -pipe -O2 -fomit-frame-pointer -Wall -Wno-implicit-int -fPIC  -c `echo tcldom-libxml2.c` -o tcldom-libxml2.o
tcldom-libxml2.c: In function 'TclDOMSerializeCommand':
tcldom-libxml2.c:960:9: warning: variable 'buf' set but not used [-Wunused-but-set-variable]
  960 |   char *buf, *encoding;
      |         ^~~
tcldom-libxml2.c: In function 'TclDOM_DispatchEvent':
tcldom-libxml2.c:4594:9: warning: variable 'phase' set but not used [-Wunused-but-set-variable]
 4594 |   char *phase;
      |         ^~~~~
tcldom-libxml2.c: In function 'NodeTypeSetFromAny':
tcldom-libxml2.c:6766:22: warning: variable 'node' set but not used [-Wunused-but-set-variable]
 6766 |   char *id, doc[21], node[21];
      |                      ^~~~
make: Leaving directory '/usr/src/RPM/BUILD/tclxml-3.2'
make: Entering directory '/usr/src/RPM/BUILD/tclxml-3.2'
rm -f libTclxml3.2.so
x86_64-alt-linux-gcc -shared -pipe -frecord-gcc-switches -Wall -g -O2 -pipe -O2 -fomit-frame-pointer -Wall -Wno-implicit-int -fPIC  -Wl,--export-dynamic  -o libTclxml3.2.so tclxml.o docObj.o tclxml-libxml2.o nodeObj.o tcldom-libxml2.o tclxslt-libxslt.o  tclxmlStubInit.o tclxmlStubLib.o -lxml2 -lxslt -lexslt -L/usr/lib64 -ltclstub8.6 -lxslt -lexslt 
: libTclxml3.2.so
: libTclxml3.2.so
make: Leaving directory '/usr/src/RPM/BUILD/tclxml-3.2'
+ cp -a tclxml-tcl/sgml-8.0.tcl tclxml-tcl/sgml-8.1.tcl tclxml-tcl/sgmlparser.tcl tclxml-tcl/tclparser-8.0.tcl tclxml-tcl/tclparser-8.1.tcl tclxml-tcl/xml-8.0.tcl tclxml-tcl/xml-8.1.tcl tclxml-tcl/xml__tcl.tcl tclxml-tcl/xmldep.tcl tclxml-tcl/xpath.tcl .
+ make doc
make: Entering directory '/usr/src/RPM/BUILD/tclxml-3.2'
TCL_LIBRARY=`echo /usr/include/tcl/library` LD_LIBRARY_PATH=".:/usr/lib64:" PATH=".:/usr/lib64:/usr/src/bin:/bin:/usr/bin:/usr/X11R6/bin:/usr/games" TCLLIBPATH="." /usr/bin/tclsh8.6 doc/transform.tcl doc/tclxml.xml doc/html.xsl doc/tclxml.html
TCL_LIBRARY=`echo /usr/include/tcl/library` LD_LIBRARY_PATH=".:/usr/lib64:" PATH=".:/usr/lib64:/usr/src/bin:/bin:/usr/bin:/usr/X11R6/bin:/usr/games" TCLLIBPATH="." /usr/bin/tclsh8.6 doc/transform.tcl doc/tclxml.xml doc/nroff.xsl doc/tclxml.n
TCL_LIBRARY=`echo /usr/include/tcl/library` LD_LIBRARY_PATH=".:/usr/lib64:" PATH=".:/usr/lib64:/usr/src/bin:/bin:/usr/bin:/usr/X11R6/bin:/usr/games" TCLLIBPATH="." /usr/bin/tclsh8.6 doc/transform.tcl doc/tcldom.xml doc/html.xsl doc/tcldom.html
TCL_LIBRARY=`echo /usr/include/tcl/library` LD_LIBRARY_PATH=".:/usr/lib64:" PATH=".:/usr/lib64:/usr/src/bin:/bin:/usr/bin:/usr/X11R6/bin:/usr/games" TCLLIBPATH="." /usr/bin/tclsh8.6 doc/transform.tcl doc/tcldom.xml doc/nroff.xsl doc/tcldom.n
TCL_LIBRARY=`echo /usr/include/tcl/library` LD_LIBRARY_PATH=".:/usr/lib64:" PATH=".:/usr/lib64:/usr/src/bin:/bin:/usr/bin:/usr/X11R6/bin:/usr/games" TCLLIBPATH="." /usr/bin/tclsh8.6 doc/transform.tcl doc/tclxslt.xml doc/html.xsl doc/tclxslt.html
TCL_LIBRARY=`echo /usr/include/tcl/library` LD_LIBRARY_PATH=".:/usr/lib64:" PATH=".:/usr/lib64:/usr/src/bin:/bin:/usr/bin:/usr/X11R6/bin:/usr/games" TCLLIBPATH="." /usr/bin/tclsh8.6 doc/transform.tcl doc/tclxslt.xml doc/nroff.xsl doc/tclxslt.n
TCL_LIBRARY=`echo /usr/include/tcl/library` LD_LIBRARY_PATH=".:/usr/lib64:" PATH=".:/usr/lib64:/usr/src/bin:/bin:/usr/bin:/usr/X11R6/bin:/usr/games" TCLLIBPATH="." /usr/bin/tclsh8.6 doc/transform.tcl doc/README.xml doc/html.xsl README.html
TCL_LIBRARY=`echo /usr/include/tcl/library` LD_LIBRARY_PATH=".:/usr/lib64:" PATH=".:/usr/lib64:/usr/src/bin:/bin:/usr/bin:/usr/X11R6/bin:/usr/games" TCLLIBPATH="." /usr/bin/tclsh8.6 doc/transform.tcl doc/README.xml doc/txt.xsl -o README
make: Leaving directory '/usr/src/RPM/BUILD/tclxml-3.2'
+ exit 0
Executing(%install): /bin/sh -e /usr/src/tmp/rpm-tmp.88133
+ umask 022
+ /bin/mkdir -p /usr/src/RPM/BUILD
+ cd /usr/src/RPM/BUILD
+ /bin/chmod -Rf u+rwX -- /usr/src/tmp/tcl-xml-buildroot
+ :
+ /bin/rm -rf -- /usr/src/tmp/tcl-xml-buildroot
+ cd tclxml-3.2
+ make 'INSTALL=/bin/install -p' DESTDIR=/usr/src/tmp/tcl-xml-buildroot install install-doc
make: Entering directory '/usr/src/RPM/BUILD/tclxml-3.2'
 /bin/install -p libTclxml3.2.so /usr/src/tmp/tcl-xml-buildroot/usr/lib64/tcl/Tclxml3.2/libTclxml3.2.so
 : /usr/src/tmp/tcl-xml-buildroot/usr/lib64/tcl/Tclxml3.2/libTclxml3.2.so
 /bin/install -p libTclxmlstub3.2.a /usr/src/tmp/tcl-xml-buildroot/usr/lib64/tcl/Tclxml3.2/libTclxmlstub3.2.a
 ranlib /usr/src/tmp/tcl-xml-buildroot/usr/lib64/tcl/Tclxml3.2/libTclxmlstub3.2.a
 Install tclxml-tcl/xml__tcl.tcl /usr/src/tmp/tcl-xml-buildroot/usr/lib64/tcl/Tclxml3.2/xml__tcl.tcl
 Install tclxml-tcl/sgml-8.0.tcl /usr/src/tmp/tcl-xml-buildroot/usr/lib64/tcl/Tclxml3.2/sgml-8.0.tcl
 Install tclxml-tcl/sgml-8.1.tcl /usr/src/tmp/tcl-xml-buildroot/usr/lib64/tcl/Tclxml3.2/sgml-8.1.tcl
 Install tclxml-tcl/xml-8.0.tcl /usr/src/tmp/tcl-xml-buildroot/usr/lib64/tcl/Tclxml3.2/xml-8.0.tcl
 Install tclxml-tcl/xml-8.1.tcl /usr/src/tmp/tcl-xml-buildroot/usr/lib64/tcl/Tclxml3.2/xml-8.1.tcl
 Install tclxml-tcl/sgmlparser.tcl /usr/src/tmp/tcl-xml-buildroot/usr/lib64/tcl/Tclxml3.2/sgmlparser.tcl
 Install tclxml-tcl/tclparser-8.0.tcl /usr/src/tmp/tcl-xml-buildroot/usr/lib64/tcl/Tclxml3.2/tclparser-8.0.tcl
 Install tclxml-tcl/tclparser-8.1.tcl /usr/src/tmp/tcl-xml-buildroot/usr/lib64/tcl/Tclxml3.2/tclparser-8.1.tcl
 Install tclxml-tcl/xmldep.tcl /usr/src/tmp/tcl-xml-buildroot/usr/lib64/tcl/Tclxml3.2/xmldep.tcl
 Install tclxml-tcl/xpath.tcl /usr/src/tmp/tcl-xml-buildroot/usr/lib64/tcl/Tclxml3.2/xpath.tcl
 Install tcldom-libxml2.tcl /usr/src/tmp/tcl-xml-buildroot/usr/lib64/tcl/Tclxml3.2/tcldom-libxml2.tcl
 Install tcldom-tcl/xmlswitch.tcl /usr/src/tmp/tcl-xml-buildroot/usr/lib64/tcl/Tclxml3.2/xmlswitch.tcl
 Install tclxslt/process.tcl /usr/src/tmp/tcl-xml-buildroot/usr/lib64/tcl/Tclxml3.2/process.tcl
 Install tclxslt/resources.tcl /usr/src/tmp/tcl-xml-buildroot/usr/lib64/tcl/Tclxml3.2/resources.tcl
 Install tclxslt/utilities.tcl /usr/src/tmp/tcl-xml-buildroot/usr/lib64/tcl/Tclxml3.2/utilities.tcl
 Install tclxslt/xsltcache.tcl /usr/src/tmp/tcl-xml-buildroot/usr/lib64/tcl/Tclxml3.2/xsltcache.tcl
 Install tclxslt-libxslt.tcl /usr/src/tmp/tcl-xml-buildroot/usr/lib64/tcl/Tclxml3.2/tclxslt-libxslt.tcl
/bin/install -p -m 644 TclxmlConfig.sh /usr/src/tmp/tcl-xml-buildroot/usr/lib64
: /usr/src/tmp/tcl-xml-buildroot/usr/lib64/tcl/Tclxml3.2/libTclxml3.2.so
if test "x1" = "x1"; then \
    /bin/install -p -m 644 pkgIndex.tcl /usr/src/tmp/tcl-xml-buildroot/usr/lib64/tcl/Tclxml3.2; \
fi
Installing header files in /usr/src/tmp/tcl-xml-buildroot/usr/include/tclxml
Installing ./include/tclxml-libxml2/docObj.h
Installing ./include/tclxml-libxml2/tclxml-libxml2.h
Installing ./include/tcldom/tcldom.h
Installing ./include/tcldom-libxml2/tcldom-libxml2.h
Installing ./include/tclxslt/tclxslt.h
libraries done
TCL_LIBRARY=`echo /usr/include/tcl/library` LD_LIBRARY_PATH=".:/usr/lib64:" PATH=".:/usr/lib64:/usr/src/bin:/bin:/usr/bin:/usr/X11R6/bin:/usr/games" TCLLIBPATH="." /usr/bin/tclsh8.6 doc/transform.tcl doc/tclxml.xml doc/html.xsl doc/tclxml.html
TCL_LIBRARY=`echo /usr/include/tcl/library` LD_LIBRARY_PATH=".:/usr/lib64:" PATH=".:/usr/lib64:/usr/src/bin:/bin:/usr/bin:/usr/X11R6/bin:/usr/games" TCLLIBPATH="." /usr/bin/tclsh8.6 doc/transform.tcl doc/tclxml.xml doc/nroff.xsl doc/tclxml.n
TCL_LIBRARY=`echo /usr/include/tcl/library` LD_LIBRARY_PATH=".:/usr/lib64:" PATH=".:/usr/lib64:/usr/src/bin:/bin:/usr/bin:/usr/X11R6/bin:/usr/games" TCLLIBPATH="." /usr/bin/tclsh8.6 doc/transform.tcl doc/tcldom.xml doc/html.xsl doc/tcldom.html
TCL_LIBRARY=`echo /usr/include/tcl/library` LD_LIBRARY_PATH=".:/usr/lib64:" PATH=".:/usr/lib64:/usr/src/bin:/bin:/usr/bin:/usr/X11R6/bin:/usr/games" TCLLIBPATH="." /usr/bin/tclsh8.6 doc/transform.tcl doc/tcldom.xml doc/nroff.xsl doc/tcldom.n
TCL_LIBRARY=`echo /usr/include/tcl/library` LD_LIBRARY_PATH=".:/usr/lib64:" PATH=".:/usr/lib64:/usr/src/bin:/bin:/usr/bin:/usr/X11R6/bin:/usr/games" TCLLIBPATH="." /usr/bin/tclsh8.6 doc/transform.tcl doc/tclxslt.xml doc/html.xsl doc/tclxslt.html
TCL_LIBRARY=`echo /usr/include/tcl/library` LD_LIBRARY_PATH=".:/usr/lib64:" PATH=".:/usr/lib64:/usr/src/bin:/bin:/usr/bin:/usr/X11R6/bin:/usr/games" TCLLIBPATH="." /usr/bin/tclsh8.6 doc/transform.tcl doc/tclxslt.xml doc/nroff.xsl doc/tclxslt.n
TCL_LIBRARY=`echo /usr/include/tcl/library` LD_LIBRARY_PATH=".:/usr/lib64:" PATH=".:/usr/lib64:/usr/src/bin:/bin:/usr/bin:/usr/X11R6/bin:/usr/games" TCLLIBPATH="." /usr/bin/tclsh8.6 doc/transform.tcl doc/README.xml doc/html.xsl README.html
TCL_LIBRARY=`echo /usr/include/tcl/library` LD_LIBRARY_PATH=".:/usr/lib64:" PATH=".:/usr/lib64:/usr/src/bin:/bin:/usr/bin:/usr/X11R6/bin:/usr/games" TCLLIBPATH="." /usr/bin/tclsh8.6 doc/transform.tcl doc/README.xml doc/txt.xsl -o README
Installing documentation in /usr/src/tmp/tcl-xml-buildroot/usr/share/man
Installing ./doc/tcldom.n
Installing ./doc/tclxml.n
Installing ./doc/tclxslt.n
make: Leaving directory '/usr/src/RPM/BUILD/tclxml-3.2'
+ xz ChangeLog
+ /usr/lib/rpm/brp-alt
Cleaning files in /usr/src/tmp/tcl-xml-buildroot (auto)
mode of './usr/lib64/tcl/Tclxml3.2/libTclxmlstub3.2.a' changed from 0755 (rwxr-xr-x) to 0644 (rw-r--r--)
mode of './usr/lib64/tcl/Tclxml3.2/libTclxml3.2.so' changed from 0755 (rwxr-xr-x) to 0644 (rw-r--r--)
Verifying and fixing files in /usr/src/tmp/tcl-xml-buildroot (binconfig,pkgconfig,libtool,desktop)
Checking contents of files in /usr/src/tmp/tcl-xml-buildroot/ (default)
Compressing files in /usr/src/tmp/tcl-xml-buildroot (auto)
Adjusting library links in /usr/src/tmp/tcl-xml-buildroot
./usr/lib64:
Verifying ELF objects in /usr/src/tmp/tcl-xml-buildroot (arch=normal,fhs=normal,lfs=relaxed,lint=relaxed,rpath=normal,stack=normal,textrel=normal,unresolved=normal)
Hardlinking identical .pyc and .pyo files
Processing files: tcl-xml-3.2-alt2
Executing(%doc): /bin/sh -e /usr/src/tmp/rpm-tmp.63221
+ umask 022
+ /bin/mkdir -p /usr/src/RPM/BUILD
+ cd /usr/src/RPM/BUILD
+ cd tclxml-3.2
+ DOCDIR=/usr/src/tmp/tcl-xml-buildroot/usr/share/doc/tcl-xml-3.2
+ export DOCDIR
+ rm -rf /usr/src/tmp/tcl-xml-buildroot/usr/share/doc/tcl-xml-3.2
+ /bin/mkdir -p /usr/src/tmp/tcl-xml-buildroot/usr/share/doc/tcl-xml-3.2
+ cp -prL ANNOUNCE ChangeLog.xz README.html LICENSE /usr/src/tmp/tcl-xml-buildroot/usr/share/doc/tcl-xml-3.2
+ chmod -R go-w /usr/src/tmp/tcl-xml-buildroot/usr/share/doc/tcl-xml-3.2
+ chmod -R a+rX /usr/src/tmp/tcl-xml-buildroot/usr/share/doc/tcl-xml-3.2
+ cp -prL doc/tcldom.html doc/tclxml.html doc/tclxslt.html /usr/src/tmp/tcl-xml-buildroot/usr/share/doc/tcl-xml-3.2
+ chmod -R go-w /usr/src/tmp/tcl-xml-buildroot/usr/share/doc/tcl-xml-3.2
+ chmod -R a+rX /usr/src/tmp/tcl-xml-buildroot/usr/share/doc/tcl-xml-3.2
+ exit 0
Finding Provides (using /usr/lib/rpm/find-provides)
Executing: /bin/sh -e /usr/src/tmp/rpm-tmp.7sxixC
find-provides: running scripts (alternatives,debuginfo,lib,pam,perl,pkgconfig,python,shell,tcl)
Finding Requires (using /usr/lib/rpm/find-requires)
Executing: /bin/sh -e /usr/src/tmp/rpm-tmp.397zNB
find-requires: running scripts (cpp,debuginfo,files,lib,pam,perl,pkgconfig,pkgconfiglib,python,rpmlib,shebang,shell,static,symlinks,systemd-services,tcl)
Provides: tcl-xml-core, tcl-dom-core, tcl-xslt, tcl(dom) = 3.2, tcl(dom::libxml2) = 3.2, tcl(puretclparser) = 3.2, tcl(sgml) = 1.9, tcl(sgmlparser) = 1.1, tcl(tclparser) = 3.2, tcl(xml) = 3.2, tcl(xml::libxml2) = 3.2, tcl(xml::tcl) = 3.2, tcl(xml::tclparser) = 3.2, tcl(xmldefs) = 3.2, tcl(xmldep) = 1.0, tcl(xmlswitch) = 3.2, tcl(xpath) = 1.0, tcl(xslt) = 3.2, tcl(xslt::cache) = 3.2, tcl(xslt::libxslt) = 3.2, tcl(xslt::process) = 1.1, tcl(xslt::resources) = 1.3, tcl(xslt::utilities) = 3.2
Requires: libc.so.6(GLIBC_2.2.5)(64bit), libc.so.6(GLIBC_2.3.4)(64bit), libc.so.6(GLIBC_2.4)(64bit), libexslt.so.0()(64bit) >= set:igtzgY5, libxml2.so.2()(64bit) >= set:ohusptwAqRiDN9QkLDXpUJPPg050Pw4M1Eus821hto900Gahcgttx3DrM79DicMZhZAFP9caToOzTr0yjyDXx5WcM7SZlEAw5EqAZjsLKCooiFbe98A0bpS2xkFUvkDKr4ceP0c6pFaDhTKNR590iNzZbEaoID4CZ28vPHMkZ1Nv5Wx3vwgIFInGzSpLoWkAXRkZ4hZnM5IZqzHB8IdaKWrFwywFJLAXIBGsdS43RGUK3TZml35osohjRDDANFIJNUmKm0fYCynQmRJY2, libxml2.so.2(LIBXML2_2.4.30)(64bit), libxml2.so.2(LIBXML2_2.5.0)(64bit), libxml2.so.2(LIBXML2_2.5.4)(64bit), libxml2.so.2(LIBXML2_2.5.8)(64bit), libxml2.so.2(LIBXML2_2.6.0)(64bit), libxml2.so.2(LIBXML2_2.6.2)(64bit), libxml2.so.2(LIBXML2_2.6.23)(64bit), libxml2.so.2(LIBXML2_2.6.3)(64bit), libxml2.so.2(LIBXML2_2.6.6)(64bit), libxml2.so.2(LIBXML2_2.6.8)(64bit), libxslt.so.1()(64bit) >= set:lgVhukflqMW3k52CT90JvVMJFQIOMYS7XJ9KllQ6oteNOVW3, libxslt.so.1(LIBXML2_1.0.11)(64bit), libxslt.so.1(LIBXML2_1.0.13)(64bit), libxslt.so.1(LIBXML2_1.0.22)(64bit), libxslt.so.1(LIBXML2_1.0.24)(64bit), rtld(GNU_HASH), tcl(uri)
Requires(rpmlib): rpmlib(SetVersions)
Conflicts: tcl-xml-libxml2 < 3.2, tcl-dom-libxml2 < 3.2
Obsoletes: tcl-xml-core < 3.2, tcl-dom-core < 3.2, tcl-xslt < 3.2
Finding debuginfo files (using /usr/lib/rpm/find-debuginfo-files)
Executing: /bin/sh -e /usr/src/tmp/rpm-tmp.q7xZKE
Creating tcl-xml-debuginfo package
Processing files: tcl-xml-devel-3.2-alt2
Finding Provides (using /usr/lib/rpm/find-provides)
Executing: /bin/sh -e /usr/src/tmp/rpm-tmp.bBEpZB
find-provides: running scripts (alternatives,debuginfo,lib,pam,perl,pkgconfig,python,shell,tcl)
Finding Requires (using /usr/lib/rpm/find-requires)
Executing: /bin/sh -e /usr/src/tmp/rpm-tmp.UAGdDE
find-requires: running scripts (cpp,debuginfo,files,lib,pam,perl,pkgconfig,pkgconfiglib,python,rpmlib,shebang,shell,static,symlinks,systemd-services,tcl)
/usr/src/tmp/tcl-xml-buildroot/usr/include/tclxml/docObj.h:28:10: fatal error: libxml/tree.h: No such file or directory
   28 | #include <libxml/tree.h>
      |          ^~~~~~~~~~~~~~~
compilation terminated.
cpp.req: /usr/src/tmp/tcl-xml-buildroot/usr/include/tclxml/docObj.h: cpp failed, trying c++ mode
x86_64-alt-linux-cpp: fatal error: cannot execute 'cc1plus': execvp: No such file or directory
compilation terminated.
cpp.req: WARNING: /usr/src/tmp/tcl-xml-buildroot/usr/include/tclxml/docObj.h: cpp failed
/usr/src/tmp/tcl-xml-buildroot/usr/include/tclxml/tclxslt.h:25:10: fatal error: tcldom-libxml2/tcldom-libxml2.h: No such file or directory
   25 | #include <tcldom-libxml2/tcldom-libxml2.h>
      |          ^~~~~~~~~~~~~~~~~~~~~~~~~~~~~~~~~
compilation terminated.
cpp.req: WARNING: /usr/src/tmp/tcl-xml-buildroot/usr/include/tclxml/tclxslt.h: cpp failed
/usr/src/tmp/tcl-xml-buildroot/usr/include/tclxml/tcldom-libxml2.h:20:10: fatal error: tcldom/tcldom.h: No such file or directory
   20 | #include <tcldom/tcldom.h>
      |          ^~~~~~~~~~~~~~~~~
compilation terminated.
cpp.req: WARNING: /usr/src/tmp/tcl-xml-buildroot/usr/include/tclxml/tcldom-libxml2.h: cpp failed
/usr/src/tmp/tcl-xml-buildroot/usr/include/tclxml/tclxml-libxml2.h:19:10: fatal error: tclxml/tclxml.h: No such file or directory
   19 | #include <tclxml/tclxml.h>
      |          ^~~~~~~~~~~~~~~~~
compilation terminated.
cpp.req: WARNING: /usr/src/tmp/tcl-xml-buildroot/usr/include/tclxml/tclxml-libxml2.h: cpp failed
Requires: tcl-xml, tcl-devel
Finding debuginfo files (using /usr/lib/rpm/find-debuginfo-files)
Executing: /bin/sh -e /usr/src/tmp/rpm-tmp.WxWMBF
Processing files: tcl-xml-debuginfo-3.2-alt2
Finding Provides (using /usr/lib/rpm/find-provides)
Executing: /bin/sh -e /usr/src/tmp/rpm-tmp.VGnRhB
find-provides: running scripts (debuginfo)
Finding Requires (using /usr/lib/rpm/find-requires)
Executing: /bin/sh -e /usr/src/tmp/rpm-tmp.K1a4nB
find-requires: running scripts (debuginfo)
Requires: tcl-xml = 3.2-alt2, debug64(libc.so.6), debug64(libexslt.so.0), debug64(libxml2.so.2), debug64(libxslt.so.1)
Adding to tcl-xml-debuginfo a strict dependency on tcl-xml
Adding to tcl-xml-devel a strict dependency on tcl-xml
warning: Installed (but unpackaged) file(s) found:
    /usr/lib64/TclxmlConfig.sh
Wrote: /usr/src/RPM/RPMS/x86_64/tcl-xml-3.2-alt2.x86_64.rpm
Wrote: /usr/src/RPM/RPMS/x86_64/tcl-xml-devel-3.2-alt2.x86_64.rpm
Wrote: /usr/src/RPM/RPMS/x86_64/tcl-xml-debuginfo-3.2-alt2.x86_64.rpm
11.04user 2.04system 0:22.32elapsed 58%CPU (0avgtext+0avgdata 69812maxresident)k
0inputs+0outputs (0major+775634minor)pagefaults 0swaps
16.74user 5.13system 0:34.64elapsed 63%CPU (0avgtext+0avgdata 109640maxresident)k
9528inputs+0outputs (0major+1132723minor)pagefaults 0swaps