<86>Dec  5 03:38:07 userdel[123646]: delete user 'rooter'
<86>Dec  5 03:38:07 groupadd[123653]: group added to /etc/group: name=rooter, GID=663
<86>Dec  5 03:38:07 groupadd[123653]: group added to /etc/gshadow: name=rooter
<86>Dec  5 03:38:07 groupadd[123653]: new group: name=rooter, GID=663
<86>Dec  5 03:38:07 useradd[123661]: new user: name=rooter, UID=663, GID=663, home=/root, shell=/bin/bash
<86>Dec  5 03:38:07 userdel[123674]: delete user 'builder'
<86>Dec  5 03:38:07 userdel[123674]: removed group 'builder' owned by 'builder'
<86>Dec  5 03:38:07 userdel[123674]: removed shadow group 'builder' owned by 'builder'
<86>Dec  5 03:38:07 groupadd[123682]: group added to /etc/group: name=builder, GID=664
<86>Dec  5 03:38:07 groupadd[123682]: group added to /etc/gshadow: name=builder
<86>Dec  5 03:38:07 groupadd[123682]: new group: name=builder, GID=664
<86>Dec  5 03:38:07 useradd[123688]: new user: name=builder, UID=664, GID=664, home=/usr/src, shell=/bin/bash
<13>Dec  5 03:38:10 rpmi: rpm-macros-cmake-3.15.4-alt1 sisyphus+239520.100.1.1 1571611942 installed
<13>Dec  5 03:38:12 rpmi: libexpat-2.2.4-alt1 1503305341 installed
<13>Dec  5 03:38:12 rpmi: libwayland-client-1.17.0-alt1 sisyphus+225894.100.1.1 1553872803 installed
<13>Dec  5 03:38:12 rpmi: xorg-proto-devel-2019.1-alt1 sisyphus+232786.100.1.1 1561106722 installed
<13>Dec  5 03:38:12 rpmi: libpng16-1.6.37-alt1 sisyphus+236677.100.2.1 1566917982 installed
<13>Dec  5 03:38:12 rpmi: perl-HTTP-Date-6.04-alt1 sisyphus+241046.100.1.1 1574192946 installed
<13>Dec  5 03:38:12 rpmi: libjpeg-2:2.0.2-alt1 sisyphus+226996.100.1.1 1554902884 installed
<13>Dec  5 03:38:12 rpmi: libglvnd-7:1.2.0-alt4 sisyphus+241659.100.1.1 1574755340 installed
<13>Dec  5 03:38:12 rpmi: libsqlite3-3.30.1-alt3 sisyphus+242073.100.1.1 1575235962 installed
<13>Dec  5 03:38:12 rpmi: liblcms2-2.9-alt1 1516411888 installed
<13>Dec  5 03:38:12 rpmi: perl-XML-NamespaceSupport-1.12-alt1 1491296348 installed
<13>Dec  5 03:38:12 rpmi: libidn2-2.3.0-alt1 sisyphus+240846.100.1.2 1573870464 installed
<13>Dec  5 03:38:12 rpmi: libnettle7-3.5.1-alt1 sisyphus+235265.40.6.1 1566223043 installed
<13>Dec  5 03:38:12 rpmi: libwayland-egl-4:18.1.0-alt1 sisyphus+225894.100.1.1 1553872803 installed
<13>Dec  5 03:38:12 rpmi: libnspr-1:4.23-alt1 sisyphus+239875.100.1.1 1572267301 installed
<13>Dec  5 03:38:12 rpmi: vapi-common-0.46.5-alt1 sisyphus+241768.100.1.1 1574848839 installed
<13>Dec  5 03:38:12 rpmi: libfribidi-1.0.7-alt1 sisyphus+238256.100.1.1 1569654630 installed
<13>Dec  5 03:38:12 rpmi: zlib-devel-1.2.11-alt1 sisyphus+221902.6000.4.1 1550600768 installed
<13>Dec  5 03:38:12 rpmi: perl-LWP-MediaTypes-6.04-alt1 sisyphus+225468.100.1.1 1553186684 installed
<13>Dec  5 03:38:12 rpmi: perl-Compress-Raw-Zlib-2.091-alt1 sisyphus+241815.100.1.1 1574875358 installed
<13>Dec  5 03:38:12 rpmi: perl-libnet-1:3.11-alt1 1511423541 installed
<13>Dec  5 03:38:12 rpmi: perl-XML-SAX-Base-1.09-alt1 1494364363 installed
<13>Dec  5 03:38:12 rpmi: libgudev-1:233-alt1 sisyphus+235422.100.1.1 1564855269 installed
<13>Dec  5 03:38:12 rpmi: libwayland-server-1.17.0-alt1 sisyphus+225894.100.1.1 1553872803 installed
<13>Dec  5 03:38:13 rpmi: libicu65-1:6.5.1-alt1 sisyphus+238768.100.16.1 1571427351 installed
<13>Dec  5 03:38:13 rpmi: libgraphite2-1.3.13-alt2 sisyphus+226799.100.1.1 1554648233 installed
<13>Dec  5 03:38:13 rpmi: libharfbuzz-2.6.4-alt1 sisyphus+240033.100.1.1 1572506772 installed
<13>Dec  5 03:38:13 rpmi: libfreetype-2.10.1-alt1 sisyphus+237471.100.1.1 1568276349 installed
<13>Dec  5 03:38:13 rpmi: fontconfig-2.13.1-alt1 sisyphus+226691.100.2.2 1554598717 installed
Updating fonts cache: <29>Dec  5 03:38:14 fontconfig: Updating fonts cache: succeeded
[ DONE ]
<13>Dec  5 03:38:14 rpmi: libgdbm-1.8.3-alt10 1454943313 installed
<13>Dec  5 03:38:14 rpmi: libp11-kit-0.23.15-alt1 sisyphus+226408.100.2.1 1554288187 installed
<13>Dec  5 03:38:14 rpmi: libtasn1-4.15.0-alt1 sisyphus+241940.100.1.1 1574959862 installed
<13>Dec  5 03:38:14 rpmi: libXau-1.0.9-alt1 sisyphus+223149.200.2.1 1551268156 installed
<13>Dec  5 03:38:14 rpmi: libICE-1.0.9-alt1 1409902719 installed
<13>Dec  5 03:38:14 rpmi: libSM-1.2.3-alt1 sisyphus+226734.100.2.1 1554586157 installed
<13>Dec  5 03:38:14 rpmi: libXau-devel-1.0.9-alt1 sisyphus+223149.200.2.1 1551268156 installed
<13>Dec  5 03:38:14 rpmi: libharfbuzz-icu-2.6.4-alt1 sisyphus+240033.100.1.1 1572506772 installed
<13>Dec  5 03:38:14 rpmi: libgraphite2-devel-1.3.13-alt2 sisyphus+226799.100.1.1 1554648233 installed
<13>Dec  5 03:38:14 rpmi: icu-utils-1:6.5.1-alt1 sisyphus+238768.100.16.1 1571427351 installed
<13>Dec  5 03:38:14 rpmi: libicu-devel-1:6.5.1-alt1 sisyphus+238768.100.16.1 1571427351 installed
<13>Dec  5 03:38:14 rpmi: libpng-devel-1.6.37-alt1 sisyphus+236677.100.2.1 1566917982 installed
<13>Dec  5 03:38:14 rpmi: libarchive13-3.4.0-alt1 sisyphus+235265.640.9.1 1566482445 installed
<13>Dec  5 03:38:14 rpmi: libhogweed5-3.5.1-alt1 sisyphus+235265.40.6.1 1566223043 installed
<13>Dec  5 03:38:14 rpmi: libgnutls30-3.6.11-alt1 sisyphus+242147.100.1.1 1575310882 installed
<13>Dec  5 03:38:14 rpmi: libOpenGL-7:1.2.0-alt4 sisyphus+241659.100.1.1 1574755340 installed
<13>Dec  5 03:38:14 rpmi: libGLES-7:1.2.0-alt4 sisyphus+241659.100.1.1 1574755340 installed
<13>Dec  5 03:38:14 rpmi: libjasper-2.0.16-alt1 sisyphus+231386.100.1.1 1559568071 installed
<13>Dec  5 03:38:14 rpmi: perl-File-Listing-6.04-alt1 1329758996 installed
<13>Dec  5 03:38:14 rpmi: libwayland-cursor-1.17.0-alt1 sisyphus+225894.100.1.1 1553872803 installed
<13>Dec  5 03:38:14 rpmi: wayland-devel-1.17.0-alt1 sisyphus+225894.100.1.1 1553872803 installed
<13>Dec  5 03:38:14 rpmi: libwayland-client-devel-1.17.0-alt1 sisyphus+225894.100.1.1 1553872803 installed
<13>Dec  5 03:38:14 rpmi: rpm-build-vala-0.3-alt1 1332324961 installed
<13>Dec  5 03:38:15 rpmi: poppler-data-0.4.9-alt1 sisyphus.216033.100 1541141723 installed
<13>Dec  5 03:38:15 rpmi: libopenjpeg2.0-2.3.1-alt1 sisyphus+226454.100.1.1 1554284336 installed
<13>Dec  5 03:38:15 rpmi: libxkbcommon-0.9.1-alt1 sisyphus+239553.100.1.1 1571659623 installed
<13>Dec  5 03:38:15 rpmi: udev-rules-1:244-alt1 sisyphus+242291.100.1.1 1575476449 installed
<13>Dec  5 03:38:15 rpmi: libepoxy-1.5.4-alt1 sisyphus+242061.100.1.1 1575190153 installed
<13>Dec  5 03:38:15 rpmi: libdatrie-0.2.9-alt1_6 1511686677 installed
<13>Dec  5 03:38:15 rpmi: libthai-0.1.28-alt1_1 sisyphus+226107.100.1.1 1554123079 installed
<13>Dec  5 03:38:15 rpmi: libusb-1.0.23-alt1 sisyphus+237317.100.1.1 1568059904 installed
<13>Dec  5 03:38:15 rpmi: libpixman-3:0.38.4-alt1 sisyphus+228006.100.1.1 1556013486 installed
<13>Dec  5 03:38:15 rpmi: perl-Try-Tiny-0.30-alt1 1514318058 installed
<13>Dec  5 03:38:15 rpmi: perl-IO-Socket-IP-0.39-alt1 1494508514 installed
<13>Dec  5 03:38:15 rpmi: perl-Compress-Raw-Bzip2-2.091-alt1 sisyphus+241814.100.1.1 1574875356 installed
<13>Dec  5 03:38:15 rpmi: perl-HTML-Tagset-3.20-alt2 1317725093 installed
<13>Dec  5 03:38:15 rpmi: perl-Term-ANSIColor-4.06-alt1 1479407083 installed
<13>Dec  5 03:38:15 rpmi: perl-Data-Dump-1.23-alt1 1444601978 installed
<13>Dec  5 03:38:15 rpmi: perl-Filter-1.59-alt1.1 sisyphus+219907.400.1.1 1548343225 installed
<13>Dec  5 03:38:15 rpmi: perl-Encode-3.01-alt1 sisyphus+224923.100.1.1 1552474113 installed
<13>Dec  5 03:38:15 rpmi: perl-URI-1.76-alt1 sisyphus+220243.100.1.1 1548863244 installed
<13>Dec  5 03:38:15 rpmi: perl-IO-Compress-2.089-alt1 sisyphus+240416.100.1.1 1573134826 installed
<13>Dec  5 03:38:15 rpmi: perl-Net-HTTP-6.19-alt1 sisyphus+229756.100.1.1 1558454558 installed
<13>Dec  5 03:38:15 rpmi: perl-HTML-Parser-3.72-alt1.2 sisyphus+219907.600.1.1 1548343407 installed
<13>Dec  5 03:38:15 rpmi: perl-WWW-RobotRules-6.02-alt1 1329756211 installed
<13>Dec  5 03:38:15 rpmi: perl-Encode-Locale-1.05-alt1 1444608613 installed
<13>Dec  5 03:38:15 rpmi: perl-IO-HTML-1.001-alt1 1404821752 installed
<13>Dec  5 03:38:15 rpmi: perl-HTTP-Message-6.18-alt1 1528288416 installed
<13>Dec  5 03:38:15 rpmi: perl-HTTP-Cookies-6.08-alt1 sisyphus+242242.100.1.1 1575454022 installed
<13>Dec  5 03:38:15 rpmi: perl-HTTP-Negotiate-6.01-alt1 1329760563 installed
<13>Dec  5 03:38:15 rpmi: perl-libwww-6.43-alt1 sisyphus+241824.100.1.3 1574885081 installed
<13>Dec  5 03:38:15 rpmi: perl-XML-LibXML-2.0201-alt2 sisyphus+240586.100.1.1 1573669063 installed
<13>Dec  5 03:38:15 rpmi: perl-XML-SAX-1.02-alt1 sisyphus+232322.100.1.1 1560758406 installed
<13>Dec  5 03:38:15 rpmi: perl-XML-Simple-2.25-alt1 1521437714 installed
<13>Dec  5 03:38:15 rpmi: icon-naming-utils-0.8.90-alt1 1236573102 installed
<13>Dec  5 03:38:16 rpmi: icon-theme-adwaita-3.34.3-alt1 sisyphus+240473.100.1.2 1573463296 installed
<13>Dec  5 03:38:16 rpmi: libwebp7-1.0.3-alt1 sisyphus+234493.100.1.1 1563090161 installed
<13>Dec  5 03:38:16 rpmi: libjbig-2.1-alt1 1401380921 installed
<13>Dec  5 03:38:16 rpmi: libtiff5-4.1.0-alt1 sisyphus+240802.100.1.1 1573743630 installed
<13>Dec  5 03:38:16 rpmi: libgdk-pixbuf-locales-2.40.0-alt1 sisyphus+238952.140.2.1 1570644607 installed
<13>Dec  5 03:38:16 rpmi: python-base-2.7.17-alt3 sisyphus+240580.60.5.1 1573516903 installed
<13>Dec  5 03:38:16 rpmi: gtk+3-themes-incompatible-3.20-alt3 1461944560 installed
<13>Dec  5 03:38:16 rpmi: liborc-0.4.31-alt1 sisyphus+240181.100.1.1 1572853313 installed
<13>Dec  5 03:38:16 rpmi: libxshmfence-1.3-alt1 sisyphus+223149.1000.2.1 1551268594 installed
<13>Dec  5 03:38:16 rpmi: libpciaccess-1:0.16-alt1 sisyphus+234814.100.1.1 1563438297 installed
<13>Dec  5 03:38:17 rpmi: libdrm-1:2.4.100-alt1 sisyphus+240099.100.1.1 1572599782 installed
<13>Dec  5 03:38:17 rpmi: libgbm-4:19.2.6-alt2 sisyphus+241659.200.1.1 1574756982 installed
<13>Dec  5 03:38:17 rpmi: libproxy-0.4.15-alt3 sisyphus+227885.100.1.2 1555818596 installed
<13>Dec  5 03:38:17 rpmi: xml-utils-1:2.9.10-alt2 sisyphus+240156.100.1.1 1572696462 installed
<13>Dec  5 03:38:17 rpmi: rpm-build-gir-0.7.3-alt3 sisyphus+242150.100.1.1 1575312005 installed
<13>Dec  5 03:38:17 rpmi: cmake-modules-3.15.4-alt1 sisyphus+239520.100.1.1 1571611942 installed
<13>Dec  5 03:38:17 rpmi: libuv-1.33.1-alt1 sisyphus+239990.100.1.1 1572378435 installed
<13>Dec  5 03:38:17 rpmi: librhash-1.3.5-alt2 1505156277 installed
<13>Dec  5 03:38:17 rpmi: libjsoncpp19-1.8.4-alt4 sisyphus+232904.100.1.1 1561247384 installed
<13>Dec  5 03:38:17 rpmi: publicsuffix-list-dafsa-20191108-alt1 sisyphus+240482.100.1.2 1573431390 installed
<13>Dec  5 03:38:17 rpmi: libpsl-0.21.0-alt2 sisyphus+237083.100.1.1 1567531663 installed
<13>Dec  5 03:38:17 rpmi: libnghttp2-1.39.2-alt1 sisyphus+236978.100.1.1 1567325215 installed
<13>Dec  5 03:38:17 rpmi: libverto-0.3.0-alt1_7 sisyphus+225932.100.1.1 1553994917 installed
<13>Dec  5 03:38:17 rpmi: libkeyutils-1.6-alt2 sisyphus+226520.100.2.1 1554512088 installed
<13>Dec  5 03:38:17 rpmi: libcom_err-1.44.6-alt1 sisyphus+224154.100.1.1 1552091653 installed
<13>Dec  5 03:38:17 rpmi: libbrotlicommon-1.0.7-alt1 sisyphus+226738.100.2.1 1554554565 installed
<13>Dec  5 03:38:17 rpmi: libbrotlidec-1.0.7-alt1 sisyphus+226738.100.2.1 1554554565 installed
<13>Dec  5 03:38:17 rpmi: bc-1:1.07.1-alt1 sisyphus+221902.700.4.1 1550587848 installed
<13>Dec  5 03:38:17 rpmi: libatk-locales-2.34.1-alt1 sisyphus+237956.700.4.2 1569332333 installed
<13>Dec  5 03:38:17 rpmi: libatk-2.34.1-alt1 sisyphus+237956.700.4.2 1569332333 installed
<13>Dec  5 03:38:17 rpmi: shared-mime-info-1.15-alt1 sisyphus+240378.100.1.1 1573073793 installed
<13>Dec  5 03:38:17 rpmi: gsettings-desktop-schemas-data-3.34.0-alt1 sisyphus+237956.300.4.2 1569331130 installed
<13>Dec  5 03:38:17 rpmi: libgio-2.62.3-alt1 sisyphus+241586.200.1.1 1574668924 installed
<13>Dec  5 03:38:17 rpmi: gsettings-desktop-schemas-3.34.0-alt1 sisyphus+237956.300.4.2 1569331130 installed
<13>Dec  5 03:38:17 rpmi: libgdk-pixbuf-2.40.0-alt1 sisyphus+238952.140.2.1 1570644607 installed
<13>Dec  5 03:38:17 rpmi: libgstreamer1.0-1.16.2-alt1 sisyphus+242248.100.2.1 1575475182 installed
<13>Dec  5 03:38:17 rpmi: libgusb-0.3.1-alt1 sisyphus+241732.100.1.1 1574798007 installed
<13>Dec  5 03:38:17 rpmi: libcolord-1.4.4-alt2 sisyphus+229904.100.1.1 1558606512 installed
<13>Dec  5 03:38:17 rpmi: gtk-update-icon-cache-3.24.13-alt1 sisyphus+241862.100.1.1 1574928005 installed
<13>Dec  5 03:38:17 rpmi: libdconf-0.34.0-alt1 sisyphus+237956.1500.4.2 1569334199 installed
<13>Dec  5 03:38:17 rpmi: libgee0.8-0.20.2-alt1 sisyphus+235471.100.1.2 1565007033 installed
<13>Dec  5 03:38:17 rpmi: libjson-glib-1.4.4-alt1 sisyphus.213175.100 1537249583 installed
<13>Dec  5 03:38:17 rpmi: liblz4-1:1.9.2-alt1 sisyphus+238585.100.2.2 1570066861 installed
<13>Dec  5 03:38:17 rpmi: libgpg-error-1.36-alt1 sisyphus+225621.300.1.1 1553521088 installed
<13>Dec  5 03:38:17 rpmi: libgcrypt20-1.8.5-alt3 sisyphus+239622.100.1.1 1571746563 installed
<13>Dec  5 03:38:17 rpmi: libsystemd-1:244-alt1 sisyphus+242291.100.1.1 1575476449 installed
<13>Dec  5 03:38:17 rpmi: libdbus-1.12.16-alt2 sisyphus+240566.100.2.1 1573547688 installed
<13>Dec  5 03:38:17 rpmi: dbus-tools-1.12.16-alt2 sisyphus+240566.100.2.1 1573547688 installed
<86>Dec  5 03:38:17 groupadd[6233]: group added to /etc/group: name=messagebus, GID=499
<86>Dec  5 03:38:17 groupadd[6233]: group added to /etc/gshadow: name=messagebus
<86>Dec  5 03:38:17 groupadd[6233]: new group: name=messagebus, GID=499
<86>Dec  5 03:38:17 useradd[6238]: new user: name=messagebus, UID=499, GID=499, home=/run/dbus, shell=/dev/null
<13>Dec  5 03:38:17 rpmi: dbus-1.12.16-alt2 sisyphus+240566.100.2.1 1573547688 installed
<13>Dec  5 03:38:17 rpmi: dconf-0.34.0-alt1 sisyphus+237956.1500.4.2 1569334199 installed
<13>Dec  5 03:38:17 rpmi: libgtk+3-schemas-3.24.13-alt1 sisyphus+241862.100.1.1 1574928005 installed
<13>Dec  5 03:38:17 rpmi: libavahi-0.7-alt1 sisyphus+237493.100.1.1 1568299460 installed
<13>Dec  5 03:38:17 rpmi: libcups-2.2.12-alt3 sisyphus+240570.100.1.1 1573481622 installed
<13>Dec  5 03:38:17 rpmi: libpolkit-0.116-alt1 sisyphus+228976.400.4.1 1557128960 installed
<86>Dec  5 03:38:17 groupadd[6298]: group added to /etc/group: name=colord, GID=498
<86>Dec  5 03:38:17 groupadd[6298]: group added to /etc/gshadow: name=colord
<86>Dec  5 03:38:17 groupadd[6298]: new group: name=colord, GID=498
<86>Dec  5 03:38:17 useradd[6305]: new user: name=colord, UID=498, GID=498, home=/var/colord, shell=/dev/null
<13>Dec  5 03:38:18 rpmi: colord-1.4.4-alt2 sisyphus+229904.100.1.1 1558606512 installed
<13>Dec  5 03:38:18 rpmi: libX11-locales-3:1.6.9-alt1 sisyphus+239210.100.1.1 1571056781 installed
<13>Dec  5 03:38:18 rpmi: libXdmcp-1.1.3-alt1 sisyphus+225206.600.1.2 1552949347 installed
<13>Dec  5 03:38:18 rpmi: libxcb-1.13.1-alt1 sisyphus+226527.100.2.2 1554593799 installed
<13>Dec  5 03:38:18 rpmi: libX11-3:1.6.9-alt1 sisyphus+239210.100.1.1 1571056781 installed
<13>Dec  5 03:38:18 rpmi: libXext-1.3.4-alt1 sisyphus+225206.700.1.2 1552949422 installed
<13>Dec  5 03:38:18 rpmi: libXrender-0.9.8-alt1 1371312110 installed
<13>Dec  5 03:38:18 rpmi: libXfixes-5.0.3-alt1 sisyphus+226736.100.2.2 1554614842 installed
<13>Dec  5 03:38:18 rpmi: libXft-2.3.3-alt1 sisyphus+225206.1000.3.2 1552987714 installed
<13>Dec  5 03:38:18 rpmi: libat-spi2-core-2.34.0-alt1 sisyphus+237956.1100.4.2 1569332544 installed
<13>Dec  5 03:38:18 rpmi: libXdamage-1.1.5-alt1 sisyphus+225206.500.1.2 1552949282 installed
<13>Dec  5 03:38:19 rpmi: libxcb-devel-1.13.1-alt1 sisyphus+226527.100.2.2 1554593799 installed
<13>Dec  5 03:38:19 rpmi: libX11-devel-3:1.6.9-alt1 sisyphus+239210.100.1.1 1571056781 installed
<13>Dec  5 03:38:19 rpmi: libXrender-devel-0.9.8-alt1 1371312110 installed
<13>Dec  5 03:38:19 rpmi: libXext-devel-1.3.4-alt1 sisyphus+225206.700.1.2 1552949422 installed
<13>Dec  5 03:38:19 rpmi: libXcursor-1.2.0-alt1 sisyphus+225206.400.1.2 1552949214 installed
<13>Dec  5 03:38:19 rpmi: libXrandr-1.5.2-alt1 sisyphus+225206.1300.1.2 1552949698 installed
<13>Dec  5 03:38:19 rpmi: libXtst-1.2.2-alt1 1369984880 installed
<13>Dec  5 03:38:19 rpmi: libXxf86vm-1.1.4-alt2 1527672159 installed
<13>Dec  5 03:38:19 rpmi: libGLX-mesa-4:19.2.6-alt2 sisyphus+241659.200.1.1 1574756982 installed
<13>Dec  5 03:38:19 rpmi: libEGL-mesa-4:19.2.6-alt2 sisyphus+241659.200.1.1 1574756982 installed
<13>Dec  5 03:38:19 rpmi: libEGL-7:1.2.0-alt4 sisyphus+241659.100.1.1 1574755340 installed
<13>Dec  5 03:38:19 rpmi: libGLX-7:1.2.0-alt4 sisyphus+241659.100.1.1 1574755340 installed
<13>Dec  5 03:38:19 rpmi: libGL-7:1.2.0-alt4 sisyphus+241659.100.1.1 1574755340 installed
<13>Dec  5 03:38:19 rpmi: libcairo-1:1.16.0-alt1 sisyphus+226534.100.2.3 1554515520 installed
<13>Dec  5 03:38:19 rpmi: libglvnd-devel-7:1.2.0-alt4 sisyphus+241659.100.1.1 1574755340 installed
<13>Dec  5 03:38:19 rpmi: libcairo-gobject-1:1.16.0-alt1 sisyphus+226534.100.2.3 1554515520 installed
<13>Dec  5 03:38:19 rpmi: libpango-1.44.7-alt1 sisyphus+239731.100.1.1 1571986941 installed
<13>Dec  5 03:38:19 rpmi: libEGL-devel-4:19.2.6-alt2 sisyphus+241659.200.1.1 1574756982 installed
<13>Dec  5 03:38:19 rpmi: libGL-devel-4:19.2.6-alt2 sisyphus+241659.200.1.1 1574756982 installed
<13>Dec  5 03:38:19 rpmi: libgst-plugins1.0-1.16.2-alt1 sisyphus+242248.200.2.1 1575475397 installed
<13>Dec  5 03:38:19 rpmi: libXi-1.7.10-alt1 sisyphus+232786.300.1.1 1561106975 installed
<13>Dec  5 03:38:19 rpmi: libXinerama-1.1.4-alt1 sisyphus+223149.300.2.1 1551268223 installed
<13>Dec  5 03:38:19 rpmi: dbus-tools-gui-1.12.16-alt2 sisyphus+240566.100.2.1 1573547688 installed
<13>Dec  5 03:38:19 rpmi: at-spi2-core-2.34.0-alt1 sisyphus+237956.1100.4.2 1569332544 installed
<13>Dec  5 03:38:19 rpmi: at-spi2-atk-2.34.1-alt1 sisyphus+238952.300.2.1 1570644690 installed
<13>Dec  5 03:38:19 rpmi: libXcomposite-0.4.5-alt1 sisyphus+225206.300.1.2 1552949136 installed
<13>Dec  5 03:38:19 rpmi: libgdk-pixbuf-xlib-2.40.0-alt1 sisyphus+238952.140.2.1 1570644607 installed
<13>Dec  5 03:38:19 rpmi: rpm-macros-alternatives-0.5.1-alt1 sisyphus+226946.100.1.1 1554830426 installed
<13>Dec  5 03:38:19 rpmi: alternatives-0.5.1-alt1 sisyphus+226946.100.1.1 1554830426 installed
<13>Dec  5 03:38:19 rpmi: ca-certificates-2019.10.28-alt1 sisyphus+239875.300.1.1 1572267834 installed
<13>Dec  5 03:38:19 rpmi: ca-trust-0.1.2-alt1 sisyphus+233348.100.1.1 1561653823 installed
<13>Dec  5 03:38:19 rpmi: p11-kit-trust-0.23.15-alt1 sisyphus+226408.100.2.1 1554288187 installed
<13>Dec  5 03:38:19 rpmi: libcrypto1.1-1.1.1d-alt1.1 sisyphus+237931.100.2.1 1569235630 installed
<13>Dec  5 03:38:19 rpmi: libssl1.1-1.1.1d-alt1.1 sisyphus+237931.100.2.1 1569235630 installed
<86>Dec  5 03:38:19 groupadd[9303]: group added to /etc/group: name=_keytab, GID=497
<86>Dec  5 03:38:19 groupadd[9303]: group added to /etc/gshadow: name=_keytab
<86>Dec  5 03:38:19 groupadd[9303]: new group: name=_keytab, GID=497
<13>Dec  5 03:38:19 rpmi: libkrb5-1.16.3-alt1 sisyphus+223678.100.1.1 1551746443 installed
<13>Dec  5 03:38:20 rpmi: libpython3-3.7.4-alt2 sisyphus+239418.100.1.1 1571389791 installed
<13>Dec  5 03:38:20 rpmi: python3-3.7.4-alt2 sisyphus+239418.100.1.1 1571389791 installed
<13>Dec  5 03:38:20 rpmi: python3-base-3.7.4-alt2 sisyphus+239418.100.1.1 1571389791 installed
<13>Dec  5 03:38:20 rpmi: glib2-devel-2.62.3-alt1 sisyphus+241586.200.1.1 1574668924 installed
<13>Dec  5 03:38:20 rpmi: libgio-devel-2.62.3-alt1 sisyphus+241586.200.1.1 1574668924 installed
<13>Dec  5 03:38:20 rpmi: libharfbuzz-devel-2.6.4-alt1 sisyphus+240033.100.1.1 1572506772 installed
<13>Dec  5 03:38:20 rpmi: libfreetype-devel-2.10.1-alt1 sisyphus+237471.100.1.1 1568276349 installed
<13>Dec  5 03:38:20 rpmi: fontconfig-devel-2.13.1-alt1 sisyphus+226691.100.2.2 1554598717 installed
<13>Dec  5 03:38:20 rpmi: libcairo-devel-1:1.16.0-alt1 sisyphus+226534.100.2.3 1554515520 installed
<13>Dec  5 03:38:20 rpmi: libcairo-gobject-devel-1:1.16.0-alt1 sisyphus+226534.100.2.3 1554515520 installed
<13>Dec  5 03:38:20 rpmi: libXft-devel-2.3.3-alt1 sisyphus+225206.1000.3.2 1552987714 installed
<13>Dec  5 03:38:21 rpmi: libpango-devel-1.44.7-alt1 sisyphus+239731.100.1.1 1571986941 installed
<13>Dec  5 03:38:21 rpmi: gstreamer1.0-devel-1.16.2-alt1 sisyphus+242248.100.2.1 1575475182 installed
<13>Dec  5 03:38:21 rpmi: libgdk-pixbuf-devel-2.40.0-alt1 sisyphus+238952.140.2.1 1570644607 installed
<13>Dec  5 03:38:21 rpmi: libatk-devel-2.34.1-alt1 sisyphus+237956.700.4.2 1569332333 installed
<86>Dec  5 03:38:21 groupadd[10509]: group added to /etc/group: name=sasl, GID=496
<86>Dec  5 03:38:21 groupadd[10509]: group added to /etc/gshadow: name=sasl
<86>Dec  5 03:38:21 groupadd[10509]: new group: name=sasl, GID=496
<13>Dec  5 03:38:21 rpmi: libsasl2-3-2.1.27-alt2 sisyphus+228101.100.1.1 1556139861 installed
<13>Dec  5 03:38:21 rpmi: libldap-2.4.48-alt3 sisyphus+238816.100.1.1 1570449061 installed
<13>Dec  5 03:38:21 rpmi: libcurl-7.67.0-alt1 sisyphus+240544.100.1.1 1573453423 installed
<13>Dec  5 03:38:21 rpmi: libcurl-devel-7.67.0-alt1 sisyphus+240544.100.1.1 1573453423 installed
<13>Dec  5 03:38:21 rpmi: libtirpc-1.0.3-alt1 1532008015 installed
<13>Dec  5 03:38:21 rpmi: libnsl2-1.1.0-alt1_1 1511548748 installed
<13>Dec  5 03:38:21 rpmi: python-modules-encodings-2.7.17-alt3 sisyphus+240580.200.5.1 1573517270 installed
<13>Dec  5 03:38:21 rpmi: python-modules-compiler-2.7.17-alt3 sisyphus+240580.200.5.1 1573517270 installed
<13>Dec  5 03:38:21 rpmi: python-modules-email-2.7.17-alt3 sisyphus+240580.200.5.1 1573517270 installed
<13>Dec  5 03:38:21 rpmi: python-modules-unittest-2.7.17-alt3 sisyphus+240580.200.5.1 1573517270 installed
<13>Dec  5 03:38:21 rpmi: python-modules-nis-2.7.17-alt3 sisyphus+240580.200.5.1 1573517270 installed
<13>Dec  5 03:38:21 rpmi: python-modules-2.7.17-alt3 sisyphus+240580.200.5.1 1573517270 installed
<13>Dec  5 03:38:21 rpmi: python-modules-xml-2.7.17-alt3 sisyphus+240580.200.5.1 1573517270 installed
<13>Dec  5 03:38:21 rpmi: gtk-builder-convert-2.24.32-alt3 sisyphus+227306.100.1.3 1555646039 installed
<13>Dec  5 03:38:21 rpmi: glib-networking-2.62.1-alt1 sisyphus+238952.4100.5.1 1570662063 installed
<13>Dec  5 03:38:22 rpmi: libsoup-2.68.3-alt1 sisyphus+242263.100.1.1 1575463134 installed
<13>Dec  5 03:38:22 rpmi: libsoup-gnome-2.68.3-alt1 sisyphus+242263.100.1.1 1575463134 installed
<13>Dec  5 03:38:22 rpmi: librest-0.8.1-alt1 1508266396 installed
<13>Dec  5 03:38:23 rpmi: libgtk+3-3.24.13-alt1 sisyphus+241862.100.1.1 1574928005 installed
<13>Dec  5 03:38:23 rpmi: libnss-3.47.1-alt1 sisyphus+242129.100.1.1 1575291004 installed
<13>Dec  5 03:38:23 rpmi: libpoppler91-0.81.0-alt1 sisyphus+238642.100.1.1 1570176624 installed
<13>Dec  5 03:38:23 rpmi: libpoppler-devel-0.81.0-alt1 sisyphus+238642.100.1.1 1570176624 installed
<13>Dec  5 03:38:23 rpmi: libpoppler8-glib-0.81.0-alt1 sisyphus+238642.100.1.1 1570176624 installed
<13>Dec  5 03:38:23 rpmi: libpoppler-glib-devel-0.81.0-alt1 sisyphus+238642.100.1.1 1570176624 installed
<13>Dec  5 03:38:23 rpmi: libgtk+3-devel-3.24.13-alt1 sisyphus+241862.100.1.1 1574928005 installed
<13>Dec  5 03:38:23 rpmi: cmake-3.15.4-alt1 sisyphus+239520.100.1.1 1571611942 installed
<13>Dec  5 03:38:23 rpmi: gst-plugins1.0-devel-1.16.2-alt1 sisyphus+242248.200.2.1 1575475397 installed
<13>Dec  5 03:38:23 rpmi: libgee0.8-devel-0.20.2-alt1 sisyphus+235471.100.1.2 1565007033 installed
<13>Dec  5 03:38:24 rpmi: vala-0.46.5-alt1 sisyphus+241768.100.1.1 1574848839 installed
Building target platforms: x86_64
Building for target x86_64
Wrote: /usr/src/in/nosrpm/pdfpc-4.3.4-alt1.nosrc.rpm
Installing pdfpc-4.3.4-alt1.src.rpm
Building target platforms: x86_64
Building for target x86_64
Executing(%prep): /bin/sh -e /usr/src/tmp/rpm-tmp.59886
+ umask 022
+ /bin/mkdir -p /usr/src/RPM/BUILD
+ cd /usr/src/RPM/BUILD
+ cd /usr/src/RPM/BUILD
+ rm -rf pdfpc-4.3.4
+ echo 'Source #0 (pdfpc-4.3.4.tar):'
Source #0 (pdfpc-4.3.4.tar):
+ /bin/tar -xf /usr/src/RPM/SOURCES/pdfpc-4.3.4.tar
+ cd pdfpc-4.3.4
+ /bin/chmod -c -Rf u+rwX,go-w .
+ exit 0
Executing(%build): /bin/sh -e /usr/src/tmp/rpm-tmp.59886
+ umask 022
+ /bin/mkdir -p /usr/src/RPM/BUILD
+ cd /usr/src/RPM/BUILD
+ cd pdfpc-4.3.4
+ mkdir -p BUILD
+ __cmake -DSYSCONFDIR=/etc
+ pushd BUILD
~/RPM/BUILD/pdfpc-4.3.4/BUILD ~/RPM/BUILD/pdfpc-4.3.4
+ cmake .. -DCMAKE_SKIP_RPATH:BOOL=ON -DCMAKE_SKIP_INSTALL_RPATH:BOOL=yes '-DCMAKE_C_FLAGS:STRING=-pipe -frecord-gcc-switches -Wall -g -O2' '-DCMAKE_CXX_FLAGS:STRING=-pipe -frecord-gcc-switches -Wall -g -O2' '-DCMAKE_Fortran_FLAGS:STRING=-pipe -frecord-gcc-switches -Wall -g -O2' -DCMAKE_INSTALL_PREFIX=/usr -DINCLUDE_INSTALL_DIR:PATH=/usr/include -DLIB_INSTALL_DIR:PATH=/usr/lib64 -DSYSCONF_INSTALL_DIR:PATH=/etc -DSHARE_INSTALL_PREFIX:PATH=/usr/share -DLIB_DESTINATION=lib64 -DLIB_SUFFIX=64 -DSYSCONFDIR=/etc
-- The C compiler identification is GNU 9.2.1
-- Check for working C compiler: /usr/bin/cc
-- Check for working C compiler: /usr/bin/cc -- works
-- Detecting C compiler ABI info
-- Detecting C compiler ABI info - done
-- Detecting C compile features
-- Detecting C compile features - done
-- Found Vala: /usr/bin/valac (found suitable version "0.46.5", minimum required is "0.34") 
-- Found PkgConfig: /usr/bin/pkg-config (found version "0.29.2") 
-- Checking for module 'gobject-2.0'
--   Found gobject-2.0, version 2.62.3
Package libpcre was not found in the pkg-config search path.
Perhaps you should add the directory containing `libpcre.pc'
to the PKG_CONFIG_PATH environment variable
Package 'libpcre', required by 'glib-2.0', not found
Package libpcre was not found in the pkg-config search path.
Perhaps you should add the directory containing `libpcre.pc'
to the PKG_CONFIG_PATH environment variable
Package 'libpcre', required by 'glib-2.0', not found
Package libpcre was not found in the pkg-config search path.
Perhaps you should add the directory containing `libpcre.pc'
to the PKG_CONFIG_PATH environment variable
Package 'libpcre', required by 'glib-2.0', not found
Package libpcre was not found in the pkg-config search path.
Perhaps you should add the directory containing `libpcre.pc'
to the PKG_CONFIG_PATH environment variable
Package 'libpcre', required by 'glib-2.0', not found
-- Checking for module 'gio-2.0'
--   Found gio-2.0, version 2.62.3
Package libpcre was not found in the pkg-config search path.
Perhaps you should add the directory containing `libpcre.pc'
to the PKG_CONFIG_PATH environment variable
Package 'libpcre', required by 'glib-2.0', not found
Package libpcre was not found in the pkg-config search path.
Perhaps you should add the directory containing `libpcre.pc'
to the PKG_CONFIG_PATH environment variable
Package 'libpcre', required by 'glib-2.0', not found
Package libpcre was not found in the pkg-config search path.
Perhaps you should add the directory containing `libpcre.pc'
to the PKG_CONFIG_PATH environment variable
Package 'libpcre', required by 'glib-2.0', not found
Package libpcre was not found in the pkg-config search path.
Perhaps you should add the directory containing `libpcre.pc'
to the PKG_CONFIG_PATH environment variable
Package 'libpcre', required by 'glib-2.0', not found
-- Checking for module 'gee-0.8'
--   Found gee-0.8, version 0.20.2
Package libpcre was not found in the pkg-config search path.
Perhaps you should add the directory containing `libpcre.pc'
to the PKG_CONFIG_PATH environment variable
Package 'libpcre', required by 'glib-2.0', not found
Package libpcre was not found in the pkg-config search path.
Perhaps you should add the directory containing `libpcre.pc'
to the PKG_CONFIG_PATH environment variable
Package 'libpcre', required by 'glib-2.0', not found
Package libpcre was not found in the pkg-config search path.
Perhaps you should add the directory containing `libpcre.pc'
to the PKG_CONFIG_PATH environment variable
Package 'libpcre', required by 'glib-2.0', not found
Package libpcre was not found in the pkg-config search path.
Perhaps you should add the directory containing `libpcre.pc'
to the PKG_CONFIG_PATH environment variable
Package 'libpcre', required by 'glib-2.0', not found
-- Checking for module 'poppler-glib>=0.22'
--   Found poppler-glib, version 0.81.0
Package libpcre was not found in the pkg-config search path.
Perhaps you should add the directory containing `libpcre.pc'
to the PKG_CONFIG_PATH environment variable
Package 'libpcre', required by 'glib-2.0', not found
Package libpcre was not found in the pkg-config search path.
Perhaps you should add the directory containing `libpcre.pc'
to the PKG_CONFIG_PATH environment variable
Package 'libpcre', required by 'glib-2.0', not found
Package libpcre was not found in the pkg-config search path.
Perhaps you should add the directory containing `libpcre.pc'
to the PKG_CONFIG_PATH environment variable
Package 'libpcre', required by 'glib-2.0', not found
Package libpcre was not found in the pkg-config search path.
Perhaps you should add the directory containing `libpcre.pc'
to the PKG_CONFIG_PATH environment variable
Package 'libpcre', required by 'glib-2.0', not found
-- Checking for module 'gtk+-3.0>=3.22'
--   Found gtk+-3.0, version 3.24.13
Package libpcre was not found in the pkg-config search path.
Perhaps you should add the directory containing `libpcre.pc'
to the PKG_CONFIG_PATH environment variable
Package 'libpcre', required by 'glib-2.0', not found
Package libpcre was not found in the pkg-config search path.
Perhaps you should add the directory containing `libpcre.pc'
to the PKG_CONFIG_PATH environment variable
Package 'libpcre', required by 'glib-2.0', not found
Package libpcre was not found in the pkg-config search path.
Perhaps you should add the directory containing `libpcre.pc'
to the PKG_CONFIG_PATH environment variable
Package 'libpcre', required by 'glib-2.0', not found
Package libpcre was not found in the pkg-config search path.
Perhaps you should add the directory containing `libpcre.pc'
to the PKG_CONFIG_PATH environment variable
Package 'libpcre', required by 'glib-2.0', not found
-- Checking for module 'gthread-2.0'
--   Found gthread-2.0, version 2.62.3
Package libpcre was not found in the pkg-config search path.
Perhaps you should add the directory containing `libpcre.pc'
to the PKG_CONFIG_PATH environment variable
Package 'libpcre', required by 'glib-2.0', not found
Package libpcre was not found in the pkg-config search path.
Perhaps you should add the directory containing `libpcre.pc'
to the PKG_CONFIG_PATH environment variable
Package 'libpcre', required by 'glib-2.0', not found
Package libpcre was not found in the pkg-config search path.
Perhaps you should add the directory containing `libpcre.pc'
to the PKG_CONFIG_PATH environment variable
Package 'libpcre', required by 'glib-2.0', not found
Package libpcre was not found in the pkg-config search path.
Perhaps you should add the directory containing `libpcre.pc'
to the PKG_CONFIG_PATH environment variable
Package 'libpcre', required by 'glib-2.0', not found
-- Checking for module 'pangocairo'
--   Found pangocairo, version 1.44.7
Package libpcre was not found in the pkg-config search path.
Perhaps you should add the directory containing `libpcre.pc'
to the PKG_CONFIG_PATH environment variable
Package 'libpcre', required by 'glib-2.0', not found
Package libpcre was not found in the pkg-config search path.
Perhaps you should add the directory containing `libpcre.pc'
to the PKG_CONFIG_PATH environment variable
Package 'libpcre', required by 'glib-2.0', not found
Package libpcre was not found in the pkg-config search path.
Perhaps you should add the directory containing `libpcre.pc'
to the PKG_CONFIG_PATH environment variable
Package 'libpcre', required by 'glib-2.0', not found
Package libpcre was not found in the pkg-config search path.
Perhaps you should add the directory containing `libpcre.pc'
to the PKG_CONFIG_PATH environment variable
Package 'libpcre', required by 'glib-2.0', not found
-- Checking for module 'gstreamer-1.0'
--   Found gstreamer-1.0, version 1.16.2
Package libpcre was not found in the pkg-config search path.
Perhaps you should add the directory containing `libpcre.pc'
to the PKG_CONFIG_PATH environment variable
Package 'libpcre', required by 'glib-2.0', not found
Package libpcre was not found in the pkg-config search path.
Perhaps you should add the directory containing `libpcre.pc'
to the PKG_CONFIG_PATH environment variable
Package 'libpcre', required by 'glib-2.0', not found
Package libpcre was not found in the pkg-config search path.
Perhaps you should add the directory containing `libpcre.pc'
to the PKG_CONFIG_PATH environment variable
Package 'libpcre', required by 'glib-2.0', not found
Package libpcre was not found in the pkg-config search path.
Perhaps you should add the directory containing `libpcre.pc'
to the PKG_CONFIG_PATH environment variable
Package 'libpcre', required by 'glib-2.0', not found
-- Checking for module 'gstreamer-base-1.0'
--   Found gstreamer-base-1.0, version 1.16.2
Package libpcre was not found in the pkg-config search path.
Perhaps you should add the directory containing `libpcre.pc'
to the PKG_CONFIG_PATH environment variable
Package 'libpcre', required by 'glib-2.0', not found
Package libpcre was not found in the pkg-config search path.
Perhaps you should add the directory containing `libpcre.pc'
to the PKG_CONFIG_PATH environment variable
Package 'libpcre', required by 'glib-2.0', not found
Package libpcre was not found in the pkg-config search path.
Perhaps you should add the directory containing `libpcre.pc'
to the PKG_CONFIG_PATH environment variable
Package 'libpcre', required by 'glib-2.0', not found
Package libpcre was not found in the pkg-config search path.
Perhaps you should add the directory containing `libpcre.pc'
to the PKG_CONFIG_PATH environment variable
Package 'libpcre', required by 'glib-2.0', not found
-- Checking for module 'gstreamer-audio-1.0'
--   Found gstreamer-audio-1.0, version 1.16.2
Package libpcre was not found in the pkg-config search path.
Perhaps you should add the directory containing `libpcre.pc'
to the PKG_CONFIG_PATH environment variable
Package 'libpcre', required by 'glib-2.0', not found
Package libpcre was not found in the pkg-config search path.
Perhaps you should add the directory containing `libpcre.pc'
to the PKG_CONFIG_PATH environment variable
Package 'libpcre', required by 'glib-2.0', not found
Package libpcre was not found in the pkg-config search path.
Perhaps you should add the directory containing `libpcre.pc'
to the PKG_CONFIG_PATH environment variable
Package 'libpcre', required by 'glib-2.0', not found
Package libpcre was not found in the pkg-config search path.
Perhaps you should add the directory containing `libpcre.pc'
to the PKG_CONFIG_PATH environment variable
Package 'libpcre', required by 'glib-2.0', not found
-- Checking for module 'gstreamer-video-1.0'
--   Found gstreamer-video-1.0, version 1.16.2
Package libpcre was not found in the pkg-config search path.
Perhaps you should add the directory containing `libpcre.pc'
to the PKG_CONFIG_PATH environment variable
Package 'libpcre', required by 'glib-2.0', not found
Package libpcre was not found in the pkg-config search path.
Perhaps you should add the directory containing `libpcre.pc'
to the PKG_CONFIG_PATH environment variable
Package 'libpcre', required by 'glib-2.0', not found
Package libpcre was not found in the pkg-config search path.
Perhaps you should add the directory containing `libpcre.pc'
to the PKG_CONFIG_PATH environment variable
Package 'libpcre', required by 'glib-2.0', not found
Package libpcre was not found in the pkg-config search path.
Perhaps you should add the directory containing `libpcre.pc'
to the PKG_CONFIG_PATH environment variable
Package 'libpcre', required by 'glib-2.0', not found
-- Performing Test CC_HAS_DISCARDED_QUALIFIERS
-- Performing Test CC_HAS_DISCARDED_QUALIFIERS - Success
-- Performing Test CC_HAS_INCOMPATIBLE_POINTER_TYPES
-- Performing Test CC_HAS_INCOMPATIBLE_POINTER_TYPES - Success
-- Performing Test CC_HAS_DEPRECATED_DECLARATIONS
-- Performing Test CC_HAS_DEPRECATED_DECLARATIONS - Success
-- Performing Test CC_HAS_IMPLICIT_FUNCTION_DECLARATION
-- Performing Test CC_HAS_IMPLICIT_FUNCTION_DECLARATION - Success
-- Configuring done
-- Generating done
CMake Warning:
  Manually-specified variables were not used by the project:

    CMAKE_CXX_FLAGS
    CMAKE_Fortran_FLAGS
    CMAKE_SKIP_INSTALL_RPATH
    INCLUDE_INSTALL_DIR
    LIB_DESTINATION
    LIB_INSTALL_DIR
    LIB_SUFFIX
    SHARE_INSTALL_PREFIX
    SYSCONF_INSTALL_DIR


-- Build files have been written to: /usr/src/RPM/BUILD/pdfpc-4.3.4/BUILD
+ popd
~/RPM/BUILD/pdfpc-4.3.4
+ make -j8 -C BUILD
make[2]: Entering directory '/usr/src/RPM/BUILD/pdfpc-4.3.4/BUILD'
[  3%] Generating classes/action/action_mapping.c, classes/action/link_action.c, classes/action/movie.c, classes/cache_status.c, classes/config_file_reader.c, classes/dbus_server.c, classes/drawings/drawing.c, classes/drawings/storage.c, classes/metadata/pdf.c, classes/metadata/slides_notes.c, classes/options.c, classes/presentation_controller.c, classes/renderer/cache/base.c, classes/renderer/cache/png/engine.c, classes/renderer/cache/png/item.c, classes/renderer/cache/png/persistent/engine.c, classes/renderer/cache/simple/engine.c, classes/renderer/pdf.c, classes/scaler.c, classes/timer_label.c, classes/view/behaviour/base.c, classes/view/behaviour/pdf_link.c, classes/view/pdf.c, classes/view/video.c, classes/window/fullscreen.c, classes/window/overview.c, classes/window/presentation.c, classes/window/presenter.c, interfaces/controllable.c, pdfpc.c
/usr/src/RPM/BUILD/pdfpc-4.3.4/src/classes/action/action_mapping.vala:51.9-51.28: error: Creation method of abstract class cannot be public.
        public ActionMapping() {
        ^^^^^^^^^^^^^^^^^^^^
/usr/src/RPM/BUILD/pdfpc-4.3.4/src/classes/drawings/storage.vala:38.9-38.19: error: Creation method of abstract class cannot be public.
        public Base(Metadata.Pdf metadata) {
        ^^^^^^^^^^^
/usr/src/RPM/BUILD/pdfpc-4.3.4/src/classes/renderer/cache/base.vala:40.9-40.19: error: Creation method of abstract class cannot be public.
        public Base(Metadata.Pdf metadata) {
        ^^^^^^^^^^^
/usr/src/RPM/BUILD/pdfpc-4.3.4/src/classes/timer_label.vala:98.9-98.25: error: Creation method of abstract class cannot be public.
        public TimerLabel(PresentationController controller, time_t start_time = 0) {
        ^^^^^^^^^^^^^^^^^
/usr/src/RPM/BUILD/pdfpc-4.3.4/src/classes/view/behaviour/base.vala:44.9-44.19: error: Creation method of abstract class cannot be public.
        public Base() {
        ^^^^^^^^^^^
Command-line option `--thread` is deprecated and will be ignored
Compilation failed: 5 error(s), 0 warning(s)
make[2]: *** [src/CMakeFiles/pdfpc.dir/build.make:93: src/classes/action/action_mapping.c] Error 1
make[2]: Leaving directory '/usr/src/RPM/BUILD/pdfpc-4.3.4/BUILD'
make[1]: *** [CMakeFiles/Makefile2:96: src/CMakeFiles/pdfpc.dir/all] Error 2
make: *** [Makefile:130: all] Error 2
error: Bad exit status from /usr/src/tmp/rpm-tmp.59886 (%build)


RPM build errors:
    Bad exit status from /usr/src/tmp/rpm-tmp.59886 (%build)
Command exited with non-zero status 1
1.16user 0.44system 0:01.81elapsed 88%CPU (0avgtext+0avgdata 120716maxresident)k
0inputs+0outputs (0major+141081minor)pagefaults 0swaps
hsh-rebuild: rebuild of `pdfpc-4.3.4-alt1.src.rpm' failed.
Command exited with non-zero status 1
14.16user 3.74system 0:24.17elapsed 74%CPU (0avgtext+0avgdata 120716maxresident)k
0inputs+0outputs (0major+603229minor)pagefaults 0swaps