<86>Dec 17 04:46:42 userdel[72188]: delete user 'rooter'
<86>Dec 17 04:46:42 userdel[72188]: removed group 'rooter' owned by 'rooter'
<86>Dec 17 04:46:42 userdel[72188]: removed shadow group 'rooter' owned by 'rooter'
<86>Dec 17 04:46:42 groupadd[72212]: group added to /etc/group: name=rooter, GID=585
<86>Dec 17 04:46:42 groupadd[72212]: group added to /etc/gshadow: name=rooter
<86>Dec 17 04:46:42 groupadd[72212]: new group: name=rooter, GID=585
<86>Dec 17 04:46:42 useradd[72239]: new user: name=rooter, UID=585, GID=585, home=/root, shell=/bin/bash
<86>Dec 17 04:46:42 userdel[72337]: delete user 'builder'
<86>Dec 17 04:46:42 userdel[72337]: removed group 'builder' owned by 'builder'
<86>Dec 17 04:46:42 userdel[72337]: removed shadow group 'builder' owned by 'builder'
<86>Dec 17 04:46:42 groupadd[72487]: group added to /etc/group: name=builder, GID=586
<86>Dec 17 04:46:42 groupadd[72487]: group added to /etc/gshadow: name=builder
<86>Dec 17 04:46:42 groupadd[72487]: new group: name=builder, GID=586
<86>Dec 17 04:46:42 useradd[72510]: new user: name=builder, UID=586, GID=586, home=/usr/src, shell=/bin/bash
<13>Dec 17 04:46:50 rpmi: libidn2-2.0.5-alt1 1526923871 installed
<13>Dec 17 04:46:50 rpmi: libexpat-2.2.4-alt1 1503305341 installed
<13>Dec 17 04:46:50 rpmi: msulogin-1.0-alt1 1366288481 installed
<13>Dec 17 04:46:50 rpmi: libtcl-8.6.8-alt1 1518663608 installed
<13>Dec 17 04:46:50 rpmi: GeoIP-Lite-Country-1:20180327-alt1 1522192520 installed
<13>Dec 17 04:46:50 rpmi: libGeoIP-1.6.12-alt1 1516269293 installed
<13>Dec 17 04:46:50 rpmi: chrooted-0.3.9-alt1 1524554183 installed
<13>Dec 17 04:46:50 rpmi: python-module-sphinxcontrib-2.1.1-alt2.1.2 1526455698 installed
<13>Dec 17 04:46:50 rpmi: libseccomp-2.3.3-alt1.S1.1 1525141482 installed
<13>Dec 17 04:46:50 rpmi: libkmod-25-alt1 1522318405 installed
<13>Dec 17 04:46:50 rpmi: liblz4-1:1.8.3-alt1 sisyphus.213737.100 1538009646 installed
<13>Dec 17 04:46:50 rpmi: libjson-c-0.12.1-alt2 1517446108 installed
<13>Dec 17 04:46:50 rpmi: libgdbm-1.8.3-alt10 1454943313 installed
<13>Dec 17 04:46:50 rpmi: libgdbm-devel-1.8.3-alt10 1454943313 installed
<13>Dec 17 04:46:50 rpmi: chrooted-resolv-0.3.1-alt2 1176155257 installed
<13>Dec 17 04:46:50 rpmi: libnss-myhostname-1:239-alt3 sisyphus.215710.300 1540765573 installed
<13>Dec 17 04:46:51 rpmi: tcl-8.6.8-alt1 1518663608 installed
<13>Dec 17 04:46:51 rpmi: sysvinit-2.88-alt5 1424350685 installed
<13>Dec 17 04:46:51 rpmi: udev-rules-1:239-alt3 sisyphus.215710.300 1540765573 installed
<13>Dec 17 04:46:51 rpmi: mount-2.32-alt2 1528296098 installed
<13>Dec 17 04:46:51 rpmi: rpm-build-compat-2.1.9-alt1 1535641052 installed
<13>Dec 17 04:46:51 rpmi: rpm-build-intro-2.1.9-alt1 1535641052 installed
<13>Dec 17 04:46:51 rpmi: python-module-imagesize-0.7.1-alt1 1461387704 installed
<13>Dec 17 04:46:51 rpmi: python-sphinx-objects.inv-1:2.3.8.20181214-alt1 sisyphus.217873.100 1544837899 installed
<13>Dec 17 04:46:51 rpmi: python-module-google-0.4.2-alt2.1 1517733339 installed
<13>Dec 17 04:46:51 rpmi: python-module-enum34-1.1.6-alt3 1527251693 installed
<13>Dec 17 04:46:51 rpmi: libxapian-1.4.5-alt3 sisyphus.215025.100 1539610702 installed
<13>Dec 17 04:46:51 rpmi: libsqlite3-3.25.2-alt2 sisyphus.215082.100 1539700192 installed
<13>Dec 17 04:46:51 rpmi: libpcre2-10.32-alt1 sisyphus.212994.100 1536866755 installed
<13>Dec 17 04:46:51 rpmi: libpcap0.8-2:1.1.1-alt3 1298589613 installed
<13>Dec 17 04:46:51 rpmi: libjemalloc2-5.1.0-alt3 1535287603 installed
<13>Dec 17 04:46:51 rpmi: libiptables-1.4.21-alt3 1435789456 installed
<13>Dec 17 04:46:51 rpmi: libunwind-1.1-alt2 1442339814 installed
<13>Dec 17 04:46:51 rpmi: libgperftools-2.6.3-alt1 1521472871 installed
<13>Dec 17 04:46:51 rpmi: libdb4.7-devel-4.7.25-alt9 1490438456 installed
<13>Dec 17 04:46:51 rpmi: perl-devel-1:5.26.2-alt2 1534850660 installed
<13>Dec 17 04:46:51 rpmi: swig-data-1:3.0.12-alt5 sisyphus.217216.100 1543832801 installed
<13>Dec 17 04:46:51 rpmi: libdevmapper-1.02.152-alt2 sisyphus.216915.100 1543418881 installed
<13>Dec 17 04:46:51 rpmi: libargon2-20171227-alt2 sisyphus.216770.100 1542965252 installed
<13>Dec 17 04:46:51 rpmi: hwclock-1:2.32-alt2 1528296098 installed
<13>Dec 17 04:46:51 rpmi: gperftools-2.6.3-alt1 1521472871 installed
<13>Dec 17 04:46:51 rpmi: gcc-c++-common-1.4.22-alt1 1519183788 installed
<13>Dec 17 04:46:52 rpmi: libstdc++8-devel-8.2.1-alt1 sisyphus.214000.20 1542662172 installed
<13>Dec 17 04:46:52 rpmi: gcc8-c++-8.2.1-alt1 sisyphus.214000.20 1542662172 installed
<13>Dec 17 04:46:52 rpmi: libgpg-error-1.31-alt1.S1 1529015796 installed
<13>Dec 17 04:46:52 rpmi: libgcrypt20-1.8.3-alt3 sisyphus.214019.140 1538990261 installed
<13>Dec 17 04:46:52 rpmi: libsystemd-1:239-alt3 sisyphus.215710.300 1540765573 installed
<13>Dec 17 04:46:52 rpmi: libcryptsetup-2.0.6-alt1 sisyphus.217248.100 1543864710 installed
<13>Dec 17 04:46:52 rpmi: startup-0.9.9.6-alt1 sisyphus.215964.200 1542884274 installed
<13>Dec 17 04:46:53 rpmi: systemd-utils-1:239-alt3 sisyphus.215710.300 1540765573 installed
<13>Dec 17 04:46:53 rpmi: libdbus-1.12.12-alt1 sisyphus.217336.100 1544000947 installed
<13>Dec 17 04:46:53 rpmi: dbus-tools-1.12.12-alt1 sisyphus.217336.100 1544000947 installed
<86>Dec 17 04:46:53 groupadd[101357]: group added to /etc/group: name=messagebus, GID=499
<86>Dec 17 04:46:53 groupadd[101357]: group added to /etc/gshadow: name=messagebus
<86>Dec 17 04:46:53 groupadd[101357]: new group: name=messagebus, GID=499
<86>Dec 17 04:46:53 useradd[101380]: new user: name=messagebus, UID=499, GID=499, home=/run/dbus, shell=/dev/null
<13>Dec 17 04:46:53 rpmi: dbus-1.12.12-alt1 sisyphus.217336.100 1544000947 installed
<13>Dec 17 04:46:53 rpmi: pam_systemd-1:239-alt3 sisyphus.215710.300 1540765573 installed
<13>Dec 17 04:46:53 rpmi: systemd-services-1:239-alt3 sisyphus.215710.300 1540765573 installed
<13>Dec 17 04:46:53 rpmi: libxslt-1.1.32-alt2 1517429962 installed
<13>Dec 17 04:46:53 rpmi: libuv-1.23.2-alt1 sisyphus.217108.100 1543612227 installed
<13>Dec 17 04:46:53 rpmi: librhash-1.3.5-alt2 1505156277 installed
<13>Dec 17 04:46:53 rpmi: libjsoncpp19-1.8.4-alt2.S1 1518769512 installed
<13>Dec 17 04:46:53 rpmi: publicsuffix-list-dafsa-20181106-alt1 sisyphus.216228.100 1541611754 installed
<13>Dec 17 04:46:53 rpmi: libpsl-0.20.2-alt2 sisyphus.216228.200 1541611883 installed
<13>Dec 17 04:46:53 rpmi: libnghttp2-1.34.0-alt1 sisyphus.214524.100 1539249616 installed
<13>Dec 17 04:46:53 rpmi: libbrotlicommon-1.0.7-alt1 sisyphus.215491.100 1540428591 installed
<13>Dec 17 04:46:53 rpmi: libbrotlidec-1.0.7-alt1 sisyphus.215491.100 1540428591 installed
<13>Dec 17 04:46:53 rpmi: libnettle6-3.4.1-alt1 sisyphus.217427.100 1544107881 installed
<13>Dec 17 04:46:53 rpmi: libarchive13-3.3.1-alt1.S1 1488799499 installed
<13>Dec 17 04:46:53 rpmi: rpm-macros-cmake-3.13.1-alt1 sisyphus.217317.100 1544006285 installed
<13>Dec 17 04:46:53 rpmi: cmake-modules-3.13.1-alt1 sisyphus.217317.100 1544006285 installed
<13>Dec 17 04:46:53 rpmi: bc-1:1.06-alt4 1461014962 installed
<13>Dec 17 04:46:53 rpmi: login-0.60-alt35 1484567251 installed
<13>Dec 17 04:46:53 rpmi: agetty-2.32-alt2 1528296098 installed
<13>Dec 17 04:46:53 rpmi: acl-2.2.53-alt1 sisyphus.217169.200 1543706502 installed
<13>Dec 17 04:46:53 rpmi: libpng16-1.6.35-alt1 sisyphus.214397.100 1539159326 installed
<13>Dec 17 04:46:53 rpmi: libgraphite2-1.3.12-alt2.1 sisyphus.215942.100 1540990747 installed
<13>Dec 17 04:46:53 rpmi: libharfbuzz-2.1.3-alt1 sisyphus.216837.100 1543085726 installed
<13>Dec 17 04:46:53 rpmi: libfreetype-2.9.1-alt1.S1 1530781049 installed
<13>Dec 17 04:46:53 rpmi: fontconfig-2.13.1-alt1 sisyphus.215917.100 1540973883 installed
Updating fonts cache: <29>Dec 17 04:46:54 fontconfig: Updating fonts cache: succeeded
[ DONE ]
<13>Dec 17 04:46:54 rpmi: libX11-locales-3:1.6.7-alt1 sisyphus.214413.200 1539171080 installed
<13>Dec 17 04:46:54 rpmi: libXdmcp-1.1.1-alt1 1334617699 installed
<13>Dec 17 04:46:54 rpmi: libXau-1.0.8-alt1 1369565807 installed
<13>Dec 17 04:46:54 rpmi: libxcb-1.13.1-alt1 sisyphus.214413.100 1539170828 installed
<13>Dec 17 04:46:54 rpmi: libX11-3:1.6.7-alt1 sisyphus.214413.200 1539171080 installed
<13>Dec 17 04:46:54 rpmi: libXrender-0.9.8-alt1 1371312110 installed
<13>Dec 17 04:46:54 rpmi: libXft-2.3.2-alt1 1409902650 installed
<13>Dec 17 04:46:54 rpmi: libtk-8.6.8-alt1 1518663802 installed
<13>Dec 17 04:46:54 rpmi: tk-8.6.8-alt1 1518663802 installed
<13>Dec 17 04:46:54 rpmi: libtinfo-devel-6.1.20180407-alt2 sisyphus.215627.200 1540831969 installed
<13>Dec 17 04:46:54 rpmi: libncurses-devel-6.1.20180407-alt2 sisyphus.215627.200 1540831969 installed
<13>Dec 17 04:46:54 rpmi: python-modules-curses-2.7.15-alt1 sisyphus.217364.100 1544022396 installed
<13>Dec 17 04:46:54 rpmi: libverto-0.3.0-alt1_5 1525957716 installed
<13>Dec 17 04:46:54 rpmi: libkeyutils-1.6-alt2 sisyphus.217337.100 1544003165 installed
<13>Dec 17 04:46:54 rpmi: libcom_err-1.44.3-alt1 1532134713 installed
<13>Dec 17 04:46:54 rpmi: libtasn1-4.13-alt2 1521133848 installed
<13>Dec 17 04:46:54 rpmi: rpm-macros-alternatives-0.4.5-alt1.1 1404382149 installed
<13>Dec 17 04:46:54 rpmi: alternatives-0.4.5-alt1.1 1404382149 installed
<13>Dec 17 04:46:54 rpmi: libp11-kit-0.23.9-alt5 1525798241 installed
<13>Dec 17 04:46:54 rpmi: ca-certificates-2018.11.12-alt1 sisyphus.216395.300 1542114035 installed
<13>Dec 17 04:46:54 rpmi: ca-trust-0.1.1-alt2 1515595785 installed
<13>Dec 17 04:46:54 rpmi: p11-kit-trust-0.23.9-alt5 1525798241 installed
<13>Dec 17 04:46:54 rpmi: libcrypto1.1-1.1.0j-alt1 sisyphus.216647.100 1542743840 installed
<13>Dec 17 04:46:55 rpmi: libssl1.1-1.1.0j-alt1 sisyphus.216647.100 1542743840 installed
<86>Dec 17 04:46:55 groupadd[105997]: group added to /etc/group: name=_keytab, GID=498
<86>Dec 17 04:46:55 groupadd[105997]: group added to /etc/gshadow: name=_keytab
<86>Dec 17 04:46:55 groupadd[105997]: new group: name=_keytab, GID=498
<13>Dec 17 04:46:55 rpmi: libkrb5-1.16.2-alt2 sisyphus.216877.200 1543483170 installed
<13>Dec 17 04:46:55 rpmi: libtirpc-1.0.3-alt1 1532008015 installed
<13>Dec 17 04:46:55 rpmi: libnsl2-1.1.0-alt1_1 1511548748 installed
<13>Dec 17 04:46:55 rpmi: python-modules-compiler-2.7.15-alt1 sisyphus.217364.100 1544022396 installed
<13>Dec 17 04:46:55 rpmi: python-modules-email-2.7.15-alt1 sisyphus.217364.100 1544022396 installed
<13>Dec 17 04:46:55 rpmi: python-modules-unittest-2.7.15-alt1 sisyphus.217364.100 1544022396 installed
<13>Dec 17 04:46:55 rpmi: python-modules-nis-2.7.15-alt1 sisyphus.217364.100 1544022396 installed
<13>Dec 17 04:46:55 rpmi: python-modules-encodings-2.7.15-alt1 sisyphus.217364.100 1544022396 installed
<13>Dec 17 04:46:55 rpmi: python-modules-2.7.15-alt1 sisyphus.217364.100 1544022396 installed
<13>Dec 17 04:46:55 rpmi: python-module-six-1.11.0-alt2 1535611135 installed
<13>Dec 17 04:46:55 rpmi: python-modules-json-2.7.15-alt1 sisyphus.217364.100 1544022396 installed
<13>Dec 17 04:46:55 rpmi: python-module-pkg_resources-1:40.5.0-alt1 sisyphus.216029.100 1541106477 installed
<13>Dec 17 04:46:55 rpmi: python-modules-ctypes-2.7.15-alt1 sisyphus.217364.100 1544022396 installed
<13>Dec 17 04:46:55 rpmi: python-modules-xml-2.7.15-alt1 sisyphus.217364.100 1544022396 installed
<13>Dec 17 04:46:55 rpmi: python-modules-multiprocessing-2.7.15-alt1 sisyphus.217364.100 1544022396 installed
<13>Dec 17 04:46:55 rpmi: python-modules-logging-2.7.15-alt1 sisyphus.217364.100 1544022396 installed
<13>Dec 17 04:46:55 rpmi: python-modules-hotshot-2.7.15-alt1 sisyphus.217364.100 1544022396 installed
<13>Dec 17 04:46:55 rpmi: python-module-chardet-3.0.4-alt1 1506613818 installed
<13>Dec 17 04:46:55 rpmi: python-module-whoosh-2.7.4-alt1 1527697941 installed
<13>Dec 17 04:46:55 rpmi: python-module-webencodings-0.5.1-alt1.1 1517943573 installed
<13>Dec 17 04:46:55 rpmi: python-module-more-itertools-4.3.0-alt1 1533048475 installed
<13>Dec 17 04:46:55 rpmi: python-modules-bsddb-2.7.15-alt1 sisyphus.217364.100 1544022396 installed
<13>Dec 17 04:46:55 rpmi: python-2.7.15-alt1 sisyphus.217364.100 1544022396 installed
<13>Dec 17 04:46:55 rpmi: python-modules-distutils-2.7.15-alt1 sisyphus.217364.100 1544022396 installed
<13>Dec 17 04:46:55 rpmi: python-module-idna-2.7-alt1 1530720902 installed
<13>Dec 17 04:46:56 rpmi: python-module-pycparser-2.19-alt1 sisyphus.216095.100 1541345023 installed
<13>Dec 17 04:46:56 rpmi: python-module-cffi-1.10.0-alt1.1 1525117590 installed
<13>Dec 17 04:46:56 rpmi: python-module-asn1crypto-0.24.0-alt1 1521037480 installed
<13>Dec 17 04:46:56 rpmi: python-module-PyStemmer-1.0.1-alt1.2.1 1321387369 installed
<13>Dec 17 04:46:56 rpmi: python-module-snowballstemmer-1.2.0-alt2.1 1457859319 installed
<13>Dec 17 04:46:56 rpmi: python-module-cssselect-0.9.1-alt1.2 1526980827 installed
<13>Dec 17 04:46:56 rpmi: python-module-html5lib-1:0.999999999-alt4.qa1 sisyphus.214868.100 1539741045 installed
<13>Dec 17 04:46:56 rpmi: python-module-lxml-4.2.1-alt1.1 1525118997 installed
<13>Dec 17 04:46:56 rpmi: python-module-docutils-0.14-alt2 1535729778 installed
<13>Dec 17 04:46:56 rpmi: python-module-ntlm-1.1.0-alt1.1.1.1 1460405346 installed
<13>Dec 17 04:46:56 rpmi: python-module-pytz-1:2016.10-alt1 1484291011 installed
<13>Dec 17 04:46:57 rpmi: python-module-babel-1:2.4.0-alt1.1 1517644530 installed
<13>Dec 17 04:46:57 rpmi: python-module-attrs-18.2.0-alt1 sisyphus.214354.100 1539088435 installed
<13>Dec 17 04:46:57 rpmi: python-module-egenix-mx-base-3.2.8-alt1 1405907330 installed
<13>Dec 17 04:46:57 rpmi: python-modules-tkinter-2.7.15-alt1 sisyphus.217364.100 1544022396 installed
<13>Dec 17 04:46:57 rpmi: python-module-ipaddress-1.0.18-alt1.1 1517713372 installed
<13>Dec 17 04:46:57 rpmi: python-module-cryptography-2.4.2-alt1 sisyphus.216799.200 1543487238 installed
<13>Dec 17 04:46:57 rpmi: python-module-OpenSSL-18.0.0-alt1 1532996168 installed
<13>Dec 17 04:46:57 rpmi: python-module-simplejson-3.15.0-alt1.qa1 sisyphus.214917.100 1539845520 installed
<13>Dec 17 04:46:57 rpmi: python-module-ndg-0.4.2-alt1.qa1 1531457730 installed
<13>Dec 17 04:46:57 rpmi: python-module-ndg-httpsclient-0.4.2-alt1.qa1 1531457730 installed
<13>Dec 17 04:46:57 rpmi: python-module-backports-3.5.0.1-alt1.1.1 1517645428 installed
<13>Dec 17 04:46:57 rpmi: python-module-backports.ssl_match_hostname-3.5.0.1-alt1.1.1 1517645428 installed
<13>Dec 17 04:46:57 rpmi: python-module-urllib3-2:1.21.1-alt1 1506613994 installed
<13>Dec 17 04:46:57 rpmi: python-module-requests-2.19.1-alt1 1530831197 installed
<13>Dec 17 04:46:57 rpmi: python-module-typing-3.6.4-alt1 1517577671 installed
<13>Dec 17 04:46:57 rpmi: python-module-markupsafe-0.23-alt1.2.1.1 1525118564 installed
<13>Dec 17 04:46:57 rpmi: python-module-jinja2-2.10-alt1 1521724576 installed
<13>Dec 17 04:46:57 rpmi: python-modules-sqlite3-2.7.15-alt1 sisyphus.217364.100 1544022396 installed
<13>Dec 17 04:46:57 rpmi: python-module-SQLAlchemy-1.0.12-alt1.1 1525119185 installed
<13>Dec 17 04:46:57 rpmi: python-module-py-1.7.0-alt1 sisyphus.214414.220 1539670883 installed
<13>Dec 17 04:46:57 rpmi: python-module-funcsigs-1.0.2-alt1.1 1517699355 installed
<13>Dec 17 04:46:57 rpmi: python-module-scandir-1.9.0-alt1 1535455368 installed
<13>Dec 17 04:46:57 rpmi: python-module-pathlib2-2.3.2-alt1 1535455443 installed
<13>Dec 17 04:46:57 rpmi: python-module-atomicwrites-1.2.1-alt1 sisyphus.214347.100 1539076636 installed
<13>Dec 17 04:46:57 rpmi: python-modules-ensurepip-2.7.15-alt1 sisyphus.217364.100 1544022396 installed
<13>Dec 17 04:46:57 rpmi: python-modules-wsgiref-2.7.15-alt1 sisyphus.217364.100 1544022396 installed
<13>Dec 17 04:46:57 rpmi: python-module-xapian-1.4.5-alt2.qa1 1531484055 installed
<13>Dec 17 04:46:57 rpmi: python-module-pluggy-0.8.0-alt1 sisyphus.215346.100 1540073015 installed
<13>Dec 17 04:46:57 rpmi: python-module-pytest-3.9.3-alt1 sisyphus.215666.100 1540687418 installed
<13>Dec 17 04:46:57 rpmi: python-module-sphinxcontrib-websupport-1.0.1-alt3.qa1 sisyphus.214922.100 1539851266 installed
<13>Dec 17 04:46:58 rpmi: python-module-alabaster-0.7.6-alt3 1526385201 installed
<13>Dec 17 04:46:58 rpmi: python-module-Pygments-2.2.0-alt2 1526455576 installed
<13>Dec 17 04:46:58 rpmi: python-module-sphinx-1:1.6.5-alt3 sisyphus.213215.100 1537280252 installed
<13>Dec 17 04:46:58 rpmi: libnsl2-devel-1.1.0-alt1_1 1511548748 installed
<13>Dec 17 04:46:58 rpmi: python-dev-2.7.15-alt1 sisyphus.217364.100 1544022396 installed
<86>Dec 17 04:46:58 groupadd[114442]: group added to /etc/group: name=sasl, GID=497
<86>Dec 17 04:46:58 groupadd[114442]: group added to /etc/gshadow: name=sasl
<86>Dec 17 04:46:58 groupadd[114442]: new group: name=sasl, GID=497
<13>Dec 17 04:46:58 rpmi: libsasl2-3-2.1.27-alt0.2 1535660692 installed
<13>Dec 17 04:46:58 rpmi: libldap-2.4.46-alt1 1535562096 installed
<13>Dec 17 04:46:58 rpmi: libcurl-7.63.0-alt1 sisyphus.217831.100 1544762807 installed
<13>Dec 17 04:46:58 rpmi: libbind-9.11.5-alt1 sisyphus.216878.100 1543573644 installed
<13>Dec 17 04:46:58 rpmi: bind-devel-9.11.5-alt1 sisyphus.216878.100 1543573644 installed
<13>Dec 17 04:46:58 rpmi: cmake-3.13.1-alt1 sisyphus.217317.100 1544006285 installed
<13>Dec 17 04:46:58 rpmi: libcurl-devel-7.63.0-alt1 sisyphus.217831.100 1544762807 installed
<13>Dec 17 04:46:58 rpmi: python-tools-scripts-2.7.15-alt1 sisyphus.217364.100 1544022396 installed
<13>Dec 17 04:46:58 rpmi: libssl-devel-1.1.0j-alt1 sisyphus.216647.100 1542743840 installed
<86>Dec 17 04:46:58 groupadd[115479]: group added to /etc/group: name=systemd-journal, GID=496
<86>Dec 17 04:46:58 groupadd[115479]: group added to /etc/gshadow: name=systemd-journal
<86>Dec 17 04:46:58 groupadd[115479]: new group: name=systemd-journal, GID=496
<13>Dec 17 04:46:59 rpmi: systemd-1:239-alt3 sisyphus.215710.300 1540765573 installed
<13>Dec 17 04:46:59 rpmi: gcc-c++-8-alt1 sisyphus.214000.40 1542664792 installed
<13>Dec 17 04:46:59 rpmi: libjemalloc-devel-5.1.0-alt3 1535287603 installed
<13>Dec 17 04:46:59 rpmi: swig-1:3.0.12-alt5 sisyphus.217216.100 1543832801 installed
<13>Dec 17 04:46:59 rpmi: libgperftools-devel-2.6.3-alt1 1521472871 installed
<13>Dec 17 04:46:59 rpmi: libpcap-devel-2:1.1.1-alt3 1298589613 installed
<13>Dec 17 04:46:59 rpmi: rpm-macros-intro-conflicts-2.1.9-alt1 1535641052 installed
<13>Dec 17 04:46:59 rpmi: libGeoIP-devel-1.6.12-alt1 1516269293 installed
<13>Dec 17 04:46:59 rpmi: libreadline-devel-7.0.3-alt2 1526988921 installed
<13>Dec 17 04:46:59 rpmi: zlib-devel-1.2.11-alt1 sisyphus.217171.100 1543710738 installed
<13>Dec 17 04:46:59 rpmi: rsync-3.1.3-alt1 1518721083 installed
<13>Dec 17 04:46:59 rpmi: python-module-pysubnettree-0.23-alt1.1.1.1 1525231373 installed
<13>Dec 17 04:46:59 rpmi: libxml2-devel-1:2.9.4.0.12.e905-alt1.1 1525115736 installed
<13>Dec 17 04:47:00 rpmi: libmagic-devel-4.26-alt13 1490157134 installed
<13>Dec 17 04:47:00 rpmi: flex-2.6.0-alt1 1449073214 installed
<13>Dec 17 04:47:00 rpmi: doxygen-1:1.8.13-alt2.1 1520290341 installed
Building target platforms: x86_64
Building for target x86_64
Wrote: /usr/src/in/nosrpm/bro-2.3.1-alt8.nosrc.rpm
Installing bro-2.3.1-alt8.src.rpm
Building target platforms: x86_64
Building for target x86_64
Executing(%prep): /bin/sh -e /usr/src/tmp/rpm-tmp.22948
+ umask 022
+ /bin/mkdir -p /usr/src/RPM/BUILD
+ cd /usr/src/RPM/BUILD
+ cd /usr/src/RPM/BUILD
+ rm -rf bro-2.3.1
+ echo 'Source #0 (bro-2.3.1.tar):'
Source #0 (bro-2.3.1.tar):
+ /bin/tar -xf /usr/src/RPM/SOURCES/bro-2.3.1.tar
+ cd bro-2.3.1
+ /bin/chmod -c -Rf u+rwX,go-w .
+ echo 'Patch #0 (bro-2.3-configure.patch):'
Patch #0 (bro-2.3-configure.patch):
+ /usr/bin/patch -p1 -b --suffix .configure
patching file configure
+ echo 'Patch #1 (bro-2.3-broctl-disable-aux.patch):'
Patch #1 (bro-2.3-broctl-disable-aux.patch):
+ /usr/bin/patch -p1 -b --suffix .cmake
patching file aux/broctl/CMakeLists.txt
+ echo 'Patch #2 (bro-2.3-broctl-path.patch):'
Patch #2 (bro-2.3-broctl-path.patch):
+ /usr/bin/patch -p1 -b --suffix .path
patching file aux/broctl/bin/broctl.in
+ echo 'Patch #3 (bro-2.3-pygments-reST-alt.patch):'
Patch #3 (bro-2.3-pygments-reST-alt.patch):
+ /usr/bin/patch -p1
patching file doc/ext/rst_directive.py
+ sed -ibak 's|/lib/broctl|/usr/lib64/python2.7/site-packages/BroControl|g' aux/broctl/BroControl/options.py
+ sed -ibak 's|/lib|/usr/lib64/bro|g' aux/broctl/BroControl/options.py
+ sed -i -e '1i#! /bin/bash' aux/broctl/bin/set-bro-path
+ sed -i -e '1i#! /bin/awk' aux/broctl/bin/helpers/to-bytes.awk
+ exit 0
Executing(%build): /bin/sh -e /usr/src/tmp/rpm-tmp.14571
+ umask 022
+ /bin/mkdir -p /usr/src/RPM/BUILD
+ cd /usr/src/RPM/BUILD
+ cd bro-2.3.1
+ ./configure --prefix=/usr --libdir=/usr/lib64 --conf-files-dir=/etc/bro --python-install-dir=/usr/lib64/python2.7/site-packages --disable-rpath --enable-debug --enable-mobile-ipv6 --enable-jemalloc --enable-binpac
Build Directory : build
Source Directory: /usr/src/RPM/BUILD/bro-2.3.1
-- The C compiler identification is GNU 8.2.1
-- The CXX compiler identification is GNU 8.2.1
-- Check for working C compiler: /usr/bin/cc
-- Check for working C compiler: /usr/bin/cc -- works
-- Detecting C compiler ABI info
-- Detecting C compiler ABI info - done
-- Detecting C compile features
-- Detecting C compile features - done
-- Check for working CXX compiler: /usr/bin/c++
-- Check for working CXX compiler: /usr/bin/c++ -- works
-- Detecting CXX compiler ABI info
-- Detecting CXX compiler ABI info - done
-- Detecting CXX compile features
-- Detecting CXX compile features - done
-- Found sed: /bin/sed
-- Found Perl: /usr/bin/perl (found version "5.26.2") 
-- Found FLEX: 2.6.0  
-- Found BISON: /usr/bin/bison  
-- Found PCAP: /usr/lib64/libpcap.so  
-- Performing Test PCAP_LINKS_SOLO
-- Performing Test PCAP_LINKS_SOLO - Success
-- Looking for pcap_get_pfring_id
-- Looking for pcap_get_pfring_id - not found
-- Found OpenSSL: /usr/lib64/libssl.so;/usr/lib64/libcrypto.so  
-- Performing Test ns_initparse_works_none
-- Performing Test ns_initparse_works_none - Failed
-- Performing Test res_mkquery_works_none
-- Performing Test res_mkquery_works_none - Failed
-- Performing Test ns_initparse_works_libresolv.a
-- Performing Test ns_initparse_works_libresolv.a - Failed
-- Performing Test res_mkquery_works_libresolv.a
-- Performing Test res_mkquery_works_libresolv.a - Failed
-- Performing Test ns_initparse_works_resolv
-- Performing Test ns_initparse_works_resolv - Success
-- Performing Test res_mkquery_works_resolv
-- Performing Test res_mkquery_works_resolv - Success
-- Found BIND: /usr/lib64/libresolv.so  
-- Found ZLIB: /usr/lib64/libz.so (found version "1.2.11") 
-- Check if the system is big endian
-- Searching 16 bit integer
-- Looking for sys/types.h
-- Looking for sys/types.h - found
-- Looking for stdint.h
-- Looking for stdint.h - found
-- Looking for stddef.h
-- Looking for stddef.h - found
-- Check size of unsigned short
-- Check size of unsigned short - done
-- Using unsigned short
-- Check if the system is big endian - little endian
-- Check size of unsigned int
-- Check size of unsigned int - done

==================|  BinPAC Build Summary  |====================

Install prefix:    /usr
Debug mode:        true

CC:                /usr/bin/cc
CFLAGS:             -Wall -Wno-unused -g -DDEBUG -DBRO_DEBUG -g
CXX:               /usr/bin/c++
CXXFLAGS:           -Wall -Wno-unused -g -DDEBUG -DBRO_DEBUG -g
CPP:               /usr/bin/c++

================================================================

-- Found BinPAC: binpac  
-- Found JeMalloc: /usr/lib64/libjemalloc.so  
-- Found LibGeoIP: /usr/lib64/libGeoIP.so  
-- Performing Test HAVE_GEOIP_COUNTRY_EDITION_V6
-- Performing Test HAVE_GEOIP_COUNTRY_EDITION_V6 - Success
-- Performing Test HAVE_GEOIP_CITY_EDITION_REV0_V6
-- Performing Test HAVE_GEOIP_CITY_EDITION_REV0_V6 - Success
-- Could NOT find GooglePerftools (missing: GooglePerftools_INCLUDE_DIR) 
-- Could NOT find Lintel (missing: Lintel_LIBRARIES Lintel_INCLUDE_DIR) 
-- Could NOT find DataSeries (missing: DataSeries_LIBRARIES DataSeries_INCLUDE_DIR) 
-- Found LibXML2: /usr/lib64/libxml2.so  
-- Found LibCURL: /usr/lib64/libcurl.so  
-- Check if the system is big endian
-- Searching 16 bit integer
-- Using unsigned short
-- Check if the system is big endian - little endian
-- Check size of long int
-- Check size of long int - done
-- Check size of long long
-- Check size of long long - done
-- Check size of void *
-- Check size of void * - done
-- Check size of int32_t
-- Check size of int32_t - done
-- Check size of u_int32_t
-- Check size of u_int32_t - done
-- Check size of u_int16_t
-- Check size of u_int16_t - done
-- Check size of u_int8_t
-- Check size of u_int8_t - done
-- Check size of socklen_t
-- Check size of socklen_t - done
-- Check size of struct ip6_opt
-- Check size of struct ip6_opt - done
-- Check size of struct ip6_ext
-- Check size of struct ip6_ext - done
-- Looking for include file getopt.h
-- Looking for include file getopt.h - found
-- Looking for include file memory.h
-- Looking for include file memory.h - found
-- Looking for 4 include files sys/socket.h, ..., netinet/if_ether.h
-- Looking for 4 include files sys/socket.h, ..., netinet/if_ether.h - found
-- Looking for 4 include files sys/socket.h, ..., netinet/ip6.h
-- Looking for 4 include files sys/socket.h, ..., netinet/ip6.h - found
-- Looking for 3 include files sys/socket.h, ..., net/ethernet.h
-- Looking for 3 include files sys/socket.h, ..., net/ethernet.h - found
-- Looking for include file sys/ethernet.h
-- Looking for include file sys/ethernet.h - not found
-- Looking for include file net/ethertypes.h
-- Looking for include file net/ethertypes.h - not found
-- Looking for include file sys/time.h
-- Looking for include file sys/time.h - found
-- Looking for include files time.h, sys/time.h
-- Looking for include files time.h, sys/time.h - found
-- Looking for include file os-proto.h
-- Looking for include file os-proto.h - not found
-- Performing Test HAVE_READLINE_HISTORY_ENTRIES
-- Performing Test HAVE_READLINE_HISTORY_ENTRIES - Failed
-- Looking for include files stdio.h, readline/readline.h
-- Looking for include files stdio.h, readline/readline.h - found
-- Looking for include files stdio.h, readline/history.h
-- Looking for include files stdio.h, readline/history.h - found
-- Performing Test SIN_LEN
-- Performing Test SIN_LEN - Failed
-- Looking for IPPROTO_HOPOPTS
-- Looking for IPPROTO_HOPOPTS - found
-- Looking for IPPROTO_IPV6
-- Looking for IPPROTO_IPV6 - found
-- Looking for IPPROTO_IPV4
-- Looking for IPPROTO_IPV4 - not found
-- Looking for IPPROTO_ROUTING
-- Looking for IPPROTO_ROUTING - found
-- Looking for IPPROTO_FRAGMENT
-- Looking for IPPROTO_FRAGMENT - found
-- Looking for IPPROTO_ESP
-- Looking for IPPROTO_ESP - found
-- Looking for IPPROTO_AH
-- Looking for IPPROTO_AH - found
-- Looking for IPPROTO_ICMPV6
-- Looking for IPPROTO_ICMPV6 - found
-- Looking for IPPROTO_NONE
-- Looking for IPPROTO_NONE - found
-- Looking for IPPROTO_DSTOPTS
-- Looking for IPPROTO_DSTOPTS - found
-- Looking for getopt_long
-- Looking for getopt_long - found
-- Looking for mallinfo
-- Looking for mallinfo - found
-- Looking for strcasestr
-- Looking for strcasestr - found
-- Looking for strerror
-- Looking for strerror - found
-- Looking for strsep
-- Looking for strsep - found
-- Looking for sigset
-- Looking for sigset - found
-- Performing Test DO_SOCK_DECL
-- Performing Test DO_SOCK_DECL - Failed
-- Performing Test SYSLOG_INT
-- Performing Test SYSLOG_INT - Failed
CMake Warning (dev) at /usr/share/cmake/Modules/CheckIncludeFiles.cmake:110 (message):
  Policy CMP0075 is not set: Include file check macros honor
  CMAKE_REQUIRED_LIBRARIES.  Run "cmake --help-policy CMP0075" for policy
  details.  Use the cmake_policy command to set the policy and suppress this
  warning.

  CMAKE_REQUIRED_LIBRARIES is set to:

    /usr/lib64/libpcap.so

  For compatibility with CMake 3.11 and below this check is ignoring it.
Call Stack (most recent call first):
  cmake/PCAPTests.cmake:9 (check_include_files)
  CMakeLists.txt:174 (include)
This warning is for project developers.  Use -Wno-dev to suppress it.

-- Looking for include file pcap-int.h
-- Looking for include file pcap-int.h - not found
-- Looking for pcap_freecode
-- Looking for pcap_freecode - found
-- Performing Test LIBPCAP_PCAP_COMPILE_NOPCAP_HAS_ERROR_PARAMETER
-- Performing Test LIBPCAP_PCAP_COMPILE_NOPCAP_HAS_ERROR_PARAMETER - Failed
-- Performing Test LIBPCAP_PCAP_COMPILE_NOPCAP_NO_ERROR_PARAMETER
-- Performing Test LIBPCAP_PCAP_COMPILE_NOPCAP_NO_ERROR_PARAMETER - Success
-- Looking for DLT_PPP_SERIAL
-- Looking for DLT_PPP_SERIAL - found
-- Performing Test including_ssl_h_works
-- Performing Test including_ssl_h_works - Success
-- Performing Test openssl_greater_than_0_9_7
-- Performing Test openssl_greater_than_0_9_7 - Success
-- Performing Test OPENSSL_D2I_X509_USES_CONST_CHAR
-- Performing Test OPENSSL_D2I_X509_USES_CONST_CHAR - Success
-- Performing Test have_nameser_header
-- Performing Test have_nameser_header - Success
-- Looking for pthread.h
-- Looking for pthread.h - found
-- Looking for pthread_create
-- Looking for pthread_create - not found
-- Looking for pthread_create in pthreads
-- Looking for pthread_create in pthreads - not found
-- Looking for pthread_create in pthread
-- Looking for pthread_create in pthread - found
-- Found Threads: TRUE  
-- Found PythonInterp: /usr/bin/python (found version "2.7.15") 
CMake Warning at aux/broctl/CMakeLists.txt:48 (message):
  A sendmail program was not found, BroControl will be unable to send mail.
  This can be fixed even after installing by editing /etc/bro/broctl.cfg



=================|  Broctl Install Summary  |===================

Install prefix:    /usr
Bro root:          /usr
Scripts Dir:       /usr/share/bro
Spool Dir:         /var/spool/bro
Log Dir:           /var/log/bro
Config File Dir:   /etc/bro

================================================================

CMake Warning (dev) at aux/bro-aux/CMakeLists.txt:52 (get_property):
  Policy CMP0026 is not set: Disallow use of the LOCATION target property.
  Run "cmake --help-policy CMP0026" for policy details.  Use the cmake_policy
  command to set the policy and suppress this warning.

  The LOCATION property should not be read from target "adtrace".  Use the
  target name directly with add_custom_command, or use the generator
  expression $<TARGET_FILE>, as appropriate.

Call Stack (most recent call first):
  aux/bro-aux/adtrace/CMakeLists.txt:12 (AddAuxInstallTarget)
This warning is for project developers.  Use -Wno-dev to suppress it.

CMake Warning (dev) at aux/bro-aux/CMakeLists.txt:52 (get_property):
  Policy CMP0026 is not set: Disallow use of the LOCATION target property.
  Run "cmake --help-policy CMP0026" for policy details.  Use the cmake_policy
  command to set the policy and suppress this warning.

  The LOCATION property should not be read from target "ftwire2bro".  Use the
  target name directly with add_custom_command, or use the generator
  expression $<TARGET_FILE>, as appropriate.

Call Stack (most recent call first):
  aux/bro-aux/nftools/CMakeLists.txt:12 (AddAuxInstallTarget)
This warning is for project developers.  Use -Wno-dev to suppress it.

CMake Warning (dev) at aux/bro-aux/CMakeLists.txt:52 (get_property):
  Policy CMP0026 is not set: Disallow use of the LOCATION target property.
  Run "cmake --help-policy CMP0026" for policy details.  Use the cmake_policy
  command to set the policy and suppress this warning.

  The LOCATION property should not be read from target "nfcollector".  Use
  the target name directly with add_custom_command, or use the generator
  expression $<TARGET_FILE>, as appropriate.

Call Stack (most recent call first):
  aux/bro-aux/nftools/CMakeLists.txt:25 (AddAuxInstallTarget)
This warning is for project developers.  Use -Wno-dev to suppress it.

CMake Warning (dev) at aux/bro-aux/CMakeLists.txt:52 (get_property):
  Policy CMP0026 is not set: Disallow use of the LOCATION target property.
  Run "cmake --help-policy CMP0026" for policy details.  Use the cmake_policy
  command to set the policy and suppress this warning.

  The LOCATION property should not be read from target "rst".  Use the target
  name directly with add_custom_command, or use the generator expression
  $<TARGET_FILE>, as appropriate.

Call Stack (most recent call first):
  aux/bro-aux/rst/CMakeLists.txt:9 (AddAuxInstallTarget)
This warning is for project developers.  Use -Wno-dev to suppress it.


==================|  Bro-Aux Build Summary  |===================

Install prefix:    /usr
Debug mode:        true

CC:                /usr/bin/cc
CFLAGS:             -Wall -Wno-unused -g -DDEBUG -DBRO_DEBUG -g
CXX:               /usr/bin/c++
CXXFLAGS:           -Wall -Wno-unused -g -DDEBUG -DBRO_DEBUG -g
CPP:               /usr/bin/c++

================================================================

-- Looking for geteuid
-- Looking for geteuid - found
-- Looking for getpwuid
-- Looking for getpwuid - found
-- Check size of uint
-- Check size of uint - done
-- Found Broccoli: broccoli  
-- Found SWIG: /usr/bin/swig (found version "3.0.12") 
-- Found PythonDev: /usr/bin/python-config  
CMake Deprecation Warning at /usr/share/cmake/Modules/UseSWIG.cmake:524 (message):
  SWIG_ADD_MODULE is deprecated.  Use SWIG_ADD_LIBRARY instead.
Call Stack (most recent call first):
  aux/broccoli/bindings/broccoli-python/CMakeLists.txt:38 (swig_add_module)


CMake Warning (dev) at /usr/share/cmake/Modules/UseSWIG.cmake:564 (message):
  Policy CMP0078 is not set.  Run "cmake --help-policy CMP0078" for policy
  details.  Use the cmake_policy command to set the policy and suppress this
  warning.
Call Stack (most recent call first):
  /usr/share/cmake/Modules/UseSWIG.cmake:525 (swig_add_library)
  aux/broccoli/bindings/broccoli-python/CMakeLists.txt:38 (swig_add_module)
This warning is for project developers.  Use -Wno-dev to suppress it.


================|  PyBroccoli Build Summary  |==================

Install dir:       /usr/lib64/python2.7/site-packages
Debug mode:        true

CC:                /usr/bin/cc
CFLAGS:             -Wall -Wno-unused -g -DDEBUG -DBRO_DEBUG -g
CPP:               /usr/bin/cc

================================================================

-- Not building broccoli-ruby bindings

=================|  Broccoli Build Summary  |===================

Install prefix:    /usr
Library prefix:    /usr/lib64
Debug mode:        true
Shared libs:       true
Static libs:       true

Config file:       /etc/bro/broccoli.conf
Packet support:    true

CC:                /usr/bin/cc
CFLAGS:             -Wall -Wno-unused -g -DDEBUG -DBRO_DEBUG -g
CPP:               /usr/bin/cc

================================================================


====================|  Bro Build Summary  |=====================

Install prefix:    /usr
Bro Script Path:   /usr/share/bro
Debug mode:        true

CC:                /usr/bin/cc
CFLAGS:             -Wall -Wno-unused -g -DDEBUG -DBRO_DEBUG -g
CXX:               /usr/bin/c++
CXXFLAGS:           -Wall -Wno-unused -g -DDEBUG -DBRO_DEBUG -g
CPP:               /usr/bin/c++

Broccoli:          true
Broctl:            true
Aux. Tools:        true

GeoIP:             true
gperftools found:  false
        tcmalloc:  false
       debugging:  false
jemalloc:          true
cURL:              true

DataSeries:        false
ElasticSearch:     true

================================================================

-- Configuring done
-- Generating done
-- Build files have been written to: /usr/src/RPM/BUILD/bro-2.3.1/build
+ make
make: Entering directory '/usr/src/RPM/BUILD/bro-2.3.1'
make -C build all
make[1]: Entering directory '/usr/src/RPM/BUILD/bro-2.3.1/build'
make[2]: Entering directory '/usr/src/RPM/BUILD/bro-2.3.1/build'
make[3]: Entering directory '/usr/src/RPM/BUILD/bro-2.3.1/build'
Scanning dependencies of target binpac_lib
make[3]: Leaving directory '/usr/src/RPM/BUILD/bro-2.3.1/build'
make[3]: Entering directory '/usr/src/RPM/BUILD/bro-2.3.1/build'
[  0%] Building CXX object aux/binpac/lib/CMakeFiles/binpac_lib.dir/binpac_buffer.cc.o
[  0%] Building CXX object aux/binpac/lib/CMakeFiles/binpac_lib.dir/binpac_bytestring.cc.o
[  0%] Linking CXX static library libbinpac.a
make[3]: Leaving directory '/usr/src/RPM/BUILD/bro-2.3.1/build'
[  0%] Built target binpac_lib
make[3]: Entering directory '/usr/src/RPM/BUILD/bro-2.3.1/build'
[  0%] [FLEX][PACScanner] Building scanner with flex 2.6.0
[  0%] [BISON][PACParser] Building parser with bison 3.0.4.0.14.8bf2
Scanning dependencies of target binpac
make[3]: Leaving directory '/usr/src/RPM/BUILD/bro-2.3.1/build'
make[3]: Entering directory '/usr/src/RPM/BUILD/bro-2.3.1/build'
[  0%] Building CXX object aux/binpac/src/CMakeFiles/binpac.dir/pac_parse.cc.o
[  1%] Building CXX object aux/binpac/src/CMakeFiles/binpac.dir/pac_scan.cc.o
[  1%] Building CXX object aux/binpac/src/CMakeFiles/binpac.dir/pac_action.cc.o
[  1%] Building CXX object aux/binpac/src/CMakeFiles/binpac.dir/pac_analyzer.cc.o
[  1%] Building CXX object aux/binpac/src/CMakeFiles/binpac.dir/pac_array.cc.o
[  1%] Building CXX object aux/binpac/src/CMakeFiles/binpac.dir/pac_attr.cc.o
[  1%] Building CXX object aux/binpac/src/CMakeFiles/binpac.dir/pac_btype.cc.o
[  1%] Building CXX object aux/binpac/src/CMakeFiles/binpac.dir/pac_case.cc.o
[  1%] Building CXX object aux/binpac/src/CMakeFiles/binpac.dir/pac_conn.cc.o
[  2%] Building CXX object aux/binpac/src/CMakeFiles/binpac.dir/pac_context.cc.o
[  2%] Building CXX object aux/binpac/src/CMakeFiles/binpac.dir/pac_cstr.cc.o
[  2%] Building CXX object aux/binpac/src/CMakeFiles/binpac.dir/pac_datadep.cc.o
[  2%] Building CXX object aux/binpac/src/CMakeFiles/binpac.dir/pac_dataptr.cc.o
[  2%] Building CXX object aux/binpac/src/CMakeFiles/binpac.dir/pac_dataunit.cc.o
[  2%] Building CXX object aux/binpac/src/CMakeFiles/binpac.dir/pac_decl.cc.o
[  2%] Building CXX object aux/binpac/src/CMakeFiles/binpac.dir/pac_embedded.cc.o
[  2%] Building CXX object aux/binpac/src/CMakeFiles/binpac.dir/pac_enum.cc.o
[  3%] Building CXX object aux/binpac/src/CMakeFiles/binpac.dir/pac_expr.cc.o
[  3%] Building CXX object aux/binpac/src/CMakeFiles/binpac.dir/pac_exttype.cc.o
[  3%] Building CXX object aux/binpac/src/CMakeFiles/binpac.dir/pac_field.cc.o
[  3%] Building CXX object aux/binpac/src/CMakeFiles/binpac.dir/pac_flow.cc.o
[  3%] Building CXX object aux/binpac/src/CMakeFiles/binpac.dir/pac_func.cc.o
[  3%] Building CXX object aux/binpac/src/CMakeFiles/binpac.dir/pac_id.cc.o
[  3%] Building CXX object aux/binpac/src/CMakeFiles/binpac.dir/pac_inputbuf.cc.o
[  4%] Building CXX object aux/binpac/src/CMakeFiles/binpac.dir/pac_let.cc.o
[  4%] Building CXX object aux/binpac/src/CMakeFiles/binpac.dir/pac_param.cc.o
[  4%] Building CXX object aux/binpac/src/CMakeFiles/binpac.dir/pac_paramtype.cc.o
[  4%] Building CXX object aux/binpac/src/CMakeFiles/binpac.dir/pac_primitive.cc.o
[  4%] Building CXX object aux/binpac/src/CMakeFiles/binpac.dir/pac_record.cc.o
[  4%] Building CXX object aux/binpac/src/CMakeFiles/binpac.dir/pac_redef.cc.o
[  4%] Building CXX object aux/binpac/src/CMakeFiles/binpac.dir/pac_regex.cc.o
[  4%] Building CXX object aux/binpac/src/CMakeFiles/binpac.dir/pac_state.cc.o
[  5%] Building CXX object aux/binpac/src/CMakeFiles/binpac.dir/pac_strtype.cc.o
[  5%] Building CXX object aux/binpac/src/CMakeFiles/binpac.dir/pac_type.cc.o
[  5%] Building CXX object aux/binpac/src/CMakeFiles/binpac.dir/pac_typedecl.cc.o
[  5%] Building CXX object aux/binpac/src/CMakeFiles/binpac.dir/pac_withinput.cc.o
[  5%] Building CXX object aux/binpac/src/CMakeFiles/binpac.dir/pac_output.cc.o
[  5%] Building CXX object aux/binpac/src/CMakeFiles/binpac.dir/pac_utils.cc.o
[  5%] Building CXX object aux/binpac/src/CMakeFiles/binpac.dir/pac_exception.cc.o
[  5%] Building CXX object aux/binpac/src/CMakeFiles/binpac.dir/pac_main.cc.o
[  6%] Linking CXX executable binpac
make[3]: Leaving directory '/usr/src/RPM/BUILD/bro-2.3.1/build'
[  6%] Built target binpac
make[3]: Entering directory '/usr/src/RPM/BUILD/bro-2.3.1/build'
[  6%] [FLEX][BIFScanner] Building scanner with flex 2.6.0
[  6%] [BISON][BIFParser] Building parser with bison 3.0.4.0.14.8bf2
Scanning dependencies of target bifcl
make[3]: Leaving directory '/usr/src/RPM/BUILD/bro-2.3.1/build'
make[3]: Entering directory '/usr/src/RPM/BUILD/bro-2.3.1/build'
[  7%] Building CXX object src/CMakeFiles/bifcl.dir/bif_parse.cc.o
[  7%] Building CXX object src/CMakeFiles/bifcl.dir/bif_lex.cc.o
[  7%] Building CXX object src/CMakeFiles/bifcl.dir/bif_arg.cc.o
[  7%] Building CXX object src/CMakeFiles/bifcl.dir/module_util.cc.o
[  7%] Linking CXX executable bifcl
make[3]: Leaving directory '/usr/src/RPM/BUILD/bro-2.3.1/build'
[  7%] Built target bifcl
make[3]: Entering directory '/usr/src/RPM/BUILD/bro-2.3.1/build'
Scanning dependencies of target bif-alt-broxygen-broxygen.bif
make[3]: Leaving directory '/usr/src/RPM/BUILD/bro-2.3.1/build'
make[3]: Entering directory '/usr/src/RPM/BUILD/bro-2.3.1/build'
[  7%] [BIFCL] Processing broxygen.bif
make[3]: Leaving directory '/usr/src/RPM/BUILD/bro-2.3.1/build'
[  7%] Built target bif-alt-broxygen-broxygen.bif
make[3]: Entering directory '/usr/src/RPM/BUILD/bro-2.3.1/build'
Scanning dependencies of target bif-std-strings.bif
make[3]: Leaving directory '/usr/src/RPM/BUILD/bro-2.3.1/build'
make[3]: Entering directory '/usr/src/RPM/BUILD/bro-2.3.1/build'
[  7%] [BIFCL] Processing strings.bif
make[3]: Leaving directory '/usr/src/RPM/BUILD/bro-2.3.1/build'
[  7%] Built target bif-std-strings.bif
make[3]: Entering directory '/usr/src/RPM/BUILD/bro-2.3.1/build'
Scanning dependencies of target pac-binpac-lib.pac
make[3]: Leaving directory '/usr/src/RPM/BUILD/bro-2.3.1/build'
make[3]: Entering directory '/usr/src/RPM/BUILD/bro-2.3.1/build'
[  7%] [BINPAC] Processing binpac-lib.pac
make[3]: Leaving directory '/usr/src/RPM/BUILD/bro-2.3.1/build'
[  7%] Built target pac-binpac-lib.pac
make[3]: Entering directory '/usr/src/RPM/BUILD/bro-2.3.1/build'
Scanning dependencies of target pac-analyzer-protocol-dce-rpc-dce_rpc.pac
make[3]: Leaving directory '/usr/src/RPM/BUILD/bro-2.3.1/build'
make[3]: Entering directory '/usr/src/RPM/BUILD/bro-2.3.1/build'
[  7%] [BINPAC] Processing dce_rpc.pac
make[3]: Leaving directory '/usr/src/RPM/BUILD/bro-2.3.1/build'
[  7%] Built target pac-analyzer-protocol-dce-rpc-dce_rpc.pac
make[3]: Entering directory '/usr/src/RPM/BUILD/bro-2.3.1/build'
Scanning dependencies of target bif-std-types.bif
make[3]: Leaving directory '/usr/src/RPM/BUILD/bro-2.3.1/build'
make[3]: Entering directory '/usr/src/RPM/BUILD/bro-2.3.1/build'
[  7%] [BIFCL] Processing types.bif
make[3]: Leaving directory '/usr/src/RPM/BUILD/bro-2.3.1/build'
[  7%] Built target bif-std-types.bif
make[3]: Entering directory '/usr/src/RPM/BUILD/bro-2.3.1/build'
Scanning dependencies of target pac-analyzer-protocol-dhcp-dhcp.pac
make[3]: Leaving directory '/usr/src/RPM/BUILD/bro-2.3.1/build'
make[3]: Entering directory '/usr/src/RPM/BUILD/bro-2.3.1/build'
[  7%] [BINPAC] Processing dhcp.pac
make[3]: Leaving directory '/usr/src/RPM/BUILD/bro-2.3.1/build'
[  7%] Built target pac-analyzer-protocol-dhcp-dhcp.pac
make[3]: Entering directory '/usr/src/RPM/BUILD/bro-2.3.1/build'
Scanning dependencies of target bif-plugin-Bro_BackDoor-events.bif
make[3]: Leaving directory '/usr/src/RPM/BUILD/bro-2.3.1/build'
make[3]: Entering directory '/usr/src/RPM/BUILD/bro-2.3.1/build'
[  7%] [BIFCL] Processing events.bif
make[3]: Leaving directory '/usr/src/RPM/BUILD/bro-2.3.1/build'
[  7%] Built target bif-plugin-Bro_BackDoor-events.bif
make[3]: Entering directory '/usr/src/RPM/BUILD/bro-2.3.1/build'
Scanning dependencies of target bif-std-input.bif
make[3]: Leaving directory '/usr/src/RPM/BUILD/bro-2.3.1/build'
make[3]: Entering directory '/usr/src/RPM/BUILD/bro-2.3.1/build'
[  8%] [BIFCL] Processing input.bif
make[3]: Leaving directory '/usr/src/RPM/BUILD/bro-2.3.1/build'
[  8%] Built target bif-std-input.bif
make[3]: Entering directory '/usr/src/RPM/BUILD/bro-2.3.1/build'
Scanning dependencies of target bif-plugin-Bro_ARP-events.bif
make[3]: Leaving directory '/usr/src/RPM/BUILD/bro-2.3.1/build'
make[3]: Entering directory '/usr/src/RPM/BUILD/bro-2.3.1/build'
[  8%] [BIFCL] Processing events.bif
make[3]: Leaving directory '/usr/src/RPM/BUILD/bro-2.3.1/build'
[  8%] Built target bif-plugin-Bro_ARP-events.bif
make[3]: Entering directory '/usr/src/RPM/BUILD/bro-2.3.1/build'
Scanning dependencies of target bif-std-const.bif
make[3]: Leaving directory '/usr/src/RPM/BUILD/bro-2.3.1/build'
make[3]: Entering directory '/usr/src/RPM/BUILD/bro-2.3.1/build'
[  8%] [BIFCL] Processing const.bif
make[3]: Leaving directory '/usr/src/RPM/BUILD/bro-2.3.1/build'
[  8%] Built target bif-std-const.bif
make[3]: Entering directory '/usr/src/RPM/BUILD/bro-2.3.1/build'
Scanning dependencies of target bif-plugin-Bro_BitTorrent-events.bif
make[3]: Leaving directory '/usr/src/RPM/BUILD/bro-2.3.1/build'
make[3]: Entering directory '/usr/src/RPM/BUILD/bro-2.3.1/build'
[  8%] [BIFCL] Processing events.bif
make[3]: Leaving directory '/usr/src/RPM/BUILD/bro-2.3.1/build'
[  8%] Built target bif-plugin-Bro_BitTorrent-events.bif
make[3]: Entering directory '/usr/src/RPM/BUILD/bro-2.3.1/build'
Scanning dependencies of target bif-plugin-Bro_AYIYA-events.bif
make[3]: Leaving directory '/usr/src/RPM/BUILD/bro-2.3.1/build'
make[3]: Entering directory '/usr/src/RPM/BUILD/bro-2.3.1/build'
[  8%] [BIFCL] Processing events.bif
make[3]: Leaving directory '/usr/src/RPM/BUILD/bro-2.3.1/build'
[  8%] Built target bif-plugin-Bro_AYIYA-events.bif
make[3]: Entering directory '/usr/src/RPM/BUILD/bro-2.3.1/build'
Scanning dependencies of target bif-plugin-Bro_DNS-events.bif
make[3]: Leaving directory '/usr/src/RPM/BUILD/bro-2.3.1/build'
make[3]: Entering directory '/usr/src/RPM/BUILD/bro-2.3.1/build'
[  8%] [BIFCL] Processing events.bif
make[3]: Leaving directory '/usr/src/RPM/BUILD/bro-2.3.1/build'
[  8%] Built target bif-plugin-Bro_DNS-events.bif
make[3]: Entering directory '/usr/src/RPM/BUILD/bro-2.3.1/build'
Scanning dependencies of target pac-analyzer-protocol-dce-rpc-dce_rpc_simple.pac
make[3]: Leaving directory '/usr/src/RPM/BUILD/bro-2.3.1/build'
make[3]: Entering directory '/usr/src/RPM/BUILD/bro-2.3.1/build'
[  8%] [BINPAC] Processing dce_rpc_simple.pac
make[3]: Leaving directory '/usr/src/RPM/BUILD/bro-2.3.1/build'
[  8%] Built target pac-analyzer-protocol-dce-rpc-dce_rpc_simple.pac
make[3]: Entering directory '/usr/src/RPM/BUILD/bro-2.3.1/build'
Scanning dependencies of target bif-plugin-Bro_ConnSize-events.bif
make[3]: Leaving directory '/usr/src/RPM/BUILD/bro-2.3.1/build'
make[3]: Entering directory '/usr/src/RPM/BUILD/bro-2.3.1/build'
[  8%] [BIFCL] Processing events.bif
make[3]: Leaving directory '/usr/src/RPM/BUILD/bro-2.3.1/build'
[  8%] Built target bif-plugin-Bro_ConnSize-events.bif
make[3]: Entering directory '/usr/src/RPM/BUILD/bro-2.3.1/build'
Scanning dependencies of target pac-binpac_bro-lib.pac
make[3]: Leaving directory '/usr/src/RPM/BUILD/bro-2.3.1/build'
make[3]: Entering directory '/usr/src/RPM/BUILD/bro-2.3.1/build'
[  9%] [BINPAC] Processing binpac_bro-lib.pac
make[3]: Leaving directory '/usr/src/RPM/BUILD/bro-2.3.1/build'
[  9%] Built target pac-binpac_bro-lib.pac
make[3]: Entering directory '/usr/src/RPM/BUILD/bro-2.3.1/build'
Scanning dependencies of target bif-std-reporter.bif
make[3]: Leaving directory '/usr/src/RPM/BUILD/bro-2.3.1/build'
make[3]: Entering directory '/usr/src/RPM/BUILD/bro-2.3.1/build'
[  9%] [BIFCL] Processing reporter.bif
make[3]: Leaving directory '/usr/src/RPM/BUILD/bro-2.3.1/build'
[  9%] Built target bif-std-reporter.bif
make[3]: Entering directory '/usr/src/RPM/BUILD/bro-2.3.1/build'
Scanning dependencies of target bif-std-event.bif
make[3]: Leaving directory '/usr/src/RPM/BUILD/bro-2.3.1/build'
make[3]: Entering directory '/usr/src/RPM/BUILD/bro-2.3.1/build'
[  9%] [BIFCL] Processing event.bif
make[3]: Leaving directory '/usr/src/RPM/BUILD/bro-2.3.1/build'
[  9%] Built target bif-std-event.bif
make[3]: Entering directory '/usr/src/RPM/BUILD/bro-2.3.1/build'
Scanning dependencies of target bif-alt-analyzer-analyzer.bif
make[3]: Leaving directory '/usr/src/RPM/BUILD/bro-2.3.1/build'
make[3]: Entering directory '/usr/src/RPM/BUILD/bro-2.3.1/build'
[  9%] [BIFCL] Processing analyzer.bif
make[3]: Leaving directory '/usr/src/RPM/BUILD/bro-2.3.1/build'
[  9%] Built target bif-alt-analyzer-analyzer.bif
make[3]: Entering directory '/usr/src/RPM/BUILD/bro-2.3.1/build'
Scanning dependencies of target bif-std-bro.bif
make[3]: Leaving directory '/usr/src/RPM/BUILD/bro-2.3.1/build'
make[3]: Entering directory '/usr/src/RPM/BUILD/bro-2.3.1/build'
[  9%] [BIFCL] Processing bro.bif
make[3]: Leaving directory '/usr/src/RPM/BUILD/bro-2.3.1/build'
[  9%] Built target bif-std-bro.bif
make[3]: Entering directory '/usr/src/RPM/BUILD/bro-2.3.1/build'
Scanning dependencies of target bif-plugin-Bro_DNP3-events.bif
make[3]: Leaving directory '/usr/src/RPM/BUILD/bro-2.3.1/build'
make[3]: Entering directory '/usr/src/RPM/BUILD/bro-2.3.1/build'
[  9%] [BIFCL] Processing events.bif
make[3]: Leaving directory '/usr/src/RPM/BUILD/bro-2.3.1/build'
[  9%] Built target bif-plugin-Bro_DNP3-events.bif
make[3]: Entering directory '/usr/src/RPM/BUILD/bro-2.3.1/build'
Scanning dependencies of target pac-analyzer-protocol-ayiya-ayiya.pac
make[3]: Leaving directory '/usr/src/RPM/BUILD/bro-2.3.1/build'
make[3]: Entering directory '/usr/src/RPM/BUILD/bro-2.3.1/build'
[  9%] [BINPAC] Processing ayiya.pac
make[3]: Leaving directory '/usr/src/RPM/BUILD/bro-2.3.1/build'
[  9%] Built target pac-analyzer-protocol-ayiya-ayiya.pac
make[3]: Entering directory '/usr/src/RPM/BUILD/bro-2.3.1/build'
Scanning dependencies of target bif-plugin-Bro_DHCP-events.bif
make[3]: Leaving directory '/usr/src/RPM/BUILD/bro-2.3.1/build'
make[3]: Entering directory '/usr/src/RPM/BUILD/bro-2.3.1/build'
[  9%] [BIFCL] Processing events.bif
make[3]: Leaving directory '/usr/src/RPM/BUILD/bro-2.3.1/build'
[  9%] Built target bif-plugin-Bro_DHCP-events.bif
make[3]: Entering directory '/usr/src/RPM/BUILD/bro-2.3.1/build'
Scanning dependencies of target bif-std-logging.bif
make[3]: Leaving directory '/usr/src/RPM/BUILD/bro-2.3.1/build'
make[3]: Entering directory '/usr/src/RPM/BUILD/bro-2.3.1/build'
[  9%] [BIFCL] Processing logging.bif
make[3]: Leaving directory '/usr/src/RPM/BUILD/bro-2.3.1/build'
[  9%] Built target bif-std-logging.bif
make[3]: Entering directory '/usr/src/RPM/BUILD/bro-2.3.1/build'
Scanning dependencies of target pac-analyzer-protocol-bittorrent-bittorrent.pac
make[3]: Leaving directory '/usr/src/RPM/BUILD/bro-2.3.1/build'
make[3]: Entering directory '/usr/src/RPM/BUILD/bro-2.3.1/build'
[ 10%] [BINPAC] Processing bittorrent.pac
make[3]: Leaving directory '/usr/src/RPM/BUILD/bro-2.3.1/build'
[ 10%] Built target pac-analyzer-protocol-bittorrent-bittorrent.pac
make[3]: Entering directory '/usr/src/RPM/BUILD/bro-2.3.1/build'
Scanning dependencies of target bif-plugin-Bro_DCE_RPC-events.bif
make[3]: Leaving directory '/usr/src/RPM/BUILD/bro-2.3.1/build'
make[3]: Entering directory '/usr/src/RPM/BUILD/bro-2.3.1/build'
[ 11%] [BIFCL] Processing events.bif
make[3]: Leaving directory '/usr/src/RPM/BUILD/bro-2.3.1/build'
[ 11%] Built target bif-plugin-Bro_DCE_RPC-events.bif
make[3]: Entering directory '/usr/src/RPM/BUILD/bro-2.3.1/build'
Scanning dependencies of target pac-analyzer-protocol-dnp3-dnp3.pac
make[3]: Leaving directory '/usr/src/RPM/BUILD/bro-2.3.1/build'
make[3]: Entering directory '/usr/src/RPM/BUILD/bro-2.3.1/build'
[ 11%] [BINPAC] Processing dnp3.pac
'make[3]: Leaving directory '/usr/src/RPM/BUILD/bro-2.3.1/build'
[ 11%] Built target pac-analyzer-protocol-dnp3-dnp3.pac
make[3]: Entering directory '/usr/src/RPM/BUILD/bro-2.3.1/build'
Scanning dependencies of target bif-plugin-Bro_File-events.bif
make[3]: Leaving directory '/usr/src/RPM/BUILD/bro-2.3.1/build'
make[3]: Entering directory '/usr/src/RPM/BUILD/bro-2.3.1/build'
[ 11%] [BIFCL] Processing events.bif
make[3]: Leaving directory '/usr/src/RPM/BUILD/bro-2.3.1/build'
[ 11%] Built target bif-plugin-Bro_File-events.bif
make[3]: Entering directory '/usr/src/RPM/BUILD/bro-2.3.1/build'
Scanning dependencies of target bif-plugin-Bro_Finger-events.bif
make[3]: Leaving directory '/usr/src/RPM/BUILD/bro-2.3.1/build'
make[3]: Entering directory '/usr/src/RPM/BUILD/bro-2.3.1/build'
[ 11%] [BIFCL] Processing events.bif
make[3]: Leaving directory '/usr/src/RPM/BUILD/bro-2.3.1/build'
[ 11%] Built target bif-plugin-Bro_Finger-events.bif
make[3]: Entering directory '/usr/src/RPM/BUILD/bro-2.3.1/build'
Scanning dependencies of target bif-plugin-Bro_FTP-functions.bif
make[3]: Leaving directory '/usr/src/RPM/BUILD/bro-2.3.1/build'
make[3]: Entering directory '/usr/src/RPM/BUILD/bro-2.3.1/build'
[ 11%] [BIFCL] Processing functions.bif
make[3]: Leaving directory '/usr/src/RPM/BUILD/bro-2.3.1/build'
[ 11%] Built target bif-plugin-Bro_FTP-functions.bif
make[3]: Entering directory '/usr/src/RPM/BUILD/bro-2.3.1/build'
Scanning dependencies of target bif-plugin-Bro_FTP-events.bif
make[3]: Leaving directory '/usr/src/RPM/BUILD/bro-2.3.1/build'
make[3]: Entering directory '/usr/src/RPM/BUILD/bro-2.3.1/build'
[ 11%] [BIFCL] Processing events.bif
make[3]: Leaving directory '/usr/src/RPM/BUILD/bro-2.3.1/build'
[ 11%] Built target bif-plugin-Bro_FTP-events.bif
make[3]: Entering directory '/usr/src/RPM/BUILD/bro-2.3.1/build'
Scanning dependencies of target bif-plugin-Bro_Gnutella-events.bif
make[3]: Leaving directory '/usr/src/RPM/BUILD/bro-2.3.1/build'
make[3]: Entering directory '/usr/src/RPM/BUILD/bro-2.3.1/build'
[ 11%] [BIFCL] Processing events.bif
make[3]: Leaving directory '/usr/src/RPM/BUILD/bro-2.3.1/build'
[ 11%] Built target bif-plugin-Bro_Gnutella-events.bif
make[3]: Entering directory '/usr/src/RPM/BUILD/bro-2.3.1/build'
Scanning dependencies of target pac-analyzer-protocol-gtpv1-gtpv1.pac
make[3]: Leaving directory '/usr/src/RPM/BUILD/bro-2.3.1/build'
make[3]: Entering directory '/usr/src/RPM/BUILD/bro-2.3.1/build'
[ 11%] [BINPAC] Processing gtpv1.pac
make[3]: Leaving directory '/usr/src/RPM/BUILD/bro-2.3.1/build'
[ 11%] Built target pac-analyzer-protocol-gtpv1-gtpv1.pac
make[3]: Entering directory '/usr/src/RPM/BUILD/bro-2.3.1/build'
Scanning dependencies of target bif-plugin-Bro_GTPv1-events.bif
make[3]: Leaving directory '/usr/src/RPM/BUILD/bro-2.3.1/build'
make[3]: Entering directory '/usr/src/RPM/BUILD/bro-2.3.1/build'
[ 11%] [BIFCL] Processing events.bif
make[3]: Leaving directory '/usr/src/RPM/BUILD/bro-2.3.1/build'
[ 11%] Built target bif-plugin-Bro_GTPv1-events.bif
make[3]: Entering directory '/usr/src/RPM/BUILD/bro-2.3.1/build'
Scanning dependencies of target bif-plugin-Bro_HTTP-functions.bif
make[3]: Leaving directory '/usr/src/RPM/BUILD/bro-2.3.1/build'
make[3]: Entering directory '/usr/src/RPM/BUILD/bro-2.3.1/build'
[ 11%] [BIFCL] Processing functions.bif
make[3]: Leaving directory '/usr/src/RPM/BUILD/bro-2.3.1/build'
[ 11%] Built target bif-plugin-Bro_HTTP-functions.bif
make[3]: Entering directory '/usr/src/RPM/BUILD/bro-2.3.1/build'
Scanning dependencies of target bif-plugin-Bro_HTTP-events.bif
make[3]: Leaving directory '/usr/src/RPM/BUILD/bro-2.3.1/build'
make[3]: Entering directory '/usr/src/RPM/BUILD/bro-2.3.1/build'
[ 11%] [BIFCL] Processing events.bif
make[3]: Leaving directory '/usr/src/RPM/BUILD/bro-2.3.1/build'
[ 11%] Built target bif-plugin-Bro_HTTP-events.bif
make[3]: Entering directory '/usr/src/RPM/BUILD/bro-2.3.1/build'
Scanning dependencies of target bif-plugin-Bro_ICMP-events.bif
make[3]: Leaving directory '/usr/src/RPM/BUILD/bro-2.3.1/build'
make[3]: Entering directory '/usr/src/RPM/BUILD/bro-2.3.1/build'
[ 11%] [BIFCL] Processing events.bif
make[3]: Leaving directory '/usr/src/RPM/BUILD/bro-2.3.1/build'
[ 11%] Built target bif-plugin-Bro_ICMP-events.bif
make[3]: Entering directory '/usr/src/RPM/BUILD/bro-2.3.1/build'
Scanning dependencies of target bif-plugin-Bro_Ident-events.bif
make[3]: Leaving directory '/usr/src/RPM/BUILD/bro-2.3.1/build'
make[3]: Entering directory '/usr/src/RPM/BUILD/bro-2.3.1/build'
[ 11%] [BIFCL] Processing events.bif
make[3]: Leaving directory '/usr/src/RPM/BUILD/bro-2.3.1/build'
[ 11%] Built target bif-plugin-Bro_Ident-events.bif
make[3]: Entering directory '/usr/src/RPM/BUILD/bro-2.3.1/build'
Scanning dependencies of target bif-plugin-Bro_InterConn-events.bif
make[3]: Leaving directory '/usr/src/RPM/BUILD/bro-2.3.1/build'
make[3]: Entering directory '/usr/src/RPM/BUILD/bro-2.3.1/build'
[ 11%] [BIFCL] Processing events.bif
make[3]: Leaving directory '/usr/src/RPM/BUILD/bro-2.3.1/build'
[ 11%] Built target bif-plugin-Bro_InterConn-events.bif
make[3]: Entering directory '/usr/src/RPM/BUILD/bro-2.3.1/build'
Scanning dependencies of target bif-plugin-Bro_IRC-events.bif
make[3]: Leaving directory '/usr/src/RPM/BUILD/bro-2.3.1/build'
make[3]: Entering directory '/usr/src/RPM/BUILD/bro-2.3.1/build'
[ 12%] [BIFCL] Processing events.bif
make[3]: Leaving directory '/usr/src/RPM/BUILD/bro-2.3.1/build'
[ 12%] Built target bif-plugin-Bro_IRC-events.bif
make[3]: Entering directory '/usr/src/RPM/BUILD/bro-2.3.1/build'
Scanning dependencies of target bif-plugin-Bro_Login-functions.bif
make[3]: Leaving directory '/usr/src/RPM/BUILD/bro-2.3.1/build'
make[3]: Entering directory '/usr/src/RPM/BUILD/bro-2.3.1/build'
[ 12%] [BIFCL] Processing functions.bif
make[3]: Leaving directory '/usr/src/RPM/BUILD/bro-2.3.1/build'
[ 12%] Built target bif-plugin-Bro_Login-functions.bif
make[3]: Entering directory '/usr/src/RPM/BUILD/bro-2.3.1/build'
Scanning dependencies of target bif-plugin-Bro_Login-events.bif
make[3]: Leaving directory '/usr/src/RPM/BUILD/bro-2.3.1/build'
make[3]: Entering directory '/usr/src/RPM/BUILD/bro-2.3.1/build'
[ 12%] [BIFCL] Processing events.bif
make[3]: Leaving directory '/usr/src/RPM/BUILD/bro-2.3.1/build'
[ 12%] Built target bif-plugin-Bro_Login-events.bif
make[3]: Entering directory '/usr/src/RPM/BUILD/bro-2.3.1/build'
Scanning dependencies of target bif-plugin-Bro_MIME-events.bif
make[3]: Leaving directory '/usr/src/RPM/BUILD/bro-2.3.1/build'
make[3]: Entering directory '/usr/src/RPM/BUILD/bro-2.3.1/build'
[ 12%] [BIFCL] Processing events.bif
make[3]: Leaving directory '/usr/src/RPM/BUILD/bro-2.3.1/build'
[ 12%] Built target bif-plugin-Bro_MIME-events.bif
make[3]: Entering directory '/usr/src/RPM/BUILD/bro-2.3.1/build'
Scanning dependencies of target pac-analyzer-protocol-modbus-modbus.pac
make[3]: Leaving directory '/usr/src/RPM/BUILD/bro-2.3.1/build'
make[3]: Entering directory '/usr/src/RPM/BUILD/bro-2.3.1/build'
[ 12%] [BINPAC] Processing modbus.pac
make[3]: Leaving directory '/usr/src/RPM/BUILD/bro-2.3.1/build'
[ 12%] Built target pac-analyzer-protocol-modbus-modbus.pac
make[3]: Entering directory '/usr/src/RPM/BUILD/bro-2.3.1/build'
Scanning dependencies of target bif-plugin-Bro_Modbus-events.bif
make[3]: Leaving directory '/usr/src/RPM/BUILD/bro-2.3.1/build'
make[3]: Entering directory '/usr/src/RPM/BUILD/bro-2.3.1/build'
[ 12%] [BIFCL] Processing events.bif
make[3]: Leaving directory '/usr/src/RPM/BUILD/bro-2.3.1/build'
[ 12%] Built target bif-plugin-Bro_Modbus-events.bif
make[3]: Entering directory '/usr/src/RPM/BUILD/bro-2.3.1/build'
Scanning dependencies of target pac-analyzer-protocol-ncp-ncp.pac
make[3]: Leaving directory '/usr/src/RPM/BUILD/bro-2.3.1/build'
make[3]: Entering directory '/usr/src/RPM/BUILD/bro-2.3.1/build'
[ 12%] [BINPAC] Processing ncp.pac
make[3]: Leaving directory '/usr/src/RPM/BUILD/bro-2.3.1/build'
[ 12%] Built target pac-analyzer-protocol-ncp-ncp.pac
make[3]: Entering directory '/usr/src/RPM/BUILD/bro-2.3.1/build'
Scanning dependencies of target bif-plugin-Bro_NCP-events.bif
make[3]: Leaving directory '/usr/src/RPM/BUILD/bro-2.3.1/build'
make[3]: Entering directory '/usr/src/RPM/BUILD/bro-2.3.1/build'
[ 13%] [BIFCL] Processing events.bif
make[3]: Leaving directory '/usr/src/RPM/BUILD/bro-2.3.1/build'
[ 13%] Built target bif-plugin-Bro_NCP-events.bif
make[3]: Entering directory '/usr/src/RPM/BUILD/bro-2.3.1/build'
Scanning dependencies of target bif-plugin-Bro_NetBIOS-functions.bif
make[3]: Leaving directory '/usr/src/RPM/BUILD/bro-2.3.1/build'
make[3]: Entering directory '/usr/src/RPM/BUILD/bro-2.3.1/build'
[ 13%] [BIFCL] Processing functions.bif
make[3]: Leaving directory '/usr/src/RPM/BUILD/bro-2.3.1/build'
[ 13%] Built target bif-plugin-Bro_NetBIOS-functions.bif
make[3]: Entering directory '/usr/src/RPM/BUILD/bro-2.3.1/build'
Scanning dependencies of target bif-plugin-Bro_NetBIOS-events.bif
make[3]: Leaving directory '/usr/src/RPM/BUILD/bro-2.3.1/build'
make[3]: Entering directory '/usr/src/RPM/BUILD/bro-2.3.1/build'
[ 13%] [BIFCL] Processing events.bif
make[3]: Leaving directory '/usr/src/RPM/BUILD/bro-2.3.1/build'
[ 13%] Built target bif-plugin-Bro_NetBIOS-events.bif
make[3]: Entering directory '/usr/src/RPM/BUILD/bro-2.3.1/build'
Scanning dependencies of target pac-analyzer-protocol-netflow-netflow.pac
make[3]: Leaving directory '/usr/src/RPM/BUILD/bro-2.3.1/build'
make[3]: Entering directory '/usr/src/RPM/BUILD/bro-2.3.1/build'
[ 14%] [BINPAC] Processing netflow.pac
make[3]: Leaving directory '/usr/src/RPM/BUILD/bro-2.3.1/build'
[ 14%] Built target pac-analyzer-protocol-netflow-netflow.pac
make[3]: Entering directory '/usr/src/RPM/BUILD/bro-2.3.1/build'
Scanning dependencies of target bif-plugin-Bro_NetFlow-events.bif
make[3]: Leaving directory '/usr/src/RPM/BUILD/bro-2.3.1/build'
make[3]: Entering directory '/usr/src/RPM/BUILD/bro-2.3.1/build'
[ 14%] [BIFCL] Processing events.bif
make[3]: Leaving directory '/usr/src/RPM/BUILD/bro-2.3.1/build'
[ 14%] Built target bif-plugin-Bro_NetFlow-events.bif
make[3]: Entering directory '/usr/src/RPM/BUILD/bro-2.3.1/build'
Scanning dependencies of target bif-plugin-Bro_NTP-events.bif
make[3]: Leaving directory '/usr/src/RPM/BUILD/bro-2.3.1/build'
make[3]: Entering directory '/usr/src/RPM/BUILD/bro-2.3.1/build'
[ 14%] [BIFCL] Processing events.bif
make[3]: Leaving directory '/usr/src/RPM/BUILD/bro-2.3.1/build'
[ 14%] Built target bif-plugin-Bro_NTP-events.bif
make[3]: Entering directory '/usr/src/RPM/BUILD/bro-2.3.1/build'
Scanning dependencies of target bif-plugin-Bro_PIA-events.bif
make[3]: Leaving directory '/usr/src/RPM/BUILD/bro-2.3.1/build'
make[3]: Entering directory '/usr/src/RPM/BUILD/bro-2.3.1/build'
[ 14%] [BIFCL] Processing events.bif
make[3]: Leaving directory '/usr/src/RPM/BUILD/bro-2.3.1/build'
[ 14%] Built target bif-plugin-Bro_PIA-events.bif
make[3]: Entering directory '/usr/src/RPM/BUILD/bro-2.3.1/build'
Scanning dependencies of target bif-plugin-Bro_POP3-events.bif
make[3]: Leaving directory '/usr/src/RPM/BUILD/bro-2.3.1/build'
make[3]: Entering directory '/usr/src/RPM/BUILD/bro-2.3.1/build'
[ 14%] [BIFCL] Processing events.bif
make[3]: Leaving directory '/usr/src/RPM/BUILD/bro-2.3.1/build'
[ 14%] Built target bif-plugin-Bro_POP3-events.bif
make[3]: Entering directory '/usr/src/RPM/BUILD/bro-2.3.1/build'
Scanning dependencies of target pac-analyzer-protocol-radius-radius.pac
make[3]: Leaving directory '/usr/src/RPM/BUILD/bro-2.3.1/build'
make[3]: Entering directory '/usr/src/RPM/BUILD/bro-2.3.1/build'
[ 14%] [BINPAC] Processing radius.pac
make[3]: Leaving directory '/usr/src/RPM/BUILD/bro-2.3.1/build'
[ 14%] Built target pac-analyzer-protocol-radius-radius.pac
make[3]: Entering directory '/usr/src/RPM/BUILD/bro-2.3.1/build'
Scanning dependencies of target bif-plugin-Bro_RADIUS-events.bif
make[3]: Leaving directory '/usr/src/RPM/BUILD/bro-2.3.1/build'
make[3]: Entering directory '/usr/src/RPM/BUILD/bro-2.3.1/build'
[ 14%] [BIFCL] Processing events.bif
make[3]: Leaving directory '/usr/src/RPM/BUILD/bro-2.3.1/build'
[ 14%] Built target bif-plugin-Bro_RADIUS-events.bif
make[3]: Entering directory '/usr/src/RPM/BUILD/bro-2.3.1/build'
Scanning dependencies of target bif-plugin-Bro_RPC-events.bif
make[3]: Leaving directory '/usr/src/RPM/BUILD/bro-2.3.1/build'
make[3]: Entering directory '/usr/src/RPM/BUILD/bro-2.3.1/build'
[ 15%] [BIFCL] Processing events.bif
make[3]: Leaving directory '/usr/src/RPM/BUILD/bro-2.3.1/build'
[ 15%] Built target bif-plugin-Bro_RPC-events.bif
make[3]: Entering directory '/usr/src/RPM/BUILD/bro-2.3.1/build'
Scanning dependencies of target bif-plugin-Bro_SNMP-events.bif
make[3]: Leaving directory '/usr/src/RPM/BUILD/bro-2.3.1/build'
make[3]: Entering directory '/usr/src/RPM/BUILD/bro-2.3.1/build'
[ 15%] [BIFCL] Processing events.bif
make[3]: Leaving directory '/usr/src/RPM/BUILD/bro-2.3.1/build'
[ 15%] Built target bif-plugin-Bro_SNMP-events.bif
make[3]: Entering directory '/usr/src/RPM/BUILD/bro-2.3.1/build'
Scanning dependencies of target pac-analyzer-protocol-snmp-snmp.pac
make[3]: Leaving directory '/usr/src/RPM/BUILD/bro-2.3.1/build'
make[3]: Entering directory '/usr/src/RPM/BUILD/bro-2.3.1/build'
[ 15%] [BINPAC] Processing snmp.pac
make[3]: Leaving directory '/usr/src/RPM/BUILD/bro-2.3.1/build'
[ 15%] Built target pac-analyzer-protocol-snmp-snmp.pac
make[3]: Entering directory '/usr/src/RPM/BUILD/bro-2.3.1/build'
Scanning dependencies of target bif-plugin-Bro_SNMP-types.bif
make[3]: Leaving directory '/usr/src/RPM/BUILD/bro-2.3.1/build'
make[3]: Entering directory '/usr/src/RPM/BUILD/bro-2.3.1/build'
[ 15%] [BIFCL] Processing types.bif
make[3]: Leaving directory '/usr/src/RPM/BUILD/bro-2.3.1/build'
[ 15%] Built target bif-plugin-Bro_SNMP-types.bif
make[3]: Entering directory '/usr/src/RPM/BUILD/bro-2.3.1/build'
Scanning dependencies of target pac-analyzer-protocol-smb-smb.pac
make[3]: Leaving directory '/usr/src/RPM/BUILD/bro-2.3.1/build'
make[3]: Entering directory '/usr/src/RPM/BUILD/bro-2.3.1/build'
[ 15%] [BINPAC] Processing smb.pac
make[3]: Leaving directory '/usr/src/RPM/BUILD/bro-2.3.1/build'
[ 15%] Built target pac-analyzer-protocol-smb-smb.pac
make[3]: Entering directory '/usr/src/RPM/BUILD/bro-2.3.1/build'
Scanning dependencies of target bif-plugin-Bro_SMB-events.bif
make[3]: Leaving directory '/usr/src/RPM/BUILD/bro-2.3.1/build'
make[3]: Entering directory '/usr/src/RPM/BUILD/bro-2.3.1/build'
[ 15%] [BIFCL] Processing events.bif
make[3]: Leaving directory '/usr/src/RPM/BUILD/bro-2.3.1/build'
[ 15%] Built target bif-plugin-Bro_SMB-events.bif
make[3]: Entering directory '/usr/src/RPM/BUILD/bro-2.3.1/build'
Scanning dependencies of target bif-plugin-Bro_SMTP-functions.bif
make[3]: Leaving directory '/usr/src/RPM/BUILD/bro-2.3.1/build'
make[3]: Entering directory '/usr/src/RPM/BUILD/bro-2.3.1/build'
[ 15%] [BIFCL] Processing functions.bif
make[3]: Leaving directory '/usr/src/RPM/BUILD/bro-2.3.1/build'
[ 15%] Built target bif-plugin-Bro_SMTP-functions.bif
make[3]: Entering directory '/usr/src/RPM/BUILD/bro-2.3.1/build'
Scanning dependencies of target bif-plugin-Bro_SMTP-events.bif
make[3]: Leaving directory '/usr/src/RPM/BUILD/bro-2.3.1/build'
make[3]: Entering directory '/usr/src/RPM/BUILD/bro-2.3.1/build'
[ 15%] [BIFCL] Processing events.bif
make[3]: Leaving directory '/usr/src/RPM/BUILD/bro-2.3.1/build'
[ 15%] Built target bif-plugin-Bro_SMTP-events.bif
make[3]: Entering directory '/usr/src/RPM/BUILD/bro-2.3.1/build'
Scanning dependencies of target pac-analyzer-protocol-socks-socks.pac
make[3]: Leaving directory '/usr/src/RPM/BUILD/bro-2.3.1/build'
make[3]: Entering directory '/usr/src/RPM/BUILD/bro-2.3.1/build'
[ 15%] [BINPAC] Processing socks.pac
make[3]: Leaving directory '/usr/src/RPM/BUILD/bro-2.3.1/build'
[ 15%] Built target pac-analyzer-protocol-socks-socks.pac
make[3]: Entering directory '/usr/src/RPM/BUILD/bro-2.3.1/build'
Scanning dependencies of target bif-plugin-Bro_SOCKS-events.bif
make[3]: Leaving directory '/usr/src/RPM/BUILD/bro-2.3.1/build'
make[3]: Entering directory '/usr/src/RPM/BUILD/bro-2.3.1/build'
[ 15%] [BIFCL] Processing events.bif
make[3]: Leaving directory '/usr/src/RPM/BUILD/bro-2.3.1/build'
[ 15%] Built target bif-plugin-Bro_SOCKS-events.bif
make[3]: Entering directory '/usr/src/RPM/BUILD/bro-2.3.1/build'
Scanning dependencies of target bif-plugin-Bro_SSH-events.bif
make[3]: Leaving directory '/usr/src/RPM/BUILD/bro-2.3.1/build'
make[3]: Entering directory '/usr/src/RPM/BUILD/bro-2.3.1/build'
[ 15%] [BIFCL] Processing events.bif
make[3]: Leaving directory '/usr/src/RPM/BUILD/bro-2.3.1/build'
[ 15%] Built target bif-plugin-Bro_SSH-events.bif
make[3]: Entering directory '/usr/src/RPM/BUILD/bro-2.3.1/build'
Scanning dependencies of target pac-analyzer-protocol-ssl-ssl.pac
make[3]: Leaving directory '/usr/src/RPM/BUILD/bro-2.3.1/build'
make[3]: Entering directory '/usr/src/RPM/BUILD/bro-2.3.1/build'
[ 15%] [BINPAC] Processing ssl.pac
make[3]: Leaving directory '/usr/src/RPM/BUILD/bro-2.3.1/build'
[ 15%] Built target pac-analyzer-protocol-ssl-ssl.pac
make[3]: Entering directory '/usr/src/RPM/BUILD/bro-2.3.1/build'
Scanning dependencies of target bif-plugin-Bro_SSL-events.bif
make[3]: Leaving directory '/usr/src/RPM/BUILD/bro-2.3.1/build'
make[3]: Entering directory '/usr/src/RPM/BUILD/bro-2.3.1/build'
[ 16%] [BIFCL] Processing events.bif
make[3]: Leaving directory '/usr/src/RPM/BUILD/bro-2.3.1/build'
[ 16%] Built target bif-plugin-Bro_SSL-events.bif
make[3]: Entering directory '/usr/src/RPM/BUILD/bro-2.3.1/build'
Scanning dependencies of target bif-plugin-Bro_SteppingStone-events.bif
make[3]: Leaving directory '/usr/src/RPM/BUILD/bro-2.3.1/build'
make[3]: Entering directory '/usr/src/RPM/BUILD/bro-2.3.1/build'
[ 16%] [BIFCL] Processing events.bif
make[3]: Leaving directory '/usr/src/RPM/BUILD/bro-2.3.1/build'
[ 16%] Built target bif-plugin-Bro_SteppingStone-events.bif
make[3]: Entering directory '/usr/src/RPM/BUILD/bro-2.3.1/build'
Scanning dependencies of target pac-analyzer-protocol-syslog-syslog.pac
make[3]: Leaving directory '/usr/src/RPM/BUILD/bro-2.3.1/build'
make[3]: Entering directory '/usr/src/RPM/BUILD/bro-2.3.1/build'
[ 16%] [BINPAC] Processing syslog.pac
make[3]: Leaving directory '/usr/src/RPM/BUILD/bro-2.3.1/build'
[ 16%] Built target pac-analyzer-protocol-syslog-syslog.pac
make[3]: Entering directory '/usr/src/RPM/BUILD/bro-2.3.1/build'
Scanning dependencies of target bif-plugin-Bro_Syslog-events.bif
make[3]: Leaving directory '/usr/src/RPM/BUILD/bro-2.3.1/build'
make[3]: Entering directory '/usr/src/RPM/BUILD/bro-2.3.1/build'
[ 16%] [BIFCL] Processing events.bif
make[3]: Leaving directory '/usr/src/RPM/BUILD/bro-2.3.1/build'
[ 16%] Built target bif-plugin-Bro_Syslog-events.bif
make[3]: Entering directory '/usr/src/RPM/BUILD/bro-2.3.1/build'
Scanning dependencies of target bif-plugin-Bro_TCP-functions.bif
make[3]: Leaving directory '/usr/src/RPM/BUILD/bro-2.3.1/build'
make[3]: Entering directory '/usr/src/RPM/BUILD/bro-2.3.1/build'
[ 16%] [BIFCL] Processing functions.bif
make[3]: Leaving directory '/usr/src/RPM/BUILD/bro-2.3.1/build'
[ 16%] Built target bif-plugin-Bro_TCP-functions.bif
make[3]: Entering directory '/usr/src/RPM/BUILD/bro-2.3.1/build'
Scanning dependencies of target bif-plugin-Bro_TCP-events.bif
make[3]: Leaving directory '/usr/src/RPM/BUILD/bro-2.3.1/build'
make[3]: Entering directory '/usr/src/RPM/BUILD/bro-2.3.1/build'
[ 16%] [BIFCL] Processing events.bif
make[3]: Leaving directory '/usr/src/RPM/BUILD/bro-2.3.1/build'
[ 16%] Built target bif-plugin-Bro_TCP-events.bif
make[3]: Entering directory '/usr/src/RPM/BUILD/bro-2.3.1/build'
Scanning dependencies of target bif-plugin-Bro_Teredo-events.bif
make[3]: Leaving directory '/usr/src/RPM/BUILD/bro-2.3.1/build'
make[3]: Entering directory '/usr/src/RPM/BUILD/bro-2.3.1/build'
[ 16%] [BIFCL] Processing events.bif
make[3]: Leaving directory '/usr/src/RPM/BUILD/bro-2.3.1/build'
[ 16%] Built target bif-plugin-Bro_Teredo-events.bif
make[3]: Entering directory '/usr/src/RPM/BUILD/bro-2.3.1/build'
Scanning dependencies of target bif-plugin-Bro_UDP-events.bif
make[3]: Leaving directory '/usr/src/RPM/BUILD/bro-2.3.1/build'
make[3]: Entering directory '/usr/src/RPM/BUILD/bro-2.3.1/build'
[ 16%] [BIFCL] Processing events.bif
make[3]: Leaving directory '/usr/src/RPM/BUILD/bro-2.3.1/build'
[ 16%] Built target bif-plugin-Bro_UDP-events.bif
make[3]: Entering directory '/usr/src/RPM/BUILD/bro-2.3.1/build'
Scanning dependencies of target bif-plugin-Bro_ZIP-events.bif
make[3]: Leaving directory '/usr/src/RPM/BUILD/bro-2.3.1/build'
make[3]: Entering directory '/usr/src/RPM/BUILD/bro-2.3.1/build'
[ 16%] [BIFCL] Processing events.bif
make[3]: Leaving directory '/usr/src/RPM/BUILD/bro-2.3.1/build'
[ 16%] Built target bif-plugin-Bro_ZIP-events.bif
make[3]: Entering directory '/usr/src/RPM/BUILD/bro-2.3.1/build'
Scanning dependencies of target bif-alt-file_analysis-file_analysis.bif
make[3]: Leaving directory '/usr/src/RPM/BUILD/bro-2.3.1/build'
make[3]: Entering directory '/usr/src/RPM/BUILD/bro-2.3.1/build'
[ 16%] [BIFCL] Processing file_analysis.bif
make[3]: Leaving directory '/usr/src/RPM/BUILD/bro-2.3.1/build'
[ 16%] Built target bif-alt-file_analysis-file_analysis.bif
make[3]: Entering directory '/usr/src/RPM/BUILD/bro-2.3.1/build'
Scanning dependencies of target bif-plugin-Bro_FileExtract-functions.bif
make[3]: Leaving directory '/usr/src/RPM/BUILD/bro-2.3.1/build'
make[3]: Entering directory '/usr/src/RPM/BUILD/bro-2.3.1/build'
[ 17%] [BIFCL] Processing functions.bif
make[3]: Leaving directory '/usr/src/RPM/BUILD/bro-2.3.1/build'
[ 17%] Built target bif-plugin-Bro_FileExtract-functions.bif
make[3]: Entering directory '/usr/src/RPM/BUILD/bro-2.3.1/build'
Scanning dependencies of target bif-plugin-Bro_FileExtract-events.bif
make[3]: Leaving directory '/usr/src/RPM/BUILD/bro-2.3.1/build'
make[3]: Entering directory '/usr/src/RPM/BUILD/bro-2.3.1/build'
[ 17%] [BIFCL] Processing events.bif
make[3]: Leaving directory '/usr/src/RPM/BUILD/bro-2.3.1/build'
[ 17%] Built target bif-plugin-Bro_FileExtract-events.bif
make[3]: Entering directory '/usr/src/RPM/BUILD/bro-2.3.1/build'
Scanning dependencies of target bif-plugin-Bro_FileHash-events.bif
make[3]: Leaving directory '/usr/src/RPM/BUILD/bro-2.3.1/build'
make[3]: Entering directory '/usr/src/RPM/BUILD/bro-2.3.1/build'
[ 17%] [BIFCL] Processing events.bif
make[3]: Leaving directory '/usr/src/RPM/BUILD/bro-2.3.1/build'
[ 17%] Built target bif-plugin-Bro_FileHash-events.bif
make[3]: Entering directory '/usr/src/RPM/BUILD/bro-2.3.1/build'
Scanning dependencies of target bif-plugin-Bro_Unified2-types.bif
make[3]: Leaving directory '/usr/src/RPM/BUILD/bro-2.3.1/build'
make[3]: Entering directory '/usr/src/RPM/BUILD/bro-2.3.1/build'
[ 18%] [BIFCL] Processing types.bif
make[3]: Leaving directory '/usr/src/RPM/BUILD/bro-2.3.1/build'
[ 18%] Built target bif-plugin-Bro_Unified2-types.bif
make[3]: Entering directory '/usr/src/RPM/BUILD/bro-2.3.1/build'
Scanning dependencies of target bif-plugin-Bro_Unified2-events.bif
make[3]: Leaving directory '/usr/src/RPM/BUILD/bro-2.3.1/build'
make[3]: Entering directory '/usr/src/RPM/BUILD/bro-2.3.1/build'
[ 18%] [BIFCL] Processing events.bif
make[3]: Leaving directory '/usr/src/RPM/BUILD/bro-2.3.1/build'
[ 18%] Built target bif-plugin-Bro_Unified2-events.bif
make[3]: Entering directory '/usr/src/RPM/BUILD/bro-2.3.1/build'
Scanning dependencies of target pac-file_analysis-analyzer-unified2-unified2.pac
make[3]: Leaving directory '/usr/src/RPM/BUILD/bro-2.3.1/build'
make[3]: Entering directory '/usr/src/RPM/BUILD/bro-2.3.1/build'
[ 18%] [BINPAC] Processing unified2.pac
make[3]: Leaving directory '/usr/src/RPM/BUILD/bro-2.3.1/build'
[ 18%] Built target pac-file_analysis-analyzer-unified2-unified2.pac
make[3]: Entering directory '/usr/src/RPM/BUILD/bro-2.3.1/build'
Scanning dependencies of target bif-plugin-Bro_X509-events.bif
make[3]: Leaving directory '/usr/src/RPM/BUILD/bro-2.3.1/build'
make[3]: Entering directory '/usr/src/RPM/BUILD/bro-2.3.1/build'
[ 18%] [BIFCL] Processing events.bif
make[3]: Leaving directory '/usr/src/RPM/BUILD/bro-2.3.1/build'
[ 18%] Built target bif-plugin-Bro_X509-events.bif
make[3]: Entering directory '/usr/src/RPM/BUILD/bro-2.3.1/build'
Scanning dependencies of target bif-plugin-Bro_X509-functions.bif
make[3]: Leaving directory '/usr/src/RPM/BUILD/bro-2.3.1/build'
make[3]: Entering directory '/usr/src/RPM/BUILD/bro-2.3.1/build'
[ 18%] [BIFCL] Processing functions.bif
make[3]: Leaving directory '/usr/src/RPM/BUILD/bro-2.3.1/build'
[ 18%] Built target bif-plugin-Bro_X509-functions.bif
make[3]: Entering directory '/usr/src/RPM/BUILD/bro-2.3.1/build'
Scanning dependencies of target bif-plugin-Bro_X509-types.bif
make[3]: Leaving directory '/usr/src/RPM/BUILD/bro-2.3.1/build'
make[3]: Entering directory '/usr/src/RPM/BUILD/bro-2.3.1/build'
[ 18%] [BIFCL] Processing types.bif
make[3]: Leaving directory '/usr/src/RPM/BUILD/bro-2.3.1/build'
[ 18%] Built target bif-plugin-Bro_X509-types.bif
make[3]: Entering directory '/usr/src/RPM/BUILD/bro-2.3.1/build'
Scanning dependencies of target bif-alt-probabilistic-cardinality-counter.bif
make[3]: Leaving directory '/usr/src/RPM/BUILD/bro-2.3.1/build'
make[3]: Entering directory '/usr/src/RPM/BUILD/bro-2.3.1/build'
[ 18%] [BIFCL] Processing cardinality-counter.bif
make[3]: Leaving directory '/usr/src/RPM/BUILD/bro-2.3.1/build'
[ 18%] Built target bif-alt-probabilistic-cardinality-counter.bif
make[3]: Entering directory '/usr/src/RPM/BUILD/bro-2.3.1/build'
Scanning dependencies of target bif-alt-probabilistic-bloom-filter.bif
make[3]: Leaving directory '/usr/src/RPM/BUILD/bro-2.3.1/build'
make[3]: Entering directory '/usr/src/RPM/BUILD/bro-2.3.1/build'
[ 19%] [BIFCL] Processing bloom-filter.bif
make[3]: Leaving directory '/usr/src/RPM/BUILD/bro-2.3.1/build'
[ 19%] Built target bif-alt-probabilistic-bloom-filter.bif
make[3]: Entering directory '/usr/src/RPM/BUILD/bro-2.3.1/build'
Scanning dependencies of target bif-alt-probabilistic-top-k.bif
make[3]: Leaving directory '/usr/src/RPM/BUILD/bro-2.3.1/build'
make[3]: Entering directory '/usr/src/RPM/BUILD/bro-2.3.1/build'
[ 19%] [BIFCL] Processing top-k.bif
make[3]: Leaving directory '/usr/src/RPM/BUILD/bro-2.3.1/build'
[ 19%] Built target bif-alt-probabilistic-top-k.bif
make[3]: Entering directory '/usr/src/RPM/BUILD/bro-2.3.1/build'
Scanning dependencies of target generate_outputs_stage1
make[3]: Leaving directory '/usr/src/RPM/BUILD/bro-2.3.1/build'
[ 19%] Built target generate_outputs_stage1
make[3]: Entering directory '/usr/src/RPM/BUILD/bro-2.3.1/build'
Scanning dependencies of target generate_outputs_stage2
make[3]: Leaving directory '/usr/src/RPM/BUILD/bro-2.3.1/build'
make[3]: Entering directory '/usr/src/RPM/BUILD/bro-2.3.1/build'
make[3]: Leaving directory '/usr/src/RPM/BUILD/bro-2.3.1/build'
[ 19%] Built target generate_outputs_stage2
make[3]: Entering directory '/usr/src/RPM/BUILD/bro-2.3.1/build'
Scanning dependencies of target generate_outputs
make[3]: Leaving directory '/usr/src/RPM/BUILD/bro-2.3.1/build'
[ 19%] Built target generate_outputs
make[3]: Entering directory '/usr/src/RPM/BUILD/bro-2.3.1/build'
Scanning dependencies of target bro_broxygen
make[3]: Leaving directory '/usr/src/RPM/BUILD/bro-2.3.1/build'
make[3]: Entering directory '/usr/src/RPM/BUILD/bro-2.3.1/build'
[ 19%] Building CXX object src/broxygen/CMakeFiles/bro_broxygen.dir/Manager.cc.o
[ 20%] Building CXX object src/broxygen/CMakeFiles/bro_broxygen.dir/PackageInfo.cc.o
[ 20%] Building CXX object src/broxygen/CMakeFiles/bro_broxygen.dir/ScriptInfo.cc.o
[ 20%] Building CXX object src/broxygen/CMakeFiles/bro_broxygen.dir/IdentifierInfo.cc.o
[ 20%] Building CXX object src/broxygen/CMakeFiles/bro_broxygen.dir/Target.cc.o
[ 20%] Building CXX object src/broxygen/CMakeFiles/bro_broxygen.dir/Configuration.cc.o
[ 20%] Building CXX object src/broxygen/CMakeFiles/bro_broxygen.dir/ReStructuredTextTable.cc.o
[ 20%] Building CXX object src/broxygen/CMakeFiles/bro_broxygen.dir/utils.cc.o
[ 21%] Linking CXX static library libbro_broxygen.a
make[3]: Leaving directory '/usr/src/RPM/BUILD/bro-2.3.1/build'
[ 21%] Built target bro_broxygen
make[3]: Entering directory '/usr/src/RPM/BUILD/bro-2.3.1/build'
Scanning dependencies of target plugin-Bro-DHCP
make[3]: Leaving directory '/usr/src/RPM/BUILD/bro-2.3.1/build'
make[3]: Entering directory '/usr/src/RPM/BUILD/bro-2.3.1/build'
[ 21%] Building CXX object src/analyzer/protocol/dhcp/CMakeFiles/plugin-Bro-DHCP.dir/DHCP.cc.o
[ 21%] Building CXX object src/analyzer/protocol/dhcp/CMakeFiles/plugin-Bro-DHCP.dir/Plugin.cc.o
[ 21%] Building CXX object src/analyzer/protocol/dhcp/CMakeFiles/plugin-Bro-DHCP.dir/events.bif.cc.o
[ 21%] Building CXX object src/analyzer/protocol/dhcp/CMakeFiles/plugin-Bro-DHCP.dir/events.bif.init.cc.o
[ 21%] Building CXX object src/analyzer/protocol/dhcp/CMakeFiles/plugin-Bro-DHCP.dir/dhcp_pac.cc.o
[ 22%] Linking CXX static library libplugin-Bro-DHCP.a
make[3]: Leaving directory '/usr/src/RPM/BUILD/bro-2.3.1/build'
[ 23%] Built target plugin-Bro-DHCP
make[3]: Entering directory '/usr/src/RPM/BUILD/bro-2.3.1/build'
Scanning dependencies of target plugin-Bro-AYIYA
make[3]: Leaving directory '/usr/src/RPM/BUILD/bro-2.3.1/build'
make[3]: Entering directory '/usr/src/RPM/BUILD/bro-2.3.1/build'
[ 23%] Building CXX object src/analyzer/protocol/ayiya/CMakeFiles/plugin-Bro-AYIYA.dir/AYIYA.cc.o
[ 23%] Building CXX object src/analyzer/protocol/ayiya/CMakeFiles/plugin-Bro-AYIYA.dir/Plugin.cc.o
[ 23%] Building CXX object src/analyzer/protocol/ayiya/CMakeFiles/plugin-Bro-AYIYA.dir/events.bif.cc.o
[ 23%] Building CXX object src/analyzer/protocol/ayiya/CMakeFiles/plugin-Bro-AYIYA.dir/events.bif.init.cc.o
[ 23%] Building CXX object src/analyzer/protocol/ayiya/CMakeFiles/plugin-Bro-AYIYA.dir/ayiya_pac.cc.o
[ 24%] Linking CXX static library libplugin-Bro-AYIYA.a
make[3]: Leaving directory '/usr/src/RPM/BUILD/bro-2.3.1/build'
[ 25%] Built target plugin-Bro-AYIYA
make[3]: Entering directory '/usr/src/RPM/BUILD/bro-2.3.1/build'
Scanning dependencies of target plugin-Bro-DNS
make[3]: Leaving directory '/usr/src/RPM/BUILD/bro-2.3.1/build'
make[3]: Entering directory '/usr/src/RPM/BUILD/bro-2.3.1/build'
[ 25%] Building CXX object src/analyzer/protocol/dns/CMakeFiles/plugin-Bro-DNS.dir/DNS.cc.o
[ 25%] Building CXX object src/analyzer/protocol/dns/CMakeFiles/plugin-Bro-DNS.dir/Plugin.cc.o
[ 25%] Building CXX object src/analyzer/protocol/dns/CMakeFiles/plugin-Bro-DNS.dir/events.bif.cc.o
[ 25%] Building CXX object src/analyzer/protocol/dns/CMakeFiles/plugin-Bro-DNS.dir/events.bif.init.cc.o
[ 25%] Linking CXX static library libplugin-Bro-DNS.a
make[3]: Leaving directory '/usr/src/RPM/BUILD/bro-2.3.1/build'
[ 25%] Built target plugin-Bro-DNS
make[3]: Entering directory '/usr/src/RPM/BUILD/bro-2.3.1/build'
Scanning dependencies of target plugin-Bro-ARP
make[3]: Leaving directory '/usr/src/RPM/BUILD/bro-2.3.1/build'
make[3]: Entering directory '/usr/src/RPM/BUILD/bro-2.3.1/build'
[ 25%] Building CXX object src/analyzer/protocol/arp/CMakeFiles/plugin-Bro-ARP.dir/ARP.cc.o
[ 25%] Building CXX object src/analyzer/protocol/arp/CMakeFiles/plugin-Bro-ARP.dir/Plugin.cc.o
[ 25%] Building CXX object src/analyzer/protocol/arp/CMakeFiles/plugin-Bro-ARP.dir/events.bif.cc.o
[ 25%] Building CXX object src/analyzer/protocol/arp/CMakeFiles/plugin-Bro-ARP.dir/events.bif.init.cc.o
[ 25%] Linking CXX static library libplugin-Bro-ARP.a
make[3]: Leaving directory '/usr/src/RPM/BUILD/bro-2.3.1/build'
[ 25%] Built target plugin-Bro-ARP
make[3]: Entering directory '/usr/src/RPM/BUILD/bro-2.3.1/build'
Scanning dependencies of target plugin-Bro-BitTorrent
make[3]: Leaving directory '/usr/src/RPM/BUILD/bro-2.3.1/build'
make[3]: Entering directory '/usr/src/RPM/BUILD/bro-2.3.1/build'
[ 25%] Building CXX object src/analyzer/protocol/bittorrent/CMakeFiles/plugin-Bro-BitTorrent.dir/BitTorrent.cc.o
[ 25%] Building CXX object src/analyzer/protocol/bittorrent/CMakeFiles/plugin-Bro-BitTorrent.dir/BitTorrentTracker.cc.o
[ 25%] Building CXX object src/analyzer/protocol/bittorrent/CMakeFiles/plugin-Bro-BitTorrent.dir/Plugin.cc.o
[ 25%] Building CXX object src/analyzer/protocol/bittorrent/CMakeFiles/plugin-Bro-BitTorrent.dir/events.bif.cc.o
[ 25%] Building CXX object src/analyzer/protocol/bittorrent/CMakeFiles/plugin-Bro-BitTorrent.dir/events.bif.init.cc.o
[ 25%] Building CXX object src/analyzer/protocol/bittorrent/CMakeFiles/plugin-Bro-BitTorrent.dir/bittorrent_pac.cc.o
[ 25%] Linking CXX static library libplugin-Bro-BitTorrent.a
make[3]: Leaving directory '/usr/src/RPM/BUILD/bro-2.3.1/build'
[ 26%] Built target plugin-Bro-BitTorrent
make[3]: Entering directory '/usr/src/RPM/BUILD/bro-2.3.1/build'
Scanning dependencies of target plugin-Bro-DNP3
make[3]: Leaving directory '/usr/src/RPM/BUILD/bro-2.3.1/build'
make[3]: Entering directory '/usr/src/RPM/BUILD/bro-2.3.1/build'
[ 26%] Building CXX object src/analyzer/protocol/dnp3/CMakeFiles/plugin-Bro-DNP3.dir/DNP3.cc.o
[ 26%] Building CXX object src/analyzer/protocol/dnp3/CMakeFiles/plugin-Bro-DNP3.dir/Plugin.cc.o
[ 26%] Building CXX object src/analyzer/protocol/dnp3/CMakeFiles/plugin-Bro-DNP3.dir/events.bif.cc.o
[ 26%] Building CXX object src/analyzer/protocol/dnp3/CMakeFiles/plugin-Bro-DNP3.dir/events.bif.init.cc.o
[ 26%] Building CXX object src/analyzer/protocol/dnp3/CMakeFiles/plugin-Bro-DNP3.dir/dnp3_pac.cc.o
[ 27%] Linking CXX static library libplugin-Bro-DNP3.a
make[3]: Leaving directory '/usr/src/RPM/BUILD/bro-2.3.1/build'
[ 27%] Built target plugin-Bro-DNP3
make[3]: Entering directory '/usr/src/RPM/BUILD/bro-2.3.1/build'
Scanning dependencies of target bro_analyzer
make[3]: Leaving directory '/usr/src/RPM/BUILD/bro-2.3.1/build'
make[3]: Entering directory '/usr/src/RPM/BUILD/bro-2.3.1/build'
[ 27%] Building CXX object src/analyzer/CMakeFiles/bro_analyzer.dir/Analyzer.cc.o
/usr/src/RPM/BUILD/bro-2.3.1/src/analyzer/Analyzer.cc:600:24: warning: invalid suffix on literal; C++11 requires a space between literal and string macro [-Wliteral-suffix]
  DBG_LOG(DBG_ANALYZER, "%s DeliverPacket(%d, %s, %"PRIu64", %p, %d) [%s%s]",
                        ^
/usr/src/RPM/BUILD/bro-2.3.1/src/analyzer/Analyzer.cc:614:24: warning: invalid suffix on literal; C++11 requires a space between literal and string macro [-Wliteral-suffix]
  DBG_LOG(DBG_ANALYZER, "%s Undelivered(%"PRIu64", %d, %s)",
                        ^
[ 27%] Building CXX object src/analyzer/CMakeFiles/bro_analyzer.dir/Manager.cc.o
[ 27%] Building CXX object src/analyzer/CMakeFiles/bro_analyzer.dir/Component.cc.o
[ 27%] Building CXX object src/analyzer/CMakeFiles/bro_analyzer.dir/Tag.cc.o
[ 27%] Building CXX object src/analyzer/CMakeFiles/bro_analyzer.dir/analyzer.bif.cc.o
[ 27%] Linking CXX static library libbro_analyzer.a
make[3]: Leaving directory '/usr/src/RPM/BUILD/bro-2.3.1/build'
[ 28%] Built target bro_analyzer
make[3]: Entering directory '/usr/src/RPM/BUILD/bro-2.3.1/build'
Scanning dependencies of target plugin-Bro-BackDoor
make[3]: Leaving directory '/usr/src/RPM/BUILD/bro-2.3.1/build'
make[3]: Entering directory '/usr/src/RPM/BUILD/bro-2.3.1/build'
[ 28%] Building CXX object src/analyzer/protocol/backdoor/CMakeFiles/plugin-Bro-BackDoor.dir/BackDoor.cc.o
[ 28%] Building CXX object src/analyzer/protocol/backdoor/CMakeFiles/plugin-Bro-BackDoor.dir/Plugin.cc.o
[ 28%] Building CXX object src/analyzer/protocol/backdoor/CMakeFiles/plugin-Bro-BackDoor.dir/events.bif.cc.o
[ 28%] Building CXX object src/analyzer/protocol/backdoor/CMakeFiles/plugin-Bro-BackDoor.dir/events.bif.init.cc.o
[ 28%] Linking CXX static library libplugin-Bro-BackDoor.a
make[3]: Leaving directory '/usr/src/RPM/BUILD/bro-2.3.1/build'
[ 28%] Built target plugin-Bro-BackDoor
make[3]: Entering directory '/usr/src/RPM/BUILD/bro-2.3.1/build'
Scanning dependencies of target plugin-Bro-ConnSize
make[3]: Leaving directory '/usr/src/RPM/BUILD/bro-2.3.1/build'
make[3]: Entering directory '/usr/src/RPM/BUILD/bro-2.3.1/build'
[ 28%] Building CXX object src/analyzer/protocol/conn-size/CMakeFiles/plugin-Bro-ConnSize.dir/ConnSize.cc.o
[ 28%] Building CXX object src/analyzer/protocol/conn-size/CMakeFiles/plugin-Bro-ConnSize.dir/Plugin.cc.o
[ 28%] Building CXX object src/analyzer/protocol/conn-size/CMakeFiles/plugin-Bro-ConnSize.dir/events.bif.cc.o
[ 28%] Building CXX object src/analyzer/protocol/conn-size/CMakeFiles/plugin-Bro-ConnSize.dir/events.bif.init.cc.o
[ 28%] Linking CXX static library libplugin-Bro-ConnSize.a
make[3]: Leaving directory '/usr/src/RPM/BUILD/bro-2.3.1/build'
[ 29%] Built target plugin-Bro-ConnSize
make[3]: Entering directory '/usr/src/RPM/BUILD/bro-2.3.1/build'
Scanning dependencies of target plugin-Bro-File
make[3]: Leaving directory '/usr/src/RPM/BUILD/bro-2.3.1/build'
make[3]: Entering directory '/usr/src/RPM/BUILD/bro-2.3.1/build'
[ 29%] Building CXX object src/analyzer/protocol/file/CMakeFiles/plugin-Bro-File.dir/File.cc.o
[ 29%] Building CXX object src/analyzer/protocol/file/CMakeFiles/plugin-Bro-File.dir/Plugin.cc.o
[ 29%] Building CXX object src/analyzer/protocol/file/CMakeFiles/plugin-Bro-File.dir/events.bif.cc.o
[ 29%] Building CXX object src/analyzer/protocol/file/CMakeFiles/plugin-Bro-File.dir/events.bif.init.cc.o
[ 29%] Linking CXX static library libplugin-Bro-File.a
make[3]: Leaving directory '/usr/src/RPM/BUILD/bro-2.3.1/build'
[ 30%] Built target plugin-Bro-File
make[3]: Entering directory '/usr/src/RPM/BUILD/bro-2.3.1/build'
Scanning dependencies of target plugin-Bro-DCE_RPC
make[3]: Leaving directory '/usr/src/RPM/BUILD/bro-2.3.1/build'
make[3]: Entering directory '/usr/src/RPM/BUILD/bro-2.3.1/build'
[ 30%] Building CXX object src/analyzer/protocol/dce-rpc/CMakeFiles/plugin-Bro-DCE_RPC.dir/DCE_RPC.cc.o
[ 30%] Building CXX object src/analyzer/protocol/dce-rpc/CMakeFiles/plugin-Bro-DCE_RPC.dir/Plugin.cc.o
[ 30%] Building CXX object src/analyzer/protocol/dce-rpc/CMakeFiles/plugin-Bro-DCE_RPC.dir/events.bif.cc.o
[ 30%] Building CXX object src/analyzer/protocol/dce-rpc/CMakeFiles/plugin-Bro-DCE_RPC.dir/events.bif.init.cc.o
[ 30%] Building CXX object src/analyzer/protocol/dce-rpc/CMakeFiles/plugin-Bro-DCE_RPC.dir/dce_rpc_pac.cc.o
[ 30%] Building CXX object src/analyzer/protocol/dce-rpc/CMakeFiles/plugin-Bro-DCE_RPC.dir/dce_rpc_simple_pac.cc.o
[ 30%] Linking CXX static library libplugin-Bro-DCE_RPC.a
make[3]: Leaving directory '/usr/src/RPM/BUILD/bro-2.3.1/build'
[ 31%] Built target plugin-Bro-DCE_RPC
make[3]: Entering directory '/usr/src/RPM/BUILD/bro-2.3.1/build'
Scanning dependencies of target plugin-Bro-Finger
make[3]: Leaving directory '/usr/src/RPM/BUILD/bro-2.3.1/build'
make[3]: Entering directory '/usr/src/RPM/BUILD/bro-2.3.1/build'
[ 31%] Building CXX object src/analyzer/protocol/finger/CMakeFiles/plugin-Bro-Finger.dir/Finger.cc.o
[ 31%] Building CXX object src/analyzer/protocol/finger/CMakeFiles/plugin-Bro-Finger.dir/Plugin.cc.o
[ 31%] Building CXX object src/analyzer/protocol/finger/CMakeFiles/plugin-Bro-Finger.dir/events.bif.cc.o
[ 32%] Building CXX object src/analyzer/protocol/finger/CMakeFiles/plugin-Bro-Finger.dir/events.bif.init.cc.o
[ 32%] Linking CXX static library libplugin-Bro-Finger.a
make[3]: Leaving directory '/usr/src/RPM/BUILD/bro-2.3.1/build'
[ 32%] Built target plugin-Bro-Finger
make[3]: Entering directory '/usr/src/RPM/BUILD/bro-2.3.1/build'
Scanning dependencies of target plugin-Bro-FTP
make[3]: Leaving directory '/usr/src/RPM/BUILD/bro-2.3.1/build'
make[3]: Entering directory '/usr/src/RPM/BUILD/bro-2.3.1/build'
[ 32%] Building CXX object src/analyzer/protocol/ftp/CMakeFiles/plugin-Bro-FTP.dir/FTP.cc.o
[ 32%] Building CXX object src/analyzer/protocol/ftp/CMakeFiles/plugin-Bro-FTP.dir/Plugin.cc.o
[ 32%] Building CXX object src/analyzer/protocol/ftp/CMakeFiles/plugin-Bro-FTP.dir/events.bif.cc.o
[ 32%] Building CXX object src/analyzer/protocol/ftp/CMakeFiles/plugin-Bro-FTP.dir/events.bif.init.cc.o
[ 32%] Building CXX object src/analyzer/protocol/ftp/CMakeFiles/plugin-Bro-FTP.dir/functions.bif.cc.o
[ 32%] Building CXX object src/analyzer/protocol/ftp/CMakeFiles/plugin-Bro-FTP.dir/functions.bif.init.cc.o
[ 32%] Linking CXX static library libplugin-Bro-FTP.a
make[3]: Leaving directory '/usr/src/RPM/BUILD/bro-2.3.1/build'
[ 33%] Built target plugin-Bro-FTP
make[3]: Entering directory '/usr/src/RPM/BUILD/bro-2.3.1/build'
Scanning dependencies of target plugin-Bro-Gnutella
make[3]: Leaving directory '/usr/src/RPM/BUILD/bro-2.3.1/build'
make[3]: Entering directory '/usr/src/RPM/BUILD/bro-2.3.1/build'
[ 33%] Building CXX object src/analyzer/protocol/gnutella/CMakeFiles/plugin-Bro-Gnutella.dir/Gnutella.cc.o
[ 33%] Building CXX object src/analyzer/protocol/gnutella/CMakeFiles/plugin-Bro-Gnutella.dir/Plugin.cc.o
[ 33%] Building CXX object src/analyzer/protocol/gnutella/CMakeFiles/plugin-Bro-Gnutella.dir/events.bif.cc.o
[ 33%] Building CXX object src/analyzer/protocol/gnutella/CMakeFiles/plugin-Bro-Gnutella.dir/events.bif.init.cc.o
[ 34%] Linking CXX static library libplugin-Bro-Gnutella.a
make[3]: Leaving directory '/usr/src/RPM/BUILD/bro-2.3.1/build'
[ 34%] Built target plugin-Bro-Gnutella
make[3]: Entering directory '/usr/src/RPM/BUILD/bro-2.3.1/build'
Scanning dependencies of target plugin-Bro-GTPv1
make[3]: Leaving directory '/usr/src/RPM/BUILD/bro-2.3.1/build'
make[3]: Entering directory '/usr/src/RPM/BUILD/bro-2.3.1/build'
[ 34%] Building CXX object src/analyzer/protocol/gtpv1/CMakeFiles/plugin-Bro-GTPv1.dir/GTPv1.cc.o
[ 34%] Building CXX object src/analyzer/protocol/gtpv1/CMakeFiles/plugin-Bro-GTPv1.dir/Plugin.cc.o
[ 34%] Building CXX object src/analyzer/protocol/gtpv1/CMakeFiles/plugin-Bro-GTPv1.dir/events.bif.cc.o
[ 34%] Building CXX object src/analyzer/protocol/gtpv1/CMakeFiles/plugin-Bro-GTPv1.dir/events.bif.init.cc.o
[ 35%] Building CXX object src/analyzer/protocol/gtpv1/CMakeFiles/plugin-Bro-GTPv1.dir/gtpv1_pac.cc.o
[ 35%] Linking CXX static library libplugin-Bro-GTPv1.a
make[3]: Leaving directory '/usr/src/RPM/BUILD/bro-2.3.1/build'
[ 35%] Built target plugin-Bro-GTPv1
make[3]: Entering directory '/usr/src/RPM/BUILD/bro-2.3.1/build'
Scanning dependencies of target plugin-Bro-HTTP
make[3]: Leaving directory '/usr/src/RPM/BUILD/bro-2.3.1/build'
make[3]: Entering directory '/usr/src/RPM/BUILD/bro-2.3.1/build'
[ 35%] Building CXX object src/analyzer/protocol/http/CMakeFiles/plugin-Bro-HTTP.dir/HTTP.cc.o
/usr/src/RPM/BUILD/bro-2.3.1/src/analyzer/protocol/http/HTTP.cc:416:14: warning: invalid suffix on literal; C++11 requires a space between literal and string macro [-Wliteral-suffix]
    DEBUG_MSG("Content-Range length = %"PRId64"\n", len);
              ^
/usr/src/RPM/BUILD/bro-2.3.1/src/analyzer/protocol/http/HTTP.cc:1148:9: warning: invalid suffix on literal; C++11 requires a space between literal and string macro [-Wliteral-suffix]
     fmt("seq=%"PRIu64", len=%d", seq, len));
         ^
[ 35%] Building CXX object src/analyzer/protocol/http/CMakeFiles/plugin-Bro-HTTP.dir/Plugin.cc.o
[ 35%] Building CXX object src/analyzer/protocol/http/CMakeFiles/plugin-Bro-HTTP.dir/events.bif.cc.o
[ 35%] Building CXX object src/analyzer/protocol/http/CMakeFiles/plugin-Bro-HTTP.dir/events.bif.init.cc.o
[ 35%] Building CXX object src/analyzer/protocol/http/CMakeFiles/plugin-Bro-HTTP.dir/functions.bif.cc.o
[ 36%] Building CXX object src/analyzer/protocol/http/CMakeFiles/plugin-Bro-HTTP.dir/functions.bif.init.cc.o
[ 36%] Linking CXX static library libplugin-Bro-HTTP.a
make[3]: Leaving directory '/usr/src/RPM/BUILD/bro-2.3.1/build'
[ 36%] Built target plugin-Bro-HTTP
make[3]: Entering directory '/usr/src/RPM/BUILD/bro-2.3.1/build'
Scanning dependencies of target plugin-Bro-ICMP
make[3]: Leaving directory '/usr/src/RPM/BUILD/bro-2.3.1/build'
make[3]: Entering directory '/usr/src/RPM/BUILD/bro-2.3.1/build'
[ 36%] Building CXX object src/analyzer/protocol/icmp/CMakeFiles/plugin-Bro-ICMP.dir/ICMP.cc.o
[ 36%] Building CXX object src/analyzer/protocol/icmp/CMakeFiles/plugin-Bro-ICMP.dir/Plugin.cc.o
[ 36%] Building CXX object src/analyzer/protocol/icmp/CMakeFiles/plugin-Bro-ICMP.dir/events.bif.cc.o
[ 36%] Building CXX object src/analyzer/protocol/icmp/CMakeFiles/plugin-Bro-ICMP.dir/events.bif.init.cc.o
[ 36%] Linking CXX static library libplugin-Bro-ICMP.a
make[3]: Leaving directory '/usr/src/RPM/BUILD/bro-2.3.1/build'
[ 36%] Built target plugin-Bro-ICMP
make[3]: Entering directory '/usr/src/RPM/BUILD/bro-2.3.1/build'
Scanning dependencies of target plugin-Bro-Ident
make[3]: Leaving directory '/usr/src/RPM/BUILD/bro-2.3.1/build'
make[3]: Entering directory '/usr/src/RPM/BUILD/bro-2.3.1/build'
[ 36%] Building CXX object src/analyzer/protocol/ident/CMakeFiles/plugin-Bro-Ident.dir/Ident.cc.o
[ 37%] Building CXX object src/analyzer/protocol/ident/CMakeFiles/plugin-Bro-Ident.dir/Plugin.cc.o
[ 37%] Building CXX object src/analyzer/protocol/ident/CMakeFiles/plugin-Bro-Ident.dir/events.bif.cc.o
[ 37%] Building CXX object src/analyzer/protocol/ident/CMakeFiles/plugin-Bro-Ident.dir/events.bif.init.cc.o
[ 37%] Linking CXX static library libplugin-Bro-Ident.a
make[3]: Leaving directory '/usr/src/RPM/BUILD/bro-2.3.1/build'
[ 37%] Built target plugin-Bro-Ident
make[3]: Entering directory '/usr/src/RPM/BUILD/bro-2.3.1/build'
Scanning dependencies of target plugin-Bro-InterConn
make[3]: Leaving directory '/usr/src/RPM/BUILD/bro-2.3.1/build'
make[3]: Entering directory '/usr/src/RPM/BUILD/bro-2.3.1/build'
[ 37%] Building CXX object src/analyzer/protocol/interconn/CMakeFiles/plugin-Bro-InterConn.dir/InterConn.cc.o
[ 37%] Building CXX object src/analyzer/protocol/interconn/CMakeFiles/plugin-Bro-InterConn.dir/Plugin.cc.o
[ 38%] Building CXX object src/analyzer/protocol/interconn/CMakeFiles/plugin-Bro-InterConn.dir/events.bif.cc.o
[ 38%] Building CXX object src/analyzer/protocol/interconn/CMakeFiles/plugin-Bro-InterConn.dir/events.bif.init.cc.o
[ 38%] Linking CXX static library libplugin-Bro-InterConn.a
make[3]: Leaving directory '/usr/src/RPM/BUILD/bro-2.3.1/build'
[ 38%] Built target plugin-Bro-InterConn
make[3]: Entering directory '/usr/src/RPM/BUILD/bro-2.3.1/build'
Scanning dependencies of target plugin-Bro-IRC
make[3]: Leaving directory '/usr/src/RPM/BUILD/bro-2.3.1/build'
make[3]: Entering directory '/usr/src/RPM/BUILD/bro-2.3.1/build'
[ 38%] Building CXX object src/analyzer/protocol/irc/CMakeFiles/plugin-Bro-IRC.dir/IRC.cc.o
[ 38%] Building CXX object src/analyzer/protocol/irc/CMakeFiles/plugin-Bro-IRC.dir/Plugin.cc.o
[ 38%] Building CXX object src/analyzer/protocol/irc/CMakeFiles/plugin-Bro-IRC.dir/events.bif.cc.o
[ 38%] Building CXX object src/analyzer/protocol/irc/CMakeFiles/plugin-Bro-IRC.dir/events.bif.init.cc.o
[ 38%] Linking CXX static library libplugin-Bro-IRC.a
make[3]: Leaving directory '/usr/src/RPM/BUILD/bro-2.3.1/build'
[ 39%] Built target plugin-Bro-IRC
make[3]: Entering directory '/usr/src/RPM/BUILD/bro-2.3.1/build'
Scanning dependencies of target plugin-Bro-Login
make[3]: Leaving directory '/usr/src/RPM/BUILD/bro-2.3.1/build'
make[3]: Entering directory '/usr/src/RPM/BUILD/bro-2.3.1/build'
[ 39%] Building CXX object src/analyzer/protocol/login/CMakeFiles/plugin-Bro-Login.dir/Login.cc.o
[ 39%] Building CXX object src/analyzer/protocol/login/CMakeFiles/plugin-Bro-Login.dir/RSH.cc.o
[ 39%] Building CXX object src/analyzer/protocol/login/CMakeFiles/plugin-Bro-Login.dir/Telnet.cc.o
[ 40%] Building CXX object src/analyzer/protocol/login/CMakeFiles/plugin-Bro-Login.dir/Rlogin.cc.o
[ 40%] Building CXX object src/analyzer/protocol/login/CMakeFiles/plugin-Bro-Login.dir/NVT.cc.o
[ 40%] Building CXX object src/analyzer/protocol/login/CMakeFiles/plugin-Bro-Login.dir/Plugin.cc.o
[ 40%] Building CXX object src/analyzer/protocol/login/CMakeFiles/plugin-Bro-Login.dir/events.bif.cc.o
[ 40%] Building CXX object src/analyzer/protocol/login/CMakeFiles/plugin-Bro-Login.dir/events.bif.init.cc.o
[ 40%] Building CXX object src/analyzer/protocol/login/CMakeFiles/plugin-Bro-Login.dir/functions.bif.cc.o
[ 40%] Building CXX object src/analyzer/protocol/login/CMakeFiles/plugin-Bro-Login.dir/functions.bif.init.cc.o
[ 40%] Linking CXX static library libplugin-Bro-Login.a
make[3]: Leaving directory '/usr/src/RPM/BUILD/bro-2.3.1/build'
[ 40%] Built target plugin-Bro-Login
make[3]: Entering directory '/usr/src/RPM/BUILD/bro-2.3.1/build'
Scanning dependencies of target plugin-Bro-MIME
make[3]: Leaving directory '/usr/src/RPM/BUILD/bro-2.3.1/build'
make[3]: Entering directory '/usr/src/RPM/BUILD/bro-2.3.1/build'
[ 40%] Building CXX object src/analyzer/protocol/mime/CMakeFiles/plugin-Bro-MIME.dir/MIME.cc.o
[ 40%] Building CXX object src/analyzer/protocol/mime/CMakeFiles/plugin-Bro-MIME.dir/Plugin.cc.o
[ 40%] Building CXX object src/analyzer/protocol/mime/CMakeFiles/plugin-Bro-MIME.dir/events.bif.cc.o
[ 40%] Building CXX object src/analyzer/protocol/mime/CMakeFiles/plugin-Bro-MIME.dir/events.bif.init.cc.o
[ 40%] Linking CXX static library libplugin-Bro-MIME.a
make[3]: Leaving directory '/usr/src/RPM/BUILD/bro-2.3.1/build'
[ 41%] Built target plugin-Bro-MIME
make[3]: Entering directory '/usr/src/RPM/BUILD/bro-2.3.1/build'
Scanning dependencies of target plugin-Bro-Modbus
make[3]: Leaving directory '/usr/src/RPM/BUILD/bro-2.3.1/build'
make[3]: Entering directory '/usr/src/RPM/BUILD/bro-2.3.1/build'
[ 42%] Building CXX object src/analyzer/protocol/modbus/CMakeFiles/plugin-Bro-Modbus.dir/Modbus.cc.o
[ 42%] Building CXX object src/analyzer/protocol/modbus/CMakeFiles/plugin-Bro-Modbus.dir/Plugin.cc.o
[ 42%] Building CXX object src/analyzer/protocol/modbus/CMakeFiles/plugin-Bro-Modbus.dir/events.bif.cc.o
[ 42%] Building CXX object src/analyzer/protocol/modbus/CMakeFiles/plugin-Bro-Modbus.dir/events.bif.init.cc.o
[ 42%] Building CXX object src/analyzer/protocol/modbus/CMakeFiles/plugin-Bro-Modbus.dir/modbus_pac.cc.o
[ 42%] Linking CXX static library libplugin-Bro-Modbus.a
make[3]: Leaving directory '/usr/src/RPM/BUILD/bro-2.3.1/build'
[ 42%] Built target plugin-Bro-Modbus
make[3]: Entering directory '/usr/src/RPM/BUILD/bro-2.3.1/build'
Scanning dependencies of target plugin-Bro-NCP
make[3]: Leaving directory '/usr/src/RPM/BUILD/bro-2.3.1/build'
make[3]: Entering directory '/usr/src/RPM/BUILD/bro-2.3.1/build'
[ 43%] Building CXX object src/analyzer/protocol/ncp/CMakeFiles/plugin-Bro-NCP.dir/NCP.cc.o
[ 43%] Building CXX object src/analyzer/protocol/ncp/CMakeFiles/plugin-Bro-NCP.dir/Plugin.cc.o
[ 43%] Building CXX object src/analyzer/protocol/ncp/CMakeFiles/plugin-Bro-NCP.dir/events.bif.cc.o
[ 43%] Building CXX object src/analyzer/protocol/ncp/CMakeFiles/plugin-Bro-NCP.dir/events.bif.init.cc.o
[ 43%] Building CXX object src/analyzer/protocol/ncp/CMakeFiles/plugin-Bro-NCP.dir/ncp_pac.cc.o
[ 43%] Linking CXX static library libplugin-Bro-NCP.a
make[3]: Leaving directory '/usr/src/RPM/BUILD/bro-2.3.1/build'
[ 43%] Built target plugin-Bro-NCP
make[3]: Entering directory '/usr/src/RPM/BUILD/bro-2.3.1/build'
Scanning dependencies of target plugin-Bro-NetBIOS
make[3]: Leaving directory '/usr/src/RPM/BUILD/bro-2.3.1/build'
make[3]: Entering directory '/usr/src/RPM/BUILD/bro-2.3.1/build'
[ 43%] Building CXX object src/analyzer/protocol/netbios/CMakeFiles/plugin-Bro-NetBIOS.dir/NetbiosSSN.cc.o
[ 44%] Building CXX object src/analyzer/protocol/netbios/CMakeFiles/plugin-Bro-NetBIOS.dir/Plugin.cc.o
[ 44%] Building CXX object src/analyzer/protocol/netbios/CMakeFiles/plugin-Bro-NetBIOS.dir/events.bif.cc.o
[ 44%] Building CXX object src/analyzer/protocol/netbios/CMakeFiles/plugin-Bro-NetBIOS.dir/events.bif.init.cc.o
[ 44%] Building CXX object src/analyzer/protocol/netbios/CMakeFiles/plugin-Bro-NetBIOS.dir/functions.bif.cc.o
[ 44%] Building CXX object src/analyzer/protocol/netbios/CMakeFiles/plugin-Bro-NetBIOS.dir/functions.bif.init.cc.o
[ 44%] Linking CXX static library libplugin-Bro-NetBIOS.a
make[3]: Leaving directory '/usr/src/RPM/BUILD/bro-2.3.1/build'
[ 44%] Built target plugin-Bro-NetBIOS
make[3]: Entering directory '/usr/src/RPM/BUILD/bro-2.3.1/build'
Scanning dependencies of target plugin-Bro-NetFlow
make[3]: Leaving directory '/usr/src/RPM/BUILD/bro-2.3.1/build'
make[3]: Entering directory '/usr/src/RPM/BUILD/bro-2.3.1/build'
[ 45%] Building CXX object src/analyzer/protocol/netflow/CMakeFiles/plugin-Bro-NetFlow.dir/Plugin.cc.o
[ 45%] Building CXX object src/analyzer/protocol/netflow/CMakeFiles/plugin-Bro-NetFlow.dir/events.bif.cc.o
[ 45%] Building CXX object src/analyzer/protocol/netflow/CMakeFiles/plugin-Bro-NetFlow.dir/events.bif.init.cc.o
[ 45%] Building CXX object src/analyzer/protocol/netflow/CMakeFiles/plugin-Bro-NetFlow.dir/netflow_pac.cc.o
[ 45%] Linking CXX static library libplugin-Bro-NetFlow.a
make[3]: Leaving directory '/usr/src/RPM/BUILD/bro-2.3.1/build'
[ 45%] Built target plugin-Bro-NetFlow
make[3]: Entering directory '/usr/src/RPM/BUILD/bro-2.3.1/build'
Scanning dependencies of target plugin-Bro-NTP
make[3]: Leaving directory '/usr/src/RPM/BUILD/bro-2.3.1/build'
make[3]: Entering directory '/usr/src/RPM/BUILD/bro-2.3.1/build'
[ 46%] Building CXX object src/analyzer/protocol/ntp/CMakeFiles/plugin-Bro-NTP.dir/NTP.cc.o
[ 46%] Building CXX object src/analyzer/protocol/ntp/CMakeFiles/plugin-Bro-NTP.dir/Plugin.cc.o
[ 46%] Building CXX object src/analyzer/protocol/ntp/CMakeFiles/plugin-Bro-NTP.dir/events.bif.cc.o
[ 46%] Building CXX object src/analyzer/protocol/ntp/CMakeFiles/plugin-Bro-NTP.dir/events.bif.init.cc.o
[ 46%] Linking CXX static library libplugin-Bro-NTP.a
make[3]: Leaving directory '/usr/src/RPM/BUILD/bro-2.3.1/build'
[ 46%] Built target plugin-Bro-NTP
make[3]: Entering directory '/usr/src/RPM/BUILD/bro-2.3.1/build'
Scanning dependencies of target plugin-Bro-PIA
make[3]: Leaving directory '/usr/src/RPM/BUILD/bro-2.3.1/build'
make[3]: Entering directory '/usr/src/RPM/BUILD/bro-2.3.1/build'
[ 46%] Building CXX object src/analyzer/protocol/pia/CMakeFiles/plugin-Bro-PIA.dir/PIA.cc.o
[ 46%] Building CXX object src/analyzer/protocol/pia/CMakeFiles/plugin-Bro-PIA.dir/Plugin.cc.o
[ 47%] Building CXX object src/analyzer/protocol/pia/CMakeFiles/plugin-Bro-PIA.dir/events.bif.cc.o
[ 47%] Building CXX object src/analyzer/protocol/pia/CMakeFiles/plugin-Bro-PIA.dir/events.bif.init.cc.o
[ 47%] Linking CXX static library libplugin-Bro-PIA.a
make[3]: Leaving directory '/usr/src/RPM/BUILD/bro-2.3.1/build'
[ 47%] Built target plugin-Bro-PIA
make[3]: Entering directory '/usr/src/RPM/BUILD/bro-2.3.1/build'
Scanning dependencies of target plugin-Bro-POP3
make[3]: Leaving directory '/usr/src/RPM/BUILD/bro-2.3.1/build'
make[3]: Entering directory '/usr/src/RPM/BUILD/bro-2.3.1/build'
[ 47%] Building CXX object src/analyzer/protocol/pop3/CMakeFiles/plugin-Bro-POP3.dir/POP3.cc.o
[ 47%] Building CXX object src/analyzer/protocol/pop3/CMakeFiles/plugin-Bro-POP3.dir/Plugin.cc.o
[ 47%] Building CXX object src/analyzer/protocol/pop3/CMakeFiles/plugin-Bro-POP3.dir/events.bif.cc.o
[ 48%] Building CXX object src/analyzer/protocol/pop3/CMakeFiles/plugin-Bro-POP3.dir/events.bif.init.cc.o
[ 48%] Linking CXX static library libplugin-Bro-POP3.a
make[3]: Leaving directory '/usr/src/RPM/BUILD/bro-2.3.1/build'
[ 48%] Built target plugin-Bro-POP3
make[3]: Entering directory '/usr/src/RPM/BUILD/bro-2.3.1/build'
Scanning dependencies of target plugin-Bro-RADIUS
make[3]: Leaving directory '/usr/src/RPM/BUILD/bro-2.3.1/build'
make[3]: Entering directory '/usr/src/RPM/BUILD/bro-2.3.1/build'
[ 48%] Building CXX object src/analyzer/protocol/radius/CMakeFiles/plugin-Bro-RADIUS.dir/RADIUS.cc.o
[ 48%] Building CXX object src/analyzer/protocol/radius/CMakeFiles/plugin-Bro-RADIUS.dir/Plugin.cc.o
[ 48%] Building CXX object src/analyzer/protocol/radius/CMakeFiles/plugin-Bro-RADIUS.dir/events.bif.cc.o
[ 48%] Building CXX object src/analyzer/protocol/radius/CMakeFiles/plugin-Bro-RADIUS.dir/events.bif.init.cc.o
[ 50%] Building CXX object src/analyzer/protocol/radius/CMakeFiles/plugin-Bro-RADIUS.dir/radius_pac.cc.o
[ 50%] Linking CXX static library libplugin-Bro-RADIUS.a
make[3]: Leaving directory '/usr/src/RPM/BUILD/bro-2.3.1/build'
[ 50%] Built target plugin-Bro-RADIUS
make[3]: Entering directory '/usr/src/RPM/BUILD/bro-2.3.1/build'
Scanning dependencies of target plugin-Bro-RPC
make[3]: Leaving directory '/usr/src/RPM/BUILD/bro-2.3.1/build'
make[3]: Entering directory '/usr/src/RPM/BUILD/bro-2.3.1/build'
[ 50%] Building CXX object src/analyzer/protocol/rpc/CMakeFiles/plugin-Bro-RPC.dir/RPC.cc.o
[ 50%] Building CXX object src/analyzer/protocol/rpc/CMakeFiles/plugin-Bro-RPC.dir/NFS.cc.o
[ 50%] Building CXX object src/analyzer/protocol/rpc/CMakeFiles/plugin-Bro-RPC.dir/Portmap.cc.o
[ 50%] Building CXX object src/analyzer/protocol/rpc/CMakeFiles/plugin-Bro-RPC.dir/XDR.cc.o
[ 50%] Building CXX object src/analyzer/protocol/rpc/CMakeFiles/plugin-Bro-RPC.dir/Plugin.cc.o
[ 51%] Building CXX object src/analyzer/protocol/rpc/CMakeFiles/plugin-Bro-RPC.dir/events.bif.cc.o
[ 51%] Building CXX object src/analyzer/protocol/rpc/CMakeFiles/plugin-Bro-RPC.dir/events.bif.init.cc.o
[ 51%] Linking CXX static library libplugin-Bro-RPC.a
make[3]: Leaving directory '/usr/src/RPM/BUILD/bro-2.3.1/build'
[ 51%] Built target plugin-Bro-RPC
make[3]: Entering directory '/usr/src/RPM/BUILD/bro-2.3.1/build'
Scanning dependencies of target plugin-Bro-SNMP
make[3]: Leaving directory '/usr/src/RPM/BUILD/bro-2.3.1/build'
make[3]: Entering directory '/usr/src/RPM/BUILD/bro-2.3.1/build'
[ 52%] Building CXX object src/analyzer/protocol/snmp/CMakeFiles/plugin-Bro-SNMP.dir/SNMP.cc.o
[ 52%] Building CXX object src/analyzer/protocol/snmp/CMakeFiles/plugin-Bro-SNMP.dir/Plugin.cc.o
[ 52%] Building CXX object src/analyzer/protocol/snmp/CMakeFiles/plugin-Bro-SNMP.dir/types.bif.cc.o
[ 52%] Building CXX object src/analyzer/protocol/snmp/CMakeFiles/plugin-Bro-SNMP.dir/types.bif.init.cc.o
[ 52%] Building CXX object src/analyzer/protocol/snmp/CMakeFiles/plugin-Bro-SNMP.dir/events.bif.cc.o
[ 52%] Building CXX object src/analyzer/protocol/snmp/CMakeFiles/plugin-Bro-SNMP.dir/events.bif.init.cc.o
[ 52%] Building CXX object src/analyzer/protocol/snmp/CMakeFiles/plugin-Bro-SNMP.dir/snmp_pac.cc.o
/usr/src/RPM/BUILD/bro-2.3.1/build/src/analyzer/protocol/snmp/snmp_pac.cc:2235:31: warning: invalid suffix on literal; C++11 requires a space between literal and string macro [-Wliteral-suffix]
    snprintf(tmp, sizeof(tmp), "%"PRIu64, subidentifier_values[i]);
                               ^
[ 52%] Linking CXX static library libplugin-Bro-SNMP.a
make[3]: Leaving directory '/usr/src/RPM/BUILD/bro-2.3.1/build'
[ 52%] Built target plugin-Bro-SNMP
make[3]: Entering directory '/usr/src/RPM/BUILD/bro-2.3.1/build'
Scanning dependencies of target plugin-Bro-SMB
make[3]: Leaving directory '/usr/src/RPM/BUILD/bro-2.3.1/build'
make[3]: Entering directory '/usr/src/RPM/BUILD/bro-2.3.1/build'
[ 52%] Building CXX object src/analyzer/protocol/smb/CMakeFiles/plugin-Bro-SMB.dir/SMB.cc.o
/usr/src/RPM/BUILD/bro-2.3.1/src/analyzer/protocol/smb/SMB.cc: In member function 'void analyzer::smb::SMB_Session::ParseMessage(int, int, const binpac::SMB::SMB_header&, const analyzer::smb::SMB_Body&)':
/usr/src/RPM/BUILD/bro-2.3.1/src/analyzer/protocol/smb/SMB.cc:226:53: warning: '<<' in boolean context, did you mean '<' ? [-Wint-in-bool-context]
    error = hdr.status()->dos_error()->error_class() << 24 ||
            ~~~~~~~~~~~~~~~~~~~~~~~~~~~~~~~~~~~~~~~~~^~~~~
/usr/src/RPM/BUILD/bro-2.3.1/src/analyzer/protocol/smb/SMB.cc: In member function 'Val* analyzer::smb::SMB_Session::BuildHeaderVal(const binpac::SMB::SMB_header&)':
/usr/src/RPM/BUILD/bro-2.3.1/src/analyzer/protocol/smb/SMB.cc:1002:49: warning: '<<' in boolean context, did you mean '<' ? [-Wint-in-bool-context]
        hdr.status()->dos_error()->error_class() << 24 ||
        ~~~~~~~~~~~~~~~~~~~~~~~~~~~~~~~~~~~~~~~~~^~~~~
[ 52%] Building CXX object src/analyzer/protocol/smb/CMakeFiles/plugin-Bro-SMB.dir/Plugin.cc.o
[ 52%] Building CXX object src/analyzer/protocol/smb/CMakeFiles/plugin-Bro-SMB.dir/events.bif.cc.o
[ 53%] Building CXX object src/analyzer/protocol/smb/CMakeFiles/plugin-Bro-SMB.dir/events.bif.init.cc.o
[ 53%] Building CXX object src/analyzer/protocol/smb/CMakeFiles/plugin-Bro-SMB.dir/smb_pac.cc.o
[ 53%] Linking CXX static library libplugin-Bro-SMB.a
make[3]: Leaving directory '/usr/src/RPM/BUILD/bro-2.3.1/build'
[ 53%] Built target plugin-Bro-SMB
make[3]: Entering directory '/usr/src/RPM/BUILD/bro-2.3.1/build'
Scanning dependencies of target plugin-Bro-SMTP
make[3]: Leaving directory '/usr/src/RPM/BUILD/bro-2.3.1/build'
make[3]: Entering directory '/usr/src/RPM/BUILD/bro-2.3.1/build'
[ 53%] Building CXX object src/analyzer/protocol/smtp/CMakeFiles/plugin-Bro-SMTP.dir/SMTP.cc.o
/usr/src/RPM/BUILD/bro-2.3.1/src/analyzer/protocol/smtp/SMTP.cc:86:24: warning: invalid suffix on literal; C++11 requires a space between literal and string macro [-Wliteral-suffix]
  const char* buf = fmt("seq = %"PRIu64", len = %d", seq, len);
                        ^
[ 53%] Building CXX object src/analyzer/protocol/smtp/CMakeFiles/plugin-Bro-SMTP.dir/Plugin.cc.o
[ 53%] Building CXX object src/analyzer/protocol/smtp/CMakeFiles/plugin-Bro-SMTP.dir/events.bif.cc.o
[ 54%] Building CXX object src/analyzer/protocol/smtp/CMakeFiles/plugin-Bro-SMTP.dir/events.bif.init.cc.o
[ 54%] Building CXX object src/analyzer/protocol/smtp/CMakeFiles/plugin-Bro-SMTP.dir/functions.bif.cc.o
[ 54%] Building CXX object src/analyzer/protocol/smtp/CMakeFiles/plugin-Bro-SMTP.dir/functions.bif.init.cc.o
[ 54%] Linking CXX static library libplugin-Bro-SMTP.a
make[3]: Leaving directory '/usr/src/RPM/BUILD/bro-2.3.1/build'
[ 54%] Built target plugin-Bro-SMTP
make[3]: Entering directory '/usr/src/RPM/BUILD/bro-2.3.1/build'
Scanning dependencies of target plugin-Bro-SOCKS
make[3]: Leaving directory '/usr/src/RPM/BUILD/bro-2.3.1/build'
make[3]: Entering directory '/usr/src/RPM/BUILD/bro-2.3.1/build'
[ 54%] Building CXX object src/analyzer/protocol/socks/CMakeFiles/plugin-Bro-SOCKS.dir/SOCKS.cc.o
[ 54%] Building CXX object src/analyzer/protocol/socks/CMakeFiles/plugin-Bro-SOCKS.dir/Plugin.cc.o
[ 54%] Building CXX object src/analyzer/protocol/socks/CMakeFiles/plugin-Bro-SOCKS.dir/events.bif.cc.o
[ 54%] Building CXX object src/analyzer/protocol/socks/CMakeFiles/plugin-Bro-SOCKS.dir/events.bif.init.cc.o
[ 54%] Building CXX object src/analyzer/protocol/socks/CMakeFiles/plugin-Bro-SOCKS.dir/socks_pac.cc.o
[ 54%] Linking CXX static library libplugin-Bro-SOCKS.a
make[3]: Leaving directory '/usr/src/RPM/BUILD/bro-2.3.1/build'
[ 55%] Built target plugin-Bro-SOCKS
make[3]: Entering directory '/usr/src/RPM/BUILD/bro-2.3.1/build'
Scanning dependencies of target plugin-Bro-SSH
make[3]: Leaving directory '/usr/src/RPM/BUILD/bro-2.3.1/build'
make[3]: Entering directory '/usr/src/RPM/BUILD/bro-2.3.1/build'
[ 55%] Building CXX object src/analyzer/protocol/ssh/CMakeFiles/plugin-Bro-SSH.dir/SSH.cc.o
[ 55%] Building CXX object src/analyzer/protocol/ssh/CMakeFiles/plugin-Bro-SSH.dir/Plugin.cc.o
[ 55%] Building CXX object src/analyzer/protocol/ssh/CMakeFiles/plugin-Bro-SSH.dir/events.bif.cc.o
[ 55%] Building CXX object src/analyzer/protocol/ssh/CMakeFiles/plugin-Bro-SSH.dir/events.bif.init.cc.o
[ 55%] Linking CXX static library libplugin-Bro-SSH.a
make[3]: Leaving directory '/usr/src/RPM/BUILD/bro-2.3.1/build'
[ 56%] Built target plugin-Bro-SSH
make[3]: Entering directory '/usr/src/RPM/BUILD/bro-2.3.1/build'
Scanning dependencies of target plugin-Bro-SSL
make[3]: Leaving directory '/usr/src/RPM/BUILD/bro-2.3.1/build'
make[3]: Entering directory '/usr/src/RPM/BUILD/bro-2.3.1/build'
[ 57%] Building CXX object src/analyzer/protocol/ssl/CMakeFiles/plugin-Bro-SSL.dir/SSL.cc.o
[ 57%] Building CXX object src/analyzer/protocol/ssl/CMakeFiles/plugin-Bro-SSL.dir/Plugin.cc.o
[ 57%] Building CXX object src/analyzer/protocol/ssl/CMakeFiles/plugin-Bro-SSL.dir/events.bif.cc.o
[ 57%] Building CXX object src/analyzer/protocol/ssl/CMakeFiles/plugin-Bro-SSL.dir/events.bif.init.cc.o
[ 57%] Building CXX object src/analyzer/protocol/ssl/CMakeFiles/plugin-Bro-SSL.dir/ssl_pac.cc.o
[ 57%] Linking CXX static library libplugin-Bro-SSL.a
make[3]: Leaving directory '/usr/src/RPM/BUILD/bro-2.3.1/build'
[ 57%] Built target plugin-Bro-SSL
make[3]: Entering directory '/usr/src/RPM/BUILD/bro-2.3.1/build'
Scanning dependencies of target plugin-Bro-SteppingStone
make[3]: Leaving directory '/usr/src/RPM/BUILD/bro-2.3.1/build'
make[3]: Entering directory '/usr/src/RPM/BUILD/bro-2.3.1/build'
[ 58%] Building CXX object src/analyzer/protocol/stepping-stone/CMakeFiles/plugin-Bro-SteppingStone.dir/SteppingStone.cc.o
[ 58%] Building CXX object src/analyzer/protocol/stepping-stone/CMakeFiles/plugin-Bro-SteppingStone.dir/Plugin.cc.o
[ 58%] Building CXX object src/analyzer/protocol/stepping-stone/CMakeFiles/plugin-Bro-SteppingStone.dir/events.bif.cc.o
[ 58%] Building CXX object src/analyzer/protocol/stepping-stone/CMakeFiles/plugin-Bro-SteppingStone.dir/events.bif.init.cc.o
[ 58%] Linking CXX static library libplugin-Bro-SteppingStone.a
make[3]: Leaving directory '/usr/src/RPM/BUILD/bro-2.3.1/build'
[ 58%] Built target plugin-Bro-SteppingStone
make[3]: Entering directory '/usr/src/RPM/BUILD/bro-2.3.1/build'
Scanning dependencies of target plugin-Bro-Syslog
make[3]: Leaving directory '/usr/src/RPM/BUILD/bro-2.3.1/build'
make[3]: Entering directory '/usr/src/RPM/BUILD/bro-2.3.1/build'
[ 58%] Building CXX object src/analyzer/protocol/syslog/CMakeFiles/plugin-Bro-Syslog.dir/Syslog.cc.o
[ 59%] Building CXX object src/analyzer/protocol/syslog/CMakeFiles/plugin-Bro-Syslog.dir/Plugin.cc.o
[ 59%] Building CXX object src/analyzer/protocol/syslog/CMakeFiles/plugin-Bro-Syslog.dir/events.bif.cc.o
[ 59%] Building CXX object src/analyzer/protocol/syslog/CMakeFiles/plugin-Bro-Syslog.dir/events.bif.init.cc.o
[ 59%] Building CXX object src/analyzer/protocol/syslog/CMakeFiles/plugin-Bro-Syslog.dir/syslog_pac.cc.o
[ 59%] Linking CXX static library libplugin-Bro-Syslog.a
make[3]: Leaving directory '/usr/src/RPM/BUILD/bro-2.3.1/build'
[ 59%] Built target plugin-Bro-Syslog
make[3]: Entering directory '/usr/src/RPM/BUILD/bro-2.3.1/build'
Scanning dependencies of target plugin-Bro-TCP
make[3]: Leaving directory '/usr/src/RPM/BUILD/bro-2.3.1/build'
make[3]: Entering directory '/usr/src/RPM/BUILD/bro-2.3.1/build'
[ 59%] Building CXX object src/analyzer/protocol/tcp/CMakeFiles/plugin-Bro-TCP.dir/TCP.cc.o
/usr/src/RPM/BUILD/bro-2.3.1/src/analyzer/protocol/tcp/TCP.cc:1904:24: warning: invalid suffix on literal; C++11 requires a space between literal and string macro [-Wliteral-suffix]
  DBG_LOG(DBG_ANALYZER, "TCP_ApplicationAnalyzer ignoring DeliverPacket(%d, %s, %"PRIu64", %p, %d) [%s%s]",
                        ^
/usr/src/RPM/BUILD/bro-2.3.1/src/analyzer/protocol/tcp/TCP.cc:2056:13: warning: invalid suffix on literal; C++11 requires a space between literal and string macro [-Wliteral-suffix]
   DEBUG_MSG("%.6f rexmit %"PRIu64" + %d <= %"PRIu64" data_in_flight = %d\n",
             ^
/usr/src/RPM/BUILD/bro-2.3.1/src/analyzer/protocol/tcp/TCP.cc:2056:34: warning: invalid suffix on literal; C++11 requires a space between literal and string macro [-Wliteral-suffix]
   DEBUG_MSG("%.6f rexmit %"PRIu64" + %d <= %"PRIu64" data_in_flight = %d\n",
                                  ^
[ 60%] Building CXX object src/analyzer/protocol/tcp/CMakeFiles/plugin-Bro-TCP.dir/TCP_Endpoint.cc.o
[ 60%] Building CXX object src/analyzer/protocol/tcp/CMakeFiles/plugin-Bro-TCP.dir/TCP_Reassembler.cc.o
/usr/src/RPM/BUILD/bro-2.3.1/src/analyzer/protocol/tcp/TCP_Reassembler.cc:152:13: warning: invalid suffix on literal; C++11 requires a space between literal and string macro [-Wliteral-suffix]
   DEBUG_MSG("%.6f Undelivered: IsOrig()=%d up_to_seq=%"PRIu64", last_reassm=%"PRIu64", "
             ^
/usr/src/RPM/BUILD/bro-2.3.1/src/analyzer/protocol/tcp/TCP_Reassembler.cc:152:62: warning: invalid suffix on literal; C++11 requires a space between literal and string macro [-Wliteral-suffix]
   DEBUG_MSG("%.6f Undelivered: IsOrig()=%d up_to_seq=%"PRIu64", last_reassm=%"PRIu64", "
                                                              ^
/usr/src/RPM/BUILD/bro-2.3.1/src/analyzer/protocol/tcp/TCP_Reassembler.cc:183:14: warning: invalid suffix on literal; C++11 requires a space between literal and string macro [-Wliteral-suffix]
    DEBUG_MSG("%.6f Undelivered: IsOrig()=%d, seq=%"PRIu64", len=%"PRIu64", "
              ^
/usr/src/RPM/BUILD/bro-2.3.1/src/analyzer/protocol/tcp/TCP_Reassembler.cc:183:58: warning: invalid suffix on literal; C++11 requires a space between literal and string macro [-Wliteral-suffix]
    DEBUG_MSG("%.6f Undelivered: IsOrig()=%d, seq=%"PRIu64", len=%"PRIu64", "
                                                          ^
/usr/src/RPM/BUILD/bro-2.3.1/src/analyzer/protocol/tcp/TCP_Reassembler.cc:326:20: warning: invalid suffix on literal; C++11 requires a space between literal and string macro [-Wliteral-suffix]
  if ( f->Write(fmt("\n<<gap %"PRIu64">>\n", upper_seq - start_seq)) )
                    ^
/usr/src/RPM/BUILD/bro-2.3.1/src/analyzer/protocol/tcp/TCP_Reassembler.cc:396:13: warning: invalid suffix on literal; C++11 requires a space between literal and string macro [-Wliteral-suffix]
   DEBUG_MSG("%.6f TCP contents overlap: %"PRIu64" IsOrig()=%d\n", network_time,  n, IsOrig());
             ^
/usr/src/RPM/BUILD/bro-2.3.1/src/analyzer/protocol/tcp/TCP_Reassembler.cc:441:13: warning: invalid suffix on literal; C++11 requires a space between literal and string macro [-Wliteral-suffix]
   DEBUG_MSG("%.6f DataSent: IsOrig()=%d seq=%"PRIu64" upper=%"PRIu64" ack=%"PRIu64"\n",
             ^
/usr/src/RPM/BUILD/bro-2.3.1/src/analyzer/protocol/tcp/TCP_Reassembler.cc:441:53: warning: invalid suffix on literal; C++11 requires a space between literal and string macro [-Wliteral-suffix]
   DEBUG_MSG("%.6f DataSent: IsOrig()=%d seq=%"PRIu64" upper=%"PRIu64" ack=%"PRIu64"\n",
                                                     ^
/usr/src/RPM/BUILD/bro-2.3.1/src/analyzer/protocol/tcp/TCP_Reassembler.cc:441:69: warning: invalid suffix on literal; C++11 requires a space between literal and string macro [-Wliteral-suffix]
   DEBUG_MSG("%.6f DataSent: IsOrig()=%d seq=%"PRIu64" upper=%"PRIu64" ack=%"PRIu64"\n",
                                                                     ^
[ 60%] Building CXX object src/analyzer/protocol/tcp/CMakeFiles/plugin-Bro-TCP.dir/ContentLine.cc.o
[ 60%] Building CXX object src/analyzer/protocol/tcp/CMakeFiles/plugin-Bro-TCP.dir/Stats.cc.o
[ 60%] Building CXX object src/analyzer/protocol/tcp/CMakeFiles/plugin-Bro-TCP.dir/Plugin.cc.o
[ 60%] Building CXX object src/analyzer/protocol/tcp/CMakeFiles/plugin-Bro-TCP.dir/events.bif.cc.o
[ 60%] Building CXX object src/analyzer/protocol/tcp/CMakeFiles/plugin-Bro-TCP.dir/events.bif.init.cc.o
[ 60%] Building CXX object src/analyzer/protocol/tcp/CMakeFiles/plugin-Bro-TCP.dir/functions.bif.cc.o
[ 61%] Building CXX object src/analyzer/protocol/tcp/CMakeFiles/plugin-Bro-TCP.dir/functions.bif.init.cc.o
[ 61%] Linking CXX static library libplugin-Bro-TCP.a
make[3]: Leaving directory '/usr/src/RPM/BUILD/bro-2.3.1/build'
[ 61%] Built target plugin-Bro-TCP
make[3]: Entering directory '/usr/src/RPM/BUILD/bro-2.3.1/build'
Scanning dependencies of target plugin-Bro-Teredo
make[3]: Leaving directory '/usr/src/RPM/BUILD/bro-2.3.1/build'
make[3]: Entering directory '/usr/src/RPM/BUILD/bro-2.3.1/build'
[ 61%] Building CXX object src/analyzer/protocol/teredo/CMakeFiles/plugin-Bro-Teredo.dir/Teredo.cc.o
[ 61%] Building CXX object src/analyzer/protocol/teredo/CMakeFiles/plugin-Bro-Teredo.dir/Plugin.cc.o
[ 61%] Building CXX object src/analyzer/protocol/teredo/CMakeFiles/plugin-Bro-Teredo.dir/events.bif.cc.o
[ 61%] Building CXX object src/analyzer/protocol/teredo/CMakeFiles/plugin-Bro-Teredo.dir/events.bif.init.cc.o
[ 61%] Linking CXX static library libplugin-Bro-Teredo.a
make[3]: Leaving directory '/usr/src/RPM/BUILD/bro-2.3.1/build'
[ 61%] Built target plugin-Bro-Teredo
make[3]: Entering directory '/usr/src/RPM/BUILD/bro-2.3.1/build'
Scanning dependencies of target plugin-Bro-UDP
make[3]: Leaving directory '/usr/src/RPM/BUILD/bro-2.3.1/build'
make[3]: Entering directory '/usr/src/RPM/BUILD/bro-2.3.1/build'
[ 61%] Building CXX object src/analyzer/protocol/udp/CMakeFiles/plugin-Bro-UDP.dir/UDP.cc.o
[ 61%] Building CXX object src/analyzer/protocol/udp/CMakeFiles/plugin-Bro-UDP.dir/Plugin.cc.o
[ 61%] Building CXX object src/analyzer/protocol/udp/CMakeFiles/plugin-Bro-UDP.dir/events.bif.cc.o
[ 61%] Building CXX object src/analyzer/protocol/udp/CMakeFiles/plugin-Bro-UDP.dir/events.bif.init.cc.o
[ 61%] Linking CXX static library libplugin-Bro-UDP.a
make[3]: Leaving directory '/usr/src/RPM/BUILD/bro-2.3.1/build'
[ 62%] Built target plugin-Bro-UDP
make[3]: Entering directory '/usr/src/RPM/BUILD/bro-2.3.1/build'
Scanning dependencies of target plugin-Bro-ZIP
make[3]: Leaving directory '/usr/src/RPM/BUILD/bro-2.3.1/build'
make[3]: Entering directory '/usr/src/RPM/BUILD/bro-2.3.1/build'
[ 63%] Building CXX object src/analyzer/protocol/zip/CMakeFiles/plugin-Bro-ZIP.dir/ZIP.cc.o
[ 63%] Building CXX object src/analyzer/protocol/zip/CMakeFiles/plugin-Bro-ZIP.dir/Plugin.cc.o
[ 63%] Building CXX object src/analyzer/protocol/zip/CMakeFiles/plugin-Bro-ZIP.dir/events.bif.cc.o
[ 63%] Building CXX object src/analyzer/protocol/zip/CMakeFiles/plugin-Bro-ZIP.dir/events.bif.init.cc.o
[ 63%] Linking CXX static library libplugin-Bro-ZIP.a
make[3]: Leaving directory '/usr/src/RPM/BUILD/bro-2.3.1/build'
[ 63%] Built target plugin-Bro-ZIP
make[3]: Entering directory '/usr/src/RPM/BUILD/bro-2.3.1/build'
Scanning dependencies of target bro_file_analysis
make[3]: Leaving directory '/usr/src/RPM/BUILD/bro-2.3.1/build'
make[3]: Entering directory '/usr/src/RPM/BUILD/bro-2.3.1/build'
[ 63%] Building CXX object src/file_analysis/CMakeFiles/bro_file_analysis.dir/Manager.cc.o
[ 63%] Building CXX object src/file_analysis/CMakeFiles/bro_file_analysis.dir/File.cc.o
[ 63%] Building CXX object src/file_analysis/CMakeFiles/bro_file_analysis.dir/FileTimer.cc.o
[ 63%] Building CXX object src/file_analysis/CMakeFiles/bro_file_analysis.dir/Analyzer.cc.o
[ 63%] Building CXX object src/file_analysis/CMakeFiles/bro_file_analysis.dir/AnalyzerSet.cc.o
[ 63%] Building CXX object src/file_analysis/CMakeFiles/bro_file_analysis.dir/Component.cc.o
[ 64%] Building CXX object src/file_analysis/CMakeFiles/bro_file_analysis.dir/Tag.cc.o
[ 64%] Building CXX object src/file_analysis/CMakeFiles/bro_file_analysis.dir/file_analysis.bif.cc.o
[ 64%] Linking CXX static library libbro_file_analysis.a
make[3]: Leaving directory '/usr/src/RPM/BUILD/bro-2.3.1/build'
[ 64%] Built target bro_file_analysis
make[3]: Entering directory '/usr/src/RPM/BUILD/bro-2.3.1/build'
Scanning dependencies of target plugin-Bro-FileDataEvent
make[3]: Leaving directory '/usr/src/RPM/BUILD/bro-2.3.1/build'
make[3]: Entering directory '/usr/src/RPM/BUILD/bro-2.3.1/build'
[ 64%] Building CXX object src/file_analysis/analyzer/data_event/CMakeFiles/plugin-Bro-FileDataEvent.dir/DataEvent.cc.o
[ 65%] Building CXX object src/file_analysis/analyzer/data_event/CMakeFiles/plugin-Bro-FileDataEvent.dir/Plugin.cc.o
[ 65%] Building CXX object src/file_analysis/analyzer/data_event/CMakeFiles/plugin-Bro-FileDataEvent.dir/__/__/Analyzer.cc.o
[ 65%] Linking CXX static library libplugin-Bro-FileDataEvent.a
make[3]: Leaving directory '/usr/src/RPM/BUILD/bro-2.3.1/build'
[ 65%] Built target plugin-Bro-FileDataEvent
make[3]: Entering directory '/usr/src/RPM/BUILD/bro-2.3.1/build'
Scanning dependencies of target plugin-Bro-FileExtract
make[3]: Leaving directory '/usr/src/RPM/BUILD/bro-2.3.1/build'
make[3]: Entering directory '/usr/src/RPM/BUILD/bro-2.3.1/build'
[ 65%] Building CXX object src/file_analysis/analyzer/extract/CMakeFiles/plugin-Bro-FileExtract.dir/Extract.cc.o
[ 65%] Building CXX object src/file_analysis/analyzer/extract/CMakeFiles/plugin-Bro-FileExtract.dir/Plugin.cc.o
[ 65%] Building CXX object src/file_analysis/analyzer/extract/CMakeFiles/plugin-Bro-FileExtract.dir/__/__/Analyzer.cc.o
[ 66%] Building CXX object src/file_analysis/analyzer/extract/CMakeFiles/plugin-Bro-FileExtract.dir/events.bif.cc.o
[ 66%] Building CXX object src/file_analysis/analyzer/extract/CMakeFiles/plugin-Bro-FileExtract.dir/events.bif.init.cc.o
[ 66%] Building CXX object src/file_analysis/analyzer/extract/CMakeFiles/plugin-Bro-FileExtract.dir/functions.bif.cc.o
[ 66%] Building CXX object src/file_analysis/analyzer/extract/CMakeFiles/plugin-Bro-FileExtract.dir/functions.bif.init.cc.o
[ 66%] Linking CXX static library libplugin-Bro-FileExtract.a
make[3]: Leaving directory '/usr/src/RPM/BUILD/bro-2.3.1/build'
[ 66%] Built target plugin-Bro-FileExtract
make[3]: Entering directory '/usr/src/RPM/BUILD/bro-2.3.1/build'
Scanning dependencies of target plugin-Bro-FileHash
make[3]: Leaving directory '/usr/src/RPM/BUILD/bro-2.3.1/build'
make[3]: Entering directory '/usr/src/RPM/BUILD/bro-2.3.1/build'
[ 66%] Building CXX object src/file_analysis/analyzer/hash/CMakeFiles/plugin-Bro-FileHash.dir/Hash.cc.o
[ 66%] Building CXX object src/file_analysis/analyzer/hash/CMakeFiles/plugin-Bro-FileHash.dir/Plugin.cc.o
[ 67%] Building CXX object src/file_analysis/analyzer/hash/CMakeFiles/plugin-Bro-FileHash.dir/__/__/Analyzer.cc.o
[ 67%] Building CXX object src/file_analysis/analyzer/hash/CMakeFiles/plugin-Bro-FileHash.dir/events.bif.cc.o
[ 67%] Building CXX object src/file_analysis/analyzer/hash/CMakeFiles/plugin-Bro-FileHash.dir/events.bif.init.cc.o
[ 67%] Linking CXX static library libplugin-Bro-FileHash.a
make[3]: Leaving directory '/usr/src/RPM/BUILD/bro-2.3.1/build'
[ 67%] Built target plugin-Bro-FileHash
make[3]: Entering directory '/usr/src/RPM/BUILD/bro-2.3.1/build'
Scanning dependencies of target plugin-Bro-Unified2
make[3]: Leaving directory '/usr/src/RPM/BUILD/bro-2.3.1/build'
make[3]: Entering directory '/usr/src/RPM/BUILD/bro-2.3.1/build'
[ 67%] Building CXX object src/file_analysis/analyzer/unified2/CMakeFiles/plugin-Bro-Unified2.dir/Unified2.cc.o
[ 67%] Building CXX object src/file_analysis/analyzer/unified2/CMakeFiles/plugin-Bro-Unified2.dir/Plugin.cc.o
[ 67%] Building CXX object src/file_analysis/analyzer/unified2/CMakeFiles/plugin-Bro-Unified2.dir/__/__/Analyzer.cc.o
[ 67%] Building CXX object src/file_analysis/analyzer/unified2/CMakeFiles/plugin-Bro-Unified2.dir/events.bif.cc.o
[ 67%] Building CXX object src/file_analysis/analyzer/unified2/CMakeFiles/plugin-Bro-Unified2.dir/events.bif.init.cc.o
[ 67%] Building CXX object src/file_analysis/analyzer/unified2/CMakeFiles/plugin-Bro-Unified2.dir/types.bif.cc.o
[ 68%] Building CXX object src/file_analysis/analyzer/unified2/CMakeFiles/plugin-Bro-Unified2.dir/types.bif.init.cc.o
[ 68%] Building CXX object src/file_analysis/analyzer/unified2/CMakeFiles/plugin-Bro-Unified2.dir/unified2_pac.cc.o
[ 68%] Linking CXX static library libplugin-Bro-Unified2.a
make[3]: Leaving directory '/usr/src/RPM/BUILD/bro-2.3.1/build'
[ 69%] Built target plugin-Bro-Unified2
make[3]: Entering directory '/usr/src/RPM/BUILD/bro-2.3.1/build'
Scanning dependencies of target plugin-Bro-X509
make[3]: Leaving directory '/usr/src/RPM/BUILD/bro-2.3.1/build'
make[3]: Entering directory '/usr/src/RPM/BUILD/bro-2.3.1/build'
[ 69%] Building CXX object src/file_analysis/analyzer/x509/CMakeFiles/plugin-Bro-X509.dir/X509.cc.o
/usr/src/RPM/BUILD/bro-2.3.1/src/file_analysis/analyzer/x509/X509.cc: In static member function 'static RecordVal* file_analysis::X509::ParseCertificate(file_analysis::X509Val*)':
/usr/src/RPM/BUILD/bro-2.3.1/src/file_analysis/analyzer/x509/X509.cc:118:43: error: invalid use of incomplete type 'X509' {aka 'struct x509_st'}
  if ( ! i2t_ASN1_OBJECT(buf, 255, ssl_cert->cert_info->key->algor->algorithm) )
                                           ^~
In file included from /usr/include/openssl/evp.h:14,
                 from /usr/src/RPM/BUILD/bro-2.3.1/src/file_analysis/../File.h:15,
                 from /usr/src/RPM/BUILD/bro-2.3.1/src/file_analysis/analyzer/x509/X509.h:9,
                 from /usr/src/RPM/BUILD/bro-2.3.1/src/file_analysis/analyzer/x509/X509.cc:5:
/usr/include/openssl/ossl_typ.h:119:16: note: forward declaration of 'X509' {aka 'struct x509_st'}
 typedef struct x509_st X509;
                ^~~~~~~
/usr/src/RPM/BUILD/bro-2.3.1/src/file_analysis/analyzer/x509/X509.cc:123:43: error: invalid use of incomplete type 'X509' {aka 'struct x509_st'}
  if ( ! i2t_ASN1_OBJECT(buf, 255, ssl_cert->sig_alg->algorithm) )
                                           ^~
In file included from /usr/include/openssl/evp.h:14,
                 from /usr/src/RPM/BUILD/bro-2.3.1/src/file_analysis/../File.h:15,
                 from /usr/src/RPM/BUILD/bro-2.3.1/src/file_analysis/analyzer/x509/X509.h:9,
                 from /usr/src/RPM/BUILD/bro-2.3.1/src/file_analysis/analyzer/x509/X509.cc:5:
/usr/include/openssl/ossl_typ.h:119:16: note: forward declaration of 'X509' {aka 'struct x509_st'}
 typedef struct x509_st X509;
                ^~~~~~~
/usr/src/RPM/BUILD/bro-2.3.1/src/file_analysis/analyzer/x509/X509.cc:132:12: error: invalid use of incomplete type 'EVP_PKEY' {aka 'struct evp_pkey_st'}
   if ( pkey->type == EVP_PKEY_DSA )
            ^~
In file included from /usr/include/openssl/evp.h:14,
                 from /usr/src/RPM/BUILD/bro-2.3.1/src/file_analysis/../File.h:15,
                 from /usr/src/RPM/BUILD/bro-2.3.1/src/file_analysis/analyzer/x509/X509.h:9,
                 from /usr/src/RPM/BUILD/bro-2.3.1/src/file_analysis/analyzer/x509/X509.cc:5:
/usr/include/openssl/ossl_typ.h:93:16: note: forward declaration of 'EVP_PKEY' {aka 'struct evp_pkey_st'}
 typedef struct evp_pkey_st EVP_PKEY;
                ^~~~~~~~~~~
/usr/src/RPM/BUILD/bro-2.3.1/src/file_analysis/analyzer/x509/X509.cc:135:17: error: invalid use of incomplete type 'EVP_PKEY' {aka 'struct evp_pkey_st'}
   else if ( pkey->type == EVP_PKEY_RSA )
                 ^~
In file included from /usr/include/openssl/evp.h:14,
                 from /usr/src/RPM/BUILD/bro-2.3.1/src/file_analysis/../File.h:15,
                 from /usr/src/RPM/BUILD/bro-2.3.1/src/file_analysis/analyzer/x509/X509.h:9,
                 from /usr/src/RPM/BUILD/bro-2.3.1/src/file_analysis/analyzer/x509/X509.cc:5:
/usr/include/openssl/ossl_typ.h:93:16: note: forward declaration of 'EVP_PKEY' {aka 'struct evp_pkey_st'}
 typedef struct evp_pkey_st EVP_PKEY;
                ^~~~~~~~~~~
/usr/src/RPM/BUILD/bro-2.3.1/src/file_analysis/analyzer/x509/X509.cc:139:35: error: invalid use of incomplete type 'EVP_PKEY' {aka 'struct evp_pkey_st'}
    char *exponent = BN_bn2dec(pkey->pkey.rsa->e);
                                   ^~
In file included from /usr/include/openssl/evp.h:14,
                 from /usr/src/RPM/BUILD/bro-2.3.1/src/file_analysis/../File.h:15,
                 from /usr/src/RPM/BUILD/bro-2.3.1/src/file_analysis/analyzer/x509/X509.h:9,
                 from /usr/src/RPM/BUILD/bro-2.3.1/src/file_analysis/analyzer/x509/X509.cc:5:
/usr/include/openssl/ossl_typ.h:93:16: note: forward declaration of 'EVP_PKEY' {aka 'struct evp_pkey_st'}
 typedef struct evp_pkey_st EVP_PKEY;
                ^~~~~~~~~~~
/usr/src/RPM/BUILD/bro-2.3.1/src/file_analysis/analyzer/x509/X509.cc:148:17: error: invalid use of incomplete type 'EVP_PKEY' {aka 'struct evp_pkey_st'}
   else if ( pkey->type == EVP_PKEY_EC )
                 ^~
In file included from /usr/include/openssl/evp.h:14,
                 from /usr/src/RPM/BUILD/bro-2.3.1/src/file_analysis/../File.h:15,
                 from /usr/src/RPM/BUILD/bro-2.3.1/src/file_analysis/analyzer/x509/X509.h:9,
                 from /usr/src/RPM/BUILD/bro-2.3.1/src/file_analysis/analyzer/x509/X509.cc:5:
/usr/include/openssl/ossl_typ.h:93:16: note: forward declaration of 'EVP_PKEY' {aka 'struct evp_pkey_st'}
 typedef struct evp_pkey_st EVP_PKEY;
                ^~~~~~~~~~~
/usr/src/RPM/BUILD/bro-2.3.1/src/file_analysis/analyzer/x509/X509.cc: In member function 'void file_analysis::X509::ParseExtension(X509_EXTENSION*)':
/usr/src/RPM/BUILD/bro-2.3.1/src/file_analysis/analyzer/x509/X509.cc:224:35: error: invalid use of incomplete type 'X509_EXTENSION' {aka 'struct X509_extension_st'}
   M_ASN1_OCTET_STRING_print(bio,ex->value);
                                   ^~
In file included from /usr/include/openssl/pem.h:17,
                 from /usr/src/RPM/BUILD/bro-2.3.1/src/file_analysis/../File.h:16,
                 from /usr/src/RPM/BUILD/bro-2.3.1/src/file_analysis/analyzer/x509/X509.h:9,
                 from /usr/src/RPM/BUILD/bro-2.3.1/src/file_analysis/analyzer/x509/X509.cc:5:
/usr/include/openssl/x509.h:79:16: note: forward declaration of 'X509_EXTENSION' {aka 'struct X509_extension_st'}
 typedef struct X509_extension_st X509_EXTENSION;
                ^~~~~~~~~~~~~~~~~
/usr/src/RPM/BUILD/bro-2.3.1/src/file_analysis/analyzer/x509/X509.cc:224:3: error: 'M_ASN1_OCTET_STRING_print' was not declared in this scope
   M_ASN1_OCTET_STRING_print(bio,ex->value);
   ^~~~~~~~~~~~~~~~~~~~~~~~~
/usr/src/RPM/BUILD/bro-2.3.1/src/file_analysis/analyzer/x509/X509.cc:224:3: note: suggested alternative: 'ASN1_OCTET_STRING_it'
   M_ASN1_OCTET_STRING_print(bio,ex->value);
   ^~~~~~~~~~~~~~~~~~~~~~~~~
   ASN1_OCTET_STRING_it
/usr/src/RPM/BUILD/bro-2.3.1/src/file_analysis/analyzer/x509/X509.cc: In member function 'void file_analysis::X509::ParseSAN(X509_EXTENSION*)':
/usr/src/RPM/BUILD/bro-2.3.1/src/file_analysis/analyzer/x509/X509.cc:318:64: warning: 'unsigned char* ASN1_STRING_data(ASN1_STRING*)' is deprecated [-Wdeprecated-declarations]
    const char* name = (const char*) ASN1_STRING_data(gen->d.ia5);
                                                                ^
In file included from /usr/include/openssl/evp.h:13,
                 from /usr/src/RPM/BUILD/bro-2.3.1/src/file_analysis/../File.h:15,
                 from /usr/src/RPM/BUILD/bro-2.3.1/src/file_analysis/analyzer/x509/X509.h:9,
                 from /usr/src/RPM/BUILD/bro-2.3.1/src/file_analysis/analyzer/x509/X509.cc:5:
/usr/include/openssl/asn1.h:553:1: note: declared here
 DEPRECATEDIN_1_1_0(unsigned char *ASN1_STRING_data(ASN1_STRING *x))
 ^~~~~~~~~~~~~~~~~~
/usr/src/RPM/BUILD/bro-2.3.1/src/file_analysis/analyzer/x509/X509.cc:318:64: warning: 'unsigned char* ASN1_STRING_data(ASN1_STRING*)' is deprecated [-Wdeprecated-declarations]
    const char* name = (const char*) ASN1_STRING_data(gen->d.ia5);
                                                                ^
In file included from /usr/include/openssl/evp.h:13,
                 from /usr/src/RPM/BUILD/bro-2.3.1/src/file_analysis/../File.h:15,
                 from /usr/src/RPM/BUILD/bro-2.3.1/src/file_analysis/analyzer/x509/X509.h:9,
                 from /usr/src/RPM/BUILD/bro-2.3.1/src/file_analysis/analyzer/x509/X509.cc:5:
/usr/include/openssl/asn1.h:553:1: note: declared here
 DEPRECATEDIN_1_1_0(unsigned char *ASN1_STRING_data(ASN1_STRING *x))
 ^~~~~~~~~~~~~~~~~~
/usr/src/RPM/BUILD/bro-2.3.1/src/file_analysis/analyzer/x509/X509.cc: In static member function 'static StringVal* file_analysis::X509::KeyCurve(EVP_PKEY*)':
/usr/src/RPM/BUILD/bro-2.3.1/src/file_analysis/analyzer/x509/X509.cc:406:10: error: invalid use of incomplete type 'EVP_PKEY' {aka 'struct evp_pkey_st'}
  if ( key->type != EVP_PKEY_EC )
          ^~
In file included from /usr/include/openssl/evp.h:14,
                 from /usr/src/RPM/BUILD/bro-2.3.1/src/file_analysis/../File.h:15,
                 from /usr/src/RPM/BUILD/bro-2.3.1/src/file_analysis/analyzer/x509/X509.h:9,
                 from /usr/src/RPM/BUILD/bro-2.3.1/src/file_analysis/analyzer/x509/X509.cc:5:
/usr/include/openssl/ossl_typ.h:93:16: note: forward declaration of 'EVP_PKEY' {aka 'struct evp_pkey_st'}
 typedef struct evp_pkey_st EVP_PKEY;
                ^~~~~~~~~~~
/usr/src/RPM/BUILD/bro-2.3.1/src/file_analysis/analyzer/x509/X509.cc:414:37: error: invalid use of incomplete type 'EVP_PKEY' {aka 'struct evp_pkey_st'}
  if ( (group = EC_KEY_get0_group(key->pkey.ec)) == NULL)
                                     ^~
In file included from /usr/include/openssl/evp.h:14,
                 from /usr/src/RPM/BUILD/bro-2.3.1/src/file_analysis/../File.h:15,
                 from /usr/src/RPM/BUILD/bro-2.3.1/src/file_analysis/analyzer/x509/X509.h:9,
                 from /usr/src/RPM/BUILD/bro-2.3.1/src/file_analysis/analyzer/x509/X509.cc:5:
/usr/include/openssl/ossl_typ.h:93:16: note: forward declaration of 'EVP_PKEY' {aka 'struct evp_pkey_st'}
 typedef struct evp_pkey_st EVP_PKEY;
                ^~~~~~~~~~~
/usr/src/RPM/BUILD/bro-2.3.1/src/file_analysis/analyzer/x509/X509.cc: In static member function 'static unsigned int file_analysis::X509::KeyLength(EVP_PKEY*)':
/usr/src/RPM/BUILD/bro-2.3.1/src/file_analysis/analyzer/x509/X509.cc:435:12: error: invalid use of incomplete type 'EVP_PKEY' {aka 'struct evp_pkey_st'}
  switch(key->type) {
            ^~
In file included from /usr/include/openssl/evp.h:14,
                 from /usr/src/RPM/BUILD/bro-2.3.1/src/file_analysis/../File.h:15,
                 from /usr/src/RPM/BUILD/bro-2.3.1/src/file_analysis/analyzer/x509/X509.h:9,
                 from /usr/src/RPM/BUILD/bro-2.3.1/src/file_analysis/analyzer/x509/X509.cc:5:
/usr/include/openssl/ossl_typ.h:93:16: note: forward declaration of 'EVP_PKEY' {aka 'struct evp_pkey_st'}
 typedef struct evp_pkey_st EVP_PKEY;
                ^~~~~~~~~~~
/usr/src/RPM/BUILD/bro-2.3.1/src/file_analysis/analyzer/x509/X509.cc:437:25: error: invalid use of incomplete type 'EVP_PKEY' {aka 'struct evp_pkey_st'}
   return BN_num_bits(key->pkey.rsa->n);
                         ^~
In file included from /usr/include/openssl/evp.h:14,
                 from /usr/src/RPM/BUILD/bro-2.3.1/src/file_analysis/../File.h:15,
                 from /usr/src/RPM/BUILD/bro-2.3.1/src/file_analysis/analyzer/x509/X509.h:9,
                 from /usr/src/RPM/BUILD/bro-2.3.1/src/file_analysis/analyzer/x509/X509.cc:5:
/usr/include/openssl/ossl_typ.h:93:16: note: forward declaration of 'EVP_PKEY' {aka 'struct evp_pkey_st'}
 typedef struct evp_pkey_st EVP_PKEY;
                ^~~~~~~~~~~
/usr/src/RPM/BUILD/bro-2.3.1/src/file_analysis/analyzer/x509/X509.cc:440:25: error: invalid use of incomplete type 'EVP_PKEY' {aka 'struct evp_pkey_st'}
   return BN_num_bits(key->pkey.dsa->p);
                         ^~
In file included from /usr/include/openssl/evp.h:14,
                 from /usr/src/RPM/BUILD/bro-2.3.1/src/file_analysis/../File.h:15,
                 from /usr/src/RPM/BUILD/bro-2.3.1/src/file_analysis/analyzer/x509/X509.h:9,
                 from /usr/src/RPM/BUILD/bro-2.3.1/src/file_analysis/analyzer/x509/X509.cc:5:
/usr/include/openssl/ossl_typ.h:93:16: note: forward declaration of 'EVP_PKEY' {aka 'struct evp_pkey_st'}
 typedef struct evp_pkey_st EVP_PKEY;
                ^~~~~~~~~~~
/usr/src/RPM/BUILD/bro-2.3.1/src/file_analysis/analyzer/x509/X509.cc:450:48: error: invalid use of incomplete type 'EVP_PKEY' {aka 'struct evp_pkey_st'}
   const EC_GROUP *group = EC_KEY_get0_group(key->pkey.ec);
                                                ^~
In file included from /usr/include/openssl/evp.h:14,
                 from /usr/src/RPM/BUILD/bro-2.3.1/src/file_analysis/../File.h:15,
                 from /usr/src/RPM/BUILD/bro-2.3.1/src/file_analysis/analyzer/x509/X509.h:9,
                 from /usr/src/RPM/BUILD/bro-2.3.1/src/file_analysis/analyzer/x509/X509.cc:5:
/usr/include/openssl/ossl_typ.h:93:16: note: forward declaration of 'EVP_PKEY' {aka 'struct evp_pkey_st'}
 typedef struct evp_pkey_st EVP_PKEY;
                ^~~~~~~~~~~
make[3]: *** [src/file_analysis/analyzer/x509/CMakeFiles/plugin-Bro-X509.dir/build.make:111: src/file_analysis/analyzer/x509/CMakeFiles/plugin-Bro-X509.dir/X509.cc.o] Error 1
make[3]: Leaving directory '/usr/src/RPM/BUILD/bro-2.3.1/build'
make[2]: *** [CMakeFiles/Makefile2:6454: src/file_analysis/analyzer/x509/CMakeFiles/plugin-Bro-X509.dir/all] Error 2
make[2]: Leaving directory '/usr/src/RPM/BUILD/bro-2.3.1/build'
make[1]: *** [Makefile:152: all] Error 2
make[1]: Leaving directory '/usr/src/RPM/BUILD/bro-2.3.1/build'
make: *** [Makefile:15: all] Error 2
make: Leaving directory '/usr/src/RPM/BUILD/bro-2.3.1'
error: Bad exit status from /usr/src/tmp/rpm-tmp.14571 (%build)


RPM build errors:
    Bad exit status from /usr/src/tmp/rpm-tmp.14571 (%build)
Command exited with non-zero status 1
466.49user 38.50system 19:11.56elapsed 43%CPU (0avgtext+0avgdata 325540maxresident)k
0inputs+0outputs (0major+16753679minor)pagefaults 0swaps
hsh-rebuild: rebuild of `bro-2.3.1-alt8.src.rpm' failed.
Command exited with non-zero status 1
486.55user 41.58system 19:45.53elapsed 44%CPU (0avgtext+0avgdata 325540maxresident)k
2584inputs+0outputs (0major+17296265minor)pagefaults 0swaps