<86>Dec  3 01:54:45 userdel[11009]: delete user 'rooter'
<86>Dec  3 01:54:45 userdel[11009]: removed group 'rooter' owned by 'rooter'
<86>Dec  3 01:54:45 userdel[11009]: removed shadow group 'rooter' owned by 'rooter'
<86>Dec  3 01:54:45 groupadd[11026]: group added to /etc/group: name=rooter, GID=528
<86>Dec  3 01:54:45 groupadd[11026]: group added to /etc/gshadow: name=rooter
<86>Dec  3 01:54:45 groupadd[11026]: new group: name=rooter, GID=528
<86>Dec  3 01:54:45 useradd[11039]: new user: name=rooter, UID=528, GID=528, home=/root, shell=/bin/bash
<86>Dec  3 01:54:45 userdel[11055]: delete user 'builder'
<86>Dec  3 01:54:45 userdel[11055]: removed group 'builder' owned by 'builder'
<86>Dec  3 01:54:45 userdel[11055]: removed shadow group 'builder' owned by 'builder'
<86>Dec  3 01:54:45 groupadd[11060]: group added to /etc/group: name=builder, GID=529
<86>Dec  3 01:54:45 groupadd[11060]: group added to /etc/gshadow: name=builder
<86>Dec  3 01:54:45 groupadd[11060]: new group: name=builder, GID=529
<86>Dec  3 01:54:45 useradd[11067]: new user: name=builder, UID=529, GID=529, home=/usr/src, shell=/bin/bash
<13>Dec  3 01:54:50 rpmi: xorg-proto-devel-2018.4-alt3 1527685079 installed
<13>Dec  3 01:54:50 rpmi: libexpat-2.2.4-alt1 1503305341 installed
<13>Dec  3 01:54:50 rpmi: libjpeg-2:1.5.1-alt1 1498218302 installed
<13>Dec  3 01:54:50 rpmi: libglvnd-7:1.1.0-alt3 sisyphus.215982.100 1541498630 installed
<13>Dec  3 01:54:50 rpmi: libpng16-1.6.35-alt1 sisyphus.214397.100 1539159326 installed
<13>Dec  3 01:54:50 rpmi: libogg-1.3.2-alt2 sisyphus.215919.100 1540973849 installed
<13>Dec  3 01:54:50 rpmi: libICE-1.0.9-alt1 1409902719 installed
<13>Dec  3 01:54:50 rpmi: libwayland-client-1.16.0-alt1 1535614868 installed
<13>Dec  3 01:54:50 rpmi: libICE-devel-1.0.9-alt1 1409902719 installed
<13>Dec  3 01:54:50 rpmi: libSM-1.2.3-alt1 sisyphus.215747.100 1540812760 installed
<13>Dec  3 01:54:51 rpmi: libsqlite3-3.25.2-alt2 sisyphus.215082.100 1539700192 installed
<13>Dec  3 01:54:51 rpmi: zlib-devel-1.2.11-alt1 sisyphus.217171.100 1543710738 installed
<13>Dec  3 01:54:51 rpmi: qt4-common-4.8.7-alt13.S1 1535591089 installed
<13>Dec  3 01:54:51 rpmi: libqt4-core-4.8.7-alt13.S1 1535591089 installed
<13>Dec  3 01:54:51 rpmi: libqt4-sql-4.8.7-alt13.S1 1535591089 installed
<13>Dec  3 01:54:51 rpmi: libXau-1.0.8-alt1 1369565807 installed
<13>Dec  3 01:54:51 rpmi: libwayland-server-1.16.0-alt1 1535614868 installed
<13>Dec  3 01:54:52 rpmi: libicu63-1:6.3.1-alt1 sisyphus.215328.100 1540049981 installed
<13>Dec  3 01:54:52 rpmi: libgraphite2-1.3.12-alt2.1 sisyphus.215942.100 1540990747 installed
<13>Dec  3 01:54:52 rpmi: libharfbuzz-2.1.3-alt1 sisyphus.216837.100 1543085726 installed
<13>Dec  3 01:54:52 rpmi: libfreetype-2.9.1-alt1.S1 1530781049 installed
<13>Dec  3 01:54:52 rpmi: fontconfig-2.13.1-alt1 sisyphus.215917.100 1540973883 installed
Updating fonts cache: <29>Dec  3 01:54:53 fontconfig: Updating fonts cache: succeeded
[ DONE ]
<13>Dec  3 01:54:53 rpmi: libidn2-2.0.5-alt1 1526923871 installed
<13>Dec  3 01:54:53 rpmi: libharfbuzz-icu-2.1.3-alt1 sisyphus.216837.100 1543085726 installed
<13>Dec  3 01:54:53 rpmi: libgraphite2-devel-1.3.12-alt2.1 sisyphus.215942.100 1540990747 installed
<13>Dec  3 01:54:53 rpmi: icu-utils-1:6.3.1-alt1 sisyphus.215328.100 1540049981 installed
<13>Dec  3 01:54:53 rpmi: libicu-devel-1:6.3.1-alt1 sisyphus.215328.100 1540049981 installed
<13>Dec  3 01:54:53 rpmi: libXau-devel-1.0.8-alt1 1369565807 installed
<13>Dec  3 01:54:53 rpmi: libqt4-sql-sqlite-4.8.7-alt13.S1 1535591089 installed
<13>Dec  3 01:54:53 rpmi: libqt4-xml-4.8.7-alt13.S1 1535591089 installed
<13>Dec  3 01:54:53 rpmi: libqt4-clucene-4.8.7-alt13.S1 1535591089 installed
<13>Dec  3 01:54:53 rpmi: libqt4-test-4.8.7-alt13.S1 1535591089 installed
<13>Dec  3 01:54:53 rpmi: rpm-macros-qt4-4.8.7-alt13.S1 1535591089 installed
<13>Dec  3 01:54:53 rpmi: libpng-devel-1.6.35-alt1 sisyphus.214397.100 1539159326 installed
<13>Dec  3 01:54:53 rpmi: libSM-devel-1.2.3-alt1 sisyphus.215747.100 1540812760 installed
<13>Dec  3 01:54:53 rpmi: libwayland-egl-4:18.1.0-alt1 1535614868 installed
<13>Dec  3 01:54:53 rpmi: libflac8-1.3.2-alt1 1507623526 installed
<13>Dec  3 01:54:53 rpmi: libvorbis-1.3.6-alt1 1528307803 installed
<13>Dec  3 01:54:53 rpmi: libOpenGL-7:1.1.0-alt3 sisyphus.215982.100 1541498630 installed
<13>Dec  3 01:54:53 rpmi: libGLES-7:1.1.0-alt3 sisyphus.215982.100 1541498630 installed
<13>Dec  3 01:54:53 rpmi: libtiff5-4.0.3-alt1 1348347498 installed
<13>Dec  3 01:54:53 rpmi: libtinfo-devel-6.1.20180407-alt2 sisyphus.215627.200 1540831969 installed
<13>Dec  3 01:54:53 rpmi: libwebp7-1.0.1-alt1 sisyphus.216740.100 1542890906 installed
<13>Dec  3 01:54:53 rpmi: libalsa-1:1.1.7-alt1 sisyphus.215150.100 1539797654 installed
<13>Dec  3 01:54:53 rpmi: libltdl7-2.4.2-alt7 sisyphus.216946.100 1543650626 installed
<13>Dec  3 01:54:53 rpmi: libunixODBC2-2.3.4-alt2 1487857369 installed
<13>Dec  3 01:54:53 rpmi: libunixODBC-devel-compat-2.3.4-alt2 1487857369 installed
<13>Dec  3 01:54:53 rpmi: libunixODBC-devel-2.3.4-alt2 1487857369 installed
<13>Dec  3 01:54:53 rpmi: liblcms2-2.9-alt1 1516411888 installed
<13>Dec  3 01:54:53 rpmi: libmng-2.0.3-alt2 sisyphus.215736.100 1540804098 installed
<13>Dec  3 01:54:53 rpmi: liborc-0.4.28-alt1 1511201491 installed
<13>Dec  3 01:54:53 rpmi: libgudev-1:232-alt3 1523738515 installed
<13>Dec  3 01:54:53 rpmi: libgsm-1.0.17-alt1 1523356157 installed
<13>Dec  3 01:54:53 rpmi: libsndfile-1.0.28-alt2 sisyphus.212728.100 1536333060 installed
<13>Dec  3 01:54:54 rpmi: shared-mime-info-1.10-alt1.1 1530525597 installed
<13>Dec  3 01:54:54 rpmi: libedit3-3.1.20141030-alt1 1414760451 installed
<13>Dec  3 01:54:54 rpmi: liblz4-1:1.8.3-alt1 sisyphus.213737.100 1538009646 installed
<13>Dec  3 01:54:54 rpmi: libgpg-error-1.31-alt1.S1 1529015796 installed
<13>Dec  3 01:54:54 rpmi: libgcrypt20-1.8.3-alt3 sisyphus.214019.140 1538990261 installed
<13>Dec  3 01:54:54 rpmi: libsystemd-1:239-alt3 sisyphus.215710.300 1540765573 installed
<13>Dec  3 01:54:54 rpmi: libdbus-1.12.10-alt1 sisyphus.212941.100 1536831868 installed
<13>Dec  3 01:54:54 rpmi: libqt4-dbus-4.8.7-alt13.S1 1535591089 installed
<13>Dec  3 01:54:54 rpmi: libqt4-script-4.8.7-alt13.S1 1535591089 installed
<13>Dec  3 01:54:54 rpmi: libdbus-devel-1.12.10-alt1 sisyphus.212941.100 1536831868 installed
<13>Dec  3 01:54:54 rpmi: libxslt-1.1.32-alt2 1517429962 installed
<13>Dec  3 01:54:54 rpmi: libasyncns-0.8-alt2.qa1 1365949819 installed
<13>Dec  3 01:54:54 rpmi: libxshmfence-1.2-alt2 1518613549 installed
<13>Dec  3 01:54:54 rpmi: libX11-locales-3:1.6.7-alt1 sisyphus.214413.200 1539171080 installed
<13>Dec  3 01:54:54 rpmi: libXdmcp-1.1.1-alt1 1334617699 installed
<13>Dec  3 01:54:54 rpmi: libxcb-1.13.1-alt1 sisyphus.214413.100 1539170828 installed
<13>Dec  3 01:54:54 rpmi: libX11-3:1.6.7-alt1 sisyphus.214413.200 1539171080 installed
<13>Dec  3 01:54:54 rpmi: libXext-1.3.3-alt1 1409902932 installed
<13>Dec  3 01:54:54 rpmi: libXrender-0.9.8-alt1 1371312110 installed
<13>Dec  3 01:54:54 rpmi: libXfixes-5.0.3-alt1 sisyphus.216396.300 1542022144 installed
<13>Dec  3 01:54:54 rpmi: libXcursor-1.1.15-alt1.S1 1512373363 installed
<13>Dec  3 01:54:54 rpmi: libXrandr-1.5.0-alt1 1431936188 installed
<13>Dec  3 01:54:54 rpmi: libXi-1.7.9-alt1.S1 1515755338 installed
<13>Dec  3 01:54:54 rpmi: libXinerama-1.1.3-alt2 1527671624 installed
<13>Dec  3 01:54:55 rpmi: libqt4-gui-4.8.7-alt13.S1 1535591089 installed
<13>Dec  3 01:54:55 rpmi: libqt4-designer-4.8.7-alt13.S1 1535591089 installed
<13>Dec  3 01:54:55 rpmi: libqt4-svg-4.8.7-alt13.S1 1535591089 installed
<13>Dec  3 01:54:55 rpmi: libqt4-uitools-4.8.7-alt13.S1 1535591089 installed
<13>Dec  3 01:54:55 rpmi: libqt4-multimedia-4.8.7-alt13.S1 1535591089 installed
<13>Dec  3 01:54:55 rpmi: libqt4-scripttools-4.8.7-alt13.S1 1535591089 installed
<13>Dec  3 01:54:55 rpmi: libXxf86vm-1.1.4-alt2 1527672159 installed
<13>Dec  3 01:54:55 rpmi: libXtst-1.2.2-alt1 1369984880 installed
<13>Dec  3 01:54:55 rpmi: libXv-1.0.11-alt1 1527685497 installed
<13>Dec  3 01:54:55 rpmi: libXdamage-1.1.3-alt4 1297162596 installed
<13>Dec  3 01:54:57 rpmi: libxcb-devel-1.13.1-alt1 sisyphus.214413.100 1539170828 installed
<13>Dec  3 01:54:57 rpmi: libX11-devel-3:1.6.7-alt1 sisyphus.214413.200 1539171080 installed
<13>Dec  3 01:54:57 rpmi: libXext-devel-1.3.3-alt1 1409902932 installed
<13>Dec  3 01:54:57 rpmi: libXfixes-devel-5.0.3-alt1 sisyphus.216396.300 1542022144 installed
<13>Dec  3 01:54:57 rpmi: libXi-devel-1.7.9-alt1.S1 1515755338 installed
<13>Dec  3 01:54:57 rpmi: libXrender-devel-0.9.8-alt1 1371312110 installed
<13>Dec  3 01:54:57 rpmi: libXrandr-devel-1.5.0-alt1 1431936188 installed
<13>Dec  3 01:54:57 rpmi: libXtst-devel-1.2.2-alt1 1369984880 installed
<13>Dec  3 01:54:57 rpmi: libXv-devel-1.0.11-alt1 1527685497 installed
<13>Dec  3 01:54:57 rpmi: libXcursor-devel-1.1.15-alt1.S1 1512373363 installed
<13>Dec  3 01:54:57 rpmi: libXinerama-devel-1.1.3-alt2 1527671624 installed
<13>Dec  3 01:54:57 rpmi: libpulseaudio-12.2-alt1 1535623578 installed
<13>Dec  3 01:54:57 rpmi: libphonon-4.8.3-alt1 1418134063 installed
<13>Dec  3 01:54:57 rpmi: libphononexperimental-4.8.3-alt1 1418134063 installed
<13>Dec  3 01:54:57 rpmi: libpciaccess-1:0.14-alt1 1528969624 installed
<13>Dec  3 01:54:57 rpmi: libdrm-1:2.4.96-alt1 sisyphus.215486.100 1540374008 installed
<13>Dec  3 01:54:58 rpmi: libGLX-mesa-4:18.2.5-alt1 sisyphus.216532.100 1542373647 installed
<13>Dec  3 01:54:58 rpmi: libgbm-4:18.2.5-alt1 sisyphus.216532.100 1542373647 installed
<13>Dec  3 01:54:58 rpmi: libEGL-mesa-4:18.2.5-alt1 sisyphus.216532.100 1542373647 installed
<13>Dec  3 01:54:58 rpmi: libEGL-7:1.1.0-alt3 sisyphus.215982.100 1541498630 installed
<13>Dec  3 01:54:58 rpmi: libGLX-7:1.1.0-alt3 sisyphus.215982.100 1541498630 installed
<13>Dec  3 01:54:58 rpmi: libGL-7:1.1.0-alt3 sisyphus.215982.100 1541498630 installed
<13>Dec  3 01:54:58 rpmi: libqt4-opengl-4.8.7-alt13.S1 1535591089 installed
<13>Dec  3 01:54:58 rpmi: libglvnd-devel-7:1.1.0-alt3 sisyphus.215982.100 1541498630 installed
<13>Dec  3 01:54:58 rpmi: libEGL-devel-4:18.2.5-alt1 sisyphus.216532.100 1542373647 installed
<13>Dec  3 01:54:58 rpmi: libGL-devel-4:18.2.5-alt1 sisyphus.216532.100 1542373647 installed
<13>Dec  3 01:54:58 rpmi: libGLU-4:9.0.0-alt1 1347643776 installed
<13>Dec  3 01:54:58 rpmi: libGLU-devel-4:9.0.0-alt1 1347643776 installed
<13>Dec  3 01:54:58 rpmi: gsettings-desktop-schemas-data-3.28.1-alt1 sisyphus.212587.100 1536082062 installed
<13>Dec  3 01:54:58 rpmi: libgio-2.58.1-alt3 sisyphus.214034.100 1538601655 installed
<13>Dec  3 01:54:58 rpmi: gsettings-desktop-schemas-3.28.1-alt1 sisyphus.212587.100 1536082062 installed
<13>Dec  3 01:54:58 rpmi: libgstreamer1.0-1.14.4-alt1 sisyphus.214120.2200 1538778549 installed
<13>Dec  3 01:54:58 rpmi: libgst-plugins1.0-1.14.4-alt3 sisyphus.216849.100 1543144417 installed
<13>Dec  3 01:54:58 rpmi: gcc-c++-common-1.4.22-alt1 1519183788 installed
<13>Dec  3 01:54:58 rpmi: libstdc++8-devel-8.2.1-alt1 sisyphus.214000.20 1542662172 installed
<13>Dec  3 01:54:59 rpmi: gcc8-c++-8.2.1-alt1 sisyphus.214000.20 1542662172 installed
<13>Dec  3 01:54:59 rpmi: libgdbm-1.8.3-alt10 1454943313 installed
<13>Dec  3 01:54:59 rpmi: xml-utils-1:2.9.4.0.12.e905-alt1.1 1525115736 installed
<13>Dec  3 01:54:59 rpmi: rpm-build-gir-0.7.2-alt4 1534675014 installed
<13>Dec  3 01:54:59 rpmi: libuv-1.23.2-alt1 sisyphus.217108.100 1543612227 installed
<13>Dec  3 01:54:59 rpmi: librhash-1.3.5-alt2 1505156277 installed
<13>Dec  3 01:54:59 rpmi: libjsoncpp19-1.8.4-alt2.S1 1518769512 installed
<13>Dec  3 01:54:59 rpmi: publicsuffix-list-dafsa-20181106-alt1 sisyphus.216228.100 1541611754 installed
<13>Dec  3 01:54:59 rpmi: libpsl-0.20.2-alt2 sisyphus.216228.200 1541611883 installed
<13>Dec  3 01:54:59 rpmi: libnghttp2-1.34.0-alt1 sisyphus.214524.100 1539249616 installed
<13>Dec  3 01:54:59 rpmi: libverto-0.3.0-alt1_5 1525957716 installed
<13>Dec  3 01:54:59 rpmi: libkeyutils-1.6-alt1 sisyphus.217029.100 1543414265 installed
<13>Dec  3 01:54:59 rpmi: libcom_err-1.44.3-alt1 1532134713 installed
<13>Dec  3 01:54:59 rpmi: libbrotlicommon-1.0.7-alt1 sisyphus.215491.100 1540428591 installed
<13>Dec  3 01:54:59 rpmi: libbrotlidec-1.0.7-alt1 sisyphus.215491.100 1540428591 installed
<13>Dec  3 01:55:00 rpmi: libnettle6-3.4-alt1 1511790158 installed
<13>Dec  3 01:55:00 rpmi: libarchive13-3.3.1-alt1.S1 1488799499 installed
<13>Dec  3 01:55:00 rpmi: rpm-macros-cmake-3.11.2-alt2 1532003375 installed
<13>Dec  3 01:55:00 rpmi: cmake-modules-3.11.2-alt2 1532003375 installed
<13>Dec  3 01:55:00 rpmi: libtasn1-4.13-alt2 1521133848 installed
<13>Dec  3 01:55:00 rpmi: libp11-kit-0.23.9-alt5 1525798241 installed
<13>Dec  3 01:55:00 rpmi: rpm-macros-alternatives-0.4.5-alt1.1 1404382149 installed
<13>Dec  3 01:55:00 rpmi: alternatives-0.4.5-alt1.1 1404382149 installed
<13>Dec  3 01:55:00 rpmi: ca-certificates-2018.11.12-alt1 sisyphus.216395.300 1542114035 installed
<13>Dec  3 01:55:00 rpmi: ca-trust-0.1.1-alt2 1515595785 installed
<13>Dec  3 01:55:00 rpmi: p11-kit-trust-0.23.9-alt5 1525798241 installed
<13>Dec  3 01:55:00 rpmi: libcrypto1.1-1.1.0j-alt1 sisyphus.216647.100 1542743840 installed
<13>Dec  3 01:55:00 rpmi: libssl1.1-1.1.0j-alt1 sisyphus.216647.100 1542743840 installed
<13>Dec  3 01:55:00 rpmi: libpython3-3.6.5-alt1.1 1535734400 installed
<13>Dec  3 01:55:00 rpmi: rpm-build-python3-0.1.13.1-alt2 1535450458 installed
<13>Dec  3 01:55:00 rpmi: tests-for-installed-python3-pkgs-0.1.13.1-alt2 1535450458 installed
<13>Dec  3 01:55:00 rpmi: python3-3.6.5-alt1.1 1535734400 installed
<13>Dec  3 01:55:01 rpmi: python3-base-3.6.5-alt1.1 1535734400 installed
<13>Dec  3 01:55:01 rpmi: libqt4-network-4.8.7-alt13.S1 1535591089 installed
<86>Dec  3 01:55:01 groupadd[27170]: group added to /etc/group: name=_keytab, GID=499
<86>Dec  3 01:55:01 groupadd[27170]: group added to /etc/gshadow: name=_keytab
<86>Dec  3 01:55:01 groupadd[27170]: new group: name=_keytab, GID=499
<13>Dec  3 01:55:01 rpmi: libkrb5-1.16.2-alt2 sisyphus.216877.200 1543483170 installed
<86>Dec  3 01:55:01 groupadd[27213]: group added to /etc/group: name=sasl, GID=498
<86>Dec  3 01:55:01 groupadd[27213]: group added to /etc/gshadow: name=sasl
<86>Dec  3 01:55:01 groupadd[27213]: new group: name=sasl, GID=498
<13>Dec  3 01:55:01 rpmi: libsasl2-3-2.1.27-alt0.2 1535660692 installed
<13>Dec  3 01:55:01 rpmi: libldap-2.4.46-alt1 1535562096 installed
<13>Dec  3 01:55:01 rpmi: libcurl-7.62.0-alt3 sisyphus.216461.100 1542191615 installed
<13>Dec  3 01:55:01 rpmi: libqt4-qt3support-4.8.7-alt13.S1 1535591089 installed
<13>Dec  3 01:55:01 rpmi: libqt4-help-4.8.7-alt13.S1 1535591089 installed
<13>Dec  3 01:55:01 rpmi: libqt4-xmlpatterns-4.8.7-alt13.S1 1535591089 installed
<13>Dec  3 01:55:02 rpmi: libqt4-declarative-4.8.7-alt13.S1 1535591089 installed
<13>Dec  3 01:55:02 rpmi: libqt4-4.8.7-alt13.S1 1535591089 installed
<13>Dec  3 01:55:03 rpmi: libqt4-webkit-1:2.3.4-alt6 sisyphus.215264.100 1540024162 installed
<13>Dec  3 01:55:03 rpmi: glib2-devel-2.58.1-alt3 sisyphus.214034.100 1538601655 installed
<13>Dec  3 01:55:03 rpmi: libharfbuzz-devel-2.1.3-alt1 sisyphus.216837.100 1543085726 installed
<13>Dec  3 01:55:03 rpmi: libfreetype-devel-2.9.1-alt1.S1 1530781049 installed
<13>Dec  3 01:55:03 rpmi: fontconfig-devel-2.13.1-alt1 sisyphus.215917.100 1540973883 installed
<13>Dec  3 01:55:03 rpmi: libssl-devel-1.1.0j-alt1 sisyphus.216647.100 1542743840 installed
<13>Dec  3 01:55:03 rpmi: phonon-devel-4.8.3-alt1 1418134063 installed
<13>Dec  3 01:55:04 rpmi: libqt4-devel-4.8.7-alt13.S1 1535591089 installed
<13>Dec  3 01:55:04 rpmi: libqt4-webkit-devel-1:2.3.4-alt6 sisyphus.215264.100 1540024162 installed
<13>Dec  3 01:55:04 rpmi: cmake-3.11.2-alt2 1532003375 installed
<13>Dec  3 01:55:04 rpmi: libldap-devel-2.4.46-alt1 1535562096 installed
<13>Dec  3 01:55:04 rpmi: gcc-c++-8-alt1 sisyphus.214000.40 1542664792 installed
<13>Dec  3 01:55:04 rpmi: libedit-devel-3.1.20141030-alt1 1414760451 installed
<13>Dec  3 01:55:04 rpmi: desktop-file-utils-0.23-alt1 sisyphus.214313.100 1539037619 installed
<13>Dec  3 01:55:04 rpmi: flex-2.6.0-alt1 1449073214 installed
Building target platforms: x86_64
Building for target x86_64
Wrote: /usr/src/in/nosrpm/ike-2.2.1-alt1.nosrc.rpm
Installing ike-2.2.1-alt1.src.rpm
Building target platforms: x86_64
Building for target x86_64
Executing(%prep): /bin/sh -e /usr/src/tmp/rpm-tmp.40587
+ umask 022
+ /bin/mkdir -p /usr/src/RPM/BUILD
+ cd /usr/src/RPM/BUILD
+ cd /usr/src/RPM/BUILD
+ rm -rf ike-2.2.1
+ echo 'Source #0 (ike-2.2.1.tar):'
Source #0 (ike-2.2.1.tar):
+ /bin/tar -xf /usr/src/RPM/SOURCES/ike-2.2.1.tar
+ cd ike-2.2.1
+ /bin/chmod -c -Rf u+rwX,go-w .
+ echo 'Patch #1 (ike-2.2.1-paths.patch):'
Patch #1 (ike-2.2.1-paths.patch):
+ /usr/bin/patch -p1
patching file source/iked/iked.8
patching file source/iked/iked.conf.5
+ echo 'Patch #2 (ike-2.2.1-spelling.patch):'
Patch #2 (ike-2.2.1-spelling.patch):
+ /usr/bin/patch -p1
patching file source/iked/ike.exch.config.cpp
patching file source/iked/ike.names.cpp
patching file source/iked/ike.xconf.cpp
patching file source/iked/iked.conf.5
+ sed -i 's/\r//' TODO.TXT
+ exit 0
Executing(%build): /bin/sh -e /usr/src/tmp/rpm-tmp.40587
+ umask 022
+ /bin/mkdir -p /usr/src/RPM/BUILD
+ cd /usr/src/RPM/BUILD
+ cd ike-2.2.1
+ cmake . -DCMAKE_SKIP_RPATH:BOOL=ON -DCMAKE_SKIP_INSTALL_RPATH:BOOL=yes '-DCMAKE_C_FLAGS:STRING=-pipe -Wall -g -O2' '-DCMAKE_CXX_FLAGS:STRING=-pipe -Wall -g -O2' '-DCMAKE_Fortran_FLAGS:STRING=-pipe -Wall -g -O2' -DCMAKE_INSTALL_PREFIX=/usr -DINCLUDE_INSTALL_DIR:PATH=/usr/include -DLIB_INSTALL_DIR:PATH=/usr/lib64 -DSYSCONF_INSTALL_DIR:PATH=/etc -DSHARE_INSTALL_PREFIX:PATH=/usr/share -DLIB_SUFFIX=64 -DLIB_DESTINATION=lib64 -DQTGUI=YES -DNATT=YES -DCMAKE_INSTALL_PREFIX:PATH=/usr -DETCDIR:PATH=/etc -DMANDIR:PATH=/usr/share/man -DLDAP=YES -DLIBDIR=/usr/lib64
-- The C compiler identification is GNU 8.2.1
-- The CXX compiler identification is GNU 8.2.1
-- Check for working C compiler: /usr/bin/cc
-- Check for working C compiler: /usr/bin/cc -- works
-- Detecting C compiler ABI info
-- Detecting C compiler ABI info - done
-- Detecting C compile features
-- Detecting C compile features - done
-- Check for working CXX compiler: /usr/bin/c++
-- Check for working CXX compiler: /usr/bin/c++ -- works
-- Detecting CXX compiler ABI info
-- Detecting CXX compiler ABI info - done
-- Detecting CXX compile features
-- Detecting CXX compile features - done
-- Using install prefix /usr ...
-- Using etc install path /etc ...
-- Using bin install path /usr/bin ...
-- Using sbin install path /usr/sbin ...
-- Using lib install path /usr/lib64 ...
-- Using man install path /usr/share/man ...
-- Looking for crypt in crypt
-- Looking for crypt in crypt - found
-- Looking for pthread.h
-- Looking for pthread.h - found
-- Looking for pthread_create
-- Looking for pthread_create - not found
-- Looking for pthread_create in pthreads
-- Looking for pthread_create in pthreads - not found
-- Looking for pthread_create in pthread
-- Looking for pthread_create in pthread - found
-- Found Threads: TRUE  
-- Using library -lpthread
-- Looking for pthread_mutex_timedlock in -lpthread
-- Looking for pthread_mutex_timedlock in -lpthread - found
-- Using binary /usr/bin/flex ...
-- Using binary /usr/bin/bison ...
-- Performing Test NATT_FOUND
-- Performing Test NATT_FOUND - Success
-- Enabled NAT Traversal support ...
-- Enabled LDAP Authentication support ...
-- Looking for Q_WS_X11
-- Looking for Q_WS_X11 - found
-- Looking for Q_WS_WIN
-- Looking for Q_WS_WIN - not found
-- Looking for Q_WS_QWS
-- Looking for Q_WS_QWS - not found
-- Looking for Q_WS_MAC
-- Looking for Q_WS_MAC - not found
-- Found Qt4: /usr/bin/qmake-qt4 (found version "4.8.7") 
-- Enabled Client QT GUI support ...
CMake Warning (dev) at source/iked/CMakeLists.txt:111 (add_custom_command):
  Policy CMP0050 is not set: Disallow add_custom_command SOURCE signatures.
  Run "cmake --help-policy CMP0050" for policy details.  Use the cmake_policy
  command to set the policy and suppress this warning.

  The SOURCE signatures of add_custom_command are no longer supported.
This warning is for project developers.  Use -Wno-dev to suppress it.

CMake Warning (dev) at source/iked/CMakeLists.txt:120 (add_custom_command):
  Policy CMP0050 is not set: Disallow add_custom_command SOURCE signatures.
  Run "cmake --help-policy CMP0050" for policy details.  Use the cmake_policy
  command to set the policy and suppress this warning.

  The SOURCE signatures of add_custom_command are no longer supported.
This warning is for project developers.  Use -Wno-dev to suppress it.

-- Configuring done
-- Generating done
CMake Warning:
  Manually-specified variables were not used by the project:

    CMAKE_Fortran_FLAGS
    CMAKE_SKIP_INSTALL_RPATH
    INCLUDE_INSTALL_DIR
    LIB_DESTINATION
    LIB_INSTALL_DIR
    LIB_SUFFIX
    SHARE_INSTALL_PREFIX
    SYSCONF_INSTALL_DIR


-- Build files have been written to: /usr/src/RPM/BUILD/ike-2.2.1
+ exit 0
Executing(%install): /bin/sh -e /usr/src/tmp/rpm-tmp.18378
+ umask 022
+ /bin/mkdir -p /usr/src/RPM/BUILD
+ cd /usr/src/RPM/BUILD
+ /bin/chmod -Rf u+rwX -- /usr/src/tmp/ike-buildroot
+ :
+ /bin/rm -rf -- /usr/src/tmp/ike-buildroot
+ cd ike-2.2.1
+ make 'INSTALL=/bin/install -p' install DESTDIR=/usr/src/tmp/ike-buildroot
make: Entering directory '/usr/src/RPM/BUILD/ike-2.2.1'
make[1]: Entering directory '/usr/src/RPM/BUILD/ike-2.2.1'
make[2]: Entering directory '/usr/src/RPM/BUILD/ike-2.2.1'
Scanning dependencies of target ss_ith
make[2]: Leaving directory '/usr/src/RPM/BUILD/ike-2.2.1'
make[2]: Entering directory '/usr/src/RPM/BUILD/ike-2.2.1'
[  1%] Building CXX object source/libith/CMakeFiles/ss_ith.dir/libith.o
/usr/src/RPM/BUILD/ike-2.2.1/source/libith/libith.cpp: In member function 'void _ITH_COND::alert()':
/usr/src/RPM/BUILD/ike-2.2.1/source/libith/libith.cpp:280:7: warning: unused variable 'result' [-Wunused-variable]
  long result = send( conn_wake[ 1 ], &c, 1, 0 );
       ^~~~~~
/usr/src/RPM/BUILD/ike-2.2.1/source/libith/libith.cpp: In member function 'void _ITH_COND::reset()':
/usr/src/RPM/BUILD/ike-2.2.1/source/libith/libith.cpp:286:7: warning: unused variable 'result' [-Wunused-variable]
  long result = recv( conn_wake[ 0 ], &c, 1, 0 );
       ^~~~~~
[  2%] Linking CXX shared library libss_ith.so
make[2]: Leaving directory '/usr/src/RPM/BUILD/ike-2.2.1'
[  2%] Built target ss_ith
make[2]: Entering directory '/usr/src/RPM/BUILD/ike-2.2.1'
Scanning dependencies of target ss_log
make[2]: Leaving directory '/usr/src/RPM/BUILD/ike-2.2.1'
make[2]: Entering directory '/usr/src/RPM/BUILD/ike-2.2.1'
[  3%] Building CXX object source/liblog/CMakeFiles/ss_log.dir/liblog.o
/usr/src/RPM/BUILD/ike-2.2.1/source/liblog/liblog.cpp: In member function 'bool _LOG::write_buff(char*, size_t)':
/usr/src/RPM/BUILD/ike-2.2.1/source/liblog/liblog.cpp:100:9: warning: unused variable 'oset' [-Wunused-variable]
  size_t oset = 0;
         ^~~~
[  4%] Linking CXX shared library libss_log.so
make[2]: Leaving directory '/usr/src/RPM/BUILD/ike-2.2.1'
[  4%] Built target ss_log
make[2]: Entering directory '/usr/src/RPM/BUILD/ike-2.2.1'
Scanning dependencies of target ss_idb
make[2]: Leaving directory '/usr/src/RPM/BUILD/ike-2.2.1'
make[2]: Entering directory '/usr/src/RPM/BUILD/ike-2.2.1'
[  5%] Building CXX object source/libidb/CMakeFiles/ss_idb.dir/libidb.o
/usr/src/RPM/BUILD/ike-2.2.1/source/libidb/libidb.cpp: In member function 'size_t _BDATA::size(size_t)':
/usr/src/RPM/BUILD/ike-2.2.1/source/libidb/libidb.cpp:114:15: warning: comparison of integer expressions of different signedness: 'size_t' {aka 'long unsigned int'} and 'int' [-Wsign-compare]
  if( new_size != ~0 )
      ~~~~~~~~~^~~~~
/usr/src/RPM/BUILD/ike-2.2.1/source/libidb/libidb.cpp: In member function 'size_t _BDATA::oset(size_t)':
/usr/src/RPM/BUILD/ike-2.2.1/source/libidb/libidb.cpp:130:15: warning: comparison of integer expressions of different signedness: 'size_t' {aka 'long unsigned int'} and 'int' [-Wsign-compare]
  if( new_oset != ~0 )
      ~~~~~~~~~^~~~~
/usr/src/RPM/BUILD/ike-2.2.1/source/libidb/libidb.cpp: In member function 'bool _BDATA::base64_encode()':
/usr/src/RPM/BUILD/ike-2.2.1/source/libidb/libidb.cpp:241:15: warning: comparison of integer expressions of different signedness: 'size_t' {aka 'long unsigned int'} and 'int' [-Wsign-compare]
  if( b64_size == -1 )
      ~~~~~~~~~^~~~~
/usr/src/RPM/BUILD/ike-2.2.1/source/libidb/libidb.cpp: In member function 'bool _BDATA::base64_decode()':
/usr/src/RPM/BUILD/ike-2.2.1/source/libidb/libidb.cpp:265:15: warning: comparison of integer expressions of different signedness: 'size_t' {aka 'long unsigned int'} and 'int' [-Wsign-compare]
  if( b64_size == -1 )
      ~~~~~~~~~^~~~~
/usr/src/RPM/BUILD/ike-2.2.1/source/libidb/libidb.cpp: In member function 'bool _BDATA::get(_BDATA&, size_t)':
/usr/src/RPM/BUILD/ike-2.2.1/source/libidb/libidb.cpp:410:11: warning: comparison of integer expressions of different signedness: 'size_t' {aka 'long unsigned int'} and 'int' [-Wsign-compare]
  if( size == BDATA_ALL )
[  6%] Building CXX object source/libidb/CMakeFiles/ss_idb.dir/base64.o
[  7%] Linking CXX shared library libss_idb.so
make[2]: Leaving directory '/usr/src/RPM/BUILD/ike-2.2.1'
[  7%] Built target ss_idb
make[2]: Entering directory '/usr/src/RPM/BUILD/ike-2.2.1'
Scanning dependencies of target ss_pfk
make[2]: Leaving directory '/usr/src/RPM/BUILD/ike-2.2.1'
make[2]: Entering directory '/usr/src/RPM/BUILD/ike-2.2.1'
[  8%] Building CXX object source/libpfk/CMakeFiles/ss_pfk.dir/libpfk.o
/usr/src/RPM/BUILD/ike-2.2.1/source/libpfk/libpfk.cpp: In member function 'const char* _PFKI::name(long int, long int)':
/usr/src/RPM/BUILD/ike-2.2.1/source/libpfk/libpfk.cpp:431:24: warning: unused variable 'satype_11' [-Wunused-variable]
    static const char * satype_11 = "TCPSIGNATURE";
                        ^~~~~~~~~
/usr/src/RPM/BUILD/ike-2.2.1/source/libpfk/libpfk.cpp: In member function 'long int _PFKI::buff_get_ext(PFKI_MSG&, sadb_ext**, long int)':
/usr/src/RPM/BUILD/ike-2.2.1/source/libpfk/libpfk.cpp:650:32: warning: comparison of integer expressions of different signedness: 'int' and 'size_t' {aka 'long unsigned int'} [-Wsign-compare]
   if( PFKEY_EXTLEN( ext_head ) > size )
/usr/src/RPM/BUILD/ike-2.2.1/source/libpfk/libpfk.cpp: At global scope:
/usr/src/RPM/BUILD/ike-2.2.1/source/libpfk/libpfk.cpp:431:24: warning: 'satype_11' defined but not used [-Wunused-variable]
    static const char * satype_11 = "TCPSIGNATURE";
                        ^~~~~~~~~
[ 10%] Linking CXX shared library libss_pfk.so
make[2]: Leaving directory '/usr/src/RPM/BUILD/ike-2.2.1'
[ 10%] Built target ss_pfk
make[2]: Entering directory '/usr/src/RPM/BUILD/ike-2.2.1'
Scanning dependencies of target ss_ike
make[2]: Leaving directory '/usr/src/RPM/BUILD/ike-2.2.1'
make[2]: Entering directory '/usr/src/RPM/BUILD/ike-2.2.1'
[ 11%] Building CXX object source/libike/CMakeFiles/ss_ike.dir/client.o
/usr/src/RPM/BUILD/ike-2.2.1/source/libike/client.cpp: In member function 'OPT_RESULT _CLIENT::read_opts(int, char**)':
/usr/src/RPM/BUILD/ike-2.2.1/source/libike/client.cpp:1397:7: warning: unused variable 'syntax_error' [-Wunused-variable]
  bool syntax_error = false;
       ^~~~~~~~~~~~
[ 12%] Building CXX object source/libike/CMakeFiles/ss_ike.dir/config.o
[ 13%] Building CXX object source/libike/CMakeFiles/ss_ike.dir/manager.o
[ 14%] Building CXX object source/libike/CMakeFiles/ss_ike.dir/manager.file.o
/usr/src/RPM/BUILD/ike-2.2.1/source/libike/manager.file.cpp: In member function 'bool _CONFIG_MANAGER::file_pcf_load(CONFIG&, const char*, bool&)':
/usr/src/RPM/BUILD/ike-2.2.1/source/libike/manager.file.cpp:682:19: error: aggregate 'EVP_CIPHER_CTX ctx_cipher' has incomplete type and cannot be defined
    EVP_CIPHER_CTX ctx_cipher;
                   ^~~~~~~~~~
make[2]: *** [source/libike/CMakeFiles/ss_ike.dir/build.make:102: source/libike/CMakeFiles/ss_ike.dir/manager.file.o] Error 1
make[2]: Leaving directory '/usr/src/RPM/BUILD/ike-2.2.1'
make[1]: *** [CMakeFiles/Makefile2:239: source/libike/CMakeFiles/ss_ike.dir/all] Error 2
make[1]: Leaving directory '/usr/src/RPM/BUILD/ike-2.2.1'
make: *** [Makefile:130: all] Error 2
make: Leaving directory '/usr/src/RPM/BUILD/ike-2.2.1'
error: Bad exit status from /usr/src/tmp/rpm-tmp.18378 (%install)


RPM build errors:
    Bad exit status from /usr/src/tmp/rpm-tmp.18378 (%install)
Command exited with non-zero status 1
9.98user 1.92system 0:11.91elapsed 99%CPU (0avgtext+0avgdata 48060maxresident)k
0inputs+0outputs (0major+331211minor)pagefaults 0swaps
hsh-rebuild: rebuild of `ike-2.2.1-alt1.src.rpm' failed.
Command exited with non-zero status 1
39.50user 9.38system 0:49.87elapsed 98%CPU (0avgtext+0avgdata 122708maxresident)k
552inputs+0outputs (0major+798609minor)pagefaults 0swaps