<86>Nov  7 01:58:40 userdel[103131]: delete user 'rooter'
<86>Nov  7 01:58:40 userdel[103131]: removed shadow group 'rooter' owned by 'rooter'
<86>Nov  7 01:58:40 groupadd[103171]: group added to /etc/group: name=rooter, GID=576
<86>Nov  7 01:58:40 groupadd[103171]: group added to /etc/gshadow: name=rooter
<86>Nov  7 01:58:40 groupadd[103171]: new group: name=rooter, GID=576
<86>Nov  7 01:58:40 useradd[103189]: new user: name=rooter, UID=576, GID=576, home=/root, shell=/bin/bash
<86>Nov  7 01:58:40 userdel[103260]: delete user 'builder'
<86>Nov  7 01:58:40 userdel[103260]: removed group 'builder' owned by 'builder'
<86>Nov  7 01:58:40 userdel[103260]: removed shadow group 'builder' owned by 'builder'
<86>Nov  7 01:58:40 groupadd[103304]: group added to /etc/group: name=builder, GID=577
<86>Nov  7 01:58:40 groupadd[103304]: group added to /etc/gshadow: name=builder
<86>Nov  7 01:58:40 groupadd[103304]: new group: name=builder, GID=577
<86>Nov  7 01:58:40 useradd[103344]: new user: name=builder, UID=577, GID=577, home=/usr/src, shell=/bin/bash
<13>Nov  7 01:58:43 rpmi: xorg-proto-devel-2018.4-alt3 1527685079 installed
<13>Nov  7 01:58:43 rpmi: libexpat-2.2.4-alt1 1503305341 installed
<13>Nov  7 01:58:43 rpmi: libglvnd-7:1.1.0-alt3 sisyphus.215982.100 1541498630 installed
<13>Nov  7 01:58:43 rpmi: libogg-1.3.2-alt2 sisyphus.215919.100 1540973849 installed
<13>Nov  7 01:58:43 rpmi: libjpeg-2:1.5.1-alt1 1498218302 installed
<13>Nov  7 01:58:43 rpmi: libpng16-1.6.35-alt1 sisyphus.214397.100 1539159326 installed
<13>Nov  7 01:58:43 rpmi: zlib-devel-1.2.8-alt1 1371079009 installed
<13>Nov  7 01:58:43 rpmi: libalsa-1:1.1.7-alt1 sisyphus.215150.100 1539797654 installed
<13>Nov  7 01:58:43 rpmi: libXau-1.0.8-alt1 1369565807 installed
<13>Nov  7 01:58:43 rpmi: libwayland-server-1.16.0-alt1 1535614868 installed
<13>Nov  7 01:58:43 rpmi: libgdbm-1.8.3-alt10 1454943313 installed
<13>Nov  7 01:58:44 rpmi: libicu63-1:6.3.1-alt1 sisyphus.215328.100 1540049981 installed
<13>Nov  7 01:58:44 rpmi: libgraphite2-1.3.12-alt2.1 sisyphus.215942.100 1540990747 installed
<13>Nov  7 01:58:44 rpmi: libharfbuzz-2.0.2-alt1 sisyphus.215425.100 1540400149 installed
<13>Nov  7 01:58:44 rpmi: libfreetype-2.9.1-alt1.S1 1530781049 installed
<13>Nov  7 01:58:44 rpmi: fontconfig-2.13.1-alt1 sisyphus.215917.100 1540973883 installed
Updating fonts cache: <29>Nov  7 01:58:45 fontconfig: Updating fonts cache: succeeded
[ DONE ]
<13>Nov  7 01:58:45 rpmi: libharfbuzz-icu-2.0.2-alt1 sisyphus.215425.100 1540400149 installed
<13>Nov  7 01:58:45 rpmi: libgraphite2-devel-1.3.12-alt2.1 sisyphus.215942.100 1540990747 installed
<13>Nov  7 01:58:45 rpmi: icu-utils-1:6.3.1-alt1 sisyphus.215328.100 1540049981 installed
<13>Nov  7 01:58:45 rpmi: libicu-devel-1:6.3.1-alt1 sisyphus.215328.100 1540049981 installed
<13>Nov  7 01:58:45 rpmi: libXau-devel-1.0.8-alt1 1369565807 installed
<13>Nov  7 01:58:45 rpmi: libjasper-2.0.14-alt1 1530105213 installed
<13>Nov  7 01:58:45 rpmi: libtiff5-4.0.3-alt1 1348347498 installed
<13>Nov  7 01:58:45 rpmi: libflac8-1.3.2-alt1 1507623526 installed
<13>Nov  7 01:58:45 rpmi: libvorbis-1.3.6-alt1 1528307803 installed
<13>Nov  7 01:58:45 rpmi: libOpenGL-7:1.1.0-alt3 sisyphus.215982.100 1541498630 installed
<13>Nov  7 01:58:45 rpmi: libGLES-7:1.1.0-alt3 sisyphus.215982.100 1541498630 installed
<13>Nov  7 01:58:46 rpmi: libgtk+2-locales-2.24.32-alt2 1518699309 installed
<13>Nov  7 01:58:46 rpmi: libfribidi-1.0.5-alt1 1532424343 installed
<13>Nov  7 01:58:46 rpmi: libdatrie-0.2.9-alt1_6 1511686677 installed
<13>Nov  7 01:58:46 rpmi: libthai-0.1.28-alt1_1 sisyphus.214516.100 1539257851 installed
<13>Nov  7 01:58:46 rpmi: libpng15-1.5.28-alt2 1497966592 installed
<13>Nov  7 01:58:46 rpmi: libpng15-devel-1.5.28-alt2 1497966592 installed
<13>Nov  7 01:58:46 rpmi: libpixman-3:0.34.0-alt1 1480491642 installed
<13>Nov  7 01:58:46 rpmi: libatk-locales-2.30.0-alt1 sisyphus.212779.100 1536768328 installed
<13>Nov  7 01:58:46 rpmi: libatk-2.30.0-alt1 sisyphus.212779.100 1536768328 installed
<13>Nov  7 01:58:46 rpmi: libgsm-1.0.17-alt1 1523356157 installed
<13>Nov  7 01:58:46 rpmi: libsndfile-1.0.28-alt2 sisyphus.212728.100 1536333060 installed
<13>Nov  7 01:58:46 rpmi: liblz4-1:1.8.3-alt1 sisyphus.213737.100 1538009646 installed
<13>Nov  7 01:58:46 rpmi: libgpg-error-1.31-alt1.S1 1529015796 installed
<13>Nov  7 01:58:46 rpmi: libgcrypt20-1.8.3-alt3 sisyphus.214019.140 1538990261 installed
<13>Nov  7 01:58:46 rpmi: libsystemd-1:239-alt3 sisyphus.215710.300 1540765573 installed
<13>Nov  7 01:58:46 rpmi: libdbus-1.12.10-alt1 sisyphus.212941.100 1536831868 installed
<13>Nov  7 01:58:46 rpmi: libavahi-0.6.32-alt1 1500485694 installed
<13>Nov  7 01:58:46 rpmi: libasyncns-0.8-alt2.qa1 1365949819 installed
<13>Nov  7 01:58:46 rpmi: libxshmfence-1.2-alt2 1518613549 installed
<13>Nov  7 01:58:46 rpmi: libX11-locales-3:1.6.7-alt1 sisyphus.214413.200 1539171080 installed
<13>Nov  7 01:58:46 rpmi: libXdmcp-1.1.1-alt1 1334617699 installed
<13>Nov  7 01:58:46 rpmi: libxcb-1.13.1-alt1 sisyphus.214413.100 1539170828 installed
<13>Nov  7 01:58:46 rpmi: libX11-3:1.6.7-alt1 sisyphus.214413.200 1539171080 installed
<13>Nov  7 01:58:46 rpmi: libXext-1.3.3-alt1 1409902932 installed
<13>Nov  7 01:58:46 rpmi: libXrender-0.9.8-alt1 1371312110 installed
<13>Nov  7 01:58:46 rpmi: libXfixes-5.0.1-alt1 1369809606 installed
<13>Nov  7 01:58:46 rpmi: libXrandr-1.5.0-alt1 1431936188 installed
<13>Nov  7 01:58:46 rpmi: libXft-2.3.2-alt1 1409902650 installed
<13>Nov  7 01:58:46 rpmi: libXdamage-1.1.3-alt4 1297162596 installed
<13>Nov  7 01:58:47 rpmi: libxcb-devel-1.13.1-alt1 sisyphus.214413.100 1539170828 installed
<13>Nov  7 01:58:47 rpmi: libX11-devel-3:1.6.7-alt1 sisyphus.214413.200 1539171080 installed
<13>Nov  7 01:58:47 rpmi: libXrender-devel-0.9.8-alt1 1371312110 installed
<13>Nov  7 01:58:47 rpmi: libXext-devel-1.3.3-alt1 1409902932 installed
<13>Nov  7 01:58:47 rpmi: libXcursor-1.1.15-alt1.S1 1512373363 installed
<13>Nov  7 01:58:47 rpmi: libXxf86vm-1.1.4-alt2 1527672159 installed
<13>Nov  7 01:58:47 rpmi: libXi-1.7.9-alt1.S1 1515755338 installed
<13>Nov  7 01:58:47 rpmi: libXinerama-1.1.3-alt2 1527671624 installed
<13>Nov  7 01:58:47 rpmi: libXcomposite-0.4.3-alt3 1297306939 installed
<13>Nov  7 01:58:47 rpmi: libpulseaudio-12.2-alt1 1535623578 installed
<13>Nov  7 01:58:47 rpmi: libSDL-1.2.14-alt7 1483707267 installed
<13>Nov  7 01:58:47 rpmi: libwayland-client-1.16.0-alt1 1535614868 installed
<13>Nov  7 01:58:47 rpmi: libpciaccess-1:0.14-alt1 1528969624 installed
<13>Nov  7 01:58:47 rpmi: libdrm-1:2.4.96-alt1 sisyphus.215486.100 1540374008 installed
<13>Nov  7 01:58:47 rpmi: libGLX-mesa-4:18.2.4-alt1 sisyphus.215982.200 1541500289 installed
<13>Nov  7 01:58:47 rpmi: libGLX-7:1.1.0-alt3 sisyphus.215982.100 1541498630 installed
<13>Nov  7 01:58:47 rpmi: libGL-7:1.1.0-alt3 sisyphus.215982.100 1541498630 installed
<13>Nov  7 01:58:47 rpmi: libGLU-4:9.0.0-alt1 1347643776 installed
<13>Nov  7 01:58:47 rpmi: libgbm-4:18.2.4-alt1 sisyphus.215982.200 1541500289 installed
<13>Nov  7 01:58:47 rpmi: libEGL-mesa-4:18.2.4-alt1 sisyphus.215982.200 1541500289 installed
<13>Nov  7 01:58:47 rpmi: libEGL-7:1.1.0-alt3 sisyphus.215982.100 1541498630 installed
<13>Nov  7 01:58:47 rpmi: libglvnd-devel-7:1.1.0-alt3 sisyphus.215982.100 1541498630 installed
<13>Nov  7 01:58:47 rpmi: libGL-devel-4:18.2.4-alt1 sisyphus.215982.200 1541500289 installed
<13>Nov  7 01:58:47 rpmi: libcairo-1:1.16.0-alt1 sisyphus.215566.100 1540457760 installed
<13>Nov  7 01:58:48 rpmi: libpango-1.42.4-alt1 1534787249 installed
<13>Nov  7 01:58:48 rpmi: libGLU-devel-4:9.0.0-alt1 1347643776 installed
<13>Nov  7 01:58:48 rpmi: libEGL-devel-4:18.2.4-alt1 sisyphus.215982.200 1541500289 installed
<13>Nov  7 01:58:48 rpmi: icon-theme-hicolor-0.17-alt1 1505715846 installed
<13>Nov  7 01:58:48 rpmi: libgdk-pixbuf-locales-2.38.0-alt2 sisyphus.213523.100 1537685512 installed
<13>Nov  7 01:58:48 rpmi: shared-mime-info-1.10-alt1.1 1530525597 installed
<13>Nov  7 01:58:48 rpmi: libverto-0.3.0-alt1_5 1525957716 installed
<13>Nov  7 01:58:48 rpmi: libkeyutils-1.5.10-alt1 1489994069 installed
<13>Nov  7 01:58:48 rpmi: libcom_err-1.44.3-alt1 1532134713 installed
<13>Nov  7 01:58:48 rpmi: gsettings-desktop-schemas-data-3.28.1-alt1 sisyphus.212587.100 1536082062 installed
<13>Nov  7 01:58:48 rpmi: libgio-2.58.1-alt3 sisyphus.214034.100 1538601655 installed
<13>Nov  7 01:58:48 rpmi: gsettings-desktop-schemas-3.28.1-alt1 sisyphus.212587.100 1536082062 installed
<13>Nov  7 01:58:48 rpmi: libgdk-pixbuf-2.38.0-alt2 sisyphus.213523.100 1537685512 installed
<13>Nov  7 01:58:48 rpmi: gtk-update-icon-cache-3.24.1-alt1 sisyphus.213271.100 1537346040 installed
<13>Nov  7 01:58:48 rpmi: libgdk-pixbuf-xlib-2.38.0-alt2 sisyphus.213523.100 1537685512 installed
<13>Nov  7 01:58:48 rpmi: xml-utils-1:2.9.4.0.12.e905-alt1.1 1525115736 installed
<13>Nov  7 01:58:48 rpmi: rpm-build-gir-0.7.2-alt4 1534675014 installed
<13>Nov  7 01:58:48 rpmi: libtasn1-4.13-alt2 1521133848 installed
<13>Nov  7 01:58:48 rpmi: libp11-kit-0.23.9-alt5 1525798241 installed
<13>Nov  7 01:58:48 rpmi: rpm-macros-alternatives-0.4.5-alt1.1 1404382149 installed
<13>Nov  7 01:58:48 rpmi: alternatives-0.4.5-alt1.1 1404382149 installed
<13>Nov  7 01:58:48 rpmi: ca-certificates-2018.09.09-alt1 sisyphus.212781.100 1536518628 installed
<13>Nov  7 01:58:48 rpmi: ca-trust-0.1.1-alt2 1515595785 installed
<13>Nov  7 01:58:48 rpmi: p11-kit-trust-0.23.9-alt5 1525798241 installed
<13>Nov  7 01:58:48 rpmi: libcrypto1.1-1.1.0i-alt1 1535471288 installed
<13>Nov  7 01:58:48 rpmi: libssl1.1-1.1.0i-alt1 1535471288 installed
<13>Nov  7 01:58:48 rpmi: libpython3-3.6.5-alt1.1 1535734400 installed
<13>Nov  7 01:58:48 rpmi: rpm-build-python3-0.1.13.1-alt2 1535450458 installed
<13>Nov  7 01:58:48 rpmi: tests-for-installed-python3-pkgs-0.1.13.1-alt2 1535450458 installed
<13>Nov  7 01:58:48 rpmi: python3-3.6.5-alt1.1 1535734400 installed
<13>Nov  7 01:58:49 rpmi: python3-base-3.6.5-alt1.1 1535734400 installed
<13>Nov  7 01:58:49 rpmi: glib2-devel-2.58.1-alt3 sisyphus.214034.100 1538601655 installed
<13>Nov  7 01:58:49 rpmi: libgio-devel-2.58.1-alt3 sisyphus.214034.100 1538601655 installed
<86>Nov  7 01:58:49 groupadd[1970]: group added to /etc/group: name=_keytab, GID=499
<86>Nov  7 01:58:49 groupadd[1970]: group added to /etc/gshadow: name=_keytab
<86>Nov  7 01:58:49 groupadd[1970]: new group: name=_keytab, GID=499
<13>Nov  7 01:58:49 rpmi: libkrb5-1.16.2-alt1 sisyphus.216047.100 1541159108 installed
<13>Nov  7 01:58:49 rpmi: libtirpc-1.0.3-alt1 1532008015 installed
<13>Nov  7 01:58:49 rpmi: libnsl2-1.1.0-alt1_1 1511548748 installed
<13>Nov  7 01:58:49 rpmi: python-modules-encodings-2.7.14-alt7.1 sisyphus.212296.100 1535808793 installed
<13>Nov  7 01:58:49 rpmi: python-modules-compiler-2.7.14-alt7.1 sisyphus.212296.100 1535808793 installed
<13>Nov  7 01:58:49 rpmi: python-modules-email-2.7.14-alt7.1 sisyphus.212296.100 1535808793 installed
<13>Nov  7 01:58:49 rpmi: python-modules-unittest-2.7.14-alt7.1 sisyphus.212296.100 1535808793 installed
<13>Nov  7 01:58:49 rpmi: python-modules-nis-2.7.14-alt7.1 sisyphus.212296.100 1535808793 installed
<13>Nov  7 01:58:49 rpmi: python-modules-2.7.14-alt7.1 sisyphus.212296.100 1535808793 installed
<13>Nov  7 01:58:49 rpmi: python-modules-xml-2.7.14-alt7.1 sisyphus.212296.100 1535808793 installed
<13>Nov  7 01:58:49 rpmi: gtk-builder-convert-2.24.32-alt2 1518699309 installed
<13>Nov  7 01:58:49 rpmi: libcups-2.2.6-alt1 1510070331 installed
<13>Nov  7 01:58:49 rpmi: libgtk+2-2.24.32-alt2 1518699259 installed
<13>Nov  7 01:58:49 rpmi: libgdk-pixbuf-devel-2.38.0-alt2 sisyphus.213523.100 1537685512 installed
<13>Nov  7 01:58:49 rpmi: libharfbuzz-devel-2.0.2-alt1 sisyphus.215425.100 1540400149 installed
<13>Nov  7 01:58:49 rpmi: libfreetype-devel-2.9.1-alt1.S1 1530781049 installed
<13>Nov  7 01:58:49 rpmi: fontconfig-devel-2.13.1-alt1 sisyphus.215917.100 1540973883 installed
<13>Nov  7 01:58:49 rpmi: libcairo-devel-1:1.16.0-alt1 sisyphus.215566.100 1540457760 installed
<13>Nov  7 01:58:49 rpmi: libXft-devel-2.3.2-alt1 1409902650 installed
<13>Nov  7 01:58:49 rpmi: libpango-devel-1.42.4-alt1 1534787249 installed
<13>Nov  7 01:58:49 rpmi: libatk-devel-2.30.0-alt1 sisyphus.212779.100 1536768328 installed
<13>Nov  7 01:58:49 rpmi: libgtk+2-devel-2.24.32-alt2 1518699259 installed
<13>Nov  7 01:58:49 rpmi: libSDL-devel-1.2.14-alt7 1483707267 installed
<13>Nov  7 01:58:49 rpmi: libalsa-devel-1:1.1.7-alt1 sisyphus.215150.100 1539797654 installed
Building target platforms: x86_64
Building for target x86_64
Wrote: /usr/src/in/nosrpm/e-uae-0.8.29-alt1.nosrc.rpm
Installing e-uae-0.8.29-alt1.src.rpm
Building target platforms: x86_64
Building for target x86_64
Executing(%prep): /bin/sh -e /usr/src/tmp/rpm-tmp.53775
+ umask 022
+ /bin/mkdir -p /usr/src/RPM/BUILD
+ cd /usr/src/RPM/BUILD
+ cd /usr/src/RPM/BUILD
+ rm -rf e-uae-0.8.29-WIP4
+ echo 'Source #0 (e-uae-0.8.29-WIP4.tar.bz2):'
Source #0 (e-uae-0.8.29-WIP4.tar.bz2):
+ /bin/bzip2 -dc /usr/src/RPM/SOURCES/e-uae-0.8.29-WIP4.tar.bz2
+ /bin/tar -xf -
+ cd e-uae-0.8.29-WIP4
+ /bin/chmod -c -Rf u+rwX,go-w .
+ exit 0
Executing(%build): /bin/sh -e /usr/src/tmp/rpm-tmp.12204
+ umask 022
+ /bin/mkdir -p /usr/src/RPM/BUILD
+ cd /usr/src/RPM/BUILD
+ cd e-uae-0.8.29-WIP4
+ CFLAGS='-pipe -frecord-gcc-switches -Wall -g -O2'
+ export CFLAGS
+ CXXFLAGS='-pipe -frecord-gcc-switches -Wall -g -O2'
+ export CXXFLAGS
+ FFLAGS='-pipe -frecord-gcc-switches -Wall -g -O2'
+ export FFLAGS
+ '[' -n '' ']'
++ printf %s '-pipe -frecord-gcc-switches -Wall -g -O2'
++ sed -r 's/(^|[[:space:]]+)-[^m][^[:space:]]*//g'
+ ASFLAGS=
+ export ASFLAGS
+ export lt_cv_deplibs_check_method=pass_all
+ lt_cv_deplibs_check_method=pass_all
+ xargs -ri find '{}' -type f '(' -name config.sub -or -name config.guess ')' -printf '%h/\n'
+ xargs -ri dirname -- '{}'
+ sort -u
+ xargs -rn1 install -pm755 -- /usr/share/gnu-config/config.sub /usr/share/gnu-config/config.guess
+ readlink -e -- ./configure
+ ./configure --build=x86_64-alt-linux --host=x86_64-alt-linux --prefix=/usr --exec-prefix=/usr --bindir=/usr/bin --sbindir=/usr/sbin --sysconfdir=/etc --datadir=/usr/share --includedir=/usr/include --libdir=/usr/lib64 --libexecdir=/usr/lib --localstatedir=/var/lib --sharedstatedir=/var/lib --mandir=/usr/share/man --infodir=/usr/share/info --disable-dependency-tracking --without-included-gettext --with-alsa --with-sdl-gl --with-sdl-gfx --enable-ui --enable-audio --disable-sdltest --disable-gtktest --enable-bsdsock
checking build system type... x86_64-alt-linux-gnu
checking host system type... x86_64-alt-linux-gnu
checking target system type... x86_64-alt-linux-gnu
checking for a BSD-compatible install... /bin/install -c
checking whether build environment is sane... yes
checking for gawk... gawk
checking whether make sets $(MAKE)... yes
checking for x86_64-alt-linux-gcc... x86_64-alt-linux-gcc
checking for C compiler default output file name... a.out
checking whether the C compiler works... yes
checking whether we are cross compiling... no
checking for suffix of executables... 
checking for suffix of object files... o
checking whether we are using the GNU C compiler... yes
checking whether x86_64-alt-linux-gcc accepts -g... yes
checking for x86_64-alt-linux-gcc option to accept ISO C89... none needed
checking for style of include used by make... GNU
checking dependency style of x86_64-alt-linux-gcc... none
checking how to run the C preprocessor... x86_64-alt-linux-gcc -E
checking for x86_64-alt-linux-g++... no
checking for x86_64-alt-linux-c++... no
checking for x86_64-alt-linux-gpp... no
checking for x86_64-alt-linux-aCC... no
checking for x86_64-alt-linux-CC... no
checking for x86_64-alt-linux-cxx... no
checking for x86_64-alt-linux-cc++... no
checking for x86_64-alt-linux-cl.exe... no
checking for x86_64-alt-linux-FCC... no
checking for x86_64-alt-linux-KCC... no
checking for x86_64-alt-linux-RCC... no
checking for x86_64-alt-linux-xlC_r... no
checking for x86_64-alt-linux-xlC... no
checking for g++... no
checking for c++... no
checking for gpp... no
checking for aCC... no
checking for CC... no
checking for cxx... no
checking for cc++... no
checking for cl.exe... no
checking for FCC... no
checking for KCC... no
checking for RCC... no
checking for xlC_r... no
checking for xlC... no
checking whether we are using the GNU C++ compiler... no
checking whether g++ accepts -g... no
checking dependency style of g++... none
checking for x86_64-alt-linux-objcc... no
checking for x86_64-alt-linux-objc... no
checking for x86_64-alt-linux-gcc... x86_64-alt-linux-gcc
checking dependency style of x86_64-alt-linux-gcc... none
checking if Objective C compiler works... no
checking whether make sets $(MAKE)... (cached) yes
checking for x86_64-alt-linux-ranlib... no
checking for ranlib... ranlib
checking for x86_64-alt-linux-ar... no
checking for ar... ar
checking for a BSD-compatible install... /bin/install -c
checking for makedepend... not-found
checking for file... /usr/bin/file
checking for wrc... not-found
checking for rcl... not-found
checking for grep that handles long lines and -e... /bin/grep
checking for egrep... /bin/grep -E
checking for AIX... no
checking for library containing strerror... none required
checking for _oss_ioctl in -lossaudio... no
checking for pkg-config... /usr/bin/pkg-config
checking for GTK+ - version >= 2.0.0... yes (version 2.24.32)
checking for dirent.h that defines DIR... yes
checking for library containing opendir... none required
checking for ANSI C header files... yes
checking for sys/types.h... yes
checking for sys/stat.h... yes
checking for stdlib.h... yes
checking for string.h... yes
checking for memory.h... yes
checking for strings.h... yes
checking for inttypes.h... yes
checking for stdint.h... yes
checking for unistd.h... yes
checking fcntl.h usability... yes
checking fcntl.h presence... yes
checking for fcntl.h... yes
checking sys/ioctl.h usability... yes
checking sys/ioctl.h presence... yes
checking for sys/ioctl.h... yes
checking sys/time.h usability... yes
checking sys/time.h presence... yes
checking for sys/time.h... yes
checking utime.h usability... yes
checking utime.h presence... yes
checking for utime.h... yes
checking values.h usability... yes
checking values.h presence... yes
checking for values.h... yes
checking ncurses.h usability... no
checking ncurses.h presence... no
checking for ncurses.h... no
checking curses.h usability... no
checking curses.h presence... no
checking for curses.h... no
checking sys/termios.h usability... yes
checking sys/termios.h presence... yes
checking for sys/termios.h... yes
checking for sys/stat.h... (cached) yes
checking sys/ipc.h usability... yes
checking sys/ipc.h presence... yes
checking for sys/ipc.h... yes
checking sys/shm.h usability... yes
checking sys/shm.h presence... yes
checking for sys/shm.h... yes
checking sys/mman.h usability... yes
checking sys/mman.h presence... yes
checking for sys/mman.h... yes
checking sys/filio.h usability... no
checking sys/filio.h presence... no
checking for sys/filio.h... no
checking libraries/cybergraphics.h usability... no
checking libraries/cybergraphics.h presence... no
checking for libraries/cybergraphics.h... no
checking cybergraphx/cybergraphics.h usability... no
checking cybergraphx/cybergraphics.h presence... no
checking for cybergraphx/cybergraphics.h... no
checking devices/ahi.h usability... no
checking devices/ahi.h presence... no
checking for devices/ahi.h... no
checking sys/soundcard.h usability... yes
checking sys/soundcard.h presence... yes
checking for sys/soundcard.h... yes
checking machine/soundcard.h usability... no
checking machine/soundcard.h presence... no
checking for machine/soundcard.h... no
checking sun/audioio.h usability... no
checking sun/audioio.h presence... no
checking for sun/audioio.h... no
checking sys/audioio.h usability... no
checking sys/audioio.h presence... no
checking for sys/audioio.h... no
checking machine/joystick.h usability... no
checking machine/joystick.h presence... no
checking for machine/joystick.h... no
checking amigainput/amigainput.h usability... no
checking amigainput/amigainput.h presence... no
checking for amigainput/amigainput.h... no
checking byteswap.h usability... yes
checking byteswap.h presence... yes
checking for byteswap.h... yes
checking for stdbool.h that conforms to C99... yes
checking for _Bool... yes
checking for an ANSI C-conforming const... yes
checking for inline... inline
checking for mode_t... yes
checking for off_t... yes
checking for size_t... yes
checking for struct stat.st_blocks... yes
checking whether time.h and sys/time.h may both be included... yes
checking whether struct tm is in sys/time.h or time.h... time.h
checking for working volatile... yes
checking whether byte ordering is bigendian... no
checking for char... yes
checking size of char... 1
checking for short... yes
checking size of short... 2
checking for int... yes
checking size of int... 4
checking for long... yes
checking size of long... 8
checking for long long... yes
checking size of long long... 8
checking for __int64... no
checking size of __int64... 0
checking for void *... yes
checking size of void *... 8
checking for socklen_t... yes
checking whether x86_64-alt-linux-gcc needs -traditional... no
checking for working memcmp... yes
checking return type of signal handlers... void
checking for utime.h... (cached) yes
checking whether utime accepts a null argument... yes
checking for getcwd... yes
checking for getopt... yes
checking for strdup... yes
checking for gettimeofday... yes
checking for sigaction... yes
checking for mkdir... yes
checking for rmdir... yes
checking for select... yes
checking for strerror... yes
checking for strstr... yes
checking for isnan... yes
checking for isinf... yes
checking for setitimer... yes
checking for alarm... yes
checking for sync... yes
checking for tcgetattr... yes
checking for cfmakeraw... yes
checking for readdir_r... yes
checking for vprintf... yes
checking for vsprintf... yes
checking for vfprintf... yes
checking for strcasecmp... yes
checking for stricmp... no
checking for strcmpi... no
checking for nanosleep... yes
checking for usleep... yes
checking for sleep... yes
checking for localtime_r... yes
checking for timegm... yes
checking for gmtime_r... yes
checking for special C compiler options needed for large files... no
checking for _FILE_OFFSET_BITS value needed for large files... no
checking for bswap_16... yes
checking for bswap_32... yes
checking sys/param.h usability... yes
checking sys/param.h presence... yes
checking for sys/param.h... yes
checking sys/vfs.h usability... yes
checking sys/vfs.h presence... yes
checking for sys/vfs.h... yes
checking sys/fs_types.h usability... no
checking sys/fs_types.h presence... no
checking for sys/fs_types.h... no
checking for sys/mount.h... yes
checking how to get filesystem space usage...
checking for statvfs function (SVR4)... no
checking for 3-argument statfs function (DEC OSF/1)... no
checking for two-argument statfs with statfs.bsize member (AIX, 4.3BSD)... yes
checking for inttypes.h... yes
checking for stdint.h... yes
checking for unsigned long long... yes
checking for fcntl.h... (cached) yes
checking dustat.h usability... no
checking dustat.h presence... no
checking for dustat.h... no
checking sys/fs/s5param.h usability... no
checking sys/fs/s5param.h presence... no
checking for sys/fs/s5param.h... no
checking sys/filsys.h usability... no
checking sys/filsys.h presence... no
checking for sys/filsys.h... no
checking sys/statfs.h usability... yes
checking sys/statfs.h presence... yes
checking for sys/statfs.h... yes
checking sys/statvfs.h usability... yes
checking sys/statvfs.h presence... yes
checking for sys/statvfs.h... yes
checking for statfs that truncates block counts... no
checking if zlib is wanted... yes
checking for inflateEnd in -lz... yes
checking zlib.h usability... yes
checking zlib.h presence... yes
checking for zlib.h... yes
checking for inflateEnd in -lz... (cached) yes
checking zlib in /usr... ok
checking for the pthreads library -lpthreads... no
checking whether pthreads work without any flags... no
checking whether pthreads work with -Kthread... no
checking whether pthreads work with -kthread... no
checking for the pthreads library -llthread... no
checking whether pthreads work with -pthread... yes
checking for joinable pthread attribute... PTHREAD_CREATE_JOINABLE
checking if more special flags are required for pthreads... no
checking for cc_r... x86_64-alt-linux-gcc
checking for library containing sem_init... none required
checking for dlopen in -ldl... yes
checking whether sys/soundcard.h or machine/soundcard.h works... yes
checking host OS support... linux
checking host cpu support... amd64
checking for GCC 2.7 or higher... yes
checking for GCC 3.0 or higher... yes
checking configuration options... ok
checking for X... libraries , headers 
checking for gethostbyname... yes
checking for connect... yes
checking for remove... yes
checking for shmat... yes
checking for IceConnectionNumber in -lICE... no
checking for waddch in -lncurses... no
checking for sdl-config... /usr/bin/sdl-config
checking for SDL - version >= 1.2.0... yes
checking whether to build JIT compiler... no
checking for graphics target to build... "SDL"
checking for sound target to build... "ALSA"
checking which UI target to build... "GTK+"
checking whether to build AGA emulation... yes
checking whether to build support for Autconfig devices... yes
checking whether to build SCSI emulation... no
no
checking whether to build CDTV emulation... no
checking whether to build CD32 emulation... no
checking whether to build bsdsocket.library emulation... yes
checking whether to build with threads... yes
checking which thread target to build... SDL
checking caps/capsimage.h usability... no
checking caps/capsimage.h presence... no
checking for caps/capsimage.h... no
checking whether to build internal debugger/monitor... yes
checking whether to build support for saving/loading emulator state... yes
checking whether to build with enforcer... yes
checking whether to build Action Replay emulation... yes
configure: creating ./config.status
config.status: creating Makefile
config.status: creating src/Makefile
config.status: creating src/dms/Makefile
config.status: creating src/caps/Makefile
config.status: creating src/md-generic/Makefile
config.status: creating src/md-i386-gcc/Makefile
config.status: creating src/md-ppc-gcc/Makefile
config.status: creating src/md-ppc/Makefile
config.status: creating src/md-68k/Makefile
config.status: creating src/md-amd64-gcc/Makefile
config.status: creating src/od-generic/Makefile
config.status: creating src/od-linux/Makefile
config.status: creating src/od-amiga/Makefile
config.status: creating src/od-beos/Makefile
config.status: creating src/od-macosx/Makefile
config.status: creating src/od-macosx/Info.plist
config.status: creating src/od-win32/Makefile
config.status: creating src/td-none/Makefile
config.status: creating src/td-amigaos/Makefile
config.status: creating src/td-beos/Makefile
config.status: creating src/td-posix/Makefile
config.status: creating src/td-sdl/Makefile
config.status: creating src/td-win32/Makefile
config.status: creating src/gfx-amigaos/Makefile
config.status: creating src/gfx-beos/Makefile
config.status: creating src/gfx-x11/Makefile
config.status: creating src/gfx-sdl/Makefile
config.status: creating src/gfx-curses/Makefile
config.status: creating src/gfx-svga/Makefile
config.status: creating src/sd-alsa/Makefile
config.status: creating src/sd-amigaos/Makefile
config.status: creating src/sd-beos/Makefile
config.status: creating src/sd-none/Makefile
config.status: creating src/sd-sdl/Makefile
config.status: creating src/sd-solaris/Makefile
config.status: creating src/sd-uss/Makefile
config.status: creating src/jd-none/Makefile
config.status: creating src/jd-amigainput/Makefile
config.status: creating src/jd-amigaos/Makefile
config.status: creating src/jd-beos/Makefile
config.status: creating src/jd-linuxold/Makefile
config.status: creating src/jd-sdl/Makefile
config.status: creating src/gui-none/Makefile
config.status: creating src/gui-beos/Makefile
config.status: creating src/gui-cocoa/Makefile
config.status: creating src/gui-gtk/Makefile
config.status: creating src/gui-muirexx/Makefile
config.status: creating src/keymap/Makefile
config.status: creating src/test/Makefile
config.status: creating src/sysconfig.h
config.status: linking ./src/targets/t-unix.h to src/target.h
config.status: linking ./src/md-amd64-gcc to src/machdep
config.status: linking ./src/include/fpp-ieee.h to src/md-fpp.h
config.status: linking ./src/od-linux to src/osdep
config.status: linking ./src/gfx-sdl to src/gfxdep
config.status: linking ./src/sd-alsa to src/sounddep
config.status: linking ./src/td-sdl to src/threaddep
config.status: linking ./src/jd-sdl to src/joydep
config.status: linking ./src/gui-gtk to src/guidep
config.status: executing depfiles commands
=== configuring in src/tools (/usr/src/RPM/BUILD/e-uae-0.8.29-WIP4/src/tools)
configure: running /bin/sh ./configure '--prefix=/usr'  '--build=x86_64-alt-linux' '--host=x86_64-alt-linux' '--exec-prefix=/usr' '--bindir=/usr/bin' '--sbindir=/usr/sbin' '--sysconfdir=/etc' '--datadir=/usr/share' '--includedir=/usr/include' '--libdir=/usr/lib64' '--libexecdir=/usr/lib' '--localstatedir=/var/lib' '--sharedstatedir=/var/lib' '--mandir=/usr/share/man' '--infodir=/usr/share/info' '--disable-dependency-tracking' '--without-included-gettext' '--with-alsa' '--with-sdl-gl' '--with-sdl-gfx' '--enable-ui' '--enable-audio' '--disable-sdltest' '--disable-gtktest' '--enable-bsdsock' 'build_alias=x86_64-alt-linux' 'host_alias=x86_64-alt-linux' 'CFLAGS=-pipe -frecord-gcc-switches -Wall -g -O2' 'CXXFLAGS=-pipe -frecord-gcc-switches -Wall -g -O2' --cache-file=/dev/null --srcdir=.
checking build system type... x86_64-alt-linux-gnu
checking host system type... x86_64-alt-linux-gnu
checking target system type... x86_64-alt-linux-gnu
checking for x86_64-alt-linux-gcc... x86_64-alt-linux-gcc
checking for C compiler default output file name... a.out
checking whether the C compiler works... yes
checking whether we are cross compiling... no
checking for suffix of executables... 
checking for suffix of object files... o
checking whether we are using the GNU C compiler... yes
checking whether x86_64-alt-linux-gcc accepts -g... yes
checking for x86_64-alt-linux-gcc option to accept ISO C89... none needed
checking how to run the C preprocessor... x86_64-alt-linux-gcc -E
checking whether make sets $(MAKE)... yes
checking for a BSD-compatible install... /usr/bin/ginstall -c
checking for grep that handles long lines and -e... /bin/grep
checking for egrep... /bin/grep -E
checking for AIX... no
checking for library containing strerror... none required
checking for ANSI C header files... yes
checking for an ANSI C-conforming const... yes
checking for inline... inline
checking for sys/types.h... yes
checking for sys/stat.h... yes
checking for stdlib.h... yes
checking for string.h... yes
checking for memory.h... yes
checking for strings.h... yes
checking for inttypes.h... yes
checking for stdint.h... yes
checking for unistd.h... yes
checking for char... yes
checking size of char... 1
checking for short... yes
checking size of short... 2
checking for int... yes
checking size of int... 4
checking for long... yes
checking size of long... 8
checking for long long... yes
checking size of long long... 8
checking for __int64... no
checking size of __int64... 0
checking for void *... yes
checking size of void *... 8
checking whether x86_64-alt-linux-gcc needs -traditional... no
checking for vprintf... yes
checking for _doprnt... no
checking for strdup... yes
checking for strcasecmp... yes
checking for strcmpi... no
checking for stricmp... no
configure: creating ./config.status
config.status: creating Makefile
config.status: creating sysconfig.h
config.status: linking ./../missing.c to missing.c
config.status: linking ./../writelog.c to writelog.c
config.status: linking ./../readcpu.c to readcpu.c
config.status: linking ./../build68k.c to build68k.c
config.status: linking ./../gencpu.c to gencpu.c
config.status: linking ./../gencomp.c to gencomp.c
config.status: linking ./../genblitter.c to genblitter.c
config.status: linking ./../blitops.c to blitops.c
config.status: linking ./../genlinetoscr.c to genlinetoscr.c
+ make -j8
Making all in src
make -C tools genblitter
make -C tools genlinetoscr
make -C tools build68k
make -C tools gencpu
make -C tools gencomp
make[2]: Entering directory '/usr/src/RPM/BUILD/e-uae-0.8.29-WIP4/src/tools'
x86_64-alt-linux-gcc -I. -I./../include/ -I. -c  -pipe -frecord-gcc-switches -Wall -g -O2 -Wall -W -Wno-unused -D__inline__=inline    writelog.c -o writelog.o
make[2]: Leaving directory '/usr/src/RPM/BUILD/e-uae-0.8.29-WIP4/src/tools'
make[2]: Entering directory '/usr/src/RPM/BUILD/e-uae-0.8.29-WIP4/src/tools'
x86_64-alt-linux-gcc -I. -I./../include/ -I. -c  -pipe -frecord-gcc-switches -Wall -g -O2 -Wall -W -Wno-unused -D__inline__=inline    blitops.c -o blitops.o
make[2]: Leaving directory '/usr/src/RPM/BUILD/e-uae-0.8.29-WIP4/src/tools'
make[2]: Entering directory '/usr/src/RPM/BUILD/e-uae-0.8.29-WIP4/src/tools'
x86_64-alt-linux-gcc -I. -I./../include/ -I. -c  -pipe -frecord-gcc-switches -Wall -g -O2 -Wall -W -Wno-unused -D__inline__=inline    genblitter.c -o genblitter.o
make[2]: Leaving directory '/usr/src/RPM/BUILD/e-uae-0.8.29-WIP4/src/tools'
make[2]: Entering directory '/usr/src/RPM/BUILD/e-uae-0.8.29-WIP4/src/tools'
x86_64-alt-linux-gcc  -o genblitter genblitter.o blitops.o writelog.o
writelog.o: file not recognized: File truncated
collect2: error: ld returned 1 exit status
make[2]: *** [Makefile:43: genblitter] Error 1
make[2]: Leaving directory '/usr/src/RPM/BUILD/e-uae-0.8.29-WIP4/src/tools'
make[1]: *** [Makefile:980: tools/genblitter] Error 2
make[1]: *** Waiting for unfinished jobs....
make[2]: Entering directory '/usr/src/RPM/BUILD/e-uae-0.8.29-WIP4/src/tools'
x86_64-alt-linux-gcc -I. -I./../include/ -I. -c  -pipe -frecord-gcc-switches -Wall -g -O2 -Wall -W -Wno-unused -D__inline__=inline    build68k.c -o build68k.o
build68k.c: In function 'main':
build68k.c:212:2: warning: ignoring return value of 'fgets', declared with attribute warn_unused_result [-Wunused-result]
  fgets(opcstr, 250, tablef);
  ^~~~~~~~~~~~~~~~~~~~~~~~~~
make[2]: Leaving directory '/usr/src/RPM/BUILD/e-uae-0.8.29-WIP4/src/tools'
make[2]: Entering directory '/usr/src/RPM/BUILD/e-uae-0.8.29-WIP4/src/tools'
x86_64-alt-linux-gcc  -o build68k build68k.o writelog.o
writelog.o: file not recognized: File truncated
collect2: error: ld returned 1 exit status
make[2]: *** [Makefile:45: build68k] Error 1
make[2]: Leaving directory '/usr/src/RPM/BUILD/e-uae-0.8.29-WIP4/src/tools'
make[2]: *** Waiting for unfinished jobs....
make[2]: Entering directory '/usr/src/RPM/BUILD/e-uae-0.8.29-WIP4/src/tools'
x86_64-alt-linux-gcc  -o build68k build68k.o writelog.o
writelog.o: file not recognized: File truncated
collect2: error: ld returned 1 exit status
make[2]: *** [Makefile:45: build68k] Error 1
make[2]: Leaving directory '/usr/src/RPM/BUILD/e-uae-0.8.29-WIP4/src/tools'
make[2]: *** Waiting for unfinished jobs....
make[2]: Entering directory '/usr/src/RPM/BUILD/e-uae-0.8.29-WIP4/src/tools'
x86_64-alt-linux-gcc -I. -I./../include/ -I. -c  -pipe -frecord-gcc-switches -Wall -g -O2 -Wall -W -Wno-unused -D__inline__=inline    genlinetoscr.c -o genlinetoscr.o
make[2]: Leaving directory '/usr/src/RPM/BUILD/e-uae-0.8.29-WIP4/src/tools'
make[2]: Entering directory '/usr/src/RPM/BUILD/e-uae-0.8.29-WIP4/src/tools'
x86_64-alt-linux-gcc -I. -I./../include/ -I. -c  -pipe -frecord-gcc-switches -Wall -g -O2 -Wall -W -Wno-unused -D__inline__=inline    writelog.c -o writelog.o
make[2]: Leaving directory '/usr/src/RPM/BUILD/e-uae-0.8.29-WIP4/src/tools'
make[2]: Entering directory '/usr/src/RPM/BUILD/e-uae-0.8.29-WIP4/src/tools'
x86_64-alt-linux-gcc -I. -I./../include/ -I. -c  -pipe -frecord-gcc-switches -Wall -g -O2 -Wall -W -Wno-unused -D__inline__=inline    missing.c -o missing.o
missing.c: In function 'xmalloc':
missing.c:33:23: warning: format '%d' expects argument of type 'int', but argument 2 has type 'size_t {aka long unsigned int}' [-Wformat=]
  write_log ("xmalloc(%d): virtual memory exhausted\n", n);
                      ~^
                      %ld
missing.c: In function 'xcalloc':
missing.c:43:23: warning: format '%d' expects argument of type 'int', but argument 2 has type 'size_t {aka long unsigned int}' [-Wformat=]
  write_log ("xcalloc(%d): virtual memory exhausted\n", n * size);
                      ~^                                ~~~~~~~~
                      %ld
make[2]: Leaving directory '/usr/src/RPM/BUILD/e-uae-0.8.29-WIP4/src/tools'
make[2]: Entering directory '/usr/src/RPM/BUILD/e-uae-0.8.29-WIP4/src/tools'
x86_64-alt-linux-gcc  -o genlinetoscr genlinetoscr.o
make[2]: Leaving directory '/usr/src/RPM/BUILD/e-uae-0.8.29-WIP4/src/tools'
make[2]: Entering directory '/usr/src/RPM/BUILD/e-uae-0.8.29-WIP4/src/tools'
x86_64-alt-linux-gcc  -o build68k build68k.o writelog.o
make[2]: Leaving directory '/usr/src/RPM/BUILD/e-uae-0.8.29-WIP4/src/tools'
make[2]: Entering directory '/usr/src/RPM/BUILD/e-uae-0.8.29-WIP4/src/tools'
x86_64-alt-linux-gcc -I. -I./../include/ -I. -c  -pipe -frecord-gcc-switches -Wall -g -O2 -Wall -W -Wno-unused -D__inline__=inline    readcpu.c -o readcpu.o
make[2]: Leaving directory '/usr/src/RPM/BUILD/e-uae-0.8.29-WIP4/src/tools'
make[2]: Entering directory '/usr/src/RPM/BUILD/e-uae-0.8.29-WIP4/src/tools'
x86_64-alt-linux-gcc -I. -I./../include/ -I. -c  -pipe -frecord-gcc-switches -Wall -g -O2 -Wall -W -Wno-unused -D__inline__=inline    readcpu.c -o readcpu.o
make[2]: Leaving directory '/usr/src/RPM/BUILD/e-uae-0.8.29-WIP4/src/tools'
make[2]: Entering directory '/usr/src/RPM/BUILD/e-uae-0.8.29-WIP4/src/tools'
x86_64-alt-linux-gcc -I. -I./../include/ -I. -c  -pipe -frecord-gcc-switches -Wall -g -O2 -Wall -W -Wno-unused -D__inline__=inline    gencomp.c -o gencomp.o
gencomp.c: In function 'main':
gencomp.c:3099:5: warning: ignoring return value of 'freopen', declared with attribute warn_unused_result [-Wunused-result]
     freopen ("compemu.c", "wb", stdout);
     ^~~~~~~~~~~~~~~~~~~~~~~~~~~~~~~~~~~
gencomp.c: In function 'read_counts':
gencomp.c:101:2: warning: ignoring return value of 'fscanf', declared with attribute warn_unused_result [-Wunused-result]
  fscanf (file, "Total: %lu\n", &total);
  ^~~~~~~~~~~~~~~~~~~~~~~~~~~~~~~~~~~~~
gencomp.c: In function 'genflags':
gencomp.c:25:31: warning: this statement may fall through [-Wimplicit-fallthrough=]
 #define failure global_failure=1
                 ~~~~~~~~~~~~~~^~
gencomp.c:1066:2: note: in expansion of macro 'failure'
  failure;
  ^~~~~~~
gencomp.c:1068:6: note: here
      case flag_and:
      ^~~~
make[2]: Leaving directory '/usr/src/RPM/BUILD/e-uae-0.8.29-WIP4/src/tools'
make[1]: *** [Makefile:986: tools/gencomp] Error 2
make[2]: Entering directory '/usr/src/RPM/BUILD/e-uae-0.8.29-WIP4/src/tools'
x86_64-alt-linux-gcc -I. -I./../include/ -I. -c  -pipe -frecord-gcc-switches -Wall -g -O2 -Wall -W -Wno-unused -D__inline__=inline    gencpu.c -o gencpu.o
gencpu.c: In function 'main':
gencpu.c:3194:6: warning: ignoring return value of 'freopen', declared with attribute warn_unused_result [-Wunused-result]
      freopen (fname, "wb", stdout);
      ^~~~~~~~~~~~~~~~~~~~~~~~~~~~~
gencpu.c: In function 'read_counts':
gencpu.c:76:2: warning: ignoring return value of 'fscanf', declared with attribute warn_unused_result [-Wunused-result]
  fscanf (file, "Total: %lu\n", &total);
  ^~~~~~~~~~~~~~~~~~~~~~~~~~~~~~~~~~~~~
make[2]: Leaving directory '/usr/src/RPM/BUILD/e-uae-0.8.29-WIP4/src/tools'
make[1]: *** [Makefile:984: tools/gencpu] Error 2
make: *** [Makefile:247: all-recursive] Error 1
error: Bad exit status from /usr/src/tmp/rpm-tmp.12204 (%build)


RPM build errors:
    Bad exit status from /usr/src/tmp/rpm-tmp.12204 (%build)
Command exited with non-zero status 1
10.75user 3.25system 0:21.29elapsed 65%CPU (0avgtext+0avgdata 75284maxresident)k
0inputs+0outputs (0major+1761341minor)pagefaults 0swaps
hsh-rebuild: rebuild of `e-uae-0.8.29-alt1.src.rpm' failed.
Command exited with non-zero status 1
24.79user 5.88system 0:40.85elapsed 75%CPU (0avgtext+0avgdata 122592maxresident)k
0inputs+0outputs (0major+2193935minor)pagefaults 0swaps