86>Nov 16 09:02:49 userdel[431566]: delete user 'rooter'
<86>Nov 16 09:02:49 userdel[431566]: removed group 'rooter' owned by 'rooter'
<86>Nov 16 09:02:49 userdel[431566]: removed shadow group 'rooter' owned by 'rooter'
<86>Nov 16 09:02:49 groupadd[431639]: group added to /etc/group: name=rooter, GID=1811
<86>Nov 16 09:02:49 groupadd[431639]: group added to /etc/gshadow: name=rooter
<86>Nov 16 09:02:49 groupadd[431639]: new group: name=rooter, GID=1811
<86>Nov 16 09:02:49 useradd[431704]: new user: name=rooter, UID=1811, GID=1811, home=/root, shell=/bin/bash, from=none
<86>Nov 16 09:02:49 userdel[431795]: delete user 'builder'
<86>Nov 16 09:02:49 userdel[431795]: removed group 'builder' owned by 'builder'
<86>Nov 16 09:02:49 userdel[431795]: removed shadow group 'builder' owned by 'builder'
<86>Nov 16 09:02:49 groupadd[431865]: group added to /etc/group: name=builder, GID=1812
<86>Nov 16 09:02:49 groupadd[431865]: group added to /etc/gshadow: name=builder
<86>Nov 16 09:02:49 groupadd[431865]: new group: name=builder, GID=1812
<86>Nov 16 09:02:49 useradd[431929]: new user: name=builder, UID=1812, GID=1812, home=/usr/src, shell=/bin/bash, from=none
/usr/src/in/srpm/kde5-kpkpass-23.08.5-alt1.src.rpm: bad symbols in the license tag: /
<13>Nov 16 09:02:53 rpmi: libxkbcommon-1.7.0-alt1.1 sisyphus+343672.100.1.1 1711490815 installed
<13>Nov 16 09:02:53 rpmi: libidn2-2.3.7-alt1 sisyphus+339505.100.1.2 1706718975 installed
<13>Nov 16 09:02:53 rpmi: libnettle8-3.9.1-alt1 sisyphus+322548.100.1.2 1686176897 installed
<13>Nov 16 09:02:53 rpmi: libexpat-2.5.0-alt1 sisyphus+346180.200.2.1 1716349845 installed
<13>Nov 16 09:02:53 rpmi: libts0-1.22-alt3 sisyphus+278442.100.1.2 1626216683 installed
<13>Nov 16 09:02:53 rpmi: qt5-base-common-5.15.15-alt1 sisyphus+359324.100.1.2 1728479179 installed
<13>Nov 16 09:02:53 rpmi: qt5-declarative-common-5.15.15-alt1 sisyphus+359325.100.1.1 1728466895 installed
<13>Nov 16 09:02:53 rpmi: libmtdev-1.1.6-alt1 sisyphus+278361.100.1.1 1626091636 installed
<13>Nov 16 09:02:53 rpmi: libpng16-1.6.42-alt2 sisyphus+339555.100.1.1 1706781690 installed
<13>Nov 16 09:02:53 rpmi: libevdev-1.13.3-alt1 sisyphus+356918.100.1.1 1725546441 installed
<13>Nov 16 09:02:53 rpmi: libICE-1.1.1-alt1 sisyphus+311428.500.1.1 1670577559 installed
<13>Nov 16 09:02:53 rpmi: libglvnd-7:1.7.0-alt1 sisyphus+330949.100.1.1 1696424894 installed
<13>Nov 16 09:02:53 rpmi: libwayland-server-1.23.1-alt1.1 sisyphus+356019.140.3.1 1724572108 installed
<13>Nov 16 09:02:53 rpmi: libp11-kit-1:0.25.5-alt1 sisyphus+352553.100.1.1 1720622586 installed
<13>Nov 16 09:02:53 rpmi: libtasn1-4.19.0-alt3 sisyphus+327816.100.1.1 1692802618 installed
<13>Nov 16 09:02:53 rpmi: libSM-1.2.4-alt1 sisyphus+312057.200.1.1 1671526918 installed
<13>Nov 16 09:02:53 rpmi: libhogweed6-3.9.1-alt1 sisyphus+322548.100.1.2 1686176897 installed
<13>Nov 16 09:02:53 rpmi: libgnutls30-3.8.4-alt1 sisyphus+343729.100.2.1 1711570650 installed
<13>Nov 16 09:02:53 rpmi: libngtcp2.16-1.7.0-alt1 sisyphus+356415.200.1.1 1725031916 installed
<13>Nov 16 09:02:53 rpmi: libngtcp2_crypto_gnutls8-1.7.0-alt1 sisyphus+356415.200.1.1 1725031916 installed
<13>Nov 16 09:02:53 rpmi: rpm-macros-ubt-0.5-alt1 sisyphus+349039.100.1.1 1716535621 installed
<13>Nov 16 09:02:53 rpmi: rpm-macros-qt5-5.15.15-alt1 sisyphus+359324.100.1.2 1728478992 installed
<13>Nov 16 09:02:53 rpmi: rpm-build-xdg-0.2-alt1 1250461503 installed
<13>Nov 16 09:02:53 rpmi: libsqlite3-3.46.0-alt1 sisyphus+352354.100.2.1 1721980459 installed
<13>Nov 16 09:02:53 rpmi: libjpeg-2:3.0.2-alt2.1 sisyphus+340135.100.1.1 1707449053 installed
<13>Nov 16 09:02:53 rpmi: libwacom-data-2.13.0-alt1 sisyphus+356629.100.1.1 1725279204 installed
<13>Nov 16 09:02:53 rpmi: libmpdec3-2.5.1-alt3 sisyphus+314490.500.5.1 1675432033 installed
<13>Nov 16 09:02:54 rpmi: libicu74-1:7.4.2-alt1 sisyphus+336372.200.1.1 1702422879 installed
<13>Nov 16 09:02:54 rpmi: libgudev-1:238-alt1 sisyphus+324364.100.1.1 1688646145 installed
<13>Nov 16 09:02:54 rpmi: desktop-file-utils-0.26-alt6 sisyphus+331944.100.1.3 1697550035 installed
<13>Nov 16 09:02:54 rpmi: shared-mime-info-2.4-alt1 sisyphus+334259.100.1.1 1699787317 installed
<13>Nov 16 09:02:54 rpmi: libgdbm-1.8.3-alt10 sisyphus+346222.200.3.2 1716468406 installed
<13>Nov 16 09:02:54 rpmi: libgraphite2-1.3.14-alt2.1 sisyphus+279571.100.1.2 1626605157 installed
<13>Nov 16 09:02:54 rpmi: libduktape207-2.7.0-alt3 sisyphus+352341.100.1.1 1720324465 installed
<13>Nov 16 09:02:54 rpmi: libdouble-conversion3-3.3.0-alt1 sisyphus+333410.100.1.1 1698928792 installed
<13>Nov 16 09:02:54 rpmi: libqt5-core-5.15.15-alt1 sisyphus+359324.100.1.2 1728479179 installed
<13>Nov 16 09:02:54 rpmi: libqt5-sql-5.15.15-alt1 sisyphus+359324.100.1.2 1728479179 installed
<13>Nov 16 09:02:54 rpmi: liblz4-1:1.9.4-alt1 sisyphus+309416.100.1.1 1667413000 installed
<13>Nov 16 09:02:54 rpmi: libsystemd-1:255.13-alt1 sisyphus+359453.100.2.1 1728651220 installed
<13>Nov 16 09:02:54 rpmi: libdbus-1.14.10-alt1 sisyphus+327286.5700.14.1 1711487513 installed
<13>Nov 16 09:02:54 rpmi: libqt5-dbus-5.15.15-alt1 sisyphus+359324.100.1.2 1728479179 installed
<13>Nov 16 09:02:54 rpmi: publicsuffix-list-dafsa-20240911-alt1 sisyphus+357399.100.1.1 1726160479 installed
<13>Nov 16 09:02:54 rpmi: libpsl-0.21.5-alt1 sisyphus+338474.100.1.1 1705684771 installed
<13>Nov 16 09:02:54 rpmi: libnghttp3.9-1.5.0-alt1 sisyphus+356415.100.1.1 1725031856 installed
<13>Nov 16 09:02:54 rpmi: libnghttp2-1.63.0-alt1 sisyphus+356414.100.1.1 1725031511 installed
<13>Nov 16 09:02:54 rpmi: openldap-common-2.6.8-alt1 sisyphus+351621.100.1.1 1719420449 installed
<13>Nov 16 09:02:54 rpmi: libntlm-1.5-alt1 sisyphus+278100.3300.1.1 1626059663 installed
<13>Nov 16 09:02:54 rpmi: libidn-1.37-alt2 sisyphus+300849.100.1.1 1653769693 installed
<13>Nov 16 09:02:54 rpmi: libverto-0.3.2-alt1_1 sisyphus+321176.2200.10.2 1684806164 installed
<13>Nov 16 09:02:54 rpmi: liblmdb-0.9.33-alt1 sisyphus+360625.100.1.1 1729819639 installed
<13>Nov 16 09:02:54 rpmi: libkeyutils-1.6.3-alt1 sisyphus+346336.200.2.2 1716472658 installed
<13>Nov 16 09:02:54 rpmi: libcom_err-1.46.4.0.5.4cda-alt1 sisyphus+283826.100.1.1 1629975361 installed
<13>Nov 16 09:02:54 rpmi: libbrotlicommon-1.1.0-alt1 sisyphus+328501.100.1.1 1693598420 installed
<13>Nov 16 09:02:54 rpmi: libbrotlidec-1.1.0-alt1 sisyphus+328501.100.1.1 1693598420 installed
<13>Nov 16 09:02:54 rpmi: libharfbuzz-10.1.0-alt1 sisyphus+361773.100.1.1 1730824050 installed
<13>Nov 16 09:02:54 rpmi: libfreetype-2.13.3-alt1 sisyphus+355656.100.1.1 1724221065 installed
<13>Nov 16 09:02:54 rpmi: libfontconfig1-2.15.0-alt1 sisyphus+355771.100.2.3 1724337302 installed
<13>Nov 16 09:02:54 rpmi: libb2-0.98.1-alt1_1 sisyphus+291614.100.1.1 1638962878 installed
<13>Nov 16 09:02:54 rpmi: libSDL2-2.30.9-alt2 sisyphus+362624.100.1.1 1731679136 installed
<13>Nov 16 09:02:54 rpmi: tslib-1.22-alt3 sisyphus+278442.100.1.2 1626216683 installed
<13>Nov 16 09:02:54 rpmi: libxshmfence-1.3.2-alt1 sisyphus+311428.400.1.1 1670577529 installed
<13>Nov 16 09:02:54 rpmi: libsensors3-3.6.0-alt3 sisyphus+308579.100.1.1 1666035269 installed
<13>Nov 16 09:02:54 rpmi: libX11-locales-3:1.8.10-alt1 sisyphus+353866.100.1.1 1722240771 installed
<13>Nov 16 09:02:54 rpmi: llvm18.1-filesystem-18.1.8-alt0.3 sisyphus+362390.100.1.1 1731449555 installed
<13>Nov 16 09:02:55 rpmi: llvm18.1-polly-18.1.8-alt0.3 sisyphus+362390.100.1.1 1731449555 installed
<13>Nov 16 09:02:55 rpmi: libedit3-3.1.20230828-alt1 sisyphus+330914.200.3.1 1696922745 installed
<13>Nov 16 09:02:55 rpmi: llvm18.1-gold-18.1.8-alt0.3 sisyphus+362390.100.1.1 1731449555 installed
<13>Nov 16 09:02:57 rpmi: llvm18.1-libs-18.1.8-alt0.3 sisyphus+362390.100.1.1 1731449555 installed
<13>Nov 16 09:02:57 rpmi: libXdmcp-1.1.5-alt1 sisyphus+343583.700.1.1 1711441073 installed
<13>Nov 16 09:02:57 rpmi: libXau-1.0.11-alt1 sisyphus+311428.100.1.1 1670577440 installed
<13>Nov 16 09:02:57 rpmi: libxcb-1.17.0-alt1 sisyphus+345308.200.1.1 1713342009 installed
<13>Nov 16 09:02:57 rpmi: libX11-3:1.8.10-alt1 sisyphus+353866.100.1.1 1722240774 installed
<13>Nov 16 09:02:57 rpmi: libXext-1.3.6-alt1 sisyphus+343583.1000.1.1 1711441114 installed
<13>Nov 16 09:02:57 rpmi: libXxf86vm-1.1.5-alt1 sisyphus+308663.1400.1.1 1666168534 installed
<13>Nov 16 09:02:57 rpmi: libXfixes-6.0.1-alt1 sisyphus+331490.300.1.1 1697023235 installed
<13>Nov 16 09:02:57 rpmi: libXrender-0.9.11-alt1 sisyphus+308841.100.1.1 1666436131 installed
<13>Nov 16 09:02:57 rpmi: libxcbutil-icccm-0.4.1-alt2 sisyphus+278275.100.1.2 1626148617 installed
<13>Nov 16 09:02:57 rpmi: libxcbutil-1:0.4.1-alt1 sisyphus+312057.100.1.1 1671526889 installed
<13>Nov 16 09:02:57 rpmi: libxcbutil-image-0.4.0-alt1 sisyphus+275413.100.1.3 1624505806 installed
<13>Nov 16 09:02:57 rpmi: libxcbutil-keysyms-0.4.0-alt1 sisyphus+278187.100.1.1 1626075950 installed
<13>Nov 16 09:02:57 rpmi: libxcb-render-util-0.3.9-alt3 sisyphus+276916.100.1.2 1625275237 installed
<13>Nov 16 09:02:57 rpmi: libxkbcommon-x11-1.7.0-alt1.1 sisyphus+343672.100.1.1 1711490815 installed
<13>Nov 16 09:02:57 rpmi: libwayland-client-1.23.1-alt1.1 sisyphus+356019.140.3.1 1724572108 installed
<13>Nov 16 09:02:57 rpmi: libpciaccess-1:0.18.1-alt1 sisyphus+343583.300.1.1 1711440792 installed
<13>Nov 16 09:02:57 rpmi: libdrm-1:2.4.123-alt1 sisyphus+357330.40.3.1 1726125397 installed
<13>Nov 16 09:02:58 rpmi: libGLX-mesa-4:24.2.7-alt1 sisyphus+362485.100.1.1 1731565545 installed
<13>Nov 16 09:02:58 rpmi: libgbm-4:24.2.7-alt1 sisyphus+362485.100.1.1 1731565545 installed
<13>Nov 16 09:02:58 rpmi: libEGL-mesa-4:24.2.7-alt1 sisyphus+362485.100.1.1 1731565545 installed
<13>Nov 16 09:02:58 rpmi: libEGL-7:1.7.0-alt1 sisyphus+330949.100.1.1 1696424894 installed
<13>Nov 16 09:02:58 rpmi: libGLX-7:1.7.0-alt1 sisyphus+330949.100.1.1 1696424894 installed
<13>Nov 16 09:02:58 rpmi: libGL-7:1.7.0-alt1 sisyphus+330949.100.1.1 1696424894 installed
<13>Nov 16 09:02:58 rpmi: gsettings-desktop-schemas-data-47.1-alt1 sisyphus+357735.300.3.1 1726641752 installed
<13>Nov 16 09:02:58 rpmi: libgio-2.82.2-alt1 sisyphus+360023.100.1.1 1729169702 installed
<13>Nov 16 09:02:58 rpmi: gsettings-desktop-schemas-47.1-alt1 sisyphus+357735.300.3.1 1726641770 installed
<13>Nov 16 09:02:58 rpmi: rpm-macros-alternatives-0.5.2-alt2 sisyphus+315270.200.2.1 1676457367 installed
<13>Nov 16 09:02:58 rpmi: alternatives-0.5.2-alt2 sisyphus+315270.200.2.1 1676457367 installed
<13>Nov 16 09:02:58 rpmi: ca-certificates-2024.07.01-alt1 sisyphus+351897.100.1.1 1719826350 installed
<13>Nov 16 09:02:58 rpmi: ca-trust-0.2.0-alt1 sisyphus+344843.100.1.1 1712743326 installed
<13>Nov 16 09:02:58 rpmi: p11-kit-trust-1:0.25.5-alt1 sisyphus+352553.100.1.1 1720622586 installed
<13>Nov 16 09:02:58 rpmi: libcrypto3-3.1.7-alt2 sisyphus+359910.100.1.1 1729080696 installed
<13>Nov 16 09:02:58 rpmi: libssl3-3.1.7-alt2 sisyphus+359910.100.1.1 1729080696 installed
<86>Nov 16 09:02:58 groupadd[467780]: group added to /etc/group: name=_keytab, GID=999
<86>Nov 16 09:02:58 groupadd[467780]: group added to /etc/gshadow: name=_keytab
<86>Nov 16 09:02:58 groupadd[467780]: new group: name=_keytab, GID=999
<13>Nov 16 09:02:58 rpmi: libkrb5-1.21.3-alt2 sisyphus+351857.100.1.1 1719735219 installed
<13>Nov 16 09:02:58 rpmi: python3-3.12.7-alt1 sisyphus+358796.100.1.1 1727844713 installed
<13>Nov 16 09:02:59 rpmi: python3-base-3.12.7-alt1 sisyphus+358796.100.1.1 1727844713 installed
<13>Nov 16 09:02:59 rpmi: python3-module-pyudev-0.24.3-alt1 sisyphus+347852.100.1.1 1715497013 installed
<13>Nov 16 09:02:59 rpmi: python3-module-libevdev-0.11-alt1 sisyphus+300877.100.1.1 1653893962 installed
<13>Nov 16 09:02:59 rpmi: libwacom-2.13.0-alt1 sisyphus+356629.100.1.1 1725279203 installed
<13>Nov 16 09:02:59 rpmi: libinput-1.26.2-alt2.1 sisyphus+358480.100.1.1 1727435756 installed
<13>Nov 16 09:02:59 rpmi: libgsasl18-2.2.1-alt2 sisyphus+359713.200.2.1 1728905438 installed
<86>Nov 16 09:02:59 groupadd[470413]: group added to /etc/group: name=sasl, GID=998
<86>Nov 16 09:02:59 groupadd[470413]: group added to /etc/gshadow: name=sasl
<86>Nov 16 09:02:59 groupadd[470413]: new group: name=sasl, GID=998
<13>Nov 16 09:02:59 rpmi: libsasl2-3-2.1.28-alt2 sisyphus+343335.100.1.1 1711112524 installed
<13>Nov 16 09:02:59 rpmi: libldap2-2.6.8-alt1 sisyphus+351621.100.1.1 1719420471 installed
<13>Nov 16 09:02:59 rpmi: libssh2-1.11.0-alt2 sisyphus+339356.100.1.1 1706593140 installed
<13>Nov 16 09:02:59 rpmi: libcurl-8.11.0-alt1 sisyphus+361800.100.1.1 1730881003 installed
<13>Nov 16 09:02:59 rpmi: libproxy-0.5.9-alt1 sisyphus+360721.100.1.1 1729865347 installed
<13>Nov 16 09:02:59 rpmi: libqt5-network-5.15.15-alt1 sisyphus+359324.100.1.2 1728479179 installed
<13>Nov 16 09:02:59 rpmi: libqt5-xcbqpa-5.15.15-alt1 sisyphus+359324.100.1.2 1728479179 installed
<13>Nov 16 09:02:59 rpmi: libqt5-eglfskmssupport-5.15.15-alt1 sisyphus+359324.100.1.2 1728479179 installed
<13>Nov 16 09:02:59 rpmi: libqt5-eglfsdeviceintegration-5.15.15-alt1 sisyphus+359324.100.1.2 1728479179 installed
<13>Nov 16 09:02:59 rpmi: libqt5-gui-5.15.15-alt1 sisyphus+359324.100.1.2 1728479179 installed
<13>Nov 16 09:02:59 rpmi: libqt5-qmlmodels-5.15.15-alt1 sisyphus+359325.100.1.1 1728466895 installed
<13>Nov 16 09:02:59 rpmi: libqt5-qmlworkerscript-5.15.15-alt1 sisyphus+359325.100.1.1 1728466895 installed
<13>Nov 16 09:02:59 rpmi: libqt5-quick-5.15.15-alt1 sisyphus+359325.100.1.1 1728466895 installed
<13>Nov 16 09:02:59 rpmi: libqt5-quickshapes-5.15.15-alt1 sisyphus+359325.100.1.1 1728466895 installed
<13>Nov 16 09:02:59 rpmi: libqt5-qml-5.15.15-alt1 sisyphus+359325.100.1.1 1728466895 installed
<13>Nov 16 09:02:59 rpmi: rpm-build-qml-5.15.15-alt1 sisyphus+359325.100.1.1 1728466895 installed
<13>Nov 16 09:02:59 rpmi: rpm-build-kf5-5.101.0-alt1 sisyphus+336971.100.1.1 1703161556 installed
<13>Nov 16 09:02:59 rpmi: rpm-build-ubt-0.3.1-alt3 sisyphus+277013.100.1.2 1625346631 installed
<13>Nov 16 09:03:02 rpmi: libqt5-widgets-5.15.15-alt1 sisyphus+359324.100.1.2 1728479179 installed
<13>Nov 16 09:03:02 rpmi: xorg-proto-devel-2024.1-alt1 sisyphus+343583.40.1.1 1711440649 installed
<13>Nov 16 09:03:04 rpmi: libxcb-devel-1.17.0-alt1 sisyphus+345308.200.1.1 1713342009 installed
<13>Nov 16 09:03:04 rpmi: libX11-devel-3:1.8.10-alt1 sisyphus+353866.100.1.1 1722240774 installed
<13>Nov 16 09:03:04 rpmi: libqt5-opengl-5.15.15-alt1 sisyphus+359324.100.1.2 1728479179 installed
<13>Nov 16 09:03:04 rpmi: xxd-4:9.1.0050-alt4 sisyphus+350411.100.1.1 1717596650 installed
<13>Nov 16 09:03:04 rpmi: vulkan-headers-1.3.290-alt1 sisyphus+356274.400.2.1 1724874998 installed
<13>Nov 16 09:03:04 rpmi: libxkbcommon-devel-1.7.0-alt1.1 sisyphus+343672.100.1.1 1711490815 installed
<13>Nov 16 09:03:04 rpmi: libudev-devel-1:255.13-alt1 sisyphus+359453.100.2.1 1728651220 installed
<13>Nov 16 09:03:04 rpmi: libssl-devel-3.1.7-alt2 sisyphus+359910.100.1.1 1729080696 installed
<13>Nov 16 09:03:04 rpmi: libqt5-xml-5.15.15-alt1 sisyphus+359324.100.1.2 1728479179 installed
<13>Nov 16 09:03:04 rpmi: libqt5-test-5.15.15-alt1 sisyphus+359324.100.1.2 1728479179 installed
<13>Nov 16 09:03:04 rpmi: libqt5-concurrent-5.15.15-alt1 sisyphus+359324.100.1.2 1728479179 installed
<13>Nov 16 09:03:04 rpmi: libdouble-conversion-devel-3.3.0-alt1 sisyphus+333410.100.1.1 1698928792 installed
<13>Nov 16 09:03:04 rpmi: libavahi-0.8-alt4 sisyphus+344258.100.1.1 1712133862 installed
<13>Nov 16 09:03:04 rpmi: libcups-2.4.11-alt1 sisyphus+359120.200.2.1 1728202638 installed
<13>Nov 16 09:03:04 rpmi: libqt5-printsupport-5.15.15-alt1 sisyphus+359324.100.1.2 1728479179 installed
<13>Nov 16 09:03:04 rpmi: libOpenGL-7:1.7.0-alt1 sisyphus+330949.100.1.1 1696424894 installed
<13>Nov 16 09:03:04 rpmi: libGLES-7:1.7.0-alt1 sisyphus+330949.100.1.1 1696424894 installed
<13>Nov 16 09:03:04 rpmi: libglvnd-devel-7:1.7.0-alt1 sisyphus+330949.100.1.1 1696424894 installed
<13>Nov 16 09:03:04 rpmi: kf5-filesystem-5.100.1-alt1 sisyphus+333884.100.1.2 1699476476 installed
<13>Nov 16 09:03:04 rpmi: kf5-karchive-common-5.116.0-alt1 sisyphus+348739.2100.3.2 1716830876 installed
<13>Nov 16 09:03:04 rpmi: libkf5archive-5.116.0-alt1 sisyphus+348739.2100.3.2 1716830978 installed
<13>Nov 16 09:03:04 rpmi: icu-utils-1:7.4.2-alt1 sisyphus+336372.200.1.1 1702422879 installed
<13>Nov 16 09:03:04 rpmi: libicu-devel-1:7.4.2-alt1 sisyphus+336372.200.1.1 1702422879 installed
<13>Nov 16 09:03:04 rpmi: gcc-c++-common-1.4.28-alt1 sisyphus+348678.100.1.1 1716396142 installed
<13>Nov 16 09:03:04 rpmi: libstdc++14-devel-14.2.1-alt1 sisyphus+360995.100.1.1 1730131612 installed
<13>Nov 16 09:03:05 rpmi: gcc14-c++-14.2.1-alt1 sisyphus+360995.100.1.1 1730131612 installed
<13>Nov 16 09:03:05 rpmi: gcc-c++-14-alt1 sisyphus+360995.300.1.1 1730139881 installed
<13>Nov 16 09:03:05 rpmi: libyaml2-0.2.5-alt1 sisyphus+278391.100.1.1 1626094932 installed
<13>Nov 16 09:03:05 rpmi: python3-module-yaml-6.0.2-alt1 sisyphus+356896.100.1.1 1725541114 installed
<13>Nov 16 09:03:05 rpmi: python3-module-pyxdg-0.28-alt1.2 sisyphus+341065.100.1.1 1708351562 installed
<13>Nov 16 09:03:05 rpmi: python3-module-urllib3-2:2.2.3-alt1 sisyphus+357427.100.2.1 1726567364 installed
<13>Nov 16 09:03:05 rpmi: python3-module-idna-3.10-alt1 sisyphus+358681.100.1.1 1727701241 installed
<13>Nov 16 09:03:05 rpmi: python3-module-charset-normalizer-3.2.0-alt1 sisyphus+347396.200.2.1 1714733144 installed
<13>Nov 16 09:03:05 rpmi: python3-module-requests-2.32.3-alt1 sisyphus+349946.100.1.1 1717059877 installed
<13>Nov 16 09:03:05 rpmi: libxxhash-0.8.2-alt1 sisyphus+336514.200.7.1 1702672120 installed
<13>Nov 16 09:03:05 rpmi: rsync-3.2.7-alt1 sisyphus+325006.2000.1.1 1689498390 installed
<13>Nov 16 09:03:05 rpmi: openssh-common-9.6p1-alt2 sisyphus+351911.100.1.1 1719838551 installed
<86>Nov 16 09:03:05 groupadd[499876]: group added to /etc/group: name=sshagent, GID=997
<86>Nov 16 09:03:05 groupadd[499876]: group added to /etc/gshadow: name=sshagent
<86>Nov 16 09:03:05 groupadd[499876]: new group: name=sshagent, GID=997
<13>Nov 16 09:03:05 rpmi: openssh-clients-9.6p1-alt2 sisyphus+351911.100.1.1 1719838551 installed
<13>Nov 16 09:03:05 rpmi: less-633-alt1 sisyphus+328181.300.2.1 1693321749 installed
<13>Nov 16 09:03:05 rpmi: diffstat-1.64-alt1 sisyphus+346132.200.3.2 1716466240 installed
<13>Nov 16 09:03:06 rpmi: git-core-2.42.2-alt1 sisyphus+348068.100.1.1 1715721643 installed
<13>Nov 16 09:03:06 rpmi: cmake-modules-3.29.3-alt1 sisyphus+348648.100.2.1 1716590540 installed
<13>Nov 16 09:03:06 rpmi: libuv-1.48.0-alt2 sisyphus+357579.100.1.1 1726426172 installed
<13>Nov 16 09:03:06 rpmi: librhash-1.3.5-alt3 sisyphus+286141.40.2.1 1632982456 installed
<13>Nov 16 09:03:06 rpmi: libjsoncpp24-1.9.4-alt2 sisyphus+346331.200.2.1 1716448553 installed
<13>Nov 16 09:03:06 rpmi: libarchive13-3.7.5-alt2 sisyphus+358189.100.1.1 1727162770 installed
<13>Nov 16 09:03:06 rpmi: rpm-macros-cmake-3.29.1-alt1 sisyphus+344518.300.3.1 1712379787 installed
<13>Nov 16 09:03:06 rpmi: cmake-3.29.3-alt1 sisyphus+348648.100.2.1 1716590556 installed
<13>Nov 16 09:03:06 rpmi: extra-cmake-modules-6.8.0-alt1 sisyphus+362414.100.2.2 1731601817 installed
<13>Nov 16 09:03:07 rpmi: qt5-base-devel-5.15.15-alt1 sisyphus+359324.100.1.2 1728479179 installed
<13>Nov 16 09:03:07 rpmi: kf5-karchive-devel-5.116.0-alt1 sisyphus+348739.2100.3.2 1716830978 installed
Building target platforms: i586
Building for target i586
Wrote: /usr/src/in/nosrpm/kde5-kpkpass-23.08.5-alt1.nosrc.rpm (w1.gzdio)
Installing kde5-kpkpass-23.08.5-alt1.src.rpm
Building target platforms: i586
Building for target i586
Executing(%prep): /bin/sh -e /usr/src/tmp/rpm-tmp.14149
+ umask 022
+ /bin/mkdir -p /usr/src/RPM/BUILD
+ cd /usr/src/RPM/BUILD
+ cd /usr/src/RPM/BUILD
+ rm -rf kpkpass-23.08.5
+ echo 'Source #0 (kpkpass-23.08.5.tar):'
Source #0 (kpkpass-23.08.5.tar):
+ /bin/tar -xf /usr/src/RPM/SOURCES/kpkpass-23.08.5.tar
+ cd kpkpass-23.08.5
+ /bin/chmod -c -Rf u+rwX,go-w .
+ exit 0
Executing(%build): /bin/sh -e /usr/src/tmp/rpm-tmp.14149
+ umask 022
+ /bin/mkdir -p /usr/src/RPM/BUILD
+ cd /usr/src/RPM/BUILD
+ cd kpkpass-23.08.5
+ __kf5_build -DKDE_INSTALL_INCLUDEDIR=/usr/include/KF5
+ mkdir -p BUILD
+ __kf5_cmake -DKDE_INSTALL_INCLUDEDIR=/usr/include/KF5
+ export PATH=/usr/lib/kf5/bin:/usr/src/bin:/usr/bin:/bin:/usr/local/bin:/usr/games
+ PATH=/usr/lib/kf5/bin:/usr/src/bin:/usr/bin:/bin:/usr/local/bin:/usr/games
+ export QTDIR=/usr/share/qt5
+ QTDIR=/usr/share/qt5
+ export 'CFLAGS=-pipe -frecord-gcc-switches -Wall -g -O2 -flto=auto -march=i586 -mtune=generic'
+ CFLAGS='-pipe -frecord-gcc-switches -Wall -g -O2 -flto=auto -march=i586 -mtune=generic'
+ export 'CXXFLAGS=-pipe -frecord-gcc-switches -Wall -g -O2 -flto=auto -march=i586 -mtune=generic'
+ CXXFLAGS='-pipe -frecord-gcc-switches -Wall -g -O2 -flto=auto -march=i586 -mtune=generic'
+ pushd BUILD
~/RPM/BUILD/kpkpass-23.08.5/BUILD ~/RPM/BUILD/kpkpass-23.08.5
+ cmake .. -DCMAKE_USE_RELATIVE_PATHS:BOOL=ON -DCMAKE_VERBOSE_MAKEFILE:BOOL=ON -DCMAKE_SKIP_RPATH:BOOL=ON -DBUILD_TESTING:BOOL=FALSE -DKDE_INSTALL_USE_QT_SYS_PATHS:BOOL=ON -DCMAKE_BUILD_TYPE=Release '-DCMAKE_EXE_LINKER_FLAGS:STRING=-L/usr/lib -L/usr/lib/kf5/devel' '-DCMAKE_MODULE_LINKER_FLAGS:STRING=-L/usr/lib -L/usr/lib/kf5/devel' '-DCMAKE_SHARED_LINKER_FLAGS:STRING=-L/usr/lib -L/usr/lib/kf5/devel' '-DCMAKE_LIBRARY_PATH=/usr/lib/kf5/devel;/usr/lib;/lib' '-DCMAKE_INCLUDE_PATH=/usr/include/KF5;/usr/include' -DCMAKE_INSTALL_PREFIX=/usr -DCMAKE_PREFIX_PATH=/usr -DCMAKE_INSTALL_BINDIR=/usr/bin -DCMAKE_INSTALL_FULL_BINDIR=/usr/bin -DBIN_INSTALL_DIR:PATH=/usr/bin -DCMAKE_INSTALL_SBINDIR=/usr/sbin -DCMAKE_INSTALL_FULL_SBINDIR=/usr/sbin -DSBIN_INSTALL_DIR:PATH=/usr/sbin -DLIBEXEC_INSTALL_DIR:PATH=/usr/libexec -DINCLUDE_INSTALL_DIR:PATH=/usr/include -DCMAKE_INSTALL_INCLUDEDIR_KF5=/usr/include/KF5 -DDATA_INSTALL_DIR:PATH=/usr/share -DCONFIG_INSTALL_DIR:PATH=/etc/xdg -DSERVICES_INSTALL_DIR:PATH=/usr/share/kservices5 -DSERVICETYPES_INSTALL_DIR:PATH=/usr/share/kservicetypes5 -DKNOTIFYRC_INSTALL_DIR:PATH=/usr/share/knotifications5 -DKXMLGUI_INSTALL_DIR:PATH=/usr/share/kxmlgui5 -DLIB_INSTALL_DIR:PATH=/usr/lib -DLIB_DESTINATION=lib -DLIB_SUFFIX= -DSYSCONF_INSTALL_DIR:PATH=/etc -DAUTOSTART_INSTALL_DIR=/etc/xdg/autostart -DHTML_INSTALL_DIR=/usr/share/doc/HTML -DICON_INSTALL_DIR=/usr/share/icons -DXDG_MIME_INSTALL_DIR=/usr/share/mime/packages -DXDG_APPS_INSTALL_DIR=/usr/share/applications -DECM_MKSPECS_INSTALL_DIR:PATH=/usr/lib/qt5/mkspecs/modules -DKCFG_INSTALL_DIR:PATH=/usr/share/config.kcfg -DPLUGIN_INSTALL_DIR:PATH=/usr/lib/qt5/plugins -DQT_PLUGIN_INSTALL_DIR:PATH=/usr/lib/qt5/plugins -DQML_INSTALL_DIR:PATH=/usr/lib/qt5/qml -DIMPORTS_INSTALL_DIR:PATH=/usr/lib/qt5/imports -DDBUS_INTERFACES_INSTALL_DIR=/usr/share/dbus-1/interfaces -DDBUS_SERVICES_INSTALL_DIR=/usr/share/dbus-1/services -DDBUS_SYSTEM_SERVICES_INSTALL_DIR=/lib/dbus-1/system-services -DKDE_INSTALL_INCLUDEDIR=/usr/include/KF5
-- The C compiler identification is GNU 14.2.1
-- The CXX compiler identification is GNU 14.2.1
-- Detecting C compiler ABI info
-- Detecting C compiler ABI info - done
-- Check for working C compiler: /usr/bin/cc - skipped
-- Detecting C compile features
-- Detecting C compile features - done
-- Detecting CXX compiler ABI info
-- Detecting CXX compiler ABI info - done
-- Check for working CXX compiler: /usr/bin/c++ - skipped
-- Detecting CXX compile features
-- Detecting CXX compile features - done
-- Looking for __GLIBC__
-- Looking for __GLIBC__ - found
-- Performing Test _OFFT_IS_64BIT
-- Performing Test _OFFT_IS_64BIT - Failed
-- Performing Test HAVE_DATE_TIME
-- Performing Test HAVE_DATE_TIME - Success
CMake Deprecation Warning at /usr/share/ECM/kde-modules/KDEInstallDirsCommon.cmake:135 (message):
BIN_INSTALL_DIR is deprecated, use KDE_INSTALL_BINDIR instead.
Call Stack (most recent call first):
/usr/share/ECM/kde-modules/KDEInstallDirsCommon.cmake:236 (_define_relative)
/usr/share/ECM/kde-modules/KDEInstallDirs5.cmake:230 (include)
/usr/share/ECM/kde-modules/KDEInstallDirs.cmake:15 (include)
CMakeLists.txt:25 (include)
CMake Deprecation Warning at /usr/share/ECM/kde-modules/KDEInstallDirsCommon.cmake:135 (message):
SBIN_INSTALL_DIR is deprecated, use KDE_INSTALL_SBINDIR instead.
Call Stack (most recent call first):
/usr/share/ECM/kde-modules/KDEInstallDirsCommon.cmake:239 (_define_relative)
/usr/share/ECM/kde-modules/KDEInstallDirs5.cmake:230 (include)
/usr/share/ECM/kde-modules/KDEInstallDirs.cmake:15 (include)
CMakeLists.txt:25 (include)
CMake Deprecation Warning at /usr/share/ECM/kde-modules/KDEInstallDirsCommon.cmake:135 (message):
LIB_INSTALL_DIR is deprecated, use KDE_INSTALL_LIBDIR instead.
Call Stack (most recent call first):
/usr/share/ECM/kde-modules/KDEInstallDirsCommon.cmake:242 (_define_relative)
/usr/share/ECM/kde-modules/KDEInstallDirs5.cmake:230 (include)
/usr/share/ECM/kde-modules/KDEInstallDirs.cmake:15 (include)
CMakeLists.txt:25 (include)
CMake Deprecation Warning at /usr/share/ECM/kde-modules/KDEInstallDirsCommon.cmake:135 (message):
LIBEXEC_INSTALL_DIR is deprecated, use KDE_INSTALL_LIBEXECDIR instead.
Call Stack (most recent call first):
/usr/share/ECM/kde-modules/KDEInstallDirsCommon.cmake:251 (_define_relative)
/usr/share/ECM/kde-modules/KDEInstallDirs5.cmake:230 (include)
/usr/share/ECM/kde-modules/KDEInstallDirs.cmake:15 (include)
CMakeLists.txt:25 (include)
CMake Deprecation Warning at /usr/share/ECM/kde-modules/KDEInstallDirsCommon.cmake:135 (message):
DATA_INSTALL_DIR is deprecated, use KDE_INSTALL_DATADIR instead.
Call Stack (most recent call first):
/usr/share/ECM/kde-modules/KDEInstallDirsCommon.cmake:280 (_define_relative)
/usr/share/ECM/kde-modules/KDEInstallDirs5.cmake:230 (include)
/usr/share/ECM/kde-modules/KDEInstallDirs.cmake:15 (include)
CMakeLists.txt:25 (include)
CMake Deprecation Warning at /usr/share/ECM/kde-modules/KDEInstallDirsCommon.cmake:135 (message):
HTML_INSTALL_DIR is deprecated, use KDE_INSTALL_DOCBUNDLEDIR instead.
Call Stack (most recent call first):
/usr/share/ECM/kde-modules/KDEInstallDirsCommon.cmake:285 (_define_relative)
/usr/share/ECM/kde-modules/KDEInstallDirs5.cmake:230 (include)
/usr/share/ECM/kde-modules/KDEInstallDirs.cmake:15 (include)
CMakeLists.txt:25 (include)
CMake Deprecation Warning at /usr/share/ECM/kde-modules/KDEInstallDirsCommon.cmake:135 (message):
KCFG_INSTALL_DIR is deprecated, use KDE_INSTALL_KCFGDIR instead.
Call Stack (most recent call first):
/usr/share/ECM/kde-modules/KDEInstallDirsCommon.cmake:288 (_define_relative)
/usr/share/ECM/kde-modules/KDEInstallDirs5.cmake:230 (include)
/usr/share/ECM/kde-modules/KDEInstallDirs.cmake:15 (include)
CMakeLists.txt:25 (include)
CMake Deprecation Warning at /usr/share/ECM/kde-modules/KDEInstallDirsCommon.cmake:135 (message):
ICON_INSTALL_DIR is deprecated, use KDE_INSTALL_ICONDIR instead.
Call Stack (most recent call first):
/usr/share/ECM/kde-modules/KDEInstallDirsCommon.cmake:305 (_define_relative)
/usr/share/ECM/kde-modules/KDEInstallDirs5.cmake:230 (include)
/usr/share/ECM/kde-modules/KDEInstallDirs.cmake:15 (include)
CMakeLists.txt:25 (include)
CMake Deprecation Warning at /usr/share/ECM/kde-modules/KDEInstallDirsCommon.cmake:135 (message):
XDG_APPS_INSTALL_DIR is deprecated, use KDE_INSTALL_APPDIR instead.
Call Stack (most recent call first):
/usr/share/ECM/kde-modules/KDEInstallDirsCommon.cmake:320 (_define_relative)
/usr/share/ECM/kde-modules/KDEInstallDirs5.cmake:230 (include)
/usr/share/ECM/kde-modules/KDEInstallDirs.cmake:15 (include)
CMakeLists.txt:25 (include)
CMake Deprecation Warning at /usr/share/ECM/kde-modules/KDEInstallDirsCommon.cmake:135 (message):
XDG_MIME_INSTALL_DIR is deprecated, use KDE_INSTALL_MIMEDIR instead.
Call Stack (most recent call first):
/usr/share/ECM/kde-modules/KDEInstallDirsCommon.cmake:326 (_define_relative)
/usr/share/ECM/kde-modules/KDEInstallDirs5.cmake:230 (include)
/usr/share/ECM/kde-modules/KDEInstallDirs.cmake:15 (include)
CMakeLists.txt:25 (include)
CMake Deprecation Warning at /usr/share/ECM/kde-modules/KDEInstallDirsCommon.cmake:135 (message):
DBUS_INTERFACES_INSTALL_DIR is deprecated, use KDE_INSTALL_DBUSINTERFACEDIR
instead.
Call Stack (most recent call first):
/usr/share/ECM/kde-modules/KDEInstallDirsCommon.cmake:340 (_define_relative)
/usr/share/ECM/kde-modules/KDEInstallDirs5.cmake:230 (include)
/usr/share/ECM/kde-modules/KDEInstallDirs.cmake:15 (include)
CMakeLists.txt:25 (include)
CMake Deprecation Warning at /usr/share/ECM/kde-modules/KDEInstallDirsCommon.cmake:135 (message):
DBUS_SERVICES_INSTALL_DIR is deprecated, use KDE_INSTALL_DBUSSERVICEDIR
instead.
Call Stack (most recent call first):
/usr/share/ECM/kde-modules/KDEInstallDirsCommon.cmake:343 (_define_relative)
/usr/share/ECM/kde-modules/KDEInstallDirs5.cmake:230 (include)
/usr/share/ECM/kde-modules/KDEInstallDirs.cmake:15 (include)
CMakeLists.txt:25 (include)
CMake Deprecation Warning at /usr/share/ECM/kde-modules/KDEInstallDirsCommon.cmake:135 (message):
DBUS_SYSTEM_SERVICES_INSTALL_DIR is deprecated, use
KDE_INSTALL_DBUSSYSTEMSERVICEDIR instead.
Call Stack (most recent call first):
/usr/share/ECM/kde-modules/KDEInstallDirsCommon.cmake:346 (_define_relative)
/usr/share/ECM/kde-modules/KDEInstallDirs5.cmake:230 (include)
/usr/share/ECM/kde-modules/KDEInstallDirs.cmake:15 (include)
CMakeLists.txt:25 (include)
CMake Deprecation Warning at /usr/share/ECM/kde-modules/KDEInstallDirsCommon.cmake:135 (message):
SYSCONF_INSTALL_DIR is deprecated, use KDE_INSTALL_SYSCONFDIR instead.
Call Stack (most recent call first):
/usr/share/ECM/kde-modules/KDEInstallDirsCommon.cmake:200 (_define_relative)
/usr/share/ECM/kde-modules/KDEInstallDirsCommon.cmake:363 (_define_absolute)
/usr/share/ECM/kde-modules/KDEInstallDirs5.cmake:230 (include)
/usr/share/ECM/kde-modules/KDEInstallDirs.cmake:15 (include)
CMakeLists.txt:25 (include)
CMake Deprecation Warning at /usr/share/ECM/kde-modules/KDEInstallDirsCommon.cmake:135 (message):
CONFIG_INSTALL_DIR is deprecated, use KDE_INSTALL_CONFDIR instead.
Call Stack (most recent call first):
/usr/share/ECM/kde-modules/KDEInstallDirsCommon.cmake:366 (_define_relative)
/usr/share/ECM/kde-modules/KDEInstallDirs5.cmake:230 (include)
/usr/share/ECM/kde-modules/KDEInstallDirs.cmake:15 (include)
CMakeLists.txt:25 (include)
CMake Deprecation Warning at /usr/share/ECM/kde-modules/KDEInstallDirsCommon.cmake:135 (message):
AUTOSTART_INSTALL_DIR is deprecated, use KDE_INSTALL_AUTOSTARTDIR instead.
Call Stack (most recent call first):
/usr/share/ECM/kde-modules/KDEInstallDirsCommon.cmake:369 (_define_relative)
/usr/share/ECM/kde-modules/KDEInstallDirs5.cmake:230 (include)
/usr/share/ECM/kde-modules/KDEInstallDirs.cmake:15 (include)
CMakeLists.txt:25 (include)
CMake Deprecation Warning at /usr/share/ECM/kde-modules/KDEInstallDirsCommon.cmake:135 (message):
QT_PLUGIN_INSTALL_DIR is deprecated, use KDE_INSTALL_QTPLUGINDIR instead.
Call Stack (most recent call first):
/usr/share/ECM/kde-modules/KDEInstallDirsCommon.cmake:200 (_define_relative)
/usr/share/ECM/kde-modules/KDEInstallDirs5.cmake:261 (_define_absolute)
/usr/share/ECM/kde-modules/KDEInstallDirs.cmake:15 (include)
CMakeLists.txt:25 (include)
CMake Deprecation Warning at /usr/share/ECM/kde-modules/KDEInstallDirsCommon.cmake:135 (message):
IMPORTS_INSTALL_DIR is deprecated, use KDE_INSTALL_QTQUICKIMPORTSDIR
instead.
Call Stack (most recent call first):
/usr/share/ECM/kde-modules/KDEInstallDirsCommon.cmake:200 (_define_relative)
/usr/share/ECM/kde-modules/KDEInstallDirs5.cmake:270 (_define_absolute)
/usr/share/ECM/kde-modules/KDEInstallDirs.cmake:15 (include)
CMakeLists.txt:25 (include)
CMake Deprecation Warning at /usr/share/ECM/kde-modules/KDEInstallDirsCommon.cmake:135 (message):
QML_INSTALL_DIR is deprecated, use KDE_INSTALL_QMLDIR instead.
Call Stack (most recent call first):
/usr/share/ECM/kde-modules/KDEInstallDirsCommon.cmake:200 (_define_relative)
/usr/share/ECM/kde-modules/KDEInstallDirs5.cmake:279 (_define_absolute)
/usr/share/ECM/kde-modules/KDEInstallDirs.cmake:15 (include)
CMakeLists.txt:25 (include)
CMake Deprecation Warning at /usr/share/ECM/kde-modules/KDEInstallDirsCommon.cmake:135 (message):
PLUGIN_INSTALL_DIR is deprecated, use KDE_INSTALL_PLUGINDIR instead.
Call Stack (most recent call first):
/usr/share/ECM/kde-modules/KDEInstallDirs5.cmake:301 (_define_relative)
/usr/share/ECM/kde-modules/KDEInstallDirs.cmake:15 (include)
CMakeLists.txt:25 (include)
CMake Deprecation Warning at /usr/share/ECM/kde-modules/KDEInstallDirsCommon.cmake:135 (message):
SERVICES_INSTALL_DIR is deprecated, use KDE_INSTALL_KSERVICES5DIR instead.
Call Stack (most recent call first):
/usr/share/ECM/kde-modules/KDEInstallDirs5.cmake:329 (_define_relative)
/usr/share/ECM/kde-modules/KDEInstallDirs.cmake:15 (include)
CMakeLists.txt:25 (include)
CMake Deprecation Warning at /usr/share/ECM/kde-modules/KDEInstallDirsCommon.cmake:135 (message):
SERVICETYPES_INSTALL_DIR is deprecated, use KDE_INSTALL_KSERVICETYPES5DIR
instead.
Call Stack (most recent call first):
/usr/share/ECM/kde-modules/KDEInstallDirs5.cmake:332 (_define_relative)
/usr/share/ECM/kde-modules/KDEInstallDirs.cmake:15 (include)
CMakeLists.txt:25 (include)
CMake Deprecation Warning at /usr/share/ECM/kde-modules/KDEInstallDirsCommon.cmake:135 (message):
KNOTIFYRC_INSTALL_DIR is deprecated, use KDE_INSTALL_KNOTIFY5RCDIR instead.
Call Stack (most recent call first):
/usr/share/ECM/kde-modules/KDEInstallDirs5.cmake:335 (_define_relative)
/usr/share/ECM/kde-modules/KDEInstallDirs.cmake:15 (include)
CMakeLists.txt:25 (include)
CMake Deprecation Warning at /usr/share/ECM/kde-modules/KDEInstallDirsCommon.cmake:135 (message):
KXMLGUI_INSTALL_DIR is deprecated, use KDE_INSTALL_KXMLGUI5DIR instead.
Call Stack (most recent call first):
/usr/share/ECM/kde-modules/KDEInstallDirs5.cmake:338 (_define_relative)
/usr/share/ECM/kde-modules/KDEInstallDirs.cmake:15 (include)
CMakeLists.txt:25 (include)
fatal: not a git repository (or any of the parent directories): .git
fatal: not a git repository (or any of the parent directories): .git
-- Found KF5Archive: /usr/lib/cmake/KF5Archive/KF5ArchiveConfig.cmake (found version "5.116.0")
-- Found KF5: success (found suitable version "5.116.0", minimum required is "5.105.0") found components: Archive
-- Found SharedMimeInfo: /usr/bin/update-mime-database (found suitable version "2.4", minimum required is "1.3")
-- Performing Test COMPILER_HAS_HIDDEN_VISIBILITY
-- Performing Test COMPILER_HAS_HIDDEN_VISIBILITY - Success
-- Performing Test COMPILER_HAS_HIDDEN_INLINE_VISIBILITY
-- Performing Test COMPILER_HAS_HIDDEN_INLINE_VISIBILITY - Success
-- Performing Test COMPILER_HAS_DEPRECATED_ATTR
-- Performing Test COMPILER_HAS_DEPRECATED_ATTR - Success
-- The following OPTIONAL packages have been found:
* Qt5Core (required version >= 5.15.2)
* Git
-- The following REQUIRED packages have been found:
* ECM (required version >= 5.105.0)
* Qt5Gui
* Qt5 (required version >= 5.15.2)
* KF5Archive (required version >= 5.105.0)
* KF5 (required version >= 5.105.0)
* SharedMimeInfo (required version >= 1.3), A database of common MIME types,
-- The following features have been disabled:
* QCH, API documentation in QCH format (for e.g. Qt Assistant, Qt Creator & KDevelop)
-- Configuring done (1.3s)
-- Generating done (0.0s)
CMake Warning:
Manually-specified variables were not used by the project:
CMAKE_INCLUDE_PATH
CMAKE_USE_RELATIVE_PATHS
ECM_MKSPECS_INSTALL_DIR
LIB_DESTINATION
LIB_SUFFIX
-- Build files have been written to: /usr/src/RPM/BUILD/kpkpass-23.08.5/BUILD
+ popd
~/RPM/BUILD/kpkpass-23.08.5
+ __kf5_make
+ pushd BUILD
~/RPM/BUILD/kpkpass-23.08.5/BUILD ~/RPM/BUILD/kpkpass-23.08.5
+ make -j16
make: Entering directory '/usr/src/RPM/BUILD/kpkpass-23.08.5/BUILD'
/usr/bin/cmake -S/usr/src/RPM/BUILD/kpkpass-23.08.5 -B/usr/src/RPM/BUILD/kpkpass-23.08.5/BUILD --check-build-system CMakeFiles/Makefile.cmake 0
make: Leaving directory '/usr/src/RPM/BUILD/kpkpass-23.08.5/BUILD'
make: Entering directory '/usr/src/RPM/BUILD/kpkpass-23.08.5/BUILD'
/usr/bin/cmake -E cmake_progress_start /usr/src/RPM/BUILD/kpkpass-23.08.5/BUILD/CMakeFiles /usr/src/RPM/BUILD/kpkpass-23.08.5/BUILD//CMakeFiles/progress.marks
make: Leaving directory '/usr/src/RPM/BUILD/kpkpass-23.08.5/BUILD'
make -f CMakeFiles/Makefile2 all
make -f src/CMakeFiles/KPim5PkPass_autogen_timestamp_deps.dir/build.make src/CMakeFiles/KPim5PkPass_autogen_timestamp_deps.dir/depend
make[2]: Entering directory '/usr/src/RPM/BUILD/kpkpass-23.08.5/BUILD'
cd /usr/src/RPM/BUILD/kpkpass-23.08.5/BUILD && /usr/bin/cmake -E cmake_depends "Unix Makefiles" /usr/src/RPM/BUILD/kpkpass-23.08.5 /usr/src/RPM/BUILD/kpkpass-23.08.5/src /usr/src/RPM/BUILD/kpkpass-23.08.5/BUILD /usr/src/RPM/BUILD/kpkpass-23.08.5/BUILD/src /usr/src/RPM/BUILD/kpkpass-23.08.5/BUILD/src/CMakeFiles/KPim5PkPass_autogen_timestamp_deps.dir/DependInfo.cmake "--color="
make[2]: Leaving directory '/usr/src/RPM/BUILD/kpkpass-23.08.5/BUILD'
make -f src/CMakeFiles/KPim5PkPass_autogen_timestamp_deps.dir/build.make src/CMakeFiles/KPim5PkPass_autogen_timestamp_deps.dir/build
make[2]: Nothing to be done for 'src/CMakeFiles/KPim5PkPass_autogen_timestamp_deps.dir/build'.
make[1]: Entering directory '/usr/src/RPM/BUILD/kpkpass-23.08.5/BUILD'
[ 0%] Built target KPim5PkPass_autogen_timestamp_deps
make[1]: Leaving directory '/usr/src/RPM/BUILD/kpkpass-23.08.5/BUILD'
make -f src/CMakeFiles/KPim5PkPass_autogen.dir/build.make src/CMakeFiles/KPim5PkPass_autogen.dir/depend
make[2]: Entering directory '/usr/src/RPM/BUILD/kpkpass-23.08.5/BUILD'
cd /usr/src/RPM/BUILD/kpkpass-23.08.5/BUILD && /usr/bin/cmake -E cmake_depends "Unix Makefiles" /usr/src/RPM/BUILD/kpkpass-23.08.5 /usr/src/RPM/BUILD/kpkpass-23.08.5/src /usr/src/RPM/BUILD/kpkpass-23.08.5/BUILD /usr/src/RPM/BUILD/kpkpass-23.08.5/BUILD/src /usr/src/RPM/BUILD/kpkpass-23.08.5/BUILD/src/CMakeFiles/KPim5PkPass_autogen.dir/DependInfo.cmake "--color="
make[2]: Leaving directory '/usr/src/RPM/BUILD/kpkpass-23.08.5/BUILD'
make -f src/CMakeFiles/KPim5PkPass_autogen.dir/build.make src/CMakeFiles/KPim5PkPass_autogen.dir/build
make[2]: Entering directory '/usr/src/RPM/BUILD/kpkpass-23.08.5/BUILD'
[ 10%] Automatic MOC for target KPim5PkPass
cd /usr/src/RPM/BUILD/kpkpass-23.08.5/BUILD/src && /usr/bin/cmake -E cmake_autogen /usr/src/RPM/BUILD/kpkpass-23.08.5/BUILD/src/CMakeFiles/KPim5PkPass_autogen.dir/AutogenInfo.json Release
cd /usr/src/RPM/BUILD/kpkpass-23.08.5/BUILD/src && /usr/bin/cmake -E touch /usr/src/RPM/BUILD/kpkpass-23.08.5/BUILD/src/KPim5PkPass_autogen/timestamp
make[2]: Leaving directory '/usr/src/RPM/BUILD/kpkpass-23.08.5/BUILD'
make[1]: Entering directory '/usr/src/RPM/BUILD/kpkpass-23.08.5/BUILD'
[ 10%] Built target KPim5PkPass_autogen
make[1]: Leaving directory '/usr/src/RPM/BUILD/kpkpass-23.08.5/BUILD'
make -f src/CMakeFiles/KPim5PkPass.dir/build.make src/CMakeFiles/KPim5PkPass.dir/depend
make[2]: Entering directory '/usr/src/RPM/BUILD/kpkpass-23.08.5/BUILD'
cd /usr/src/RPM/BUILD/kpkpass-23.08.5/BUILD && /usr/bin/cmake -E cmake_depends "Unix Makefiles" /usr/src/RPM/BUILD/kpkpass-23.08.5 /usr/src/RPM/BUILD/kpkpass-23.08.5/src /usr/src/RPM/BUILD/kpkpass-23.08.5/BUILD /usr/src/RPM/BUILD/kpkpass-23.08.5/BUILD/src /usr/src/RPM/BUILD/kpkpass-23.08.5/BUILD/src/CMakeFiles/KPim5PkPass.dir/DependInfo.cmake "--color="
make[2]: Leaving directory '/usr/src/RPM/BUILD/kpkpass-23.08.5/BUILD'
make -f src/CMakeFiles/KPim5PkPass.dir/build.make src/CMakeFiles/KPim5PkPass.dir/build
make[2]: Entering directory '/usr/src/RPM/BUILD/kpkpass-23.08.5/BUILD'
[ 50%] Building CXX object src/CMakeFiles/KPim5PkPass.dir/KPim5PkPass_autogen/mocs_compilation.cpp.o
cd /usr/src/RPM/BUILD/kpkpass-23.08.5/BUILD/src && /usr/bin/c++ -DKF_DEPRECATED_WARNINGS_SINCE=0x60000 -DKF_DISABLE_DEPRECATED_BEFORE_AND_AT=0x56900 -DKPim5PkPass_EXPORTS -DQT_CORE_LIB -DQT_DEPRECATED_WARNINGS_SINCE=0x70000 -DQT_DISABLE_DEPRECATED_BEFORE=0x60400 -DQT_GUI_LIB -DQT_NO_CAST_FROM_ASCII -DQT_NO_CAST_FROM_BYTEARRAY -DQT_NO_CAST_TO_ASCII -DQT_NO_DEBUG -DQT_NO_FOREACH -DQT_NO_KEYWORDS -DQT_NO_NARROWING_CONVERSIONS_IN_CONNECT -DQT_NO_URL_CAST_FROM_STRING -DQT_STRICT_ITERATORS -DQT_USE_QSTRINGBUILDER -D_FILE_OFFSET_BITS=64 -D_GNU_SOURCE -D_LARGEFILE64_SOURCE -I/usr/src/RPM/BUILD/kpkpass-23.08.5/BUILD/src -I/usr/src/RPM/BUILD/kpkpass-23.08.5/src -I/usr/src/RPM/BUILD/kpkpass-23.08.5/BUILD/src/KPim5PkPass_autogen/include -isystem /usr/include/qt5 -isystem /usr/include/qt5/QtGui -isystem /usr/include/qt5/QtCore -isystem /usr/share/qt5/../../lib/qt5/mkspecs/linux-g++ -isystem /usr/include/KF5/KArchive -isystem /usr/include/KF5 -pipe -frecord-gcc-switches -Wall -g -O2 -flto=auto -march=i586 -mtune=generic -fno-operator-names -fno-exceptions -Wall -Wextra -Wcast-align -Wchar-subscripts -Wformat-security -Wno-long-long -Wpointer-arith -Wundef -Wnon-virtual-dtor -Woverloaded-virtual -Werror=return-type -Werror=init-self -Werror=undef -Wvla -Wdate-time -Wsuggest-override -Wlogical-op -pedantic -Wzero-as-null-pointer-constant -Wmissing-include-dirs -O2 -DNDEBUG -std=c++17 -fPIC -fvisibility=hidden -fvisibility-inlines-hidden -fPIC -MD -MT src/CMakeFiles/KPim5PkPass.dir/KPim5PkPass_autogen/mocs_compilation.cpp.o -MF CMakeFiles/KPim5PkPass.dir/KPim5PkPass_autogen/mocs_compilation.cpp.o.d -o CMakeFiles/KPim5PkPass.dir/KPim5PkPass_autogen/mocs_compilation.cpp.o -c /usr/src/RPM/BUILD/kpkpass-23.08.5/BUILD/src/KPim5PkPass_autogen/mocs_compilation.cpp
make[2]: Leaving directory '/usr/src/RPM/BUILD/kpkpass-23.08.5/BUILD'
make[2]: Entering directory '/usr/src/RPM/BUILD/kpkpass-23.08.5/BUILD'
[ 40%] Building CXX object src/CMakeFiles/KPim5PkPass.dir/boardingpass.cpp.o
cd /usr/src/RPM/BUILD/kpkpass-23.08.5/BUILD/src && /usr/bin/c++ -DKF_DEPRECATED_WARNINGS_SINCE=0x60000 -DKF_DISABLE_DEPRECATED_BEFORE_AND_AT=0x56900 -DKPim5PkPass_EXPORTS -DQT_CORE_LIB -DQT_DEPRECATED_WARNINGS_SINCE=0x70000 -DQT_DISABLE_DEPRECATED_BEFORE=0x60400 -DQT_GUI_LIB -DQT_NO_CAST_FROM_ASCII -DQT_NO_CAST_FROM_BYTEARRAY -DQT_NO_CAST_TO_ASCII -DQT_NO_DEBUG -DQT_NO_FOREACH -DQT_NO_KEYWORDS -DQT_NO_NARROWING_CONVERSIONS_IN_CONNECT -DQT_NO_URL_CAST_FROM_STRING -DQT_STRICT_ITERATORS -DQT_USE_QSTRINGBUILDER -D_FILE_OFFSET_BITS=64 -D_GNU_SOURCE -D_LARGEFILE64_SOURCE -I/usr/src/RPM/BUILD/kpkpass-23.08.5/BUILD/src -I/usr/src/RPM/BUILD/kpkpass-23.08.5/src -I/usr/src/RPM/BUILD/kpkpass-23.08.5/BUILD/src/KPim5PkPass_autogen/include -isystem /usr/include/qt5 -isystem /usr/include/qt5/QtGui -isystem /usr/include/qt5/QtCore -isystem /usr/share/qt5/../../lib/qt5/mkspecs/linux-g++ -isystem /usr/include/KF5/KArchive -isystem /usr/include/KF5 -pipe -frecord-gcc-switches -Wall -g -O2 -flto=auto -march=i586 -mtune=generic -fno-operator-names -fno-exceptions -Wall -Wextra -Wcast-align -Wchar-subscripts -Wformat-security -Wno-long-long -Wpointer-arith -Wundef -Wnon-virtual-dtor -Woverloaded-virtual -Werror=return-type -Werror=init-self -Werror=undef -Wvla -Wdate-time -Wsuggest-override -Wlogical-op -pedantic -Wzero-as-null-pointer-constant -Wmissing-include-dirs -O2 -DNDEBUG -std=c++17 -fPIC -fvisibility=hidden -fvisibility-inlines-hidden -fPIC -MD -MT src/CMakeFiles/KPim5PkPass.dir/boardingpass.cpp.o -MF CMakeFiles/KPim5PkPass.dir/boardingpass.cpp.o.d -o CMakeFiles/KPim5PkPass.dir/boardingpass.cpp.o -c /usr/src/RPM/BUILD/kpkpass-23.08.5/src/boardingpass.cpp
make[2]: Leaving directory '/usr/src/RPM/BUILD/kpkpass-23.08.5/BUILD'
make[2]: Entering directory '/usr/src/RPM/BUILD/kpkpass-23.08.5/BUILD'
[ 40%] Building CXX object src/CMakeFiles/KPim5PkPass.dir/location.cpp.o
cd /usr/src/RPM/BUILD/kpkpass-23.08.5/BUILD/src && /usr/bin/c++ -DKF_DEPRECATED_WARNINGS_SINCE=0x60000 -DKF_DISABLE_DEPRECATED_BEFORE_AND_AT=0x56900 -DKPim5PkPass_EXPORTS -DQT_CORE_LIB -DQT_DEPRECATED_WARNINGS_SINCE=0x70000 -DQT_DISABLE_DEPRECATED_BEFORE=0x60400 -DQT_GUI_LIB -DQT_NO_CAST_FROM_ASCII -DQT_NO_CAST_FROM_BYTEARRAY -DQT_NO_CAST_TO_ASCII -DQT_NO_DEBUG -DQT_NO_FOREACH -DQT_NO_KEYWORDS -DQT_NO_NARROWING_CONVERSIONS_IN_CONNECT -DQT_NO_URL_CAST_FROM_STRING -DQT_STRICT_ITERATORS -DQT_USE_QSTRINGBUILDER -D_FILE_OFFSET_BITS=64 -D_GNU_SOURCE -D_LARGEFILE64_SOURCE -I/usr/src/RPM/BUILD/kpkpass-23.08.5/BUILD/src -I/usr/src/RPM/BUILD/kpkpass-23.08.5/src -I/usr/src/RPM/BUILD/kpkpass-23.08.5/BUILD/src/KPim5PkPass_autogen/include -isystem /usr/include/qt5 -isystem /usr/include/qt5/QtGui -isystem /usr/include/qt5/QtCore -isystem /usr/share/qt5/../../lib/qt5/mkspecs/linux-g++ -isystem /usr/include/KF5/KArchive -isystem /usr/include/KF5 -pipe -frecord-gcc-switches -Wall -g -O2 -flto=auto -march=i586 -mtune=generic -fno-operator-names -fno-exceptions -Wall -Wextra -Wcast-align -Wchar-subscripts -Wformat-security -Wno-long-long -Wpointer-arith -Wundef -Wnon-virtual-dtor -Woverloaded-virtual -Werror=return-type -Werror=init-self -Werror=undef -Wvla -Wdate-time -Wsuggest-override -Wlogical-op -pedantic -Wzero-as-null-pointer-constant -Wmissing-include-dirs -O2 -DNDEBUG -std=c++17 -fPIC -fvisibility=hidden -fvisibility-inlines-hidden -fPIC -MD -MT src/CMakeFiles/KPim5PkPass.dir/location.cpp.o -MF CMakeFiles/KPim5PkPass.dir/location.cpp.o.d -o CMakeFiles/KPim5PkPass.dir/location.cpp.o -c /usr/src/RPM/BUILD/kpkpass-23.08.5/src/location.cpp
make[2]: Leaving directory '/usr/src/RPM/BUILD/kpkpass-23.08.5/BUILD'
make[2]: Entering directory '/usr/src/RPM/BUILD/kpkpass-23.08.5/BUILD'
[ 60%] Building CXX object src/CMakeFiles/KPim5PkPass.dir/barcode.cpp.o
cd /usr/src/RPM/BUILD/kpkpass-23.08.5/BUILD/src && /usr/bin/c++ -DKF_DEPRECATED_WARNINGS_SINCE=0x60000 -DKF_DISABLE_DEPRECATED_BEFORE_AND_AT=0x56900 -DKPim5PkPass_EXPORTS -DQT_CORE_LIB -DQT_DEPRECATED_WARNINGS_SINCE=0x70000 -DQT_DISABLE_DEPRECATED_BEFORE=0x60400 -DQT_GUI_LIB -DQT_NO_CAST_FROM_ASCII -DQT_NO_CAST_FROM_BYTEARRAY -DQT_NO_CAST_TO_ASCII -DQT_NO_DEBUG -DQT_NO_FOREACH -DQT_NO_KEYWORDS -DQT_NO_NARROWING_CONVERSIONS_IN_CONNECT -DQT_NO_URL_CAST_FROM_STRING -DQT_STRICT_ITERATORS -DQT_USE_QSTRINGBUILDER -D_FILE_OFFSET_BITS=64 -D_GNU_SOURCE -D_LARGEFILE64_SOURCE -I/usr/src/RPM/BUILD/kpkpass-23.08.5/BUILD/src -I/usr/src/RPM/BUILD/kpkpass-23.08.5/src -I/usr/src/RPM/BUILD/kpkpass-23.08.5/BUILD/src/KPim5PkPass_autogen/include -isystem /usr/include/qt5 -isystem /usr/include/qt5/QtGui -isystem /usr/include/qt5/QtCore -isystem /usr/share/qt5/../../lib/qt5/mkspecs/linux-g++ -isystem /usr/include/KF5/KArchive -isystem /usr/include/KF5 -pipe -frecord-gcc-switches -Wall -g -O2 -flto=auto -march=i586 -mtune=generic -fno-operator-names -fno-exceptions -Wall -Wextra -Wcast-align -Wchar-subscripts -Wformat-security -Wno-long-long -Wpointer-arith -Wundef -Wnon-virtual-dtor -Woverloaded-virtual -Werror=return-type -Werror=init-self -Werror=undef -Wvla -Wdate-time -Wsuggest-override -Wlogical-op -pedantic -Wzero-as-null-pointer-constant -Wmissing-include-dirs -O2 -DNDEBUG -std=c++17 -fPIC -fvisibility=hidden -fvisibility-inlines-hidden -fPIC -MD -MT src/CMakeFiles/KPim5PkPass.dir/barcode.cpp.o -MF CMakeFiles/KPim5PkPass.dir/barcode.cpp.o.d -o CMakeFiles/KPim5PkPass.dir/barcode.cpp.o -c /usr/src/RPM/BUILD/kpkpass-23.08.5/src/barcode.cpp
make[2]: Leaving directory '/usr/src/RPM/BUILD/kpkpass-23.08.5/BUILD'
make[2]: Entering directory '/usr/src/RPM/BUILD/kpkpass-23.08.5/BUILD'
[ 80%] Building CXX object src/CMakeFiles/KPim5PkPass.dir/logging.cpp.o
cd /usr/src/RPM/BUILD/kpkpass-23.08.5/BUILD/src && /usr/bin/c++ -DKF_DEPRECATED_WARNINGS_SINCE=0x60000 -DKF_DISABLE_DEPRECATED_BEFORE_AND_AT=0x56900 -DKPim5PkPass_EXPORTS -DQT_CORE_LIB -DQT_DEPRECATED_WARNINGS_SINCE=0x70000 -DQT_DISABLE_DEPRECATED_BEFORE=0x60400 -DQT_GUI_LIB -DQT_NO_CAST_FROM_ASCII -DQT_NO_CAST_FROM_BYTEARRAY -DQT_NO_CAST_TO_ASCII -DQT_NO_DEBUG -DQT_NO_FOREACH -DQT_NO_KEYWORDS -DQT_NO_NARROWING_CONVERSIONS_IN_CONNECT -DQT_NO_URL_CAST_FROM_STRING -DQT_STRICT_ITERATORS -DQT_USE_QSTRINGBUILDER -D_FILE_OFFSET_BITS=64 -D_GNU_SOURCE -D_LARGEFILE64_SOURCE -I/usr/src/RPM/BUILD/kpkpass-23.08.5/BUILD/src -I/usr/src/RPM/BUILD/kpkpass-23.08.5/src -I/usr/src/RPM/BUILD/kpkpass-23.08.5/BUILD/src/KPim5PkPass_autogen/include -isystem /usr/include/qt5 -isystem /usr/include/qt5/QtGui -isystem /usr/include/qt5/QtCore -isystem /usr/share/qt5/../../lib/qt5/mkspecs/linux-g++ -isystem /usr/include/KF5/KArchive -isystem /usr/include/KF5 -pipe -frecord-gcc-switches -Wall -g -O2 -flto=auto -march=i586 -mtune=generic -fno-operator-names -fno-exceptions -Wall -Wextra -Wcast-align -Wchar-subscripts -Wformat-security -Wno-long-long -Wpointer-arith -Wundef -Wnon-virtual-dtor -Woverloaded-virtual -Werror=return-type -Werror=init-self -Werror=undef -Wvla -Wdate-time -Wsuggest-override -Wlogical-op -pedantic -Wzero-as-null-pointer-constant -Wmissing-include-dirs -O2 -DNDEBUG -std=c++17 -fPIC -fvisibility=hidden -fvisibility-inlines-hidden -fPIC -MD -MT src/CMakeFiles/KPim5PkPass.dir/logging.cpp.o -MF CMakeFiles/KPim5PkPass.dir/logging.cpp.o.d -o CMakeFiles/KPim5PkPass.dir/logging.cpp.o -c /usr/src/RPM/BUILD/kpkpass-23.08.5/BUILD/src/logging.cpp
make[2]: Leaving directory '/usr/src/RPM/BUILD/kpkpass-23.08.5/BUILD'
make[2]: Entering directory '/usr/src/RPM/BUILD/kpkpass-23.08.5/BUILD'
[ 40%] Building CXX object src/CMakeFiles/KPim5PkPass.dir/field.cpp.o
cd /usr/src/RPM/BUILD/kpkpass-23.08.5/BUILD/src && /usr/bin/c++ -DKF_DEPRECATED_WARNINGS_SINCE=0x60000 -DKF_DISABLE_DEPRECATED_BEFORE_AND_AT=0x56900 -DKPim5PkPass_EXPORTS -DQT_CORE_LIB -DQT_DEPRECATED_WARNINGS_SINCE=0x70000 -DQT_DISABLE_DEPRECATED_BEFORE=0x60400 -DQT_GUI_LIB -DQT_NO_CAST_FROM_ASCII -DQT_NO_CAST_FROM_BYTEARRAY -DQT_NO_CAST_TO_ASCII -DQT_NO_DEBUG -DQT_NO_FOREACH -DQT_NO_KEYWORDS -DQT_NO_NARROWING_CONVERSIONS_IN_CONNECT -DQT_NO_URL_CAST_FROM_STRING -DQT_STRICT_ITERATORS -DQT_USE_QSTRINGBUILDER -D_FILE_OFFSET_BITS=64 -D_GNU_SOURCE -D_LARGEFILE64_SOURCE -I/usr/src/RPM/BUILD/kpkpass-23.08.5/BUILD/src -I/usr/src/RPM/BUILD/kpkpass-23.08.5/src -I/usr/src/RPM/BUILD/kpkpass-23.08.5/BUILD/src/KPim5PkPass_autogen/include -isystem /usr/include/qt5 -isystem /usr/include/qt5/QtGui -isystem /usr/include/qt5/QtCore -isystem /usr/share/qt5/../../lib/qt5/mkspecs/linux-g++ -isystem /usr/include/KF5/KArchive -isystem /usr/include/KF5 -pipe -frecord-gcc-switches -Wall -g -O2 -flto=auto -march=i586 -mtune=generic -fno-operator-names -fno-exceptions -Wall -Wextra -Wcast-align -Wchar-subscripts -Wformat-security -Wno-long-long -Wpointer-arith -Wundef -Wnon-virtual-dtor -Woverloaded-virtual -Werror=return-type -Werror=init-self -Werror=undef -Wvla -Wdate-time -Wsuggest-override -Wlogical-op -pedantic -Wzero-as-null-pointer-constant -Wmissing-include-dirs -O2 -DNDEBUG -std=c++17 -fPIC -fvisibility=hidden -fvisibility-inlines-hidden -fPIC -MD -MT src/CMakeFiles/KPim5PkPass.dir/field.cpp.o -MF CMakeFiles/KPim5PkPass.dir/field.cpp.o.d -o CMakeFiles/KPim5PkPass.dir/field.cpp.o -c /usr/src/RPM/BUILD/kpkpass-23.08.5/src/field.cpp
make[2]: Leaving directory '/usr/src/RPM/BUILD/kpkpass-23.08.5/BUILD'
make[2]: Entering directory '/usr/src/RPM/BUILD/kpkpass-23.08.5/BUILD'
[ 70%] Building CXX object src/CMakeFiles/KPim5PkPass.dir/pass.cpp.o
cd /usr/src/RPM/BUILD/kpkpass-23.08.5/BUILD/src && /usr/bin/c++ -DKF_DEPRECATED_WARNINGS_SINCE=0x60000 -DKF_DISABLE_DEPRECATED_BEFORE_AND_AT=0x56900 -DKPim5PkPass_EXPORTS -DQT_CORE_LIB -DQT_DEPRECATED_WARNINGS_SINCE=0x70000 -DQT_DISABLE_DEPRECATED_BEFORE=0x60400 -DQT_GUI_LIB -DQT_NO_CAST_FROM_ASCII -DQT_NO_CAST_FROM_BYTEARRAY -DQT_NO_CAST_TO_ASCII -DQT_NO_DEBUG -DQT_NO_FOREACH -DQT_NO_KEYWORDS -DQT_NO_NARROWING_CONVERSIONS_IN_CONNECT -DQT_NO_URL_CAST_FROM_STRING -DQT_STRICT_ITERATORS -DQT_USE_QSTRINGBUILDER -D_FILE_OFFSET_BITS=64 -D_GNU_SOURCE -D_LARGEFILE64_SOURCE -I/usr/src/RPM/BUILD/kpkpass-23.08.5/BUILD/src -I/usr/src/RPM/BUILD/kpkpass-23.08.5/src -I/usr/src/RPM/BUILD/kpkpass-23.08.5/BUILD/src/KPim5PkPass_autogen/include -isystem /usr/include/qt5 -isystem /usr/include/qt5/QtGui -isystem /usr/include/qt5/QtCore -isystem /usr/share/qt5/../../lib/qt5/mkspecs/linux-g++ -isystem /usr/include/KF5/KArchive -isystem /usr/include/KF5 -pipe -frecord-gcc-switches -Wall -g -O2 -flto=auto -march=i586 -mtune=generic -fno-operator-names -fno-exceptions -Wall -Wextra -Wcast-align -Wchar-subscripts -Wformat-security -Wno-long-long -Wpointer-arith -Wundef -Wnon-virtual-dtor -Woverloaded-virtual -Werror=return-type -Werror=init-self -Werror=undef -Wvla -Wdate-time -Wsuggest-override -Wlogical-op -pedantic -Wzero-as-null-pointer-constant -Wmissing-include-dirs -O2 -DNDEBUG -std=c++17 -fPIC -fvisibility=hidden -fvisibility-inlines-hidden -fPIC -MD -MT src/CMakeFiles/KPim5PkPass.dir/pass.cpp.o -MF CMakeFiles/KPim5PkPass.dir/pass.cpp.o.d -o CMakeFiles/KPim5PkPass.dir/pass.cpp.o -c /usr/src/RPM/BUILD/kpkpass-23.08.5/src/pass.cpp
make[2]: Leaving directory '/usr/src/RPM/BUILD/kpkpass-23.08.5/BUILD'
make[2]: Entering directory '/usr/src/RPM/BUILD/kpkpass-23.08.5/BUILD'
[ 90%] Linking CXX shared library ../bin/libKPim5PkPass.so
cd /usr/src/RPM/BUILD/kpkpass-23.08.5/BUILD/src && /usr/bin/cmake -E cmake_link_script CMakeFiles/KPim5PkPass.dir/link.txt --verbose=1
/usr/bin/c++ -fPIC -pipe -frecord-gcc-switches -Wall -g -O2 -flto=auto -march=i586 -mtune=generic -fno-operator-names -fno-exceptions -Wall -Wextra -Wcast-align -Wchar-subscripts -Wformat-security -Wno-long-long -Wpointer-arith -Wundef -Wnon-virtual-dtor -Woverloaded-virtual -Werror=return-type -Werror=init-self -Werror=undef -Wvla -Wdate-time -Wsuggest-override -Wlogical-op -pedantic -Wzero-as-null-pointer-constant -Wmissing-include-dirs -O2 -DNDEBUG -Wl,--no-undefined -Wl,--fatal-warnings -Wl,--enable-new-dtags -L/usr/lib -L/usr/lib/kf5/devel -shared -Wl,-soname,libKPim5PkPass.so.5 -o ../bin/libKPim5PkPass.so.5.24.5 CMakeFiles/KPim5PkPass.dir/KPim5PkPass_autogen/mocs_compilation.cpp.o CMakeFiles/KPim5PkPass.dir/barcode.cpp.o CMakeFiles/KPim5PkPass.dir/boardingpass.cpp.o CMakeFiles/KPim5PkPass.dir/field.cpp.o CMakeFiles/KPim5PkPass.dir/location.cpp.o CMakeFiles/KPim5PkPass.dir/pass.cpp.o CMakeFiles/KPim5PkPass.dir/logging.cpp.o /usr/lib/libKF5Archive.so.5.116.0 /usr/lib/libQt5Gui.so.5.15.15 /usr/lib/libQt5Core.so.5.15.15
cd /usr/src/RPM/BUILD/kpkpass-23.08.5/BUILD/src && /usr/bin/cmake -E cmake_symlink_library ../bin/libKPim5PkPass.so.5.24.5 ../bin/libKPim5PkPass.so.5 ../bin/libKPim5PkPass.so
make[2]: Leaving directory '/usr/src/RPM/BUILD/kpkpass-23.08.5/BUILD'
make[1]: Entering directory '/usr/src/RPM/BUILD/kpkpass-23.08.5/BUILD'
[100%] Built target KPim5PkPass
make[1]: Leaving directory '/usr/src/RPM/BUILD/kpkpass-23.08.5/BUILD'
make: Entering directory '/usr/src/RPM/BUILD/kpkpass-23.08.5/BUILD'
/usr/bin/cmake -E cmake_progress_start /usr/src/RPM/BUILD/kpkpass-23.08.5/BUILD/CMakeFiles 0
make: Leaving directory '/usr/src/RPM/BUILD/kpkpass-23.08.5/BUILD'
+ popd
~/RPM/BUILD/kpkpass-23.08.5
+ exit 0
Executing(%install): /bin/sh -e /usr/src/tmp/rpm-tmp.90067
+ umask 022
+ /bin/mkdir -p /usr/src/RPM/BUILD
+ cd /usr/src/RPM/BUILD
+ /bin/chmod -Rf u+rwX -- /usr/src/tmp/kde5-kpkpass-buildroot
+ :
+ /bin/rm -rf -- /usr/src/tmp/kde5-kpkpass-buildroot
+ PATH=/usr/libexec/rpm-build:/usr/src/bin:/usr/bin:/bin:/usr/local/bin:/usr/games
+ cd kpkpass-23.08.5
+ __kf5_install
+ make -C BUILD DESTDIR=/usr/src/tmp/kde5-kpkpass-buildroot install
make: Entering directory '/usr/src/RPM/BUILD/kpkpass-23.08.5/BUILD'
/usr/bin/cmake -S/usr/src/RPM/BUILD/kpkpass-23.08.5 -B/usr/src/RPM/BUILD/kpkpass-23.08.5/BUILD --check-build-system CMakeFiles/Makefile.cmake 0
/usr/bin/cmake -E cmake_progress_start /usr/src/RPM/BUILD/kpkpass-23.08.5/BUILD/CMakeFiles /usr/src/RPM/BUILD/kpkpass-23.08.5/BUILD//CMakeFiles/progress.marks
make -f CMakeFiles/Makefile2 all
make[1]: Entering directory '/usr/src/RPM/BUILD/kpkpass-23.08.5/BUILD'
make -f src/CMakeFiles/KPim5PkPass_autogen_timestamp_deps.dir/build.make src/CMakeFiles/KPim5PkPass_autogen_timestamp_deps.dir/depend
make[2]: Entering directory '/usr/src/RPM/BUILD/kpkpass-23.08.5/BUILD'
cd /usr/src/RPM/BUILD/kpkpass-23.08.5/BUILD && /usr/bin/cmake -E cmake_depends "Unix Makefiles" /usr/src/RPM/BUILD/kpkpass-23.08.5 /usr/src/RPM/BUILD/kpkpass-23.08.5/src /usr/src/RPM/BUILD/kpkpass-23.08.5/BUILD /usr/src/RPM/BUILD/kpkpass-23.08.5/BUILD/src /usr/src/RPM/BUILD/kpkpass-23.08.5/BUILD/src/CMakeFiles/KPim5PkPass_autogen_timestamp_deps.dir/DependInfo.cmake "--color="
make[2]: Leaving directory '/usr/src/RPM/BUILD/kpkpass-23.08.5/BUILD'
make -f src/CMakeFiles/KPim5PkPass_autogen_timestamp_deps.dir/build.make src/CMakeFiles/KPim5PkPass_autogen_timestamp_deps.dir/build
make[2]: Entering directory '/usr/src/RPM/BUILD/kpkpass-23.08.5/BUILD'
make[2]: Nothing to be done for 'src/CMakeFiles/KPim5PkPass_autogen_timestamp_deps.dir/build'.
make[2]: Leaving directory '/usr/src/RPM/BUILD/kpkpass-23.08.5/BUILD'
[ 0%] Built target KPim5PkPass_autogen_timestamp_deps
make -f src/CMakeFiles/KPim5PkPass_autogen.dir/build.make src/CMakeFiles/KPim5PkPass_autogen.dir/depend
make[2]: Entering directory '/usr/src/RPM/BUILD/kpkpass-23.08.5/BUILD'
cd /usr/src/RPM/BUILD/kpkpass-23.08.5/BUILD && /usr/bin/cmake -E cmake_depends "Unix Makefiles" /usr/src/RPM/BUILD/kpkpass-23.08.5 /usr/src/RPM/BUILD/kpkpass-23.08.5/src /usr/src/RPM/BUILD/kpkpass-23.08.5/BUILD /usr/src/RPM/BUILD/kpkpass-23.08.5/BUILD/src /usr/src/RPM/BUILD/kpkpass-23.08.5/BUILD/src/CMakeFiles/KPim5PkPass_autogen.dir/DependInfo.cmake "--color="
make[2]: Leaving directory '/usr/src/RPM/BUILD/kpkpass-23.08.5/BUILD'
make -f src/CMakeFiles/KPim5PkPass_autogen.dir/build.make src/CMakeFiles/KPim5PkPass_autogen.dir/build
make[2]: Entering directory '/usr/src/RPM/BUILD/kpkpass-23.08.5/BUILD'
make[2]: Nothing to be done for 'src/CMakeFiles/KPim5PkPass_autogen.dir/build'.
make[2]: Leaving directory '/usr/src/RPM/BUILD/kpkpass-23.08.5/BUILD'
[ 10%] Built target KPim5PkPass_autogen
make -f src/CMakeFiles/KPim5PkPass.dir/build.make src/CMakeFiles/KPim5PkPass.dir/depend
make[2]: Entering directory '/usr/src/RPM/BUILD/kpkpass-23.08.5/BUILD'
cd /usr/src/RPM/BUILD/kpkpass-23.08.5/BUILD && /usr/bin/cmake -E cmake_depends "Unix Makefiles" /usr/src/RPM/BUILD/kpkpass-23.08.5 /usr/src/RPM/BUILD/kpkpass-23.08.5/src /usr/src/RPM/BUILD/kpkpass-23.08.5/BUILD /usr/src/RPM/BUILD/kpkpass-23.08.5/BUILD/src /usr/src/RPM/BUILD/kpkpass-23.08.5/BUILD/src/CMakeFiles/KPim5PkPass.dir/DependInfo.cmake "--color="
make[2]: Leaving directory '/usr/src/RPM/BUILD/kpkpass-23.08.5/BUILD'
make -f src/CMakeFiles/KPim5PkPass.dir/build.make src/CMakeFiles/KPim5PkPass.dir/build
make[2]: Entering directory '/usr/src/RPM/BUILD/kpkpass-23.08.5/BUILD'
make[2]: Nothing to be done for 'src/CMakeFiles/KPim5PkPass.dir/build'.
make[2]: Leaving directory '/usr/src/RPM/BUILD/kpkpass-23.08.5/BUILD'
[100%] Built target KPim5PkPass
make[1]: Leaving directory '/usr/src/RPM/BUILD/kpkpass-23.08.5/BUILD'
/usr/bin/cmake -E cmake_progress_start /usr/src/RPM/BUILD/kpkpass-23.08.5/BUILD/CMakeFiles 0
make -f CMakeFiles/Makefile2 preinstall
make[1]: Entering directory '/usr/src/RPM/BUILD/kpkpass-23.08.5/BUILD'
make[1]: Nothing to be done for 'preinstall'.
make[1]: Leaving directory '/usr/src/RPM/BUILD/kpkpass-23.08.5/BUILD'
Install the project...
/usr/bin/cmake -P cmake_install.cmake
-- Install configuration: "Release"
-- Installing: /usr/src/tmp/kde5-kpkpass-buildroot/usr/lib/libKPim5PkPass.so.5.24.5
-- Installing: /usr/src/tmp/kde5-kpkpass-buildroot/usr/lib/libKPim5PkPass.so.5
-- Installing: /usr/src/tmp/kde5-kpkpass-buildroot/usr/lib/libKPim5PkPass.so
-- Installing: /usr/src/tmp/kde5-kpkpass-buildroot/usr/include/KF5/KPim5/KPkPass/Barcode
-- Installing: /usr/src/tmp/kde5-kpkpass-buildroot/usr/include/KF5/KPim5/KPkPass/BoardingPass
-- Installing: /usr/src/tmp/kde5-kpkpass-buildroot/usr/include/KF5/KPim5/KPkPass/Field
-- Installing: /usr/src/tmp/kde5-kpkpass-buildroot/usr/include/KF5/KPim5/KPkPass/Location
-- Installing: /usr/src/tmp/kde5-kpkpass-buildroot/usr/include/KF5/KPim5/KPkPass/Pass
-- Installing: /usr/src/tmp/kde5-kpkpass-buildroot/usr/include/KF5/KPim5/KPkPass/barcode.h
-- Installing: /usr/src/tmp/kde5-kpkpass-buildroot/usr/include/KF5/KPim5/KPkPass/boardingpass.h
-- Installing: /usr/src/tmp/kde5-kpkpass-buildroot/usr/include/KF5/KPim5/KPkPass/field.h
-- Installing: /usr/src/tmp/kde5-kpkpass-buildroot/usr/include/KF5/KPim5/KPkPass/location.h
-- Installing: /usr/src/tmp/kde5-kpkpass-buildroot/usr/include/KF5/KPim5/KPkPass/pass.h
-- Installing: /usr/src/tmp/kde5-kpkpass-buildroot/usr/include/KF5/KPim5/KPkPass/kpkpass_export.h
-- Installing: /usr/src/tmp/kde5-kpkpass-buildroot/usr/include/KF5/KPim5/KPkPass/kpkpass_version.h
-- Installing: /usr/src/tmp/kde5-kpkpass-buildroot/usr/share/qlogging-categories5/org_kde_kpkpass.categories
-- Installing: /usr/src/tmp/kde5-kpkpass-buildroot/usr/lib/cmake/KPim5PkPass/KPim5PkPassConfig.cmake
-- Installing: /usr/src/tmp/kde5-kpkpass-buildroot/usr/lib/cmake/KPim5PkPass/KPim5PkPassConfigVersion.cmake
-- Installing: /usr/src/tmp/kde5-kpkpass-buildroot/usr/lib/cmake/KPim5PkPass/KPim5PkPassTargets.cmake
-- Installing: /usr/src/tmp/kde5-kpkpass-buildroot/usr/lib/cmake/KPim5PkPass/KPim5PkPassTargets-release.cmake
-- Installing: /usr/src/tmp/kde5-kpkpass-buildroot/usr/lib/cmake/KPimPkPass/KPimPkPassConfig.cmake
-- Installing: /usr/src/tmp/kde5-kpkpass-buildroot/usr/lib/cmake/KPimPkPass/KPimPkPassConfigVersion.cmake
-- Installing: /usr/src/tmp/kde5-kpkpass-buildroot/usr/lib/cmake/KPimPkPass/KPim5PkPassTargets.cmake
-- Installing: /usr/src/tmp/kde5-kpkpass-buildroot/usr/lib/cmake/KPimPkPass/KPim5PkPassTargets-release.cmake
make: Leaving directory '/usr/src/RPM/BUILD/kpkpass-23.08.5/BUILD'
+ '[' -d /usr/src/tmp/kde5-kpkpass-buildroot//usr/share ']'
+ ls -1d '/usr/src/tmp/kde5-kpkpass-buildroot//usr/share/kf5/k*5'
+ read d
ls: cannot access '/usr/src/tmp/kde5-kpkpass-buildroot//usr/share/kf5/k*5': No such file or directory
+ '[' -d /usr/src/tmp/kde5-kpkpass-buildroot//usr/share/lib64 ']'
+ '[' -d /usr/src/tmp/kde5-kpkpass-buildroot//usr/share/lib ']'
+ '[' /usr/lib/kf5/devel '!=' /usr/lib ']'
+ ls -1 /usr/src/tmp/kde5-kpkpass-buildroot//usr/lib/libKPim5PkPass.so
+ read p
+ '[' -L /usr/src/tmp/kde5-kpkpass-buildroot//usr/lib/libKPim5PkPass.so ']'
+ mkdir -p /usr/src/tmp/kde5-kpkpass-buildroot//usr/lib/kf5/devel
++ readlink /usr/src/tmp/kde5-kpkpass-buildroot//usr/lib/libKPim5PkPass.so
+ f=libKPim5PkPass.so.5
++ basename /usr/src/tmp/kde5-kpkpass-buildroot//usr/lib/libKPim5PkPass.so
+ l=libKPim5PkPass.so
++ relative /usr/src/tmp/kde5-kpkpass-buildroot//usr/lib/libKPim5PkPass.so.5 /usr/src/tmp/kde5-kpkpass-buildroot//usr/lib/kf5/devel/libKPim5PkPass.so.5
+ ln -sf ../../libKPim5PkPass.so.5 /usr/src/tmp/kde5-kpkpass-buildroot//usr/lib/kf5/devel/libKPim5PkPass.so
+ rm -f /usr/src/tmp/kde5-kpkpass-buildroot//usr/lib/libKPim5PkPass.so
+ read p
+ '[' -d /usr/src/tmp/kde5-kpkpass-buildroot//usr/share/bin ']'
+ '[' -d /usr/src/tmp/kde5-kpkpass-buildroot//usr/share/include ']'
+ '[' -d /usr/src/tmp/kde5-kpkpass-buildroot//usr/bin -a false == true ']'
+ '[' -d /usr/src/tmp/kde5-kpkpass-buildroot//usr/share/akonadi ']'
+ '[' -d /usr/src/tmp/kde5-kpkpass-buildroot//usr/share/kf5/akonadi ']'
+ '[' -d /usr/src/tmp/kde5-kpkpass-buildroot//usr/share/man -a remove == remove ']'
+ '[' -d /usr/src/tmp/kde5-kpkpass-buildroot//usr/share/appdata -a keep == remove ']'
+ '[' -d /usr/src/tmp/kde5-kpkpass-buildroot//usr/share/metainfo -a keep == remove ']'
+ '[' -d /usr/src/tmp/kde5-kpkpass-buildroot//usr/lib/cmake/ ']'
+ find /usr/src/tmp/kde5-kpkpass-buildroot//usr/lib/cmake/ -type f -name '*.cmake'
+ read f
+ sed -i -e 's|\(set(.*\)${PACKAGE_PREFIX_DIR}//usr/|\1${PACKAGE_PREFIX_DIR}/|' /usr/src/tmp/kde5-kpkpass-buildroot//usr/lib/cmake/KPim5PkPass/KPim5PkPassConfig.cmake
+ sed -i -e 's|/usr//usr/|/usr/|' /usr/src/tmp/kde5-kpkpass-buildroot//usr/lib/cmake/KPim5PkPass/KPim5PkPassConfig.cmake
+ read f
+ sed -i -e 's|\(set(.*\)${PACKAGE_PREFIX_DIR}//usr/|\1${PACKAGE_PREFIX_DIR}/|' /usr/src/tmp/kde5-kpkpass-buildroot//usr/lib/cmake/KPim5PkPass/KPim5PkPassConfigVersion.cmake
+ sed -i -e 's|/usr//usr/|/usr/|' /usr/src/tmp/kde5-kpkpass-buildroot//usr/lib/cmake/KPim5PkPass/KPim5PkPassConfigVersion.cmake
+ read f
+ sed -i -e 's|\(set(.*\)${PACKAGE_PREFIX_DIR}//usr/|\1${PACKAGE_PREFIX_DIR}/|' /usr/src/tmp/kde5-kpkpass-buildroot//usr/lib/cmake/KPim5PkPass/KPim5PkPassTargets.cmake
+ sed -i -e 's|/usr//usr/|/usr/|' /usr/src/tmp/kde5-kpkpass-buildroot//usr/lib/cmake/KPim5PkPass/KPim5PkPassTargets.cmake
+ read f
+ sed -i -e 's|\(set(.*\)${PACKAGE_PREFIX_DIR}//usr/|\1${PACKAGE_PREFIX_DIR}/|' /usr/src/tmp/kde5-kpkpass-buildroot//usr/lib/cmake/KPim5PkPass/KPim5PkPassTargets-release.cmake
+ sed -i -e 's|/usr//usr/|/usr/|' /usr/src/tmp/kde5-kpkpass-buildroot//usr/lib/cmake/KPim5PkPass/KPim5PkPassTargets-release.cmake
+ read f
+ sed -i -e 's|\(set(.*\)${PACKAGE_PREFIX_DIR}//usr/|\1${PACKAGE_PREFIX_DIR}/|' /usr/src/tmp/kde5-kpkpass-buildroot//usr/lib/cmake/KPimPkPass/KPimPkPassConfig.cmake
+ sed -i -e 's|/usr//usr/|/usr/|' /usr/src/tmp/kde5-kpkpass-buildroot//usr/lib/cmake/KPimPkPass/KPimPkPassConfig.cmake
+ read f
+ sed -i -e 's|\(set(.*\)${PACKAGE_PREFIX_DIR}//usr/|\1${PACKAGE_PREFIX_DIR}/|' /usr/src/tmp/kde5-kpkpass-buildroot//usr/lib/cmake/KPimPkPass/KPimPkPassConfigVersion.cmake
+ sed -i -e 's|/usr//usr/|/usr/|' /usr/src/tmp/kde5-kpkpass-buildroot//usr/lib/cmake/KPimPkPass/KPimPkPassConfigVersion.cmake
+ read f
+ sed -i -e 's|\(set(.*\)${PACKAGE_PREFIX_DIR}//usr/|\1${PACKAGE_PREFIX_DIR}/|' /usr/src/tmp/kde5-kpkpass-buildroot//usr/lib/cmake/KPimPkPass/KPim5PkPassTargets.cmake
+ sed -i -e 's|/usr//usr/|/usr/|' /usr/src/tmp/kde5-kpkpass-buildroot//usr/lib/cmake/KPimPkPass/KPim5PkPassTargets.cmake
+ read f
+ sed -i -e 's|\(set(.*\)${PACKAGE_PREFIX_DIR}//usr/|\1${PACKAGE_PREFIX_DIR}/|' /usr/src/tmp/kde5-kpkpass-buildroot//usr/lib/cmake/KPimPkPass/KPim5PkPassTargets-release.cmake
+ sed -i -e 's|/usr//usr/|/usr/|' /usr/src/tmp/kde5-kpkpass-buildroot//usr/lib/cmake/KPimPkPass/KPim5PkPassTargets-release.cmake
+ read f
+ /usr/lib/rpm/find-lang kde5-kpkpass --all-name
+ /usr/lib/rpm/brp-alt
Cleaning files in /usr/src/tmp/kde5-kpkpass-buildroot (auto)
mode of './usr/lib/libKPim5PkPass.so.5.24.5' changed from 0755 (rwxr-xr-x) to 0644 (rw-r--r--)
Verifying and fixing files in /usr/src/tmp/kde5-kpkpass-buildroot (binconfig,pkgconfig,libtool,desktop,gnuconfig)
Checking contents of files in /usr/src/tmp/kde5-kpkpass-buildroot/ (default)
Compressing files in /usr/src/tmp/kde5-kpkpass-buildroot (auto)
Adjusting library links in /usr/src/tmp/kde5-kpkpass-buildroot
./usr/lib: (from :0)
libKPim5PkPass.so.5 -> libKPim5PkPass.so.5.24.5
Verifying ELF objects in /usr/src/tmp/kde5-kpkpass-buildroot (arch=normal,fhs=normal,lfs=relaxed,lint=relaxed,rpath=normal,stack=normal,textrel=normal,unresolved=normal)
Splitting links to aliased files under /{,s}bin in /usr/src/tmp/kde5-kpkpass-buildroot
Processing files: kde5-kpkpass-common-23.08.5-alt1
Executing(%doc): /bin/sh -e /usr/src/tmp/rpm-tmp.81295
+ umask 022
+ /bin/mkdir -p /usr/src/RPM/BUILD
+ cd /usr/src/RPM/BUILD
+ cd kpkpass-23.08.5
+ DOCDIR=/usr/src/tmp/kde5-kpkpass-buildroot/usr/share/doc/kde5-kpkpass-common-23.08.5
+ export DOCDIR
+ rm -rf /usr/src/tmp/kde5-kpkpass-buildroot/usr/share/doc/kde5-kpkpass-common-23.08.5
+ /bin/mkdir -p /usr/src/tmp/kde5-kpkpass-buildroot/usr/share/doc/kde5-kpkpass-common-23.08.5
+ cp -prL LICENSES/BSD-3-Clause.txt LICENSES/CC0-1.0.txt LICENSES/LGPL-2.0-or-later.txt README.md /usr/src/tmp/kde5-kpkpass-buildroot/usr/share/doc/kde5-kpkpass-common-23.08.5
+ chmod -R go-w /usr/src/tmp/kde5-kpkpass-buildroot/usr/share/doc/kde5-kpkpass-common-23.08.5
+ chmod -R a+rX /usr/src/tmp/kde5-kpkpass-buildroot/usr/share/doc/kde5-kpkpass-common-23.08.5
+ exit 0
Finding Provides (using /usr/lib/rpm/find-provides)
Executing: /bin/sh -e /usr/src/tmp/rpm-tmp.lmkVSe
find-provides: running scripts (alternatives,debuginfo,lib,pam,perl,pkgconfig,python,python3,qml,shell)
Finding Requires (using /usr/lib/rpm/find-requires)
Executing: /bin/sh -e /usr/src/tmp/rpm-tmp.Ru9AgA
find-requires: running scripts (cpp,debuginfo,files,lib,pam,perl,pkgconfig,pkgconfiglib,python,python3,qml,rpmlib,shebang,shell,static,symlinks,systemd-services)
Requires: kf5-filesystem
Processing files: kde5-kpkpass-devel-23.08.5-alt1
Finding Provides (using /usr/lib/rpm/find-provides)
Executing: /bin/sh -e /usr/src/tmp/rpm-tmp.c29ofi
find-provides: running scripts (alternatives,debuginfo,lib,pam,perl,pkgconfig,python,python3,qml,shell)
Finding Requires (using /usr/lib/rpm/find-requires)
Executing: /bin/sh -e /usr/src/tmp/rpm-tmp.ku6MXP
find-requires: running scripts (cpp,debuginfo,files,lib,pam,perl,pkgconfig,pkgconfiglib,python,python3,qml,rpmlib,shebang,shell,static,symlinks,systemd-services)
In file included from /usr/src/tmp/kde5-kpkpass-buildroot/usr/include/KF5/KPim5/KPkPass/pass.h:9:
/usr/src/tmp/kde5-kpkpass-buildroot/usr/include/KF5/KPim5/KPkPass/field.h:11:10: fatal error: QMetaType: No such file or directory
11 | #include
| ^~~~~~~~~~~
compilation terminated.
cpp.req: /usr/src/tmp/kde5-kpkpass-buildroot/usr/include/KF5/KPim5/KPkPass/pass.h: cpp failed, trying c++ mode
In file included from /usr/src/tmp/kde5-kpkpass-buildroot/usr/include/KF5/KPim5/KPkPass/pass.h:9:
/usr/src/tmp/kde5-kpkpass-buildroot/usr/include/KF5/KPim5/KPkPass/field.h:11:10: fatal error: QMetaType: No such file or directory
11 | #include
| ^~~~~~~~~~~
compilation terminated.
cpp.req: WARNING: /usr/src/tmp/kde5-kpkpass-buildroot/usr/include/KF5/KPim5/KPkPass/pass.h: cpp failed
/usr/src/tmp/kde5-kpkpass-buildroot/usr/include/KF5/KPim5/KPkPass/field.h:11:10: fatal error: QMetaType: No such file or directory
11 | #include
| ^~~~~~~~~~~
compilation terminated.
cpp.req: /usr/src/tmp/kde5-kpkpass-buildroot/usr/include/KF5/KPim5/KPkPass/field.h: cpp failed, trying c++ mode
/usr/src/tmp/kde5-kpkpass-buildroot/usr/include/KF5/KPim5/KPkPass/field.h:11:10: fatal error: QMetaType: No such file or directory
11 | #include
| ^~~~~~~~~~~
compilation terminated.
cpp.req: WARNING: /usr/src/tmp/kde5-kpkpass-buildroot/usr/include/KF5/KPim5/KPkPass/field.h: cpp failed
/usr/src/tmp/kde5-kpkpass-buildroot/usr/include/KF5/KPim5/KPkPass/barcode.h:11:10: fatal error: QMetaType: No such file or directory
11 | #include
| ^~~~~~~~~~~
compilation terminated.
cpp.req: /usr/src/tmp/kde5-kpkpass-buildroot/usr/include/KF5/KPim5/KPkPass/barcode.h: cpp failed, trying c++ mode
/usr/src/tmp/kde5-kpkpass-buildroot/usr/include/KF5/KPim5/KPkPass/barcode.h:11:10: fatal error: QMetaType: No such file or directory
11 | #include
| ^~~~~~~~~~~
compilation terminated.
cpp.req: WARNING: /usr/src/tmp/kde5-kpkpass-buildroot/usr/include/KF5/KPim5/KPkPass/barcode.h: cpp failed
/usr/src/tmp/kde5-kpkpass-buildroot/usr/include/KF5/KPim5/KPkPass/location.h:11:10: fatal error: QMetaType: No such file or directory
11 | #include
| ^~~~~~~~~~~
compilation terminated.
cpp.req: /usr/src/tmp/kde5-kpkpass-buildroot/usr/include/KF5/KPim5/KPkPass/location.h: cpp failed, trying c++ mode
/usr/src/tmp/kde5-kpkpass-buildroot/usr/include/KF5/KPim5/KPkPass/location.h:11:10: fatal error: QMetaType: No such file or directory
11 | #include
| ^~~~~~~~~~~
compilation terminated.
cpp.req: WARNING: /usr/src/tmp/kde5-kpkpass-buildroot/usr/include/KF5/KPim5/KPkPass/location.h: cpp failed
In file included from /usr/src/tmp/kde5-kpkpass-buildroot/usr/include/KF5/KPim5/KPkPass/pass.h:9,
from /usr/src/tmp/kde5-kpkpass-buildroot/usr/include/KF5/KPim5/KPkPass/boardingpass.h:9:
/usr/src/tmp/kde5-kpkpass-buildroot/usr/include/KF5/KPim5/KPkPass/field.h:11:10: fatal error: QMetaType: No such file or directory
11 | #include
| ^~~~~~~~~~~
compilation terminated.
cpp.req: /usr/src/tmp/kde5-kpkpass-buildroot/usr/include/KF5/KPim5/KPkPass/boardingpass.h: cpp failed, trying c++ mode
In file included from /usr/src/tmp/kde5-kpkpass-buildroot/usr/include/KF5/KPim5/KPkPass/pass.h:9,
from /usr/src/tmp/kde5-kpkpass-buildroot/usr/include/KF5/KPim5/KPkPass/boardingpass.h:9:
/usr/src/tmp/kde5-kpkpass-buildroot/usr/include/KF5/KPim5/KPkPass/field.h:11:10: fatal error: QMetaType: No such file or directory
11 | #include
| ^~~~~~~~~~~
compilation terminated.
cpp.req: WARNING: /usr/src/tmp/kde5-kpkpass-buildroot/usr/include/KF5/KPim5/KPkPass/boardingpass.h: cpp failed
Requires: /usr/lib/libKPim5PkPass.so.5
Finding debuginfo files (using /usr/lib/rpm/find-debuginfo-files)
Executing: /bin/sh -e /usr/src/tmp/rpm-tmp.N8ArXe
Processing files: libkpimpkpass5-23.08.5-alt1
warning: File listed twice: /usr/lib/libKPim5PkPass.so.5
Finding Provides (using /usr/lib/rpm/find-provides)
Executing: /bin/sh -e /usr/src/tmp/rpm-tmp.abxVMX
find-provides: running scripts (alternatives,debuginfo,lib,pam,perl,pkgconfig,python,python3,qml,shell)
lib.prov: /usr/src/tmp/kde5-kpkpass-buildroot/usr/lib/libKPim5PkPass.so.5: 120 symbols, 17 bpp
warning: hash collision: _ZN7KPkPass12BoardingPassC1EP7QObject _ZN7KPkPass4Pass11qt_metacallEN11QMetaObject4CallEiPPv
Finding Requires (using /usr/lib/rpm/find-requires)
Executing: /bin/sh -e /usr/src/tmp/rpm-tmp.Jhe6yX
find-requires: running scripts (cpp,debuginfo,files,lib,pam,perl,pkgconfig,pkgconfiglib,python,python3,qml,rpmlib,shebang,shell,static,symlinks,systemd-services)
Provides: libkpimpkpass = 23.08.5-alt1, libKPim5PkPass.so.5 = set:kdwicdqTy9j8XwIm66PuniRhrEcFsbccBerh6MXbZ1npZykJYdedgk8Nqu9ZsLU15lgZtuXPSZE0UPMmdVSy6ZykVNJzPI3J2PVx7igkvUrENCMdeJBCsPFoOykTd5ssXyCiloHF9g7j5r14TsbsKkqEDenlbC3xHJMnGi1fIgyoO5MZISUGZDwLHjhFNCOzje3bbHIN5DvcsiE9lBHwhN5R973m8RBpARqaUhZ9fWPX0
Requires: kde5-kpkpass-common = 23.08.5-alt1, libKF5Archive.so.5 >= set:liW8ifFWH8VSCe79Zcn, libQt5Core.so.5 >= set:qiUVPh9azx2x5jI4ackblZ0QB10jy8sOzFd8F9ZqXH90GZmxBQ1yzCQZ5MBMeL81fQDhO0wQORMojoTmNVOnIeT0uKstSkbj3F8GZIIsHiuajZxyjFV5Kh0Oz4I4UriaojeZJqC8LCtySYYBGsJJ2BOm1YlmpSTBzNe6HBw0q9ntLAh0nQuraivzwcjA4Zs969JRiG0SRmhY1wsW5ko7ZqbgqZntJ7UiRYPybkfqW2R7Z2FMd08hntx9ZpuDEUqTQ8bXhFPQmwBOkCZwgHeZuzgds8EzSLQvORirzRfOJJqdsZ00toqOMZDyi74f0J12Npe4vFZot6EhW2qLKhVrxjAZ5Pk6xhlfidhMYwu3JMioPOwZeVL19JZycVM8eeZur0, libQt5Core.so.5(Qt_5), libQt5Core.so.5(Qt_5.15), libQt5Gui.so.5 >= set:rnSHCTdRvkzOwfSxIIELdZFd0TyixfZ8a, libQt5Gui.so.5(Qt_5), libc.so.6(GLIBC_2.0), libc.so.6(GLIBC_2.1.3), libc.so.6(GLIBC_2.32), libc.so.6(GLIBC_2.4), libstdc++.so.6(CXXABI_1.3), libstdc++.so.6(CXXABI_1.3.9), libstdc++.so.6(GLIBCXX_3.4), rtld(GNU_HASH)
Requires(rpmlib): rpmlib(SetVersions)
Obsoletes: libkpimpkpass < 23.08.5-alt1
Finding debuginfo files (using /usr/lib/rpm/find-debuginfo-files)
Executing: /bin/sh -e /usr/src/tmp/rpm-tmp.u8cq0T
Creating libkpimpkpass5-debuginfo package
Processing files: libkpimpkpass5-debuginfo-23.08.5-alt1
Finding Provides (using /usr/lib/rpm/find-provides)
Executing: /bin/sh -e /usr/src/tmp/rpm-tmp.Go8eDc
find-provides: running scripts (debuginfo)
Finding Requires (using /usr/lib/rpm/find-requires)
Executing: /bin/sh -e /usr/src/tmp/rpm-tmp.0HUVIN
find-requires: running scripts (debuginfo)
Provides: debug(libKPim5PkPass.so.5)
Requires: libkpimpkpass5 = 23.08.5-alt1, debug(libKF5Archive.so.5), debug(libQt5Core.so.5), debug(libQt5Gui.so.5), debug(libc.so.6), debug(libstdc++.so.6)
Adding to libkpimpkpass5 a strict dependency on kde5-kpkpass-common
Adding to libkpimpkpass5-debuginfo a strict dependency on libkpimpkpass5
Adding to kde5-kpkpass-devel a strict dependency on libkpimpkpass5
Removing 1 extra deps from kde5-kpkpass-devel due to dependency on libkpimpkpass5
Wrote: /usr/src/RPM/RPMS/noarch/kde5-kpkpass-common-23.08.5-alt1.noarch.rpm (w2.lzdio)
Wrote: /usr/src/RPM/RPMS/i586/kde5-kpkpass-devel-23.08.5-alt1.i586.rpm (w2.lzdio)
Wrote: /usr/src/RPM/RPMS/i586/libkpimpkpass5-23.08.5-alt1.i586.rpm (w2.lzdio)
Wrote: /usr/src/RPM/RPMS/i586/libkpimpkpass5-debuginfo-23.08.5-alt1.i586.rpm (w2.lzdio)
12.82user 5.68system 0:18.02elapsed 102%CPU (0avgtext+0avgdata 178520maxresident)k
0inputs+0outputs (0major+1033068minor)pagefaults 0swaps
/.out/kde5-kpkpass-common-23.08.5-alt1.noarch.rpm: bad symbols in the license tag: /
/.out/kde5-kpkpass-devel-23.08.5-alt1.i586.rpm: bad symbols in the license tag: /
/.out/libkpimpkpass5-23.08.5-alt1.i586.rpm: bad symbols in the license tag: /
/.out/libkpimpkpass5-debuginfo-23.08.5-alt1.i586.rpm: bad symbols in the license tag: /
4.64user 3.91system 0:43.52elapsed 19%CPU (0avgtext+0avgdata 132240maxresident)k
0inputs+0outputs (0major+331936minor)pagefaults 0swaps
--- kde5-kpkpass-devel-23.08.5-alt1.i586.rpm.repo 2024-02-16 12:36:35.000000000 +0000
+++ kde5-kpkpass-devel-23.08.5-alt1.i586.rpm.hasher 2024-11-16 09:03:29.272477675 +0000
@@ -44,6 +44,6 @@
File: /usr/lib/cmake/KPim5PkPass/KPim5PkPassTargets-release.cmake 100644 root:root f0e183ab2c34c3b7ba3d23f1a6acbfd2
-File: /usr/lib/cmake/KPim5PkPass/KPim5PkPassTargets.cmake 100644 root:root c1ebf53f9b01248f919d3c308428b877
+File: /usr/lib/cmake/KPim5PkPass/KPim5PkPassTargets.cmake 100644 root:root 18c84d550216ee0aeca6a478ef63bad1
File: /usr/lib/cmake/KPimPkPass 40755 root:root
File: /usr/lib/cmake/KPimPkPass/KPim5PkPassTargets-release.cmake 100644 root:root d62557b7473227775237dc3f1bea0f9a
-File: /usr/lib/cmake/KPimPkPass/KPim5PkPassTargets.cmake 100644 root:root 842665cfd148bef9c810e82a4a47ba32
+File: /usr/lib/cmake/KPimPkPass/KPim5PkPassTargets.cmake 100644 root:root 5c4c52ae10e6ef1ce9bde736c6485303
File: /usr/lib/cmake/KPimPkPass/KPimPkPassConfig.cmake 100644 root:root 51793047234cc16787ef6bf3a879f878
@@ -51,2 +51,2 @@
File: /usr/lib/kf5/devel/libKPim5PkPass.so 120777 root:root ../../libKPim5PkPass.so.5
-RPMIdentity: 12a757d1cc62604cf8f2301f37710418e4a17df648be924173ac5b03c29634c753dce065c042f453fa98e0eb72b9651a6ff1b803d8d9fd86aa327485902e9c6a
+RPMIdentity: c3e1ebcb330d6254b68da5abd2af93977b3c872551a79dbdf71e758902598cdeb00803ae1482e353f22eb94b9c80be5aad074d37d860d7076f8480625f0f5b99
--- libkpimpkpass5-23.08.5-alt1.i586.rpm.repo 2024-02-16 12:36:35.000000000 +0000
+++ libkpimpkpass5-23.08.5-alt1.i586.rpm.hasher 2024-11-16 09:03:29.343478564 +0000
@@ -24,3 +24,3 @@
File: /usr/lib/libKPim5PkPass.so.5 120777 root:root libKPim5PkPass.so.5.24.5
-File: /usr/lib/libKPim5PkPass.so.5.24.5 100644 root:root 7a0e524cdbd299679dbac3e585d3b6f1
-RPMIdentity: 8ec818113e019639ad891548c68fdfe127badbac610b73ca41b9e7114863889faeefcdd5daa4d9d586c45d7942b0354284adff4dd2c921b2ea4f5d67259e47e1
+File: /usr/lib/libKPim5PkPass.so.5.24.5 100644 root:root 87941c93a97d05d2a560b3b526fd0a10
+RPMIdentity: a2a82c02e0ba948ea9a8c2b37feb3a5aac852c8167a536860644122455e9e8b2fe753d3119cea2469419d6effa8ac1612117bdda149368b524364aad6a79503a
--- libkpimpkpass5-debuginfo-23.08.5-alt1.i586.rpm.repo 2024-02-16 12:36:36.000000000 +0000
+++ libkpimpkpass5-debuginfo-23.08.5-alt1.i586.rpm.hasher 2024-11-16 09:03:29.422479552 +0000
@@ -1,4 +1,4 @@
-/usr/lib/debug/.build-id/b4 40755 root:root
-/usr/lib/debug/.build-id/b4/b7733646bb09793738142ddb412e6de90caeec 120777 root:root ../../../libKPim5PkPass.so.5.24.5
-/usr/lib/debug/.build-id/b4/b7733646bb09793738142ddb412e6de90caeec.debug 120777 root:root ../../usr/lib/libKPim5PkPass.so.5.24.5.debug
+/usr/lib/debug/.build-id/41 40755 root:root
+/usr/lib/debug/.build-id/41/fdd43bc4889b30771a1f4e2a4817608552a53c 120777 root:root ../../../libKPim5PkPass.so.5.24.5
+/usr/lib/debug/.build-id/41/fdd43bc4889b30771a1f4e2a4817608552a53c.debug 120777 root:root ../../usr/lib/libKPim5PkPass.so.5.24.5.debug
/usr/lib/debug/usr/lib/libKPim5PkPass.so.5.24.5.debug 100644 root:root
@@ -40,6 +40,6 @@
Provides: libkpimpkpass5-debuginfo = 23.08.5-alt1:sisyphus+340825.100.1.1
-File: /usr/lib/debug/.build-id/b4 40755 root:root
-File: /usr/lib/debug/.build-id/b4/b7733646bb09793738142ddb412e6de90caeec 120777 root:root ../../../libKPim5PkPass.so.5.24.5
-File: /usr/lib/debug/.build-id/b4/b7733646bb09793738142ddb412e6de90caeec.debug 120777 root:root ../../usr/lib/libKPim5PkPass.so.5.24.5.debug
-File: /usr/lib/debug/usr/lib/libKPim5PkPass.so.5.24.5.debug 100644 root:root 4cc15d41860500cb8eed778c78d8d5e1
+File: /usr/lib/debug/.build-id/41 40755 root:root
+File: /usr/lib/debug/.build-id/41/fdd43bc4889b30771a1f4e2a4817608552a53c 120777 root:root ../../../libKPim5PkPass.so.5.24.5
+File: /usr/lib/debug/.build-id/41/fdd43bc4889b30771a1f4e2a4817608552a53c.debug 120777 root:root ../../usr/lib/libKPim5PkPass.so.5.24.5.debug
+File: /usr/lib/debug/usr/lib/libKPim5PkPass.so.5.24.5.debug 100644 root:root 561d50c79f0ddf8e47880928044c3c29
File: /usr/lib/debug/usr/lib/libKPim5PkPass.so.5.debug 120777 root:root libKPim5PkPass.so.5.24.5.debug
@@ -50,8 +50,8 @@
File: /usr/src/debug/kpkpass-23.08.5/BUILD/src/KPim5PkPass_autogen/EWIEGA46WW 40755 root:root
-File: /usr/src/debug/kpkpass-23.08.5/BUILD/src/KPim5PkPass_autogen/EWIEGA46WW/moc_barcode.cpp 100644 root:root 768e951dc9280672ae586aaca43d2d44
-File: /usr/src/debug/kpkpass-23.08.5/BUILD/src/KPim5PkPass_autogen/EWIEGA46WW/moc_boardingpass.cpp 100644 root:root d0437bc21896a15fdb116c56032e3cbc
-File: /usr/src/debug/kpkpass-23.08.5/BUILD/src/KPim5PkPass_autogen/EWIEGA46WW/moc_location.cpp 100644 root:root cbf591ba0e3749372ecce2412ffaaf70
+File: /usr/src/debug/kpkpass-23.08.5/BUILD/src/KPim5PkPass_autogen/EWIEGA46WW/moc_barcode.cpp 100644 root:root cac616fe0da8bc97f3c5d600129ff8b8
+File: /usr/src/debug/kpkpass-23.08.5/BUILD/src/KPim5PkPass_autogen/EWIEGA46WW/moc_boardingpass.cpp 100644 root:root 7a55f8410387ddf1ea8b1a1e9fa2b1b6
+File: /usr/src/debug/kpkpass-23.08.5/BUILD/src/KPim5PkPass_autogen/EWIEGA46WW/moc_location.cpp 100644 root:root 4ca461edcaeb22351867bbdcaf3c7275
File: /usr/src/debug/kpkpass-23.08.5/BUILD/src/KPim5PkPass_autogen/include 40755 root:root
-File: /usr/src/debug/kpkpass-23.08.5/BUILD/src/KPim5PkPass_autogen/include/moc_field.cpp 100644 root:root 5ad5bc18cc7184ce641dc26af913157b
-File: /usr/src/debug/kpkpass-23.08.5/BUILD/src/KPim5PkPass_autogen/include/moc_pass.cpp 100644 root:root 363f81184eb99221971e16899e3ebc48
+File: /usr/src/debug/kpkpass-23.08.5/BUILD/src/KPim5PkPass_autogen/include/moc_field.cpp 100644 root:root 4fc9829b4bd40b10dc4e8e1bba91a9d7
+File: /usr/src/debug/kpkpass-23.08.5/BUILD/src/KPim5PkPass_autogen/include/moc_pass.cpp 100644 root:root ab98a312761ab36b7769efaea986b15b
File: /usr/src/debug/kpkpass-23.08.5/BUILD/src/KPim5PkPass_autogen/mocs_compilation.cpp 100644 root:root 088341971645161f871675632e44cf8b
@@ -71,2 +71,2 @@
File: /usr/src/debug/kpkpass-23.08.5/src/pass_p.h 100644 root:root 6ab6d853a81d1eb0c35c5a6a0b7634a2
-RPMIdentity: fefdab344c181de3bb7bd823de88f2d0eadcf69a3953b54853f1a53561dcac4054be96bb8aad917a42520501d1b12401bff7ec217e7041a8f8e50f6b2e416a45
+RPMIdentity: 581310164f094d8973e981927535f82cba24b3768d7724616cebfb5383a8fb4d3d3121d7e997bbf15f2b34077c016d7b601f606fb5df591d4b91f51ecc515679