<86>Nov  2 08:55:05 userdel[4024969]: delete user 'rooter'
<86>Nov  2 08:55:05 userdel[4024969]: removed group 'rooter' owned by 'rooter'
<86>Nov  2 08:55:05 userdel[4024969]: removed shadow group 'rooter' owned by 'rooter'
<86>Nov  2 08:55:05 groupadd[4024984]: group added to /etc/group: name=rooter, GID=1814
<86>Nov  2 08:55:05 groupadd[4024984]: group added to /etc/gshadow: name=rooter
<86>Nov  2 08:55:05 groupadd[4024984]: new group: name=rooter, GID=1814
<86>Nov  2 08:55:05 useradd[4024995]: new user: name=rooter, UID=1814, GID=1814, home=/root, shell=/bin/bash, from=none
<86>Nov  2 08:55:05 userdel[4025007]: delete user 'builder'
<86>Nov  2 08:55:05 userdel[4025007]: removed group 'builder' owned by 'builder'
<86>Nov  2 08:55:05 userdel[4025007]: removed shadow group 'builder' owned by 'builder'
<86>Nov  2 08:55:05 groupadd[4025021]: group added to /etc/group: name=builder, GID=1815
<86>Nov  2 08:55:05 groupadd[4025021]: group added to /etc/gshadow: name=builder
<86>Nov  2 08:55:05 groupadd[4025021]: new group: name=builder, GID=1815
<86>Nov  2 08:55:05 useradd[4025033]: new user: name=builder, UID=1815, GID=1815, home=/usr/src, shell=/bin/bash, from=none
<13>Nov  2 08:55:08 rpmi: rpm-build-qml6-6.7.2-alt1 sisyphus+359329.100.1.1 1728468660 installed
<13>Nov  2 08:55:08 rpmi: rpm-macros-qt6-6.7.2-alt5 sisyphus+361249.300.3.1 1730377912 installed
<13>Nov  2 08:55:08 rpmi: rpm-build-xdg-0.2-alt1 1250461503 installed
<13>Nov  2 08:55:08 rpmi: rpm-build-kf6-6.0.4-alt3 sisyphus+356739.100.1.1 1725371435 installed
<13>Nov  2 08:55:11 rpmi: libxkbcommon-1.7.0-alt1.1 sisyphus+343672.100.1.1 1711490815 installed
<13>Nov  2 08:55:11 rpmi: libexpat-2.5.0-alt1 sisyphus+346180.200.2.1 1716349845 installed
<13>Nov  2 08:55:11 rpmi: libglvnd-7:1.7.0-alt1 sisyphus+330949.100.1.1 1696424894 installed
<13>Nov  2 08:55:11 rpmi: libOpenGL-7:1.7.0-alt1 sisyphus+330949.100.1.1 1696424894 installed
<13>Nov  2 08:55:11 rpmi: libwayland-client-1.23.1-alt1.1 sisyphus+356019.140.3.1 1724572108 installed
<13>Nov  2 08:55:11 rpmi: libpng16-1.6.42-alt2 sisyphus+339555.100.1.1 1706781690 installed
<13>Nov  2 08:55:11 rpmi: qt6-base-common-6.7.2-alt5 sisyphus+361249.300.3.1 1730377963 installed
<13>Nov  2 08:55:11 rpmi: perl-HTTP-Date-6.06-alt1 sisyphus+324527.100.1.1 1688834564 installed
<13>Nov  2 08:55:11 rpmi: perl-XML-NamespaceSupport-1.12-alt1 1491296348 installed
<13>Nov  2 08:55:11 rpmi: libjpeg-2:3.0.2-alt2.1 sisyphus+340135.100.1.1 1707449053 installed
<13>Nov  2 08:55:11 rpmi: libidn2-2.3.7-alt1 sisyphus+339505.100.1.2 1706718975 installed
<13>Nov  2 08:55:11 rpmi: libnettle8-3.9.1-alt1 sisyphus+322548.100.1.2 1686176897 installed
<13>Nov  2 08:55:11 rpmi: libxslt-1.1.39-alt1 sisyphus+349406.100.1.1 1716751808 installed
<13>Nov  2 08:55:11 rpmi: xml-utils-1:2.12.9-alt1 sisyphus+355784.100.1.1 1724333695 installed
<13>Nov  2 08:55:11 rpmi: libICE-1.1.1-alt1 sisyphus+311428.500.1.1 1670577559 installed
<13>Nov  2 08:55:11 rpmi: libmtdev-1.1.6-alt1 sisyphus+278361.100.1.1 1626091636 installed
<13>Nov  2 08:55:11 rpmi: libevdev-1.13.3-alt1 sisyphus+356918.100.1.1 1725546441 installed
<13>Nov  2 08:55:11 rpmi: libts0-1.22-alt3 sisyphus+278442.100.1.2 1626216683 installed
<13>Nov  2 08:55:11 rpmi: libfribidi-1.0.16-alt1 sisyphus+358393.100.1.1 1727333693 installed
<13>Nov  2 08:55:11 rpmi: libsqlite3-3.46.0-alt1 sisyphus+352354.100.2.1 1721980459 installed
<13>Nov  2 08:55:11 rpmi: liblcms2-2.16-alt1 sisyphus+335676.100.1.1 1701682605 installed
<13>Nov  2 08:55:11 rpmi: libgudev-1:238-alt1 sisyphus+324364.100.1.1 1688646145 installed
<13>Nov  2 08:55:11 rpmi: libwayland-server-1.23.1-alt1.1 sisyphus+356019.140.3.1 1724572108 installed
<13>Nov  2 08:55:11 rpmi: libdouble-conversion3-3.3.0-alt1 sisyphus+333410.100.1.1 1698928792 installed
<13>Nov  2 08:55:11 rpmi: libicu74-1:7.4.2-alt1 sisyphus+336372.200.1.1 1702422879 installed
<13>Nov  2 08:55:11 rpmi: perl-LWP-MediaTypes-6.04-alt1 sisyphus+225468.100.1.1 1553186684 installed
<13>Nov  2 08:55:11 rpmi: perl-Compress-Raw-Zlib-2.206-alt1 sisyphus+335067.600.1.1 1700901614 installed
<13>Nov  2 08:55:11 rpmi: perl-libnet-1:3.15-alt1 sisyphus+317310.100.1.1 1679580208 installed
<13>Nov  2 08:55:11 rpmi: perl-XML-SAX-Base-1.09-alt1 1494364363 installed
<13>Nov  2 08:55:11 rpmi: libedit3-3.1.20230828-alt1 sisyphus+330914.200.3.1 1696922745 installed
<13>Nov  2 08:55:11 rpmi: libb2-0.98.1-alt1_1 sisyphus+291614.100.1.1 1638962878 installed
<13>Nov  2 08:55:11 rpmi: shared-mime-info-2.4-alt1 sisyphus+334259.100.1.1 1699787317 installed
<13>Nov  2 08:55:11 rpmi: libp11-kit-1:0.25.5-alt1 sisyphus+352553.100.1.1 1720622586 installed
<13>Nov  2 08:55:11 rpmi: libtasn1-4.19.0-alt3 sisyphus+327816.100.1.1 1692802618 installed
<13>Nov  2 08:55:11 rpmi: libatk-2.54.0-alt1 sisyphus+357735.600.3.1 1726642173 installed
<13>Nov  2 08:55:11 rpmi: liblz4-1:1.9.4-alt1 sisyphus+309416.100.1.1 1667413000 installed
<13>Nov  2 08:55:11 rpmi: libsystemd-1:255.13-alt1 sisyphus+359453.100.2.1 1728651220 installed
<13>Nov  2 08:55:12 rpmi: libdbus-1.14.10-alt1 sisyphus+327286.5700.14.1 1711487513 installed
<13>Nov  2 08:55:12 rpmi: dbus-tools-1.14.10-alt1 sisyphus+327286.5700.14.1 1711487513 installed
<86>Nov  2 08:55:12 groupadd[4040707]: group added to /etc/group: name=messagebus, GID=999
<86>Nov  2 08:55:12 groupadd[4040707]: group added to /etc/gshadow: name=messagebus
<86>Nov  2 08:55:12 groupadd[4040707]: new group: name=messagebus, GID=999
<86>Nov  2 08:55:12 useradd[4040743]: new user: name=messagebus, UID=999, GID=999, home=/run/dbus, shell=/dev/null, from=none
<13>Nov  2 08:55:12 rpmi: dbus-1.14.10-alt1 sisyphus+327286.5700.14.1 1711487513 installed
<13>Nov  2 08:55:12 rpmi: libavahi-0.8-alt4 sisyphus+344258.100.1.1 1712133862 installed
<13>Nov  2 08:55:12 rpmi: icu-utils-1:7.4.2-alt1 sisyphus+336372.200.1.1 1702422879 installed
<13>Nov  2 08:55:12 rpmi: libicu-devel-1:7.4.2-alt1 sisyphus+336372.200.1.1 1702422879 installed
<13>Nov  2 08:55:12 rpmi: libdouble-conversion-devel-3.3.0-alt1 sisyphus+333410.100.1.1 1698928792 installed
<13>Nov  2 08:55:12 rpmi: libSM-1.2.4-alt1 sisyphus+312057.200.1.1 1671526918 installed
<13>Nov  2 08:55:12 rpmi: libhogweed6-3.9.1-alt1 sisyphus+322548.100.1.2 1686176897 installed
<13>Nov  2 08:55:12 rpmi: libgnutls30-3.8.4-alt1 sisyphus+343729.100.2.1 1711570650 installed
<13>Nov  2 08:55:12 rpmi: libngtcp2.16-1.7.0-alt1 sisyphus+356415.200.1.1 1725031916 installed
<13>Nov  2 08:55:12 rpmi: libngtcp2_crypto_gnutls8-1.7.0-alt1 sisyphus+356415.200.1.1 1725031916 installed
<13>Nov  2 08:55:12 rpmi: perl-File-Listing-6.16-alt1 sisyphus+325783.100.1.1 1690559356 installed
<13>Nov  2 08:55:12 rpmi: kf6-filesystem-6.0.0-alt1 sisyphus+350471.360.11.1 1718043567 installed
<13>Nov  2 08:55:12 rpmi: kde-common-24.1-alt1 sisyphus+350471.500.11.1 1718043587 installed
<13>Nov  2 08:55:12 rpmi: kf6-karchive-common-6.7.0-alt1 sisyphus+359691.2000.1.2 1728919291 installed
<13>Nov  2 08:55:12 rpmi: kf6-kconfig-common-6.7.0-alt1 sisyphus+359691.1500.1.2 1728919008 installed
<13>Nov  2 08:55:12 rpmi: kf6-kcoreaddons-common-6.7.0-alt1 sisyphus+359691.2200.1.2 1728919459 installed
<13>Nov  2 08:55:12 rpmi: kf6-kdoctools-common-6.7.0-alt1 sisyphus+359691.3300.1.2 1728920213 installed
<13>Nov  2 08:55:12 rpmi: kf6-ki18n-common-6.7.0-alt1 sisyphus+359691.3100.1.2 1728920050 installed
<13>Nov  2 08:55:12 rpmi: qt6-declarative-common-6.7.2-alt1 sisyphus+359329.100.1.1 1728468660 installed
<13>Nov  2 08:55:12 rpmi: libwayland-cursor-1.23.1-alt1.1 sisyphus+356019.140.3.1 1724572108 installed
<13>Nov  2 08:55:12 rpmi: libwayland-egl-4:18.1.0-alt1.1 sisyphus+356019.140.3.1 1724572108 installed
<13>Nov  2 08:55:12 rpmi: libGLES-7:1.7.0-alt1 sisyphus+330949.100.1.1 1696424894 installed
<13>Nov  2 08:55:12 rpmi: libxkbcommon-devel-1.7.0-alt1.1 sisyphus+343672.100.1.1 1711490815 installed
<13>Nov  2 08:55:12 rpmi: sgml-common-0.6.3-alt15 sisyphus+276099.100.1.1 1624817971 installed
<13>Nov  2 08:55:12 rpmi: docbook-dtds-4.5-alt1 sisyphus+276837.100.1.1 1625242123 installed
<13>Nov  2 08:55:12 rpmi: docbook-style-xsl-1.79.1-alt4 sisyphus+232871.100.1.1 1561238010 installed
<13>Nov  2 08:55:12 rpmi: xxd-4:9.1.0050-alt4 sisyphus+350411.100.1.1 1717596650 installed
<13>Nov  2 08:55:12 rpmi: vulkan-headers-1.3.290-alt1 sisyphus+356274.400.2.1 1724874998 installed
<13>Nov  2 08:55:12 rpmi: xorg-proto-devel-2024.1-alt1 sisyphus+343583.40.1.1 1711440649 installed
<13>Nov  2 08:55:12 rpmi: libwacom-data-2.13.0-alt1 sisyphus+356629.100.1.1 1725279204 installed
<13>Nov  2 08:55:12 rpmi: libSDL2-2.30.8-alt1 sisyphus+358811.100.1.1 1727865603 installed
<13>Nov  2 08:55:12 rpmi: tslib-1.22-alt3 sisyphus+278442.100.1.2 1626216683 installed
<13>Nov  2 08:55:12 rpmi: libdatrie-0.2.13-alt1_7 sisyphus+328221.100.1.1 1693336967 installed
<13>Nov  2 08:55:12 rpmi: libthai-0.1.29-alt1_6 sisyphus+328230.100.1.2 1693348044 installed
<13>Nov  2 08:55:12 rpmi: libepoxy-1.5.10-alt1 sisyphus+296853.200.2.1 1647631868 installed
<13>Nov  2 08:55:12 rpmi: libpixman-3:0.43.4-alt2 sisyphus+344164.100.1.1 1711987947 installed
<13>Nov  2 08:55:12 rpmi: libusb-1.0.27-alt1 sisyphus+347412.100.1.1 1714739652 installed
<13>Nov  2 08:55:12 rpmi: libgraphite2-1.3.14-alt2.1 sisyphus+279571.100.1.2 1626605157 installed
<13>Nov  2 08:55:12 rpmi: libxshmfence-1.3.2-alt1 sisyphus+311428.400.1.1 1670577529 installed
<13>Nov  2 08:55:12 rpmi: libsensors3-3.6.0-alt3 sisyphus+308579.100.1.1 1666035269 installed
<13>Nov  2 08:55:12 rpmi: llvm18.1-filesystem-18.1.8-alt0.2 sisyphus+357910.700.19.1 1728048529 installed
<13>Nov  2 08:55:13 rpmi: llvm18.1-polly-18.1.8-alt0.2 sisyphus+357910.700.19.1 1728048529 installed
<13>Nov  2 08:55:13 rpmi: llvm18.1-gold-18.1.8-alt0.2 sisyphus+357910.700.19.1 1728048529 installed
<13>Nov  2 08:55:15 rpmi: llvm18.1-libs-18.1.8-alt0.2 sisyphus+357910.700.19.1 1728048529 installed
<13>Nov  2 08:55:15 rpmi: libpciaccess-1:0.18.1-alt1 sisyphus+343583.300.1.1 1711440792 installed
<13>Nov  2 08:55:15 rpmi: libdrm-1:2.4.123-alt1 sisyphus+357330.40.3.1 1726125397 installed
<13>Nov  2 08:55:15 rpmi: libduktape207-2.7.0-alt3 sisyphus+352341.100.1.1 1720324465 installed
<13>Nov  2 08:55:15 rpmi: iso-codes-4.17.0-alt1 sisyphus+357584.100.1.1 1726430044 installed
<13>Nov  2 08:55:15 rpmi: perl-Try-Tiny-0.31-alt1 sisyphus+290597.100.1.1 1637915507 installed
<13>Nov  2 08:55:15 rpmi: perl-IO-Socket-IP-0.42-alt1 sisyphus+325815.100.1.2 1690571193 installed
<13>Nov  2 08:55:15 rpmi: perl-Module-Load-0.36-alt1 sisyphus+258992.100.1.1 1601543407 installed
<13>Nov  2 08:55:15 rpmi: perl-Compress-Raw-Bzip2-2.210-alt1 sisyphus+343108.100.1.3 1710881036 installed
<13>Nov  2 08:55:15 rpmi: perl-IO-Compress-Brotli-2:0.004001-alt3 sisyphus+335067.1200.1.1 1700901700 installed
<13>Nov  2 08:55:15 rpmi: perl-Clone-0.46-alt1 sisyphus+335067.1100.1.1 1700901674 installed
<13>Nov  2 08:55:15 rpmi: perl-HTML-Tagset-3.24-alt1 sisyphus+343117.100.1.3 1710883587 installed
<13>Nov  2 08:55:15 rpmi: perl-Term-ANSIColor-5.01-alt1 sisyphus+244783.100.1.2 1579747505 installed
<13>Nov  2 08:55:15 rpmi: perl-Data-Dump-1.25-alt1 sisyphus+276551.100.1.1 1625126880 installed
<13>Nov  2 08:55:15 rpmi: perl-Filter-1.64-alt1 sisyphus+335067.400.1.1 1700901530 installed
<13>Nov  2 08:55:15 rpmi: perl-Encode-3.21-alt1 sisyphus+343095.100.1.1 1710875480 installed
<13>Nov  2 08:55:15 rpmi: perl-URI-5.27-alt1 sisyphus+340901.100.1.1 1708180683 installed
<13>Nov  2 08:55:15 rpmi: perl-IO-Compress-2.206-alt1 sisyphus+325819.100.1.1 1690563199 installed
<13>Nov  2 08:55:15 rpmi: perl-Net-HTTP-6.23-alt1 sisyphus+323470.100.1.1 1687422469 installed
<13>Nov  2 08:55:15 rpmi: perl-HTML-Parser-3.82-alt1 sisyphus+343116.100.1.3 1710883258 installed
<13>Nov  2 08:55:15 rpmi: perl-WWW-RobotRules-6.02-alt1 1329756211 installed
<13>Nov  2 08:55:15 rpmi: perl-Encode-Locale-1.05-alt1 1444608613 installed
<13>Nov  2 08:55:15 rpmi: perl-IO-HTML-1.004-alt1 sisyphus+258983.100.1.1 1601542619 installed
<13>Nov  2 08:55:15 rpmi: perl-HTTP-Message-6.45-alt1 sisyphus+330728.100.1.1 1696162276 installed
<13>Nov  2 08:55:15 rpmi: perl-HTTP-Negotiate-6.01-alt1 1329760563 installed
<13>Nov  2 08:55:15 rpmi: perl-libwww-6.77-alt1 sisyphus+343120.100.1.2 1710884405 installed
<13>Nov  2 08:55:15 rpmi: perl-XML-LibXML-2.0210-alt8 sisyphus+355798.100.1.1 1724340088 installed
<13>Nov  2 08:55:15 rpmi: perl-XML-SAX-1.02-alt1 sisyphus+232322.100.1.1 1560758406 installed
<13>Nov  2 08:55:15 rpmi: perl-XML-Simple-2.25-alt2 sisyphus+257498.100.1.1 1599324034 installed
<13>Nov  2 08:55:15 rpmi: icon-naming-utils-0.8.90-alt1 sisyphus+276851.100.1.1 1625243947 installed
<13>Nov  2 08:55:15 rpmi: icon-theme-adwaita-47.0-alt1 sisyphus+357735.1000.3.1 1726642413 installed
<13>Nov  2 08:55:15 rpmi: usbids-20240206-alt1 sisyphus+339943.100.1.1 1707270512 installed
<13>Nov  2 08:55:15 rpmi: pciids-20241031-alt1 sisyphus+361327.100.1.1 1730460822 installed
<13>Nov  2 08:55:16 rpmi: hwdata-0.384-alt1 sisyphus+354460.100.1.1 1722898493 installed
<13>Nov  2 08:55:16 rpmi: libwebp7-1.4.0-alt1 sisyphus+345159.200.1.1 1713168690 installed
<13>Nov  2 08:55:16 rpmi: libdeflate-1.22-alt1 sisyphus+359192.100.1.1 1728330311 installed
<13>Nov  2 08:55:16 rpmi: libtiff5-4.4.0-alt4 sisyphus+322581.100.1.2 1686180093 installed
<13>Nov  2 08:55:16 rpmi: libgdk-pixbuf-locales-2.42.12-alt1 sisyphus+348142.100.1.1 1715791856 installed
<13>Nov  2 08:55:16 rpmi: gtk+3-themes-incompatible-3.20-alt3 1461944560 installed
<13>Nov  2 08:55:16 rpmi: gcc-c++-common-1.4.28-alt1 sisyphus+348678.100.1.1 1716396142 installed
<13>Nov  2 08:55:16 rpmi: libstdc++14-devel-14.2.1-alt1 sisyphus+360995.100.1.1 1730131612 installed
<13>Nov  2 08:55:17 rpmi: gcc14-c++-14.2.1-alt1 sisyphus+360995.100.1.1 1730131612 installed
<13>Nov  2 08:55:17 rpmi: gcc-c++-14-alt1 sisyphus+360995.300.1.1 1730139881 installed
<13>Nov  2 08:55:17 rpmi: libyaml2-0.2.5-alt1 sisyphus+278391.100.1.1 1626094932 installed
<13>Nov  2 08:55:17 rpmi: libxxhash-0.8.2-alt1 sisyphus+336514.200.7.1 1702672120 installed
<13>Nov  2 08:55:17 rpmi: less-633-alt1 sisyphus+328181.300.2.1 1693321749 installed
<13>Nov  2 08:55:17 rpmi: libmpdec3-2.5.1-alt3 sisyphus+314490.500.5.1 1675432033 installed
<13>Nov  2 08:55:17 rpmi: libgdbm-1.8.3-alt10 sisyphus+346222.200.3.2 1716468406 installed
<13>Nov  2 08:55:17 rpmi: libdevmapper-1.02.200-alt1 sisyphus+355869.100.1.1 1724444362 installed
<13>Nov  2 08:55:17 rpmi: mount-2.39.2-alt1 sisyphus+327286.4500.14.1 1711486360 installed
<13>Nov  2 08:55:17 rpmi: losetup-2.39.2-alt1 sisyphus+327286.4500.14.1 1711486360 installed
<13>Nov  2 08:55:17 rpmi: lsblk-2.39.2-alt1 sisyphus+327286.4500.14.1 1711486360 installed
<13>Nov  2 08:55:17 rpmi: diffstat-1.64-alt1 sisyphus+346132.200.3.2 1716466240 installed
<13>Nov  2 08:55:17 rpmi: dconf-profile-0.1-alt1 sisyphus+325633.340.3.1 1690415358 installed
<13>Nov  2 08:55:17 rpmi: cmake-modules-3.29.3-alt1 sisyphus+348648.100.2.1 1716590540 installed
<13>Nov  2 08:55:17 rpmi: libuv-1.48.0-alt2 sisyphus+357579.100.1.1 1726426172 installed
<13>Nov  2 08:55:17 rpmi: librhash-1.3.5-alt3 sisyphus+286141.40.2.1 1632982456 installed
<13>Nov  2 08:55:17 rpmi: libjsoncpp24-1.9.4-alt2 sisyphus+346331.200.2.1 1716448553 installed
<13>Nov  2 08:55:17 rpmi: publicsuffix-list-dafsa-20240911-alt1 sisyphus+357399.100.1.1 1726160479 installed
<13>Nov  2 08:55:17 rpmi: libpsl-0.21.5-alt1 sisyphus+338474.100.1.1 1705684771 installed
<13>Nov  2 08:55:17 rpmi: libnghttp3.9-1.5.0-alt1 sisyphus+356415.100.1.1 1725031856 installed
<13>Nov  2 08:55:17 rpmi: libnghttp2-1.63.0-alt1 sisyphus+356414.100.1.1 1725031511 installed
<13>Nov  2 08:55:17 rpmi: openldap-common-2.6.8-alt1 sisyphus+351621.100.1.1 1719420449 installed
<13>Nov  2 08:55:17 rpmi: libntlm-1.5-alt1 sisyphus+278100.3300.1.1 1626059663 installed
<13>Nov  2 08:55:17 rpmi: libidn-1.37-alt2 sisyphus+300849.100.1.1 1653769693 installed
<13>Nov  2 08:55:17 rpmi: libverto-0.3.2-alt1_1 sisyphus+321176.2200.10.2 1684806164 installed
<13>Nov  2 08:55:17 rpmi: liblmdb-0.9.33-alt1 sisyphus+360625.100.1.1 1729819639 installed
<13>Nov  2 08:55:17 rpmi: libkeyutils-1.6.3-alt1 sisyphus+346336.200.2.2 1716472658 installed
<13>Nov  2 08:55:17 rpmi: libcom_err-1.46.4.0.5.4cda-alt1 sisyphus+283826.100.1.1 1629975361 installed
<13>Nov  2 08:55:17 rpmi: libbrotlicommon-1.1.0-alt1 sisyphus+328501.100.1.1 1693598420 installed
<13>Nov  2 08:55:17 rpmi: libbrotlidec-1.1.0-alt1 sisyphus+328501.100.1.1 1693598420 installed
<13>Nov  2 08:55:17 rpmi: libharfbuzz-10.0.1-alt1 sisyphus+358317.100.1.1 1727257738 installed
<13>Nov  2 08:55:17 rpmi: libfreetype-2.13.3-alt1 sisyphus+355656.100.1.1 1724221065 installed
<13>Nov  2 08:55:17 rpmi: libfontconfig1-2.15.0-alt1 sisyphus+355771.100.2.3 1724337302 installed
<13>Nov  2 08:55:17 rpmi: rpm-macros-cmake-3.29.1-alt1 sisyphus+344518.300.3.1 1712379787 installed
<13>Nov  2 08:55:17 rpmi: desktop-file-utils-0.26-alt6 sisyphus+331944.100.1.3 1697550035 installed
<13>Nov  2 08:55:17 rpmi: gsettings-desktop-schemas-data-47.1-alt1 sisyphus+357735.300.3.1 1726641752 installed
<13>Nov  2 08:55:17 rpmi: libgio-2.82.2-alt1 sisyphus+360023.100.1.1 1729169702 installed
<13>Nov  2 08:55:17 rpmi: gsettings-desktop-schemas-47.1-alt1 sisyphus+357735.300.3.1 1726641770 installed
<13>Nov  2 08:55:17 rpmi: libgdk-pixbuf-2.42.12-alt1 sisyphus+348142.100.1.1 1715791858 installed
<13>Nov  2 08:55:17 rpmi: gtk4-update-icon-cache-4.16.4-alt1 sisyphus+361465.200.1.1 1730475407 installed
<13>Nov  2 08:55:17 rpmi: libdconf-0.40.0-alt3 sisyphus+325650.100.1.1 1690417204 installed
<13>Nov  2 08:55:17 rpmi: dconf-0.40.0-alt3 sisyphus+325650.100.1.1 1690417204 installed
<13>Nov  2 08:55:17 rpmi: libgtk+3-schemas-3.24.43-alt1 sisyphus+352627.100.1.1 1720700731 installed
<13>Nov  2 08:55:17 rpmi: libjson-glib-1.10.0-alt1 sisyphus+357735.1200.3.1 1726642704 installed
<13>Nov  2 08:55:17 rpmi: libgusb-0.4.9-alt1 sisyphus+345693.100.1.1 1713857462 installed
<13>Nov  2 08:55:17 rpmi: libcolord-1.4.7-alt1.1 sisyphus+338793.100.1.1 1706039037 installed
<13>Nov  2 08:55:17 rpmi: libpolkit-124-alt3 sisyphus+351454.100.1.1 1719236631 installed
<13>Nov  2 08:55:17 rpmi: systemd-modules-common-1:255.13-alt1 sisyphus+359453.100.2.1 1728651180 installed
<13>Nov  2 08:55:17 rpmi: systemd-sysctl-common-1:255.13-alt1 sisyphus+359453.100.2.1 1728651220 installed
<13>Nov  2 08:55:17 rpmi: systemd-tmpfiles-common-1:255.13-alt1 sisyphus+359453.100.2.1 1728651180 installed
<13>Nov  2 08:55:17 rpmi: systemd-utils-filetriggers-1:255.13-alt1 sisyphus+359453.100.2.1 1728651180 installed
<13>Nov  2 08:55:17 rpmi: libfdisk-2.39.2-alt1 sisyphus+327286.4500.14.1 1711486360 installed
<13>Nov  2 08:55:17 rpmi: libX11-locales-3:1.8.10-alt1 sisyphus+353866.100.1.1 1722240771 installed
<13>Nov  2 08:55:17 rpmi: libXdmcp-1.1.5-alt1 sisyphus+343583.700.1.1 1711441073 installed
<13>Nov  2 08:55:17 rpmi: libXau-1.0.11-alt1 sisyphus+311428.100.1.1 1670577440 installed
<13>Nov  2 08:55:17 rpmi: libxcb-1.17.0-alt1 sisyphus+345308.200.1.1 1713342009 installed
<13>Nov  2 08:55:17 rpmi: libX11-3:1.8.10-alt1 sisyphus+353866.100.1.1 1722240774 installed
<13>Nov  2 08:55:17 rpmi: libXext-1.3.6-alt1 sisyphus+343583.1000.1.1 1711441114 installed
<13>Nov  2 08:55:17 rpmi: libXrender-0.9.11-alt1 sisyphus+308841.100.1.1 1666436131 installed
<13>Nov  2 08:55:17 rpmi: libcairo-1:1.18.2-alt1 sisyphus+357195.100.1.1 1725948394 installed
<13>Nov  2 08:55:17 rpmi: libXfixes-6.0.1-alt1 sisyphus+331490.300.1.1 1697023235 installed
<13>Nov  2 08:55:17 rpmi: libXi-1.8-alt1 sisyphus+285490.200.1.1 1632124180 installed
<13>Nov  2 08:55:17 rpmi: libat-spi2-core-2.54.0-alt1 sisyphus+357735.600.3.1 1726642173 installed
<13>Nov  2 08:55:17 rpmi: libxcb-render-util-0.3.9-alt3 sisyphus+276916.100.1.2 1625275237 installed
<13>Nov  2 08:55:19 rpmi: libxcb-devel-1.17.0-alt1 sisyphus+345308.200.1.1 1713342009 installed
<13>Nov  2 08:55:19 rpmi: libX11-devel-3:1.8.10-alt1 sisyphus+353866.100.1.1 1722240774 installed
<13>Nov  2 08:55:19 rpmi: at-spi2-atk-2.54.0-alt1 sisyphus+357735.600.3.1 1726642173 installed
<13>Nov  2 08:55:19 rpmi: libXcursor-1.2.2-alt1 sisyphus+343583.600.1.1 1711441036 installed
<13>Nov  2 08:55:19 rpmi: libcairo-gobject-1:1.18.2-alt1 sisyphus+357195.100.1.1 1725948394 installed
<13>Nov  2 08:55:19 rpmi: libXrandr-1.5.4-alt1 sisyphus+330992.100.1.1 1696485401 installed
<13>Nov  2 08:55:19 rpmi: libXft-2.3.8-alt1 sisyphus+331490.400.1.1 1697023273 installed
<13>Nov  2 08:55:19 rpmi: libpango-1.54.0-alt1 sisyphus+350796.200.1.1 1718041404 installed
<13>Nov  2 08:55:19 rpmi: libXtst-1.2.4-alt1 sisyphus+308663.1300.1.1 1666168504 installed
<13>Nov  2 08:55:19 rpmi: libXxf86vm-1.1.5-alt1 sisyphus+308663.1400.1.1 1666168534 installed
<13>Nov  2 08:55:19 rpmi: libGLX-mesa-4:24.2.6-alt1 sisyphus+361255.100.1.1 1730364475 installed
<13>Nov  2 08:55:19 rpmi: libgbm-4:24.2.6-alt1 sisyphus+361255.100.1.1 1730364475 installed
<13>Nov  2 08:55:19 rpmi: libGLX-7:1.7.0-alt1 sisyphus+330949.100.1.1 1696424894 installed
<13>Nov  2 08:55:19 rpmi: libGL-7:1.7.0-alt1 sisyphus+330949.100.1.1 1696424894 installed
<13>Nov  2 08:55:19 rpmi: libEGL-mesa-4:24.2.6-alt1 sisyphus+361255.100.1.1 1730364475 installed
<13>Nov  2 08:55:19 rpmi: libEGL-7:1.7.0-alt1 sisyphus+330949.100.1.1 1696424894 installed
<13>Nov  2 08:55:19 rpmi: libglvnd-devel-7:1.7.0-alt1 sisyphus+330949.100.1.1 1696424894 installed
<13>Nov  2 08:55:19 rpmi: libXinerama-1.1.5-alt1 sisyphus+309287.100.1.1 1667213209 installed
<13>Nov  2 08:55:19 rpmi: dbus-tools-gui-1.14.10-alt1 sisyphus+327286.5700.14.1 1711487513 installed
<13>Nov  2 08:55:19 rpmi: xprop-1.2.5-alt1 sisyphus+279025.100.1.1 1626354193 installed
<13>Nov  2 08:55:19 rpmi: libXcomposite-0.4.6-alt1 sisyphus+311188.200.1.1 1670233684 installed
<13>Nov  2 08:55:19 rpmi: libXdamage-1.1.6-alt1 sisyphus+311188.300.1.1 1670233713 installed
<13>Nov  2 08:55:19 rpmi: libxcbutil-1:0.4.1-alt1 sisyphus+312057.100.1.1 1671526889 installed
<13>Nov  2 08:55:19 rpmi: libxcbutil-image-0.4.0-alt1 sisyphus+275413.100.1.3 1624505806 installed
<13>Nov  2 08:55:19 rpmi: libxcbutil-cursor-0.1.3-alt2 sisyphus+278274.100.1.2 1626148618 installed
<13>Nov  2 08:55:19 rpmi: libxcbutil-icccm-0.4.1-alt2 sisyphus+278275.100.1.2 1626148617 installed
<13>Nov  2 08:55:19 rpmi: libxcbutil-keysyms-0.4.0-alt1 sisyphus+278187.100.1.1 1626075950 installed
<13>Nov  2 08:55:19 rpmi: libxkbcommon-x11-1.7.0-alt1.1 sisyphus+343672.100.1.1 1711490815 installed
<13>Nov  2 08:55:19 rpmi: rpm-macros-alternatives-0.5.2-alt2 sisyphus+315270.200.2.1 1676457367 installed
<13>Nov  2 08:55:19 rpmi: alternatives-0.5.2-alt2 sisyphus+315270.200.2.1 1676457367 installed
<13>Nov  2 08:55:19 rpmi: ca-certificates-2024.07.01-alt1 sisyphus+351897.100.1.1 1719826350 installed
<13>Nov  2 08:55:19 rpmi: ca-trust-0.2.0-alt1 sisyphus+344843.100.1.1 1712743326 installed
<13>Nov  2 08:55:19 rpmi: p11-kit-trust-1:0.25.5-alt1 sisyphus+352553.100.1.1 1720622586 installed
<13>Nov  2 08:55:20 rpmi: libcrypto3-3.1.7-alt2 sisyphus+359910.100.1.1 1729080696 installed
<13>Nov  2 08:55:20 rpmi: libqt6-core-6.7.2-alt5 sisyphus+361249.300.3.1 1730377963 installed
<13>Nov  2 08:55:20 rpmi: libssl3-3.1.7-alt2 sisyphus+359910.100.1.1 1729080696 installed
<13>Nov  2 08:55:20 rpmi: python3-3.12.7-alt1 sisyphus+358796.100.1.1 1727844713 installed
<13>Nov  2 08:55:20 rpmi: python3-base-3.12.7-alt1 sisyphus+358796.100.1.1 1727844713 installed
<86>Nov  2 08:55:20 groupadd[4062535]: group added to /etc/group: name=_keytab, GID=998
<86>Nov  2 08:55:20 groupadd[4062535]: group added to /etc/gshadow: name=_keytab
<86>Nov  2 08:55:20 groupadd[4062535]: new group: name=_keytab, GID=998
<13>Nov  2 08:55:20 rpmi: libkrb5-1.21.3-alt2 sisyphus+351857.100.1.1 1719735219 installed
<13>Nov  2 08:55:21 rpmi: libkf6archive-6.7.0-alt1 sisyphus+359691.2000.1.2 1728919362 installed
<13>Nov  2 08:55:21 rpmi: libqt6-dbus-6.7.2-alt5 sisyphus+361249.300.3.1 1730377963 installed
<13>Nov  2 08:55:21 rpmi: libkmod-32-alt1 sisyphus+357452.100.2.1 1727718010 installed
<13>Nov  2 08:55:21 rpmi: libcups-2.4.11-alt1 sisyphus+359120.200.2.1 1728202638 installed
<13>Nov  2 08:55:21 rpmi: libqt6-xml-6.7.2-alt5 sisyphus+361249.300.3.1 1730377963 installed
<13>Nov  2 08:55:21 rpmi: systemd-utils-standalone-1:255.13-alt1 sisyphus+359453.100.2.1 1728651220 installed
<13>Nov  2 08:55:21 rpmi: at-spi2-core-2.54.0-alt1 sisyphus+357735.600.3.1 1726642173 installed
<13>Nov  2 08:55:21 rpmi: kmod-32-alt1 sisyphus+357452.100.2.1 1727718010 installed
<13>Nov  2 08:55:21 rpmi: dmsetup-1.02.200-alt1 sisyphus+355869.100.1.1 1724444362 installed
<86>Nov  2 08:55:21 groupadd[4062729]: group added to /etc/group: name=tape, GID=997
<86>Nov  2 08:55:21 groupadd[4062729]: group added to /etc/gshadow: name=tape
<86>Nov  2 08:55:21 groupadd[4062729]: new group: name=tape, GID=997
<86>Nov  2 08:55:21 groupadd[4062743]: group added to /etc/group: name=dialout, GID=996
<86>Nov  2 08:55:21 groupadd[4062743]: group added to /etc/gshadow: name=dialout
<86>Nov  2 08:55:21 groupadd[4062743]: new group: name=dialout, GID=996
<86>Nov  2 08:55:21 groupadd[4062755]: group added to /etc/group: name=input, GID=995
<86>Nov  2 08:55:21 groupadd[4062755]: group added to /etc/gshadow: name=input
<86>Nov  2 08:55:21 groupadd[4062755]: new group: name=input, GID=995
<86>Nov  2 08:55:21 groupadd[4062763]: group added to /etc/group: name=video, GID=994
<86>Nov  2 08:55:21 groupadd[4062763]: group added to /etc/gshadow: name=video
<86>Nov  2 08:55:21 groupadd[4062763]: new group: name=video, GID=994
<86>Nov  2 08:55:21 groupadd[4062769]: group added to /etc/group: name=render, GID=993
<86>Nov  2 08:55:21 groupadd[4062769]: group added to /etc/gshadow: name=render
<86>Nov  2 08:55:21 groupadd[4062769]: new group: name=render, GID=993
<86>Nov  2 08:55:21 groupadd[4062775]: group added to /etc/group: name=sgx, GID=992
<86>Nov  2 08:55:21 groupadd[4062775]: group added to /etc/gshadow: name=sgx
<86>Nov  2 08:55:21 groupadd[4062775]: new group: name=sgx, GID=992
<13>Nov  2 08:55:21 rpmi: udev-1:255.13-alt1 sisyphus+359453.100.2.1 1728651220 installed
<86>Nov  2 08:55:21 groupadd[4063510]: group added to /etc/group: name=colord, GID=991
<86>Nov  2 08:55:21 groupadd[4063510]: new group: name=colord, GID=991
<86>Nov  2 08:55:21 useradd[4063544]: new user: name=colord, UID=998, GID=991, home=/var/colord, shell=/dev/null, from=none
<13>Nov  2 08:55:21 rpmi: colord-1.4.7-alt1.1 sisyphus+338793.100.1.1 1706039037 installed
<13>Nov  2 08:55:22 rpmi: libgtk+3-3.24.43-alt1 sisyphus+352627.100.1.1 1720700753 installed
<13>Nov  2 08:55:22 rpmi: libkf6configcore-6.7.0-alt1 sisyphus+359691.1500.1.2 1728919064 installed
<13>Nov  2 08:55:22 rpmi: kf6-kdoctools-6.7.0-alt1 sisyphus+359691.3300.1.2 1728920342 installed
<13>Nov  2 08:55:22 rpmi: libkf6doctools-6.7.0-alt1 sisyphus+359691.3300.1.2 1728920342 installed
<13>Nov  2 08:55:22 rpmi: libgsasl18-2.2.1-alt2 sisyphus+359713.200.2.1 1728905438 installed
<86>Nov  2 08:55:22 groupadd[4066029]: group added to /etc/group: name=sasl, GID=990
<86>Nov  2 08:55:22 groupadd[4066029]: group added to /etc/gshadow: name=sasl
<86>Nov  2 08:55:22 groupadd[4066029]: new group: name=sasl, GID=990
<13>Nov  2 08:55:22 rpmi: libsasl2-3-2.1.28-alt2 sisyphus+343335.100.1.1 1711112524 installed
<13>Nov  2 08:55:22 rpmi: libldap2-2.6.8-alt1 sisyphus+351621.100.1.1 1719420471 installed
<13>Nov  2 08:55:22 rpmi: python3-module-charset-normalizer-3.2.0-alt1 sisyphus+347396.200.2.1 1714733144 installed
<13>Nov  2 08:55:22 rpmi: python3-module-idna-3.10-alt1 sisyphus+358681.100.1.1 1727701241 installed
<13>Nov  2 08:55:22 rpmi: python3-module-urllib3-2:2.2.3-alt1 sisyphus+357427.100.2.1 1726567364 installed
<13>Nov  2 08:55:22 rpmi: python3-module-requests-2.32.3-alt1 sisyphus+349946.100.1.1 1717059877 installed
<13>Nov  2 08:55:22 rpmi: python3-module-pyxdg-0.28-alt1.2 sisyphus+341065.100.1.1 1708351562 installed
<13>Nov  2 08:55:22 rpmi: python3-module-yaml-6.0.2-alt1 sisyphus+356896.100.1.1 1725541114 installed
<13>Nov  2 08:55:22 rpmi: python3-module-pyudev-0.24.3-alt1 sisyphus+347852.100.1.1 1715497013 installed
<13>Nov  2 08:55:22 rpmi: python3-module-libevdev-0.11-alt1 sisyphus+300877.100.1.1 1653893962 installed
<13>Nov  2 08:55:22 rpmi: libwacom-2.13.0-alt1 sisyphus+356629.100.1.1 1725279203 installed
<13>Nov  2 08:55:22 rpmi: libinput-1.26.2-alt2.1 sisyphus+358480.100.1.1 1727435756 installed
<13>Nov  2 08:55:22 rpmi: libssl-devel-3.1.7-alt2 sisyphus+359910.100.1.1 1729080696 installed
<13>Nov  2 08:55:22 rpmi: libqt6-sql-6.7.2-alt5 sisyphus+361249.300.3.1 1730377963 installed
<13>Nov  2 08:55:22 rpmi: libqt6-concurrent-6.7.2-alt5 sisyphus+361249.300.3.1 1730377963 installed
<13>Nov  2 08:55:22 rpmi: libqt6-test-6.7.2-alt5 sisyphus+361249.300.3.1 1730377963 installed
<13>Nov  2 08:55:22 rpmi: libarchive13-3.7.5-alt2 sisyphus+358189.100.1.1 1727162770 installed
<13>Nov  2 08:55:22 rpmi: libssh2-1.11.0-alt2 sisyphus+339356.100.1.1 1706593140 installed
<13>Nov  2 08:55:22 rpmi: libcurl-8.10.0-alt1 sisyphus+357271.100.1.1 1726044795 installed
<13>Nov  2 08:55:23 rpmi: cmake-3.29.3-alt1 sisyphus+348648.100.2.1 1716590556 installed
<13>Nov  2 08:55:23 rpmi: libproxy-0.5.9-alt1 sisyphus+360721.100.1.1 1729865347 installed
<13>Nov  2 08:55:23 rpmi: libqt6-network-6.7.2-alt5 sisyphus+361249.300.3.1 1730377963 installed
<13>Nov  2 08:55:23 rpmi: libqt6-opengl-6.7.2-alt5 sisyphus+361249.300.3.1 1730377963 installed
<13>Nov  2 08:55:23 rpmi: libqt6-eglfsdeviceintegration-6.7.2-alt5 sisyphus+361249.300.3.1 1730377963 installed
<13>Nov  2 08:55:23 rpmi: libqt6-xcbqpa-6.7.2-alt5 sisyphus+361249.300.3.1 1730377963 installed
<13>Nov  2 08:55:23 rpmi: libqt6-eglfskmssupport-6.7.2-alt5 sisyphus+361249.300.3.1 1730377963 installed
<13>Nov  2 08:55:23 rpmi: libqt6-eglfskmsgbmsupport-6.7.2-alt5 sisyphus+361249.300.3.1 1730377963 installed
<13>Nov  2 08:55:23 rpmi: libqt6-gui-6.7.2-alt5 sisyphus+361249.300.3.1 1730377963 installed
<13>Nov  2 08:55:23 rpmi: libqt6-qml-6.7.2-alt1 sisyphus+359329.100.1.1 1728468660 installed
<13>Nov  2 08:55:23 rpmi: libqt6-widgets-6.7.2-alt5 sisyphus+361249.300.3.1 1730377963 installed
<13>Nov  2 08:55:23 rpmi: libqt6-printsupport-6.7.2-alt5 sisyphus+361249.300.3.1 1730377963 installed
<13>Nov  2 08:55:23 rpmi: libqt6-openglwidgets-6.7.2-alt5 sisyphus+361249.300.3.1 1730377963 installed
<13>Nov  2 08:55:24 rpmi: qt6-base-devel-6.7.2-alt5 sisyphus+361249.300.3.1 1730377963 installed
<13>Nov  2 08:55:24 rpmi: libqt6-qmlmodels-6.7.2-alt1 sisyphus+359329.100.1.1 1728468660 installed
<13>Nov  2 08:55:24 rpmi: libqt6-labsqmlmodels-6.7.2-alt1 sisyphus+359329.100.1.1 1728468660 installed
<13>Nov  2 08:55:24 rpmi: libqt6-quick-6.7.2-alt1 sisyphus+359329.100.1.1 1728468660 installed
<13>Nov  2 08:55:24 rpmi: libkf6coreaddons-6.7.0-alt1 sisyphus+359691.2200.1.2 1728919539 installed
<13>Nov  2 08:55:24 rpmi: libkf6i18n-6.7.0-alt1 sisyphus+359691.3100.1.2 1728920165 installed
<13>Nov  2 08:55:24 rpmi: libkf6i18nlocaledata-6.7.0-alt1 sisyphus+359691.3100.1.2 1728920165 installed
<13>Nov  2 08:55:24 rpmi: libkf6configgui-6.7.0-alt1 sisyphus+359691.1500.1.2 1728919064 installed
<13>Nov  2 08:55:24 rpmi: libkf6configqml-6.7.0-alt1 sisyphus+359691.1500.1.2 1728919064 installed
<13>Nov  2 08:55:24 rpmi: openssh-common-9.6p1-alt2 sisyphus+351911.100.1.1 1719838551 installed
<86>Nov  2 08:55:24 groupadd[4072561]: group added to /etc/group: name=sshagent, GID=989
<86>Nov  2 08:55:24 groupadd[4072561]: group added to /etc/gshadow: name=sshagent
<86>Nov  2 08:55:24 groupadd[4072561]: new group: name=sshagent, GID=989
<13>Nov  2 08:55:24 rpmi: openssh-clients-9.6p1-alt2 sisyphus+351911.100.1.1 1719838551 installed
<13>Nov  2 08:55:24 rpmi: rsync-3.2.7-alt1 sisyphus+325006.2000.1.1 1689498390 installed
<13>Nov  2 08:55:25 rpmi: git-core-2.42.2-alt1 sisyphus+348068.100.1.1 1715721643 installed
<13>Nov  2 08:55:25 rpmi: extra-cmake-modules-6.7.0-alt2 sisyphus+360099.100.1.1 1729243654 installed
<13>Nov  2 08:55:25 rpmi: kf6-kconfig-devel-6.7.0-alt1 sisyphus+359691.1500.1.2 1728919064 installed
<13>Nov  2 08:55:25 rpmi: kf6-ki18n-devel-6.7.0-alt1 sisyphus+359691.3100.1.2 1728920165 installed
<13>Nov  2 08:55:25 rpmi: kf6-kcoreaddons-devel-6.7.0-alt1 sisyphus+359691.2200.1.2 1728919539 installed
<13>Nov  2 08:55:25 rpmi: kf6-kdoctools-devel-6.7.0-alt1 sisyphus+359691.3300.1.2 1728920342 installed
<13>Nov  2 08:55:25 rpmi: kf6-karchive-devel-6.7.0-alt1 sisyphus+359691.2000.1.2 1728919362 installed
Building target platforms: i586
Building for target i586
Wrote: /usr/src/in/nosrpm/kf6-kpackage-6.7.0-alt1.nosrc.rpm (w1.gzdio)
Installing kf6-kpackage-6.7.0-alt1.src.rpm
Building target platforms: i586
Building for target i586
Executing(%prep): /bin/sh -e /usr/src/tmp/rpm-tmp.36964
+ umask 022
+ /bin/mkdir -p /usr/src/RPM/BUILD
+ cd /usr/src/RPM/BUILD
+ cd /usr/src/RPM/BUILD
+ rm -rf kpackage-6.7.0
+ echo 'Source #0 (kpackage-6.7.0.tar):'
Source #0 (kpackage-6.7.0.tar):
+ /bin/tar -xf /usr/src/RPM/SOURCES/kpackage-6.7.0.tar
+ cd kpackage-6.7.0
+ /bin/chmod -c -Rf u+rwX,go-w .
+ exit 0
Executing(%build): /bin/sh -e /usr/src/tmp/rpm-tmp.36964
+ umask 022
+ /bin/mkdir -p /usr/src/RPM/BUILD
+ cd /usr/src/RPM/BUILD
+ cd kpackage-6.7.0
+ __kf6_build
+ mkdir -p BUILD
+ __kf6_cmake
+ export LC_ALL=C.UTF-8
+ LC_ALL=C.UTF-8
+ export PATH=/usr/lib/kf6/bin:/usr/src/bin:/usr/bin:/bin:/usr/local/bin:/usr/games
+ PATH=/usr/lib/kf6/bin:/usr/src/bin:/usr/bin:/bin:/usr/local/bin:/usr/games
+ export QTDIR=/usr/share/qt6
+ QTDIR=/usr/share/qt6
+ export 'CFLAGS=-pipe -frecord-gcc-switches -Wall -g -O2 -flto=auto -march=i586 -mtune=generic'
+ CFLAGS='-pipe -frecord-gcc-switches -Wall -g -O2 -flto=auto -march=i586 -mtune=generic'
+ export 'CXXFLAGS=-pipe -frecord-gcc-switches -Wall -g -O2 -flto=auto -march=i586 -mtune=generic'
+ CXXFLAGS='-pipe -frecord-gcc-switches -Wall -g -O2 -flto=auto -march=i586 -mtune=generic'
+ pushd BUILD
~/RPM/BUILD/kpackage-6.7.0/BUILD ~/RPM/BUILD/kpackage-6.7.0
+ cmake .. -DCMAKE_USE_RELATIVE_PATHS:BOOL=ON -DCMAKE_VERBOSE_MAKEFILE:BOOL=ON -DCMAKE_SKIP_RPATH:BOOL=ON -DBUILD_TESTING:BOOL=FALSE -DKDE_INSTALL_USE_QT_SYS_PATHS:BOOL=ON -DCMAKE_BUILD_TYPE=Release '-DCMAKE_EXE_LINKER_FLAGS:STRING=-L/usr/lib -L/usr/lib/kf6/devel' '-DCMAKE_MODULE_LINKER_FLAGS:STRING=-L/usr/lib -L/usr/lib/kf6/devel' '-DCMAKE_SHARED_LINKER_FLAGS:STRING=-L/usr/lib -L/usr/lib/kf6/devel' '-DCMAKE_LIBRARY_PATH=/usr/lib/kf6/devel;/usr/lib;/lib' '-DCMAKE_INCLUDE_PATH=/usr/include/KF6;/usr/include' -DCMAKE_INSTALL_PREFIX=/usr -DCMAKE_PREFIX_PATH=/usr -DCMAKE_INSTALL_BINDIR=/usr/lib/kf6/bin -DCMAKE_INSTALL_FULL_BINDIR=/usr/lib/kf6/bin -DBIN_INSTALL_DIR:PATH=/usr/lib/kf6/bin -DCMAKE_INSTALL_SBINDIR=/usr/lib/kf6/sbin -DCMAKE_INSTALL_FULL_SBINDIR=/usr/lib/kf6/sbin -DSBIN_INSTALL_DIR:PATH=/usr/lib/kf6/sbin -DLIBEXEC_INSTALL_DIR:PATH=/usr/libexec -DKDE_INSTALL_LIBEXECDIR:PATH=/usr/libexec -DINCLUDE_INSTALL_DIR:PATH=/usr/include -DCMAKE_INSTALL_INCLUDEDIR_KF6=/usr/include/KF6 -DDATA_INSTALL_DIR:PATH=/usr/share -DCONFIG_INSTALL_DIR:PATH=/etc/kf6/xdg -DSERVICES_INSTALL_DIR:PATH=/usr/share/kservices6 -DSERVICETYPES_INSTALL_DIR:PATH=/usr/share/kservicetypes6 -DKNOTIFYRC_INSTALL_DIR:PATH=/usr/share/knotifications6 -DKXMLGUI_INSTALL_DIR:PATH=/usr/share/kxmlgui6 -DLIB_INSTALL_DIR:PATH=/usr/lib -DLIB_DESTINATION=lib -DLIB_SUFFIX= -DSYSCONF_INSTALL_DIR:PATH=/etc -DAUTOSTART_INSTALL_DIR=/etc/kf6/xdg/autostart -DHTML_INSTALL_DIR=/usr/share/kf6/doc/HTML -DICON_INSTALL_DIR=/usr/share/kf6/icons -DXDG_MIME_INSTALL_DIR=/usr/share/mime/packages -DXDG_APPS_INSTALL_DIR=/usr/share/kf6/applications -DECM_MKSPECS_INSTALL_DIR:PATH=/usr/lib/qt6/mkspecs/modules -DKCFG_INSTALL_DIR:PATH=/usr/share/kf6/config.kcfg -DPLUGIN_INSTALL_DIR:PATH=/usr/lib/qt6/plugins -DQT_PLUGIN_INSTALL_DIR:PATH=/usr/lib/qt6/plugins -DQML_INSTALL_DIR:PATH=/usr/lib/qt6/qml -DIMPORTS_INSTALL_DIR:PATH=/usr/lib/qt6/imports -DDBUS_INTERFACES_INSTALL_DIR=/usr/share/dbus-1/interfaces -DDBUS_SERVICES_INSTALL_DIR=/usr/share/dbus-1/services -DDBUS_SYSTEM_SERVICES_INSTALL_DIR=/usr/share/dbus-1/system-services
-- The C compiler identification is GNU 14.2.1
-- The CXX compiler identification is GNU 14.2.1
-- Detecting C compiler ABI info
-- Detecting C compiler ABI info - done
-- Check for working C compiler: /usr/bin/cc - skipped
-- Detecting C compile features
-- Detecting C compile features - done
-- Detecting CXX compiler ABI info
-- Detecting CXX compiler ABI info - done
-- Check for working CXX compiler: /usr/bin/c++ - skipped
-- Detecting CXX compile features
-- Detecting CXX compile features - done
-- 

-- Performing Test HAVE_STDATOMIC
-- Performing Test HAVE_STDATOMIC - Success
-- Found WrapAtomic: TRUE
-- Looking for __GLIBC__
-- Looking for __GLIBC__ - found
-- Performing Test _OFFT_IS_64BIT
-- Performing Test _OFFT_IS_64BIT - Failed
-- Performing Test HAVE_DATE_TIME
-- Performing Test HAVE_DATE_TIME - Success
-- Found Gettext: /usr/bin/msgmerge (found version "0.21")
-- Performing Test COMPILER_HAS_HIDDEN_VISIBILITY
-- Performing Test COMPILER_HAS_HIDDEN_VISIBILITY - Success
-- Performing Test COMPILER_HAS_HIDDEN_INLINE_VISIBILITY
-- Performing Test COMPILER_HAS_HIDDEN_INLINE_VISIBILITY - Success
-- Performing Test COMPILER_HAS_DEPRECATED_ATTR
-- Performing Test COMPILER_HAS_DEPRECATED_ATTR - Success
-- The following OPTIONAL packages have been found:

 * Qt6DBusTools (required version >= 6.7.2)
 * Qt6DBus (required version >= 6.5.0)
 * Qt6CoreTools (required version >= 6.7.2)
 * KF6DocTools (required version >= 6.7.0), Tools to generate documentation

-- The following REQUIRED packages have been found:

 * ECM (required version >= 6.7.0), Extra CMake Modules., <https://commits.kde.org/extra-cmake-modules>
 * Qt6 (required version >= 6.5.0)
 * KF6Archive (required version >= 6.7.0)
 * Gettext
 * KF6I18n (required version >= 6.7.0)
 * KF6CoreAddons (required version >= 6.7.0)
 * Qt6Core (required version >= 6.5.0)

-- The following features have been disabled:

 * QCH, API documentation in QCH format (for e.g. Qt Assistant, Qt Creator & KDevelop)

-- Configuring done (1.7s)
-- Generating done (0.0s)
CMake Warning:
  Manually-specified variables were not used by the project:

    AUTOSTART_INSTALL_DIR
    BIN_INSTALL_DIR
    CMAKE_INCLUDE_PATH
    CMAKE_INSTALL_INCLUDEDIR_KF6
    CMAKE_LIBRARY_PATH
    CMAKE_USE_RELATIVE_PATHS
    CONFIG_INSTALL_DIR
    DATA_INSTALL_DIR
    DBUS_INTERFACES_INSTALL_DIR
    DBUS_SERVICES_INSTALL_DIR
    DBUS_SYSTEM_SERVICES_INSTALL_DIR
    ECM_MKSPECS_INSTALL_DIR
    HTML_INSTALL_DIR
    ICON_INSTALL_DIR
    IMPORTS_INSTALL_DIR
    INCLUDE_INSTALL_DIR
    KCFG_INSTALL_DIR
    KNOTIFYRC_INSTALL_DIR
    KXMLGUI_INSTALL_DIR
    LIBEXEC_INSTALL_DIR
    LIB_DESTINATION
    LIB_SUFFIX
    PLUGIN_INSTALL_DIR
    QML_INSTALL_DIR
    QT_PLUGIN_INSTALL_DIR
    SBIN_INSTALL_DIR
    SERVICES_INSTALL_DIR
    SERVICETYPES_INSTALL_DIR
    SYSCONF_INSTALL_DIR
    XDG_APPS_INSTALL_DIR
    XDG_MIME_INSTALL_DIR


-- Build files have been written to: /usr/src/RPM/BUILD/kpackage-6.7.0/BUILD
+ popd
~/RPM/BUILD/kpackage-6.7.0
+ __kf6_make
+ pushd BUILD
~/RPM/BUILD/kpackage-6.7.0/BUILD ~/RPM/BUILD/kpackage-6.7.0
+ make -j16
make: Entering directory '/usr/src/RPM/BUILD/kpackage-6.7.0/BUILD'
/usr/bin/cmake -S/usr/src/RPM/BUILD/kpackage-6.7.0 -B/usr/src/RPM/BUILD/kpackage-6.7.0/BUILD --check-build-system CMakeFiles/Makefile.cmake 0
make: Leaving directory '/usr/src/RPM/BUILD/kpackage-6.7.0/BUILD'
make: Entering directory '/usr/src/RPM/BUILD/kpackage-6.7.0/BUILD'
/usr/bin/cmake -E cmake_progress_start /usr/src/RPM/BUILD/kpackage-6.7.0/BUILD/CMakeFiles /usr/src/RPM/BUILD/kpackage-6.7.0/BUILD//CMakeFiles/progress.marks
make: Leaving directory '/usr/src/RPM/BUILD/kpackage-6.7.0/BUILD'
make  -f CMakeFiles/Makefile2 all
make  -f CMakeFiles/pofiles-ed088cc3b180440eebf06fe1c22e644e.dir/build.make CMakeFiles/pofiles-ed088cc3b180440eebf06fe1c22e644e.dir/depend
make  -f CMakeFiles/tsfiles-ed088cc3b180440eebf06fe1c22e644e.dir/build.make CMakeFiles/tsfiles-ed088cc3b180440eebf06fe1c22e644e.dir/depend
make  -f CMakeFiles/po-ca-docs-kpackagetool-kpackagetool6-1.dir/build.make CMakeFiles/po-ca-docs-kpackagetool-kpackagetool6-1.dir/depend
make  -f CMakeFiles/po-es-docs-kpackagetool-kpackagetool6-1.dir/build.make CMakeFiles/po-es-docs-kpackagetool-kpackagetool6-1.dir/depend
make  -f CMakeFiles/po-fr-docs-kpackagetool-kpackagetool6-1.dir/build.make CMakeFiles/po-fr-docs-kpackagetool-kpackagetool6-1.dir/depend
make  -f CMakeFiles/po-it-docs-kpackagetool-kpackagetool6-1.dir/build.make CMakeFiles/po-it-docs-kpackagetool-kpackagetool6-1.dir/depend
make  -f CMakeFiles/po-nl-docs-kpackagetool-kpackagetool6-1.dir/build.make CMakeFiles/po-nl-docs-kpackagetool-kpackagetool6-1.dir/depend
make  -f CMakeFiles/po-pt-BR-docs-kpackagetool-kpackagetool6-1.dir/build.make CMakeFiles/po-pt-BR-docs-kpackagetool-kpackagetool6-1.dir/depend
make  -f CMakeFiles/po-sl-docs-kpackagetool-kpackagetool6-1.dir/build.make CMakeFiles/po-sl-docs-kpackagetool-kpackagetool6-1.dir/depend
make  -f CMakeFiles/po-tr-docs-kpackagetool-kpackagetool6-1.dir/build.make CMakeFiles/po-tr-docs-kpackagetool-kpackagetool6-1.dir/depend
make  -f CMakeFiles/po-uk-docs-kpackagetool-kpackagetool6-1.dir/build.make CMakeFiles/po-uk-docs-kpackagetool-kpackagetool6-1.dir/depend
make  -f docs/kpackagetool/CMakeFiles/docs-kpackagetool-kpackagetool6-1.dir/build.make docs/kpackagetool/CMakeFiles/docs-kpackagetool-kpackagetool6-1.dir/depend
make  -f src/kpackage/CMakeFiles/KF6Package_autogen_timestamp_deps.dir/build.make src/kpackage/CMakeFiles/KF6Package_autogen_timestamp_deps.dir/depend
make[2]: Entering directory '/usr/src/RPM/BUILD/kpackage-6.7.0/BUILD'
cd /usr/src/RPM/BUILD/kpackage-6.7.0/BUILD && /usr/bin/cmake -E cmake_depends "Unix Makefiles" /usr/src/RPM/BUILD/kpackage-6.7.0 /usr/src/RPM/BUILD/kpackage-6.7.0 /usr/src/RPM/BUILD/kpackage-6.7.0/BUILD /usr/src/RPM/BUILD/kpackage-6.7.0/BUILD /usr/src/RPM/BUILD/kpackage-6.7.0/BUILD/CMakeFiles/pofiles-ed088cc3b180440eebf06fe1c22e644e.dir/DependInfo.cmake "--color="
make[2]: Leaving directory '/usr/src/RPM/BUILD/kpackage-6.7.0/BUILD'
make  -f CMakeFiles/pofiles-ed088cc3b180440eebf06fe1c22e644e.dir/build.make CMakeFiles/pofiles-ed088cc3b180440eebf06fe1c22e644e.dir/build
make[2]: Entering directory '/usr/src/RPM/BUILD/kpackage-6.7.0/BUILD'
cd /usr/src/RPM/BUILD/kpackage-6.7.0/BUILD && /usr/bin/cmake -E cmake_depends "Unix Makefiles" /usr/src/RPM/BUILD/kpackage-6.7.0 /usr/src/RPM/BUILD/kpackage-6.7.0 /usr/src/RPM/BUILD/kpackage-6.7.0/BUILD /usr/src/RPM/BUILD/kpackage-6.7.0/BUILD /usr/src/RPM/BUILD/kpackage-6.7.0/BUILD/CMakeFiles/tsfiles-ed088cc3b180440eebf06fe1c22e644e.dir/DependInfo.cmake "--color="
make[2]: Leaving directory '/usr/src/RPM/BUILD/kpackage-6.7.0/BUILD'
make  -f CMakeFiles/tsfiles-ed088cc3b180440eebf06fe1c22e644e.dir/build.make CMakeFiles/tsfiles-ed088cc3b180440eebf06fe1c22e644e.dir/build
make[2]: Entering directory '/usr/src/RPM/BUILD/kpackage-6.7.0/BUILD'
cd /usr/src/RPM/BUILD/kpackage-6.7.0/BUILD && /usr/bin/cmake -E cmake_depends "Unix Makefiles" /usr/src/RPM/BUILD/kpackage-6.7.0 /usr/src/RPM/BUILD/kpackage-6.7.0 /usr/src/RPM/BUILD/kpackage-6.7.0/BUILD /usr/src/RPM/BUILD/kpackage-6.7.0/BUILD /usr/src/RPM/BUILD/kpackage-6.7.0/BUILD/CMakeFiles/po-es-docs-kpackagetool-kpackagetool6-1.dir/DependInfo.cmake "--color="
make[2]: Leaving directory '/usr/src/RPM/BUILD/kpackage-6.7.0/BUILD'
make[2]: Entering directory '/usr/src/RPM/BUILD/kpackage-6.7.0/BUILD'
cd /usr/src/RPM/BUILD/kpackage-6.7.0/BUILD && /usr/bin/cmake -E cmake_depends "Unix Makefiles" /usr/src/RPM/BUILD/kpackage-6.7.0 /usr/src/RPM/BUILD/kpackage-6.7.0/docs/kpackagetool /usr/src/RPM/BUILD/kpackage-6.7.0/BUILD /usr/src/RPM/BUILD/kpackage-6.7.0/BUILD/docs/kpackagetool /usr/src/RPM/BUILD/kpackage-6.7.0/BUILD/docs/kpackagetool/CMakeFiles/docs-kpackagetool-kpackagetool6-1.dir/DependInfo.cmake "--color="
make[2]: Leaving directory '/usr/src/RPM/BUILD/kpackage-6.7.0/BUILD'
make[2]: Entering directory '/usr/src/RPM/BUILD/kpackage-6.7.0/BUILD'
cd /usr/src/RPM/BUILD/kpackage-6.7.0/BUILD && /usr/bin/cmake -E cmake_depends "Unix Makefiles" /usr/src/RPM/BUILD/kpackage-6.7.0 /usr/src/RPM/BUILD/kpackage-6.7.0 /usr/src/RPM/BUILD/kpackage-6.7.0/BUILD /usr/src/RPM/BUILD/kpackage-6.7.0/BUILD /usr/src/RPM/BUILD/kpackage-6.7.0/BUILD/CMakeFiles/po-fr-docs-kpackagetool-kpackagetool6-1.dir/DependInfo.cmake "--color="
make[2]: Leaving directory '/usr/src/RPM/BUILD/kpackage-6.7.0/BUILD'
make  -f CMakeFiles/po-es-docs-kpackagetool-kpackagetool6-1.dir/build.make CMakeFiles/po-es-docs-kpackagetool-kpackagetool6-1.dir/build
make[2]: Entering directory '/usr/src/RPM/BUILD/kpackage-6.7.0/BUILD'
cd /usr/src/RPM/BUILD/kpackage-6.7.0/BUILD && /usr/bin/cmake -E cmake_depends "Unix Makefiles" /usr/src/RPM/BUILD/kpackage-6.7.0 /usr/src/RPM/BUILD/kpackage-6.7.0 /usr/src/RPM/BUILD/kpackage-6.7.0/BUILD /usr/src/RPM/BUILD/kpackage-6.7.0/BUILD /usr/src/RPM/BUILD/kpackage-6.7.0/BUILD/CMakeFiles/po-ca-docs-kpackagetool-kpackagetool6-1.dir/DependInfo.cmake "--color="
make[2]: Leaving directory '/usr/src/RPM/BUILD/kpackage-6.7.0/BUILD'
make  -f docs/kpackagetool/CMakeFiles/docs-kpackagetool-kpackagetool6-1.dir/build.make docs/kpackagetool/CMakeFiles/docs-kpackagetool-kpackagetool6-1.dir/build
make  -f CMakeFiles/po-ca-docs-kpackagetool-kpackagetool6-1.dir/build.make CMakeFiles/po-ca-docs-kpackagetool-kpackagetool6-1.dir/build
make[2]: Entering directory '/usr/src/RPM/BUILD/kpackage-6.7.0/BUILD'
cd /usr/src/RPM/BUILD/kpackage-6.7.0/BUILD && /usr/bin/cmake -E cmake_depends "Unix Makefiles" /usr/src/RPM/BUILD/kpackage-6.7.0 /usr/src/RPM/BUILD/kpackage-6.7.0 /usr/src/RPM/BUILD/kpackage-6.7.0/BUILD /usr/src/RPM/BUILD/kpackage-6.7.0/BUILD /usr/src/RPM/BUILD/kpackage-6.7.0/BUILD/CMakeFiles/po-it-docs-kpackagetool-kpackagetool6-1.dir/DependInfo.cmake "--color="
make[2]: Leaving directory '/usr/src/RPM/BUILD/kpackage-6.7.0/BUILD'
make[2]: Entering directory '/usr/src/RPM/BUILD/kpackage-6.7.0/BUILD'
cd /usr/src/RPM/BUILD/kpackage-6.7.0/BUILD && /usr/bin/cmake -E cmake_depends "Unix Makefiles" /usr/src/RPM/BUILD/kpackage-6.7.0 /usr/src/RPM/BUILD/kpackage-6.7.0 /usr/src/RPM/BUILD/kpackage-6.7.0/BUILD /usr/src/RPM/BUILD/kpackage-6.7.0/BUILD /usr/src/RPM/BUILD/kpackage-6.7.0/BUILD/CMakeFiles/po-nl-docs-kpackagetool-kpackagetool6-1.dir/DependInfo.cmake "--color="
make[2]: Leaving directory '/usr/src/RPM/BUILD/kpackage-6.7.0/BUILD'
make  -f CMakeFiles/po-fr-docs-kpackagetool-kpackagetool6-1.dir/build.make CMakeFiles/po-fr-docs-kpackagetool-kpackagetool6-1.dir/build
make[2]: Entering directory '/usr/src/RPM/BUILD/kpackage-6.7.0/BUILD'
cd /usr/src/RPM/BUILD/kpackage-6.7.0/BUILD && /usr/bin/cmake -E cmake_depends "Unix Makefiles" /usr/src/RPM/BUILD/kpackage-6.7.0 /usr/src/RPM/BUILD/kpackage-6.7.0 /usr/src/RPM/BUILD/kpackage-6.7.0/BUILD /usr/src/RPM/BUILD/kpackage-6.7.0/BUILD /usr/src/RPM/BUILD/kpackage-6.7.0/BUILD/CMakeFiles/po-pt-BR-docs-kpackagetool-kpackagetool6-1.dir/DependInfo.cmake "--color="
make[2]: Leaving directory '/usr/src/RPM/BUILD/kpackage-6.7.0/BUILD'
make  -f CMakeFiles/po-it-docs-kpackagetool-kpackagetool6-1.dir/build.make CMakeFiles/po-it-docs-kpackagetool-kpackagetool6-1.dir/build
make  -f CMakeFiles/po-nl-docs-kpackagetool-kpackagetool6-1.dir/build.make CMakeFiles/po-nl-docs-kpackagetool-kpackagetool6-1.dir/build
make[2]: Entering directory '/usr/src/RPM/BUILD/kpackage-6.7.0/BUILD'
cd /usr/src/RPM/BUILD/kpackage-6.7.0/BUILD && /usr/bin/cmake -E cmake_depends "Unix Makefiles" /usr/src/RPM/BUILD/kpackage-6.7.0 /usr/src/RPM/BUILD/kpackage-6.7.0 /usr/src/RPM/BUILD/kpackage-6.7.0/BUILD /usr/src/RPM/BUILD/kpackage-6.7.0/BUILD /usr/src/RPM/BUILD/kpackage-6.7.0/BUILD/CMakeFiles/po-sl-docs-kpackagetool-kpackagetool6-1.dir/DependInfo.cmake "--color="
make[2]: Leaving directory '/usr/src/RPM/BUILD/kpackage-6.7.0/BUILD'
make  -f CMakeFiles/po-pt-BR-docs-kpackagetool-kpackagetool6-1.dir/build.make CMakeFiles/po-pt-BR-docs-kpackagetool-kpackagetool6-1.dir/build
make  -f CMakeFiles/po-sl-docs-kpackagetool-kpackagetool6-1.dir/build.make CMakeFiles/po-sl-docs-kpackagetool-kpackagetool6-1.dir/build
make[2]: Entering directory '/usr/src/RPM/BUILD/kpackage-6.7.0/BUILD'
cd /usr/src/RPM/BUILD/kpackage-6.7.0/BUILD && /usr/bin/cmake -E cmake_depends "Unix Makefiles" /usr/src/RPM/BUILD/kpackage-6.7.0 /usr/src/RPM/BUILD/kpackage-6.7.0 /usr/src/RPM/BUILD/kpackage-6.7.0/BUILD /usr/src/RPM/BUILD/kpackage-6.7.0/BUILD /usr/src/RPM/BUILD/kpackage-6.7.0/BUILD/CMakeFiles/po-uk-docs-kpackagetool-kpackagetool6-1.dir/DependInfo.cmake "--color="
make[2]: Leaving directory '/usr/src/RPM/BUILD/kpackage-6.7.0/BUILD'
make[2]: Entering directory '/usr/src/RPM/BUILD/kpackage-6.7.0/BUILD'
cd /usr/src/RPM/BUILD/kpackage-6.7.0/BUILD && /usr/bin/cmake -E cmake_depends "Unix Makefiles" /usr/src/RPM/BUILD/kpackage-6.7.0 /usr/src/RPM/BUILD/kpackage-6.7.0 /usr/src/RPM/BUILD/kpackage-6.7.0/BUILD /usr/src/RPM/BUILD/kpackage-6.7.0/BUILD /usr/src/RPM/BUILD/kpackage-6.7.0/BUILD/CMakeFiles/po-tr-docs-kpackagetool-kpackagetool6-1.dir/DependInfo.cmake "--color="
make[2]: Leaving directory '/usr/src/RPM/BUILD/kpackage-6.7.0/BUILD'
make[2]: Entering directory '/usr/src/RPM/BUILD/kpackage-6.7.0/BUILD'
cd /usr/src/RPM/BUILD/kpackage-6.7.0/BUILD && /usr/bin/cmake -E cmake_depends "Unix Makefiles" /usr/src/RPM/BUILD/kpackage-6.7.0 /usr/src/RPM/BUILD/kpackage-6.7.0/src/kpackage /usr/src/RPM/BUILD/kpackage-6.7.0/BUILD /usr/src/RPM/BUILD/kpackage-6.7.0/BUILD/src/kpackage /usr/src/RPM/BUILD/kpackage-6.7.0/BUILD/src/kpackage/CMakeFiles/KF6Package_autogen_timestamp_deps.dir/DependInfo.cmake "--color="
make[2]: Leaving directory '/usr/src/RPM/BUILD/kpackage-6.7.0/BUILD'
make  -f CMakeFiles/po-tr-docs-kpackagetool-kpackagetool6-1.dir/build.make CMakeFiles/po-tr-docs-kpackagetool-kpackagetool6-1.dir/build
make  -f CMakeFiles/po-uk-docs-kpackagetool-kpackagetool6-1.dir/build.make CMakeFiles/po-uk-docs-kpackagetool-kpackagetool6-1.dir/build
make  -f src/kpackage/CMakeFiles/KF6Package_autogen_timestamp_deps.dir/build.make src/kpackage/CMakeFiles/KF6Package_autogen_timestamp_deps.dir/build
make[2]: Nothing to be done for 'src/kpackage/CMakeFiles/KF6Package_autogen_timestamp_deps.dir/build'.
make[1]: Entering directory '/usr/src/RPM/BUILD/kpackage-6.7.0/BUILD'
[ 20%] Built target KF6Package_autogen_timestamp_deps
make[1]: Leaving directory '/usr/src/RPM/BUILD/kpackage-6.7.0/BUILD'
make  -f src/kpackage/CMakeFiles/KF6Package_autogen.dir/build.make src/kpackage/CMakeFiles/KF6Package_autogen.dir/depend
make[2]: Entering directory '/usr/src/RPM/BUILD/kpackage-6.7.0/BUILD'
cd /usr/src/RPM/BUILD/kpackage-6.7.0/BUILD && /usr/bin/cmake -E cmake_depends "Unix Makefiles" /usr/src/RPM/BUILD/kpackage-6.7.0 /usr/src/RPM/BUILD/kpackage-6.7.0/src/kpackage /usr/src/RPM/BUILD/kpackage-6.7.0/BUILD /usr/src/RPM/BUILD/kpackage-6.7.0/BUILD/src/kpackage /usr/src/RPM/BUILD/kpackage-6.7.0/BUILD/src/kpackage/CMakeFiles/KF6Package_autogen.dir/DependInfo.cmake "--color="
make[2]: Leaving directory '/usr/src/RPM/BUILD/kpackage-6.7.0/BUILD'
make  -f src/kpackage/CMakeFiles/KF6Package_autogen.dir/build.make src/kpackage/CMakeFiles/KF6Package_autogen.dir/build
make[2]: Entering directory '/usr/src/RPM/BUILD/kpackage-6.7.0/BUILD'
[  3%] Generating ts...
/usr/bin/cmake -DPython3_EXECUTABLE=/usr/bin/python3 -D_ki18n_pmap_compile_script=/usr/lib/cmake/KF6I18n/ts-pmap-compile.py -DCOPY_TO=/usr/src/RPM/BUILD/kpackage-6.7.0/BUILD/locale -DPO_DIR=/usr/src/RPM/BUILD/kpackage-6.7.0/po -P /usr/lib/cmake/KF6I18n/build-tsfiles.cmake
make[2]: Leaving directory '/usr/src/RPM/BUILD/kpackage-6.7.0/BUILD'
make[1]: Entering directory '/usr/src/RPM/BUILD/kpackage-6.7.0/BUILD'
[ 43%] Built target tsfiles-ed088cc3b180440eebf06fe1c22e644e
make[1]: Leaving directory '/usr/src/RPM/BUILD/kpackage-6.7.0/BUILD'
make[2]: Entering directory '/usr/src/RPM/BUILD/kpackage-6.7.0/BUILD'
[  6%] Generating mo...
/usr/bin/cmake -DGETTEXT_MSGFMT_EXECUTABLE=/usr/bin/msgfmt -DCOPY_TO=/usr/src/RPM/BUILD/kpackage-6.7.0/BUILD/locale -DPO_DIR=/usr/src/RPM/BUILD/kpackage-6.7.0/po -P /usr/lib/cmake/KF6I18n/build-pofiles.cmake
make[2]: Leaving directory '/usr/src/RPM/BUILD/kpackage-6.7.0/BUILD'
make[1]: Entering directory '/usr/src/RPM/BUILD/kpackage-6.7.0/BUILD'
[ 43%] Built target pofiles-ed088cc3b180440eebf06fe1c22e644e
make[1]: Leaving directory '/usr/src/RPM/BUILD/kpackage-6.7.0/BUILD'
make[2]: Entering directory '/usr/src/RPM/BUILD/kpackage-6.7.0/BUILD'
[ 20%] Generating po/fr/docs/kpackagetool/kpackagetool6.1
cd /usr/src/RPM/BUILD/kpackage-6.7.0/BUILD/po/fr/docs/kpackagetool && /usr/lib/kf6/bin/meinproc6 --stylesheet /usr/share/kf6/kdoctools/customization/kde-include-man.xsl --check /usr/src/RPM/BUILD/kpackage-6.7.0/po/fr/docs/kpackagetool/man-kpackagetool6.1.docbook
Note: Writing kpackagetool6.1
make[2]: Leaving directory '/usr/src/RPM/BUILD/kpackage-6.7.0/BUILD'
make[2]: Entering directory '/usr/src/RPM/BUILD/kpackage-6.7.0/BUILD'
[ 10%] Generating po/es/docs/kpackagetool/kpackagetool6.1
cd /usr/src/RPM/BUILD/kpackage-6.7.0/BUILD/po/es/docs/kpackagetool && /usr/lib/kf6/bin/meinproc6 --stylesheet /usr/share/kf6/kdoctools/customization/kde-include-man.xsl --check /usr/src/RPM/BUILD/kpackage-6.7.0/po/es/docs/kpackagetool/man-kpackagetool6.1.docbook
Note: Writing kpackagetool6.1
make[2]: Leaving directory '/usr/src/RPM/BUILD/kpackage-6.7.0/BUILD'
make[1]: Entering directory '/usr/src/RPM/BUILD/kpackage-6.7.0/BUILD'
[ 43%] Built target po-fr-docs-kpackagetool-kpackagetool6-1
make[1]: Leaving directory '/usr/src/RPM/BUILD/kpackage-6.7.0/BUILD'
make[2]: Entering directory '/usr/src/RPM/BUILD/kpackage-6.7.0/BUILD'
[ 20%] Generating kpackagetool6.1
cd /usr/src/RPM/BUILD/kpackage-6.7.0/BUILD/docs/kpackagetool && /usr/lib/kf6/bin/meinproc6 --stylesheet /usr/share/kf6/kdoctools/customization/kde-include-man.xsl --check /usr/src/RPM/BUILD/kpackage-6.7.0/docs/kpackagetool/man-kpackagetool6.1.docbook
Note: Writing kpackagetool6.1
make[2]: Leaving directory '/usr/src/RPM/BUILD/kpackage-6.7.0/BUILD'
make[1]: Entering directory '/usr/src/RPM/BUILD/kpackage-6.7.0/BUILD'
[ 43%] Built target po-es-docs-kpackagetool-kpackagetool6-1
make[1]: Leaving directory '/usr/src/RPM/BUILD/kpackage-6.7.0/BUILD'
make[2]: Entering directory '/usr/src/RPM/BUILD/kpackage-6.7.0/BUILD'
[ 30%] Generating po/nl/docs/kpackagetool/kpackagetool6.1
cd /usr/src/RPM/BUILD/kpackage-6.7.0/BUILD/po/nl/docs/kpackagetool && /usr/lib/kf6/bin/meinproc6 --stylesheet /usr/share/kf6/kdoctools/customization/kde-include-man.xsl --check /usr/src/RPM/BUILD/kpackage-6.7.0/po/nl/docs/kpackagetool/man-kpackagetool6.1.docbook
Note: Writing kpackagetool6.1
make[2]: Leaving directory '/usr/src/RPM/BUILD/kpackage-6.7.0/BUILD'
make[1]: Entering directory '/usr/src/RPM/BUILD/kpackage-6.7.0/BUILD'
[ 43%] Built target docs-kpackagetool-kpackagetool6-1
make[1]: Leaving directory '/usr/src/RPM/BUILD/kpackage-6.7.0/BUILD'
make[2]: Entering directory '/usr/src/RPM/BUILD/kpackage-6.7.0/BUILD'
[ 26%] Generating po/sl/docs/kpackagetool/kpackagetool6.1
cd /usr/src/RPM/BUILD/kpackage-6.7.0/BUILD/po/sl/docs/kpackagetool && /usr/lib/kf6/bin/meinproc6 --stylesheet /usr/share/kf6/kdoctools/customization/kde-include-man.xsl --check /usr/src/RPM/BUILD/kpackage-6.7.0/po/sl/docs/kpackagetool/man-kpackagetool6.1.docbook
Warn: meta author : no refentry/info/author                        kpackagetool6
Note: meta author : see http://docbook.sf.net/el/author            kpackagetool6
Warn: meta author : no author data, so inserted a fixme            kpackagetool6
Note: Writing kpackagetool6.1
make[2]: Leaving directory '/usr/src/RPM/BUILD/kpackage-6.7.0/BUILD'
make[2]: Entering directory '/usr/src/RPM/BUILD/kpackage-6.7.0/BUILD'
[ 20%] Generating po/ca/docs/kpackagetool/kpackagetool6.1
cd /usr/src/RPM/BUILD/kpackage-6.7.0/BUILD/po/ca/docs/kpackagetool && /usr/lib/kf6/bin/meinproc6 --stylesheet /usr/share/kf6/kdoctools/customization/kde-include-man.xsl --check /usr/src/RPM/BUILD/kpackage-6.7.0/po/ca/docs/kpackagetool/man-kpackagetool6.1.docbook
Note: Writing kpackagetool6.1
make[2]: Leaving directory '/usr/src/RPM/BUILD/kpackage-6.7.0/BUILD'
make[2]: Entering directory '/usr/src/RPM/BUILD/kpackage-6.7.0/BUILD'
[ 40%] Generating po/tr/docs/kpackagetool/kpackagetool6.1
cd /usr/src/RPM/BUILD/kpackage-6.7.0/BUILD/po/tr/docs/kpackagetool && /usr/lib/kf6/bin/meinproc6 --stylesheet /usr/share/kf6/kdoctools/customization/kde-include-man.xsl --check /usr/src/RPM/BUILD/kpackage-6.7.0/po/tr/docs/kpackagetool/man-kpackagetool6.1.docbook
Warn: meta author : no refentry/info/author                        kpackagetool6
Note: meta author : see http://docbook.sf.net/el/author            kpackagetool6
Warn: meta author : no author data, so inserted a fixme            kpackagetool6
Note: Writing kpackagetool6.1
make[2]: Leaving directory '/usr/src/RPM/BUILD/kpackage-6.7.0/BUILD'
make[1]: Entering directory '/usr/src/RPM/BUILD/kpackage-6.7.0/BUILD'
[ 43%] Built target po-nl-docs-kpackagetool-kpackagetool6-1
make[1]: Leaving directory '/usr/src/RPM/BUILD/kpackage-6.7.0/BUILD'
make[1]: Entering directory '/usr/src/RPM/BUILD/kpackage-6.7.0/BUILD'
[ 43%] Built target po-tr-docs-kpackagetool-kpackagetool6-1
make[1]: Leaving directory '/usr/src/RPM/BUILD/kpackage-6.7.0/BUILD'
make[1]: Entering directory '/usr/src/RPM/BUILD/kpackage-6.7.0/BUILD'
[ 43%] Built target po-ca-docs-kpackagetool-kpackagetool6-1
make[1]: Leaving directory '/usr/src/RPM/BUILD/kpackage-6.7.0/BUILD'
make[1]: Entering directory '/usr/src/RPM/BUILD/kpackage-6.7.0/BUILD'
[ 43%] Built target po-sl-docs-kpackagetool-kpackagetool6-1
make[1]: Leaving directory '/usr/src/RPM/BUILD/kpackage-6.7.0/BUILD'
make[2]: Entering directory '/usr/src/RPM/BUILD/kpackage-6.7.0/BUILD'
[ 36%] Generating po/uk/docs/kpackagetool/kpackagetool6.1
cd /usr/src/RPM/BUILD/kpackage-6.7.0/BUILD/po/uk/docs/kpackagetool && /usr/lib/kf6/bin/meinproc6 --stylesheet /usr/share/kf6/kdoctools/customization/kde-include-man.xsl --check /usr/src/RPM/BUILD/kpackage-6.7.0/po/uk/docs/kpackagetool/man-kpackagetool6.1.docbook
Note: Writing kpackagetool6.1
make[2]: Leaving directory '/usr/src/RPM/BUILD/kpackage-6.7.0/BUILD'
make[2]: Entering directory '/usr/src/RPM/BUILD/kpackage-6.7.0/BUILD'
[ 23%] Generating po/it/docs/kpackagetool/kpackagetool6.1
cd /usr/src/RPM/BUILD/kpackage-6.7.0/BUILD/po/it/docs/kpackagetool && /usr/lib/kf6/bin/meinproc6 --stylesheet /usr/share/kf6/kdoctools/customization/kde-include-man.xsl --check /usr/src/RPM/BUILD/kpackage-6.7.0/po/it/docs/kpackagetool/man-kpackagetool6.1.docbook
Note: Writing kpackagetool6.1
make[2]: Leaving directory '/usr/src/RPM/BUILD/kpackage-6.7.0/BUILD'
make[2]: Entering directory '/usr/src/RPM/BUILD/kpackage-6.7.0/BUILD'
[ 33%] Generating po/pt_BR/docs/kpackagetool/kpackagetool6.1
cd /usr/src/RPM/BUILD/kpackage-6.7.0/BUILD/po/pt_BR/docs/kpackagetool && /usr/lib/kf6/bin/meinproc6 --stylesheet /usr/share/kf6/kdoctools/customization/kde-include-man.xsl --check /usr/src/RPM/BUILD/kpackage-6.7.0/po/pt_BR/docs/kpackagetool/man-kpackagetool6.1.docbook
Note: Writing kpackagetool6.1
make[2]: Leaving directory '/usr/src/RPM/BUILD/kpackage-6.7.0/BUILD'
make[1]: Entering directory '/usr/src/RPM/BUILD/kpackage-6.7.0/BUILD'
[ 43%] Built target po-uk-docs-kpackagetool-kpackagetool6-1
make[1]: Leaving directory '/usr/src/RPM/BUILD/kpackage-6.7.0/BUILD'
make[1]: Entering directory '/usr/src/RPM/BUILD/kpackage-6.7.0/BUILD'
[ 43%] Built target po-pt-BR-docs-kpackagetool-kpackagetool6-1
make[1]: Leaving directory '/usr/src/RPM/BUILD/kpackage-6.7.0/BUILD'
make[1]: Entering directory '/usr/src/RPM/BUILD/kpackage-6.7.0/BUILD'
[ 43%] Built target po-it-docs-kpackagetool-kpackagetool6-1
make[1]: Leaving directory '/usr/src/RPM/BUILD/kpackage-6.7.0/BUILD'
make[2]: Entering directory '/usr/src/RPM/BUILD/kpackage-6.7.0/BUILD'
[ 43%] Automatic MOC for target KF6Package
cd /usr/src/RPM/BUILD/kpackage-6.7.0/BUILD/src/kpackage && /usr/bin/cmake -E cmake_autogen /usr/src/RPM/BUILD/kpackage-6.7.0/BUILD/src/kpackage/CMakeFiles/KF6Package_autogen.dir/AutogenInfo.json Release
cd /usr/src/RPM/BUILD/kpackage-6.7.0/BUILD/src/kpackage && /usr/bin/cmake -E touch /usr/src/RPM/BUILD/kpackage-6.7.0/BUILD/src/kpackage/KF6Package_autogen/timestamp
make[2]: Leaving directory '/usr/src/RPM/BUILD/kpackage-6.7.0/BUILD'
make[1]: Entering directory '/usr/src/RPM/BUILD/kpackage-6.7.0/BUILD'
[ 43%] Built target KF6Package_autogen
make[1]: Leaving directory '/usr/src/RPM/BUILD/kpackage-6.7.0/BUILD'
make  -f src/kpackage/CMakeFiles/KF6Package.dir/build.make src/kpackage/CMakeFiles/KF6Package.dir/depend
make[2]: Entering directory '/usr/src/RPM/BUILD/kpackage-6.7.0/BUILD'
cd /usr/src/RPM/BUILD/kpackage-6.7.0/BUILD && /usr/bin/cmake -E cmake_depends "Unix Makefiles" /usr/src/RPM/BUILD/kpackage-6.7.0 /usr/src/RPM/BUILD/kpackage-6.7.0/src/kpackage /usr/src/RPM/BUILD/kpackage-6.7.0/BUILD /usr/src/RPM/BUILD/kpackage-6.7.0/BUILD/src/kpackage /usr/src/RPM/BUILD/kpackage-6.7.0/BUILD/src/kpackage/CMakeFiles/KF6Package.dir/DependInfo.cmake "--color="
make[2]: Leaving directory '/usr/src/RPM/BUILD/kpackage-6.7.0/BUILD'
make  -f src/kpackage/CMakeFiles/KF6Package.dir/build.make src/kpackage/CMakeFiles/KF6Package.dir/build
make[2]: Entering directory '/usr/src/RPM/BUILD/kpackage-6.7.0/BUILD'
[ 46%] Building CXX object src/kpackage/CMakeFiles/KF6Package.dir/KF6Package_autogen/mocs_compilation.cpp.o
cd /usr/src/RPM/BUILD/kpackage-6.7.0/BUILD/src/kpackage && /usr/bin/c++ -DHAVE_QTDBUS=1 -DKCOREADDONS_LIB -DKF6Package_EXPORTS -DKF_DEPRECATED_WARNINGS_SINCE=0x60000 -DKF_DISABLE_DEPRECATED_BEFORE_AND_AT=0x5ef00 -DKPACKAGE_DEPRECATED_WARNINGS_SINCE=0x0 -DKPACKAGE_DISABLE_DEPRECATED_BEFORE_AND_AT=0x0 -DQT_CORE_LIB -DQT_DBUS_LIB -DQT_DEPRECATED_WARNINGS_SINCE=0x70000 -DQT_DISABLE_DEPRECATED_BEFORE=0x60700 -DQT_NO_CAST_FROM_ASCII -DQT_NO_CAST_FROM_BYTEARRAY -DQT_NO_CAST_TO_ASCII -DQT_NO_DEBUG -DQT_NO_FOREACH -DQT_NO_KEYWORDS -DQT_NO_NARROWING_CONVERSIONS_IN_CONNECT -DQT_NO_URL_CAST_FROM_STRING -DQT_STRICT_ITERATORS -DQT_USE_QSTRINGBUILDER -DTRANSLATION_DOMAIN=\"libkpackage6\" -D_FILE_OFFSET_BITS=64 -D_GNU_SOURCE -D_LARGEFILE64_SOURCE -I/usr/src/RPM/BUILD/kpackage-6.7.0/BUILD/src/kpackage -I/usr/src/RPM/BUILD/kpackage-6.7.0/src/kpackage -I/usr/src/RPM/BUILD/kpackage-6.7.0/BUILD/src/kpackage/KF6Package_autogen/include -I/usr/src/RPM/BUILD/kpackage-6.7.0/BUILD -I/usr/src/RPM/BUILD/kpackage-6.7.0/src/kpackage/.. -I/usr/src/RPM/BUILD/kpackage-6.7.0/BUILD/src/kpackage/KPackage -isystem /usr/include/KF6/KCoreAddons -isystem /usr/include/qt6/QtCore -isystem /usr/include/qt6 -isystem /usr/lib/qt6/mkspecs/linux-g++ -isystem /usr/include/KF6/KArchive -isystem /usr/include/KF6/KI18n -isystem /usr/include/qt6/QtDBus -pipe -frecord-gcc-switches -Wall -g -O2 -flto=auto -march=i586 -mtune=generic -fno-operator-names -fno-exceptions -Wall -Wextra -Wcast-align -Wchar-subscripts -Wformat-security -Wno-long-long -Wpointer-arith -Wundef -Wnon-virtual-dtor -Woverloaded-virtual -Werror=return-type -Werror=init-self -Werror=undef -Wvla -Wdate-time -Wsuggest-override -Wlogical-op -pedantic -Wzero-as-null-pointer-constant -Wmissing-include-dirs -O2 -DNDEBUG -std=c++20 -fPIC -fvisibility=hidden -fvisibility-inlines-hidden -MD -MT src/kpackage/CMakeFiles/KF6Package.dir/KF6Package_autogen/mocs_compilation.cpp.o -MF CMakeFiles/KF6Package.dir/KF6Package_autogen/mocs_compilation.cpp.o.d -o CMakeFiles/KF6Package.dir/KF6Package_autogen/mocs_compilation.cpp.o -c /usr/src/RPM/BUILD/kpackage-6.7.0/BUILD/src/kpackage/KF6Package_autogen/mocs_compilation.cpp
make[2]: Leaving directory '/usr/src/RPM/BUILD/kpackage-6.7.0/BUILD'
make[2]: Entering directory '/usr/src/RPM/BUILD/kpackage-6.7.0/BUILD'
[ 70%] Building CXX object src/kpackage/CMakeFiles/KF6Package.dir/kpackage_debug.cpp.o
cd /usr/src/RPM/BUILD/kpackage-6.7.0/BUILD/src/kpackage && /usr/bin/c++ -DHAVE_QTDBUS=1 -DKCOREADDONS_LIB -DKF6Package_EXPORTS -DKF_DEPRECATED_WARNINGS_SINCE=0x60000 -DKF_DISABLE_DEPRECATED_BEFORE_AND_AT=0x5ef00 -DKPACKAGE_DEPRECATED_WARNINGS_SINCE=0x0 -DKPACKAGE_DISABLE_DEPRECATED_BEFORE_AND_AT=0x0 -DQT_CORE_LIB -DQT_DBUS_LIB -DQT_DEPRECATED_WARNINGS_SINCE=0x70000 -DQT_DISABLE_DEPRECATED_BEFORE=0x60700 -DQT_NO_CAST_FROM_ASCII -DQT_NO_CAST_FROM_BYTEARRAY -DQT_NO_CAST_TO_ASCII -DQT_NO_DEBUG -DQT_NO_FOREACH -DQT_NO_KEYWORDS -DQT_NO_NARROWING_CONVERSIONS_IN_CONNECT -DQT_NO_URL_CAST_FROM_STRING -DQT_STRICT_ITERATORS -DQT_USE_QSTRINGBUILDER -DTRANSLATION_DOMAIN=\"libkpackage6\" -D_FILE_OFFSET_BITS=64 -D_GNU_SOURCE -D_LARGEFILE64_SOURCE -I/usr/src/RPM/BUILD/kpackage-6.7.0/BUILD/src/kpackage -I/usr/src/RPM/BUILD/kpackage-6.7.0/src/kpackage -I/usr/src/RPM/BUILD/kpackage-6.7.0/BUILD/src/kpackage/KF6Package_autogen/include -I/usr/src/RPM/BUILD/kpackage-6.7.0/BUILD -I/usr/src/RPM/BUILD/kpackage-6.7.0/src/kpackage/.. -I/usr/src/RPM/BUILD/kpackage-6.7.0/BUILD/src/kpackage/KPackage -isystem /usr/include/KF6/KCoreAddons -isystem /usr/include/qt6/QtCore -isystem /usr/include/qt6 -isystem /usr/lib/qt6/mkspecs/linux-g++ -isystem /usr/include/KF6/KArchive -isystem /usr/include/KF6/KI18n -isystem /usr/include/qt6/QtDBus -pipe -frecord-gcc-switches -Wall -g -O2 -flto=auto -march=i586 -mtune=generic -fno-operator-names -fno-exceptions -Wall -Wextra -Wcast-align -Wchar-subscripts -Wformat-security -Wno-long-long -Wpointer-arith -Wundef -Wnon-virtual-dtor -Woverloaded-virtual -Werror=return-type -Werror=init-self -Werror=undef -Wvla -Wdate-time -Wsuggest-override -Wlogical-op -pedantic -Wzero-as-null-pointer-constant -Wmissing-include-dirs -O2 -DNDEBUG -std=c++20 -fPIC -fvisibility=hidden -fvisibility-inlines-hidden -MD -MT src/kpackage/CMakeFiles/KF6Package.dir/kpackage_debug.cpp.o -MF CMakeFiles/KF6Package.dir/kpackage_debug.cpp.o.d -o CMakeFiles/KF6Package.dir/kpackage_debug.cpp.o -c /usr/src/RPM/BUILD/kpackage-6.7.0/BUILD/src/kpackage/kpackage_debug.cpp
make[2]: Leaving directory '/usr/src/RPM/BUILD/kpackage-6.7.0/BUILD'
make[2]: Entering directory '/usr/src/RPM/BUILD/kpackage-6.7.0/BUILD'
[ 63%] Building CXX object src/kpackage/CMakeFiles/KF6Package.dir/private/packages.cpp.o
cd /usr/src/RPM/BUILD/kpackage-6.7.0/BUILD/src/kpackage && /usr/bin/c++ -DHAVE_QTDBUS=1 -DKCOREADDONS_LIB -DKF6Package_EXPORTS -DKF_DEPRECATED_WARNINGS_SINCE=0x60000 -DKF_DISABLE_DEPRECATED_BEFORE_AND_AT=0x5ef00 -DKPACKAGE_DEPRECATED_WARNINGS_SINCE=0x0 -DKPACKAGE_DISABLE_DEPRECATED_BEFORE_AND_AT=0x0 -DQT_CORE_LIB -DQT_DBUS_LIB -DQT_DEPRECATED_WARNINGS_SINCE=0x70000 -DQT_DISABLE_DEPRECATED_BEFORE=0x60700 -DQT_NO_CAST_FROM_ASCII -DQT_NO_CAST_FROM_BYTEARRAY -DQT_NO_CAST_TO_ASCII -DQT_NO_DEBUG -DQT_NO_FOREACH -DQT_NO_KEYWORDS -DQT_NO_NARROWING_CONVERSIONS_IN_CONNECT -DQT_NO_URL_CAST_FROM_STRING -DQT_STRICT_ITERATORS -DQT_USE_QSTRINGBUILDER -DTRANSLATION_DOMAIN=\"libkpackage6\" -D_FILE_OFFSET_BITS=64 -D_GNU_SOURCE -D_LARGEFILE64_SOURCE -I/usr/src/RPM/BUILD/kpackage-6.7.0/BUILD/src/kpackage -I/usr/src/RPM/BUILD/kpackage-6.7.0/src/kpackage -I/usr/src/RPM/BUILD/kpackage-6.7.0/BUILD/src/kpackage/KF6Package_autogen/include -I/usr/src/RPM/BUILD/kpackage-6.7.0/BUILD -I/usr/src/RPM/BUILD/kpackage-6.7.0/src/kpackage/.. -I/usr/src/RPM/BUILD/kpackage-6.7.0/BUILD/src/kpackage/KPackage -isystem /usr/include/KF6/KCoreAddons -isystem /usr/include/qt6/QtCore -isystem /usr/include/qt6 -isystem /usr/lib/qt6/mkspecs/linux-g++ -isystem /usr/include/KF6/KArchive -isystem /usr/include/KF6/KI18n -isystem /usr/include/qt6/QtDBus -pipe -frecord-gcc-switches -Wall -g -O2 -flto=auto -march=i586 -mtune=generic -fno-operator-names -fno-exceptions -Wall -Wextra -Wcast-align -Wchar-subscripts -Wformat-security -Wno-long-long -Wpointer-arith -Wundef -Wnon-virtual-dtor -Woverloaded-virtual -Werror=return-type -Werror=init-self -Werror=undef -Wvla -Wdate-time -Wsuggest-override -Wlogical-op -pedantic -Wzero-as-null-pointer-constant -Wmissing-include-dirs -O2 -DNDEBUG -std=c++20 -fPIC -fvisibility=hidden -fvisibility-inlines-hidden -MD -MT src/kpackage/CMakeFiles/KF6Package.dir/private/packages.cpp.o -MF CMakeFiles/KF6Package.dir/private/packages.cpp.o.d -o CMakeFiles/KF6Package.dir/private/packages.cpp.o -c /usr/src/RPM/BUILD/kpackage-6.7.0/src/kpackage/private/packages.cpp
make[2]: Leaving directory '/usr/src/RPM/BUILD/kpackage-6.7.0/BUILD'
make[2]: Entering directory '/usr/src/RPM/BUILD/kpackage-6.7.0/BUILD'
[ 53%] Building CXX object src/kpackage/CMakeFiles/KF6Package.dir/packagestructure.cpp.o
cd /usr/src/RPM/BUILD/kpackage-6.7.0/BUILD/src/kpackage && /usr/bin/c++ -DHAVE_QTDBUS=1 -DKCOREADDONS_LIB -DKF6Package_EXPORTS -DKF_DEPRECATED_WARNINGS_SINCE=0x60000 -DKF_DISABLE_DEPRECATED_BEFORE_AND_AT=0x5ef00 -DKPACKAGE_DEPRECATED_WARNINGS_SINCE=0x0 -DKPACKAGE_DISABLE_DEPRECATED_BEFORE_AND_AT=0x0 -DQT_CORE_LIB -DQT_DBUS_LIB -DQT_DEPRECATED_WARNINGS_SINCE=0x70000 -DQT_DISABLE_DEPRECATED_BEFORE=0x60700 -DQT_NO_CAST_FROM_ASCII -DQT_NO_CAST_FROM_BYTEARRAY -DQT_NO_CAST_TO_ASCII -DQT_NO_DEBUG -DQT_NO_FOREACH -DQT_NO_KEYWORDS -DQT_NO_NARROWING_CONVERSIONS_IN_CONNECT -DQT_NO_URL_CAST_FROM_STRING -DQT_STRICT_ITERATORS -DQT_USE_QSTRINGBUILDER -DTRANSLATION_DOMAIN=\"libkpackage6\" -D_FILE_OFFSET_BITS=64 -D_GNU_SOURCE -D_LARGEFILE64_SOURCE -I/usr/src/RPM/BUILD/kpackage-6.7.0/BUILD/src/kpackage -I/usr/src/RPM/BUILD/kpackage-6.7.0/src/kpackage -I/usr/src/RPM/BUILD/kpackage-6.7.0/BUILD/src/kpackage/KF6Package_autogen/include -I/usr/src/RPM/BUILD/kpackage-6.7.0/BUILD -I/usr/src/RPM/BUILD/kpackage-6.7.0/src/kpackage/.. -I/usr/src/RPM/BUILD/kpackage-6.7.0/BUILD/src/kpackage/KPackage -isystem /usr/include/KF6/KCoreAddons -isystem /usr/include/qt6/QtCore -isystem /usr/include/qt6 -isystem /usr/lib/qt6/mkspecs/linux-g++ -isystem /usr/include/KF6/KArchive -isystem /usr/include/KF6/KI18n -isystem /usr/include/qt6/QtDBus -pipe -frecord-gcc-switches -Wall -g -O2 -flto=auto -march=i586 -mtune=generic -fno-operator-names -fno-exceptions -Wall -Wextra -Wcast-align -Wchar-subscripts -Wformat-security -Wno-long-long -Wpointer-arith -Wundef -Wnon-virtual-dtor -Woverloaded-virtual -Werror=return-type -Werror=init-self -Werror=undef -Wvla -Wdate-time -Wsuggest-override -Wlogical-op -pedantic -Wzero-as-null-pointer-constant -Wmissing-include-dirs -O2 -DNDEBUG -std=c++20 -fPIC -fvisibility=hidden -fvisibility-inlines-hidden -MD -MT src/kpackage/CMakeFiles/KF6Package.dir/packagestructure.cpp.o -MF CMakeFiles/KF6Package.dir/packagestructure.cpp.o.d -o CMakeFiles/KF6Package.dir/packagestructure.cpp.o -c /usr/src/RPM/BUILD/kpackage-6.7.0/src/kpackage/packagestructure.cpp
make[2]: Leaving directory '/usr/src/RPM/BUILD/kpackage-6.7.0/BUILD'
make[2]: Entering directory '/usr/src/RPM/BUILD/kpackage-6.7.0/BUILD'
[ 60%] Building CXX object src/kpackage/CMakeFiles/KF6Package.dir/packagejob.cpp.o
cd /usr/src/RPM/BUILD/kpackage-6.7.0/BUILD/src/kpackage && /usr/bin/c++ -DHAVE_QTDBUS=1 -DKCOREADDONS_LIB -DKF6Package_EXPORTS -DKF_DEPRECATED_WARNINGS_SINCE=0x60000 -DKF_DISABLE_DEPRECATED_BEFORE_AND_AT=0x5ef00 -DKPACKAGE_DEPRECATED_WARNINGS_SINCE=0x0 -DKPACKAGE_DISABLE_DEPRECATED_BEFORE_AND_AT=0x0 -DQT_CORE_LIB -DQT_DBUS_LIB -DQT_DEPRECATED_WARNINGS_SINCE=0x70000 -DQT_DISABLE_DEPRECATED_BEFORE=0x60700 -DQT_NO_CAST_FROM_ASCII -DQT_NO_CAST_FROM_BYTEARRAY -DQT_NO_CAST_TO_ASCII -DQT_NO_DEBUG -DQT_NO_FOREACH -DQT_NO_KEYWORDS -DQT_NO_NARROWING_CONVERSIONS_IN_CONNECT -DQT_NO_URL_CAST_FROM_STRING -DQT_STRICT_ITERATORS -DQT_USE_QSTRINGBUILDER -DTRANSLATION_DOMAIN=\"libkpackage6\" -D_FILE_OFFSET_BITS=64 -D_GNU_SOURCE -D_LARGEFILE64_SOURCE -I/usr/src/RPM/BUILD/kpackage-6.7.0/BUILD/src/kpackage -I/usr/src/RPM/BUILD/kpackage-6.7.0/src/kpackage -I/usr/src/RPM/BUILD/kpackage-6.7.0/BUILD/src/kpackage/KF6Package_autogen/include -I/usr/src/RPM/BUILD/kpackage-6.7.0/BUILD -I/usr/src/RPM/BUILD/kpackage-6.7.0/src/kpackage/.. -I/usr/src/RPM/BUILD/kpackage-6.7.0/BUILD/src/kpackage/KPackage -isystem /usr/include/KF6/KCoreAddons -isystem /usr/include/qt6/QtCore -isystem /usr/include/qt6 -isystem /usr/lib/qt6/mkspecs/linux-g++ -isystem /usr/include/KF6/KArchive -isystem /usr/include/KF6/KI18n -isystem /usr/include/qt6/QtDBus -pipe -frecord-gcc-switches -Wall -g -O2 -flto=auto -march=i586 -mtune=generic -fno-operator-names -fno-exceptions -Wall -Wextra -Wcast-align -Wchar-subscripts -Wformat-security -Wno-long-long -Wpointer-arith -Wundef -Wnon-virtual-dtor -Woverloaded-virtual -Werror=return-type -Werror=init-self -Werror=undef -Wvla -Wdate-time -Wsuggest-override -Wlogical-op -pedantic -Wzero-as-null-pointer-constant -Wmissing-include-dirs -O2 -DNDEBUG -std=c++20 -fPIC -fvisibility=hidden -fvisibility-inlines-hidden -MD -MT src/kpackage/CMakeFiles/KF6Package.dir/packagejob.cpp.o -MF CMakeFiles/KF6Package.dir/packagejob.cpp.o.d -o CMakeFiles/KF6Package.dir/packagejob.cpp.o -c /usr/src/RPM/BUILD/kpackage-6.7.0/src/kpackage/packagejob.cpp
make[2]: Leaving directory '/usr/src/RPM/BUILD/kpackage-6.7.0/BUILD'
make[2]: Entering directory '/usr/src/RPM/BUILD/kpackage-6.7.0/BUILD'
[ 66%] Building CXX object src/kpackage/CMakeFiles/KF6Package.dir/private/packagejobthread.cpp.o
cd /usr/src/RPM/BUILD/kpackage-6.7.0/BUILD/src/kpackage && /usr/bin/c++ -DHAVE_QTDBUS=1 -DKCOREADDONS_LIB -DKF6Package_EXPORTS -DKF_DEPRECATED_WARNINGS_SINCE=0x60000 -DKF_DISABLE_DEPRECATED_BEFORE_AND_AT=0x5ef00 -DKPACKAGE_DEPRECATED_WARNINGS_SINCE=0x0 -DKPACKAGE_DISABLE_DEPRECATED_BEFORE_AND_AT=0x0 -DQT_CORE_LIB -DQT_DBUS_LIB -DQT_DEPRECATED_WARNINGS_SINCE=0x70000 -DQT_DISABLE_DEPRECATED_BEFORE=0x60700 -DQT_NO_CAST_FROM_ASCII -DQT_NO_CAST_FROM_BYTEARRAY -DQT_NO_CAST_TO_ASCII -DQT_NO_DEBUG -DQT_NO_FOREACH -DQT_NO_KEYWORDS -DQT_NO_NARROWING_CONVERSIONS_IN_CONNECT -DQT_NO_URL_CAST_FROM_STRING -DQT_STRICT_ITERATORS -DQT_USE_QSTRINGBUILDER -DTRANSLATION_DOMAIN=\"libkpackage6\" -D_FILE_OFFSET_BITS=64 -D_GNU_SOURCE -D_LARGEFILE64_SOURCE -I/usr/src/RPM/BUILD/kpackage-6.7.0/BUILD/src/kpackage -I/usr/src/RPM/BUILD/kpackage-6.7.0/src/kpackage -I/usr/src/RPM/BUILD/kpackage-6.7.0/BUILD/src/kpackage/KF6Package_autogen/include -I/usr/src/RPM/BUILD/kpackage-6.7.0/BUILD -I/usr/src/RPM/BUILD/kpackage-6.7.0/src/kpackage/.. -I/usr/src/RPM/BUILD/kpackage-6.7.0/BUILD/src/kpackage/KPackage -isystem /usr/include/KF6/KCoreAddons -isystem /usr/include/qt6/QtCore -isystem /usr/include/qt6 -isystem /usr/lib/qt6/mkspecs/linux-g++ -isystem /usr/include/KF6/KArchive -isystem /usr/include/KF6/KI18n -isystem /usr/include/qt6/QtDBus -pipe -frecord-gcc-switches -Wall -g -O2 -flto=auto -march=i586 -mtune=generic -fno-operator-names -fno-exceptions -Wall -Wextra -Wcast-align -Wchar-subscripts -Wformat-security -Wno-long-long -Wpointer-arith -Wundef -Wnon-virtual-dtor -Woverloaded-virtual -Werror=return-type -Werror=init-self -Werror=undef -Wvla -Wdate-time -Wsuggest-override -Wlogical-op -pedantic -Wzero-as-null-pointer-constant -Wmissing-include-dirs -O2 -DNDEBUG -std=c++20 -fPIC -fvisibility=hidden -fvisibility-inlines-hidden -MD -MT src/kpackage/CMakeFiles/KF6Package.dir/private/packagejobthread.cpp.o -MF CMakeFiles/KF6Package.dir/private/packagejobthread.cpp.o.d -o CMakeFiles/KF6Package.dir/private/packagejobthread.cpp.o -c /usr/src/RPM/BUILD/kpackage-6.7.0/src/kpackage/private/packagejobthread.cpp
make[2]: Leaving directory '/usr/src/RPM/BUILD/kpackage-6.7.0/BUILD'
make[2]: Entering directory '/usr/src/RPM/BUILD/kpackage-6.7.0/BUILD'
[ 60%] Building CXX object src/kpackage/CMakeFiles/KF6Package.dir/packageloader.cpp.o
cd /usr/src/RPM/BUILD/kpackage-6.7.0/BUILD/src/kpackage && /usr/bin/c++ -DHAVE_QTDBUS=1 -DKCOREADDONS_LIB -DKF6Package_EXPORTS -DKF_DEPRECATED_WARNINGS_SINCE=0x60000 -DKF_DISABLE_DEPRECATED_BEFORE_AND_AT=0x5ef00 -DKPACKAGE_DEPRECATED_WARNINGS_SINCE=0x0 -DKPACKAGE_DISABLE_DEPRECATED_BEFORE_AND_AT=0x0 -DQT_CORE_LIB -DQT_DBUS_LIB -DQT_DEPRECATED_WARNINGS_SINCE=0x70000 -DQT_DISABLE_DEPRECATED_BEFORE=0x60700 -DQT_NO_CAST_FROM_ASCII -DQT_NO_CAST_FROM_BYTEARRAY -DQT_NO_CAST_TO_ASCII -DQT_NO_DEBUG -DQT_NO_FOREACH -DQT_NO_KEYWORDS -DQT_NO_NARROWING_CONVERSIONS_IN_CONNECT -DQT_NO_URL_CAST_FROM_STRING -DQT_STRICT_ITERATORS -DQT_USE_QSTRINGBUILDER -DTRANSLATION_DOMAIN=\"libkpackage6\" -D_FILE_OFFSET_BITS=64 -D_GNU_SOURCE -D_LARGEFILE64_SOURCE -I/usr/src/RPM/BUILD/kpackage-6.7.0/BUILD/src/kpackage -I/usr/src/RPM/BUILD/kpackage-6.7.0/src/kpackage -I/usr/src/RPM/BUILD/kpackage-6.7.0/BUILD/src/kpackage/KF6Package_autogen/include -I/usr/src/RPM/BUILD/kpackage-6.7.0/BUILD -I/usr/src/RPM/BUILD/kpackage-6.7.0/src/kpackage/.. -I/usr/src/RPM/BUILD/kpackage-6.7.0/BUILD/src/kpackage/KPackage -isystem /usr/include/KF6/KCoreAddons -isystem /usr/include/qt6/QtCore -isystem /usr/include/qt6 -isystem /usr/lib/qt6/mkspecs/linux-g++ -isystem /usr/include/KF6/KArchive -isystem /usr/include/KF6/KI18n -isystem /usr/include/qt6/QtDBus -pipe -frecord-gcc-switches -Wall -g -O2 -flto=auto -march=i586 -mtune=generic -fno-operator-names -fno-exceptions -Wall -Wextra -Wcast-align -Wchar-subscripts -Wformat-security -Wno-long-long -Wpointer-arith -Wundef -Wnon-virtual-dtor -Woverloaded-virtual -Werror=return-type -Werror=init-self -Werror=undef -Wvla -Wdate-time -Wsuggest-override -Wlogical-op -pedantic -Wzero-as-null-pointer-constant -Wmissing-include-dirs -O2 -DNDEBUG -std=c++20 -fPIC -fvisibility=hidden -fvisibility-inlines-hidden -MD -MT src/kpackage/CMakeFiles/KF6Package.dir/packageloader.cpp.o -MF CMakeFiles/KF6Package.dir/packageloader.cpp.o.d -o CMakeFiles/KF6Package.dir/packageloader.cpp.o -c /usr/src/RPM/BUILD/kpackage-6.7.0/src/kpackage/packageloader.cpp
make[2]: Leaving directory '/usr/src/RPM/BUILD/kpackage-6.7.0/BUILD'
make[2]: Entering directory '/usr/src/RPM/BUILD/kpackage-6.7.0/BUILD'
[ 50%] Building CXX object src/kpackage/CMakeFiles/KF6Package.dir/package.cpp.o
cd /usr/src/RPM/BUILD/kpackage-6.7.0/BUILD/src/kpackage && /usr/bin/c++ -DHAVE_QTDBUS=1 -DKCOREADDONS_LIB -DKF6Package_EXPORTS -DKF_DEPRECATED_WARNINGS_SINCE=0x60000 -DKF_DISABLE_DEPRECATED_BEFORE_AND_AT=0x5ef00 -DKPACKAGE_DEPRECATED_WARNINGS_SINCE=0x0 -DKPACKAGE_DISABLE_DEPRECATED_BEFORE_AND_AT=0x0 -DQT_CORE_LIB -DQT_DBUS_LIB -DQT_DEPRECATED_WARNINGS_SINCE=0x70000 -DQT_DISABLE_DEPRECATED_BEFORE=0x60700 -DQT_NO_CAST_FROM_ASCII -DQT_NO_CAST_FROM_BYTEARRAY -DQT_NO_CAST_TO_ASCII -DQT_NO_DEBUG -DQT_NO_FOREACH -DQT_NO_KEYWORDS -DQT_NO_NARROWING_CONVERSIONS_IN_CONNECT -DQT_NO_URL_CAST_FROM_STRING -DQT_STRICT_ITERATORS -DQT_USE_QSTRINGBUILDER -DTRANSLATION_DOMAIN=\"libkpackage6\" -D_FILE_OFFSET_BITS=64 -D_GNU_SOURCE -D_LARGEFILE64_SOURCE -I/usr/src/RPM/BUILD/kpackage-6.7.0/BUILD/src/kpackage -I/usr/src/RPM/BUILD/kpackage-6.7.0/src/kpackage -I/usr/src/RPM/BUILD/kpackage-6.7.0/BUILD/src/kpackage/KF6Package_autogen/include -I/usr/src/RPM/BUILD/kpackage-6.7.0/BUILD -I/usr/src/RPM/BUILD/kpackage-6.7.0/src/kpackage/.. -I/usr/src/RPM/BUILD/kpackage-6.7.0/BUILD/src/kpackage/KPackage -isystem /usr/include/KF6/KCoreAddons -isystem /usr/include/qt6/QtCore -isystem /usr/include/qt6 -isystem /usr/lib/qt6/mkspecs/linux-g++ -isystem /usr/include/KF6/KArchive -isystem /usr/include/KF6/KI18n -isystem /usr/include/qt6/QtDBus -pipe -frecord-gcc-switches -Wall -g -O2 -flto=auto -march=i586 -mtune=generic -fno-operator-names -fno-exceptions -Wall -Wextra -Wcast-align -Wchar-subscripts -Wformat-security -Wno-long-long -Wpointer-arith -Wundef -Wnon-virtual-dtor -Woverloaded-virtual -Werror=return-type -Werror=init-self -Werror=undef -Wvla -Wdate-time -Wsuggest-override -Wlogical-op -pedantic -Wzero-as-null-pointer-constant -Wmissing-include-dirs -O2 -DNDEBUG -std=c++20 -fPIC -fvisibility=hidden -fvisibility-inlines-hidden -MD -MT src/kpackage/CMakeFiles/KF6Package.dir/package.cpp.o -MF CMakeFiles/KF6Package.dir/package.cpp.o.d -o CMakeFiles/KF6Package.dir/package.cpp.o -c /usr/src/RPM/BUILD/kpackage-6.7.0/src/kpackage/package.cpp
make[2]: Leaving directory '/usr/src/RPM/BUILD/kpackage-6.7.0/BUILD'
make[2]: Entering directory '/usr/src/RPM/BUILD/kpackage-6.7.0/BUILD'
[ 73%] Linking CXX shared library ../../bin/libKF6Package.so
cd /usr/src/RPM/BUILD/kpackage-6.7.0/BUILD/src/kpackage && /usr/bin/cmake -E cmake_link_script CMakeFiles/KF6Package.dir/link.txt --verbose=1
/usr/bin/c++ -fPIC -pipe -frecord-gcc-switches -Wall -g -O2 -flto=auto -march=i586 -mtune=generic -fno-operator-names -fno-exceptions -Wall -Wextra -Wcast-align -Wchar-subscripts -Wformat-security -Wno-long-long -Wpointer-arith -Wundef -Wnon-virtual-dtor -Woverloaded-virtual -Werror=return-type -Werror=init-self -Werror=undef -Wvla -Wdate-time -Wsuggest-override -Wlogical-op -pedantic -Wzero-as-null-pointer-constant -Wmissing-include-dirs -O2 -DNDEBUG -Wl,--no-undefined -Wl,--fatal-warnings -Wl,--enable-new-dtags -L/usr/lib -L/usr/lib/kf6/devel -shared -Wl,-soname,libKF6Package.so.6 -o ../../bin/libKF6Package.so.6.7.0 CMakeFiles/KF6Package.dir/KF6Package_autogen/mocs_compilation.cpp.o CMakeFiles/KF6Package.dir/package.cpp.o CMakeFiles/KF6Package.dir/packagestructure.cpp.o CMakeFiles/KF6Package.dir/packageloader.cpp.o CMakeFiles/KF6Package.dir/packagejob.cpp.o CMakeFiles/KF6Package.dir/private/packages.cpp.o CMakeFiles/KF6Package.dir/private/packagejobthread.cpp.o CMakeFiles/KF6Package.dir/kpackage_debug.cpp.o  /usr/lib/libKF6CoreAddons.so.6.7.0 /usr/lib/libKF6Archive.so.6.7.0 /usr/lib/libKF6I18n.so.6.7.0 /usr/lib/libQt6DBus.so.6.7.2 /usr/lib/libQt6Core.so.6.7.2
cd /usr/src/RPM/BUILD/kpackage-6.7.0/BUILD/src/kpackage && /usr/bin/cmake -E cmake_symlink_library ../../bin/libKF6Package.so.6.7.0 ../../bin/libKF6Package.so.6 ../../bin/libKF6Package.so
make[2]: Leaving directory '/usr/src/RPM/BUILD/kpackage-6.7.0/BUILD'
make[1]: Entering directory '/usr/src/RPM/BUILD/kpackage-6.7.0/BUILD'
[ 76%] Built target KF6Package
make[1]: Leaving directory '/usr/src/RPM/BUILD/kpackage-6.7.0/BUILD'
make  -f src/kpackagetool/CMakeFiles/kpackagetool6_autogen_timestamp_deps.dir/build.make src/kpackagetool/CMakeFiles/kpackagetool6_autogen_timestamp_deps.dir/depend
make[2]: Entering directory '/usr/src/RPM/BUILD/kpackage-6.7.0/BUILD'
cd /usr/src/RPM/BUILD/kpackage-6.7.0/BUILD && /usr/bin/cmake -E cmake_depends "Unix Makefiles" /usr/src/RPM/BUILD/kpackage-6.7.0 /usr/src/RPM/BUILD/kpackage-6.7.0/src/kpackagetool /usr/src/RPM/BUILD/kpackage-6.7.0/BUILD /usr/src/RPM/BUILD/kpackage-6.7.0/BUILD/src/kpackagetool /usr/src/RPM/BUILD/kpackage-6.7.0/BUILD/src/kpackagetool/CMakeFiles/kpackagetool6_autogen_timestamp_deps.dir/DependInfo.cmake "--color="
make[2]: Leaving directory '/usr/src/RPM/BUILD/kpackage-6.7.0/BUILD'
make  -f src/kpackagetool/CMakeFiles/kpackagetool6_autogen_timestamp_deps.dir/build.make src/kpackagetool/CMakeFiles/kpackagetool6_autogen_timestamp_deps.dir/build
make[2]: Nothing to be done for 'src/kpackagetool/CMakeFiles/kpackagetool6_autogen_timestamp_deps.dir/build'.
make[1]: Entering directory '/usr/src/RPM/BUILD/kpackage-6.7.0/BUILD'
[ 76%] Built target kpackagetool6_autogen_timestamp_deps
make[1]: Leaving directory '/usr/src/RPM/BUILD/kpackage-6.7.0/BUILD'
make  -f src/kpackagetool/CMakeFiles/kpackagetool6_autogen.dir/build.make src/kpackagetool/CMakeFiles/kpackagetool6_autogen.dir/depend
make[2]: Entering directory '/usr/src/RPM/BUILD/kpackage-6.7.0/BUILD'
cd /usr/src/RPM/BUILD/kpackage-6.7.0/BUILD && /usr/bin/cmake -E cmake_depends "Unix Makefiles" /usr/src/RPM/BUILD/kpackage-6.7.0 /usr/src/RPM/BUILD/kpackage-6.7.0/src/kpackagetool /usr/src/RPM/BUILD/kpackage-6.7.0/BUILD /usr/src/RPM/BUILD/kpackage-6.7.0/BUILD/src/kpackagetool /usr/src/RPM/BUILD/kpackage-6.7.0/BUILD/src/kpackagetool/CMakeFiles/kpackagetool6_autogen.dir/DependInfo.cmake "--color="
make[2]: Leaving directory '/usr/src/RPM/BUILD/kpackage-6.7.0/BUILD'
make  -f src/kpackagetool/CMakeFiles/kpackagetool6_autogen.dir/build.make src/kpackagetool/CMakeFiles/kpackagetool6_autogen.dir/build
make[2]: Entering directory '/usr/src/RPM/BUILD/kpackage-6.7.0/BUILD'
[ 80%] Automatic MOC for target kpackagetool6
cd /usr/src/RPM/BUILD/kpackage-6.7.0/BUILD/src/kpackagetool && /usr/bin/cmake -E cmake_autogen /usr/src/RPM/BUILD/kpackage-6.7.0/BUILD/src/kpackagetool/CMakeFiles/kpackagetool6_autogen.dir/AutogenInfo.json Release
cd /usr/src/RPM/BUILD/kpackage-6.7.0/BUILD/src/kpackagetool && /usr/bin/cmake -E touch /usr/src/RPM/BUILD/kpackage-6.7.0/BUILD/src/kpackagetool/kpackagetool6_autogen/timestamp
make[2]: Leaving directory '/usr/src/RPM/BUILD/kpackage-6.7.0/BUILD'
make[1]: Entering directory '/usr/src/RPM/BUILD/kpackage-6.7.0/BUILD'
[ 80%] Built target kpackagetool6_autogen
make[1]: Leaving directory '/usr/src/RPM/BUILD/kpackage-6.7.0/BUILD'
make  -f src/kpackagetool/CMakeFiles/kpackagetool6.dir/build.make src/kpackagetool/CMakeFiles/kpackagetool6.dir/depend
make[2]: Entering directory '/usr/src/RPM/BUILD/kpackage-6.7.0/BUILD'
cd /usr/src/RPM/BUILD/kpackage-6.7.0/BUILD && /usr/bin/cmake -E cmake_depends "Unix Makefiles" /usr/src/RPM/BUILD/kpackage-6.7.0 /usr/src/RPM/BUILD/kpackage-6.7.0/src/kpackagetool /usr/src/RPM/BUILD/kpackage-6.7.0/BUILD /usr/src/RPM/BUILD/kpackage-6.7.0/BUILD/src/kpackagetool /usr/src/RPM/BUILD/kpackage-6.7.0/BUILD/src/kpackagetool/CMakeFiles/kpackagetool6.dir/DependInfo.cmake "--color="
make[2]: Leaving directory '/usr/src/RPM/BUILD/kpackage-6.7.0/BUILD'
make  -f src/kpackagetool/CMakeFiles/kpackagetool6.dir/build.make src/kpackagetool/CMakeFiles/kpackagetool6.dir/build
make[2]: Entering directory '/usr/src/RPM/BUILD/kpackage-6.7.0/BUILD'
[ 83%] Building CXX object src/kpackagetool/CMakeFiles/kpackagetool6.dir/kpackagetool6_autogen/mocs_compilation.cpp.o
cd /usr/src/RPM/BUILD/kpackage-6.7.0/BUILD/src/kpackagetool && /usr/bin/c++ -DKCOREADDONS_LIB -DKF_DEPRECATED_WARNINGS_SINCE=0x60000 -DKF_DISABLE_DEPRECATED_BEFORE_AND_AT=0x5ef00 -DKPACKAGE_DEPRECATED_WARNINGS_SINCE=0x0 -DKPACKAGE_DISABLE_DEPRECATED_BEFORE_AND_AT=0x0 -DQT_CORE_LIB -DQT_DEPRECATED_WARNINGS_SINCE=0x70000 -DQT_DISABLE_DEPRECATED_BEFORE=0x60700 -DQT_NO_CAST_FROM_ASCII -DQT_NO_CAST_FROM_BYTEARRAY -DQT_NO_CAST_TO_ASCII -DQT_NO_DEBUG -DQT_NO_FOREACH -DQT_NO_KEYWORDS -DQT_NO_NARROWING_CONVERSIONS_IN_CONNECT -DQT_NO_URL_CAST_FROM_STRING -DQT_STRICT_ITERATORS -DQT_USE_QSTRINGBUILDER -DTRANSLATION_DOMAIN=\"libkpackage6\" -D_FILE_OFFSET_BITS=64 -D_GNU_SOURCE -D_LARGEFILE64_SOURCE -I/usr/src/RPM/BUILD/kpackage-6.7.0/BUILD/src/kpackagetool -I/usr/src/RPM/BUILD/kpackage-6.7.0/src/kpackagetool -I/usr/src/RPM/BUILD/kpackage-6.7.0/BUILD/src/kpackagetool/kpackagetool6_autogen/include -I/usr/src/RPM/BUILD/kpackage-6.7.0/BUILD -I/usr/src/RPM/BUILD/kpackage-6.7.0/src/kpackage/.. -I/usr/src/RPM/BUILD/kpackage-6.7.0/BUILD/src/kpackage -I/usr/src/RPM/BUILD/kpackage-6.7.0/BUILD/src/kpackage/KPackage -I/usr/src/RPM/BUILD/kpackage-6.7.0/src/kpackage -isystem /usr/include/KF6/KArchive -isystem /usr/include/qt6/QtCore -isystem /usr/include/qt6 -isystem /usr/lib/qt6/mkspecs/linux-g++ -isystem /usr/include/KF6/KCoreAddons -isystem /usr/include/KF6/KI18n -pipe -frecord-gcc-switches -Wall -g -O2 -flto=auto -march=i586 -mtune=generic -fno-operator-names -fno-exceptions -Wall -Wextra -Wcast-align -Wchar-subscripts -Wformat-security -Wno-long-long -Wpointer-arith -Wundef -Wnon-virtual-dtor -Woverloaded-virtual -Werror=return-type -Werror=init-self -Werror=undef -Wvla -Wdate-time -Wsuggest-override -Wlogical-op -pedantic -Wzero-as-null-pointer-constant -Wmissing-include-dirs -O2 -DNDEBUG -std=c++20 -fvisibility=hidden -fvisibility-inlines-hidden -MD -MT src/kpackagetool/CMakeFiles/kpackagetool6.dir/kpackagetool6_autogen/mocs_compilation.cpp.o -MF CMakeFiles/kpackagetool6.dir/kpackagetool6_autogen/mocs_compilation.cpp.o.d -o CMakeFiles/kpackagetool6.dir/kpackagetool6_autogen/mocs_compilation.cpp.o -c /usr/src/RPM/BUILD/kpackage-6.7.0/BUILD/src/kpackagetool/kpackagetool6_autogen/mocs_compilation.cpp
make[2]: Leaving directory '/usr/src/RPM/BUILD/kpackage-6.7.0/BUILD'
make[2]: Entering directory '/usr/src/RPM/BUILD/kpackage-6.7.0/BUILD'
[ 90%] Building CXX object src/kpackagetool/CMakeFiles/kpackagetool6.dir/kpackage_debug.cpp.o
cd /usr/src/RPM/BUILD/kpackage-6.7.0/BUILD/src/kpackagetool && /usr/bin/c++ -DKCOREADDONS_LIB -DKF_DEPRECATED_WARNINGS_SINCE=0x60000 -DKF_DISABLE_DEPRECATED_BEFORE_AND_AT=0x5ef00 -DKPACKAGE_DEPRECATED_WARNINGS_SINCE=0x0 -DKPACKAGE_DISABLE_DEPRECATED_BEFORE_AND_AT=0x0 -DQT_CORE_LIB -DQT_DEPRECATED_WARNINGS_SINCE=0x70000 -DQT_DISABLE_DEPRECATED_BEFORE=0x60700 -DQT_NO_CAST_FROM_ASCII -DQT_NO_CAST_FROM_BYTEARRAY -DQT_NO_CAST_TO_ASCII -DQT_NO_DEBUG -DQT_NO_FOREACH -DQT_NO_KEYWORDS -DQT_NO_NARROWING_CONVERSIONS_IN_CONNECT -DQT_NO_URL_CAST_FROM_STRING -DQT_STRICT_ITERATORS -DQT_USE_QSTRINGBUILDER -DTRANSLATION_DOMAIN=\"libkpackage6\" -D_FILE_OFFSET_BITS=64 -D_GNU_SOURCE -D_LARGEFILE64_SOURCE -I/usr/src/RPM/BUILD/kpackage-6.7.0/BUILD/src/kpackagetool -I/usr/src/RPM/BUILD/kpackage-6.7.0/src/kpackagetool -I/usr/src/RPM/BUILD/kpackage-6.7.0/BUILD/src/kpackagetool/kpackagetool6_autogen/include -I/usr/src/RPM/BUILD/kpackage-6.7.0/BUILD -I/usr/src/RPM/BUILD/kpackage-6.7.0/src/kpackage/.. -I/usr/src/RPM/BUILD/kpackage-6.7.0/BUILD/src/kpackage -I/usr/src/RPM/BUILD/kpackage-6.7.0/BUILD/src/kpackage/KPackage -I/usr/src/RPM/BUILD/kpackage-6.7.0/src/kpackage -isystem /usr/include/KF6/KArchive -isystem /usr/include/qt6/QtCore -isystem /usr/include/qt6 -isystem /usr/lib/qt6/mkspecs/linux-g++ -isystem /usr/include/KF6/KCoreAddons -isystem /usr/include/KF6/KI18n -pipe -frecord-gcc-switches -Wall -g -O2 -flto=auto -march=i586 -mtune=generic -fno-operator-names -fno-exceptions -Wall -Wextra -Wcast-align -Wchar-subscripts -Wformat-security -Wno-long-long -Wpointer-arith -Wundef -Wnon-virtual-dtor -Woverloaded-virtual -Werror=return-type -Werror=init-self -Werror=undef -Wvla -Wdate-time -Wsuggest-override -Wlogical-op -pedantic -Wzero-as-null-pointer-constant -Wmissing-include-dirs -O2 -DNDEBUG -std=c++20 -fvisibility=hidden -fvisibility-inlines-hidden -MD -MT src/kpackagetool/CMakeFiles/kpackagetool6.dir/kpackage_debug.cpp.o -MF CMakeFiles/kpackagetool6.dir/kpackage_debug.cpp.o.d -o CMakeFiles/kpackagetool6.dir/kpackage_debug.cpp.o -c /usr/src/RPM/BUILD/kpackage-6.7.0/BUILD/src/kpackagetool/kpackage_debug.cpp
make[2]: Leaving directory '/usr/src/RPM/BUILD/kpackage-6.7.0/BUILD'
make[2]: Entering directory '/usr/src/RPM/BUILD/kpackage-6.7.0/BUILD'
[ 86%] Building CXX object src/kpackagetool/CMakeFiles/kpackagetool6.dir/main.cpp.o
cd /usr/src/RPM/BUILD/kpackage-6.7.0/BUILD/src/kpackagetool && /usr/bin/c++ -DKCOREADDONS_LIB -DKF_DEPRECATED_WARNINGS_SINCE=0x60000 -DKF_DISABLE_DEPRECATED_BEFORE_AND_AT=0x5ef00 -DKPACKAGE_DEPRECATED_WARNINGS_SINCE=0x0 -DKPACKAGE_DISABLE_DEPRECATED_BEFORE_AND_AT=0x0 -DQT_CORE_LIB -DQT_DEPRECATED_WARNINGS_SINCE=0x70000 -DQT_DISABLE_DEPRECATED_BEFORE=0x60700 -DQT_NO_CAST_FROM_ASCII -DQT_NO_CAST_FROM_BYTEARRAY -DQT_NO_CAST_TO_ASCII -DQT_NO_DEBUG -DQT_NO_FOREACH -DQT_NO_KEYWORDS -DQT_NO_NARROWING_CONVERSIONS_IN_CONNECT -DQT_NO_URL_CAST_FROM_STRING -DQT_STRICT_ITERATORS -DQT_USE_QSTRINGBUILDER -DTRANSLATION_DOMAIN=\"libkpackage6\" -D_FILE_OFFSET_BITS=64 -D_GNU_SOURCE -D_LARGEFILE64_SOURCE -I/usr/src/RPM/BUILD/kpackage-6.7.0/BUILD/src/kpackagetool -I/usr/src/RPM/BUILD/kpackage-6.7.0/src/kpackagetool -I/usr/src/RPM/BUILD/kpackage-6.7.0/BUILD/src/kpackagetool/kpackagetool6_autogen/include -I/usr/src/RPM/BUILD/kpackage-6.7.0/BUILD -I/usr/src/RPM/BUILD/kpackage-6.7.0/src/kpackage/.. -I/usr/src/RPM/BUILD/kpackage-6.7.0/BUILD/src/kpackage -I/usr/src/RPM/BUILD/kpackage-6.7.0/BUILD/src/kpackage/KPackage -I/usr/src/RPM/BUILD/kpackage-6.7.0/src/kpackage -isystem /usr/include/KF6/KArchive -isystem /usr/include/qt6/QtCore -isystem /usr/include/qt6 -isystem /usr/lib/qt6/mkspecs/linux-g++ -isystem /usr/include/KF6/KCoreAddons -isystem /usr/include/KF6/KI18n -pipe -frecord-gcc-switches -Wall -g -O2 -flto=auto -march=i586 -mtune=generic -fno-operator-names -fno-exceptions -Wall -Wextra -Wcast-align -Wchar-subscripts -Wformat-security -Wno-long-long -Wpointer-arith -Wundef -Wnon-virtual-dtor -Woverloaded-virtual -Werror=return-type -Werror=init-self -Werror=undef -Wvla -Wdate-time -Wsuggest-override -Wlogical-op -pedantic -Wzero-as-null-pointer-constant -Wmissing-include-dirs -O2 -DNDEBUG -std=c++20 -fvisibility=hidden -fvisibility-inlines-hidden -MD -MT src/kpackagetool/CMakeFiles/kpackagetool6.dir/main.cpp.o -MF CMakeFiles/kpackagetool6.dir/main.cpp.o.d -o CMakeFiles/kpackagetool6.dir/main.cpp.o -c /usr/src/RPM/BUILD/kpackage-6.7.0/src/kpackagetool/main.cpp
make[2]: Leaving directory '/usr/src/RPM/BUILD/kpackage-6.7.0/BUILD'
make[2]: Entering directory '/usr/src/RPM/BUILD/kpackage-6.7.0/BUILD'
[ 93%] Building CXX object src/kpackagetool/CMakeFiles/kpackagetool6.dir/kpackagetool.cpp.o
cd /usr/src/RPM/BUILD/kpackage-6.7.0/BUILD/src/kpackagetool && /usr/bin/c++ -DKCOREADDONS_LIB -DKF_DEPRECATED_WARNINGS_SINCE=0x60000 -DKF_DISABLE_DEPRECATED_BEFORE_AND_AT=0x5ef00 -DKPACKAGE_DEPRECATED_WARNINGS_SINCE=0x0 -DKPACKAGE_DISABLE_DEPRECATED_BEFORE_AND_AT=0x0 -DQT_CORE_LIB -DQT_DEPRECATED_WARNINGS_SINCE=0x70000 -DQT_DISABLE_DEPRECATED_BEFORE=0x60700 -DQT_NO_CAST_FROM_ASCII -DQT_NO_CAST_FROM_BYTEARRAY -DQT_NO_CAST_TO_ASCII -DQT_NO_DEBUG -DQT_NO_FOREACH -DQT_NO_KEYWORDS -DQT_NO_NARROWING_CONVERSIONS_IN_CONNECT -DQT_NO_URL_CAST_FROM_STRING -DQT_STRICT_ITERATORS -DQT_USE_QSTRINGBUILDER -DTRANSLATION_DOMAIN=\"libkpackage6\" -D_FILE_OFFSET_BITS=64 -D_GNU_SOURCE -D_LARGEFILE64_SOURCE -I/usr/src/RPM/BUILD/kpackage-6.7.0/BUILD/src/kpackagetool -I/usr/src/RPM/BUILD/kpackage-6.7.0/src/kpackagetool -I/usr/src/RPM/BUILD/kpackage-6.7.0/BUILD/src/kpackagetool/kpackagetool6_autogen/include -I/usr/src/RPM/BUILD/kpackage-6.7.0/BUILD -I/usr/src/RPM/BUILD/kpackage-6.7.0/src/kpackage/.. -I/usr/src/RPM/BUILD/kpackage-6.7.0/BUILD/src/kpackage -I/usr/src/RPM/BUILD/kpackage-6.7.0/BUILD/src/kpackage/KPackage -I/usr/src/RPM/BUILD/kpackage-6.7.0/src/kpackage -isystem /usr/include/KF6/KArchive -isystem /usr/include/qt6/QtCore -isystem /usr/include/qt6 -isystem /usr/lib/qt6/mkspecs/linux-g++ -isystem /usr/include/KF6/KCoreAddons -isystem /usr/include/KF6/KI18n -pipe -frecord-gcc-switches -Wall -g -O2 -flto=auto -march=i586 -mtune=generic -fno-operator-names -fno-exceptions -Wall -Wextra -Wcast-align -Wchar-subscripts -Wformat-security -Wno-long-long -Wpointer-arith -Wundef -Wnon-virtual-dtor -Woverloaded-virtual -Werror=return-type -Werror=init-self -Werror=undef -Wvla -Wdate-time -Wsuggest-override -Wlogical-op -pedantic -Wzero-as-null-pointer-constant -Wmissing-include-dirs -O2 -DNDEBUG -std=c++20 -fvisibility=hidden -fvisibility-inlines-hidden -MD -MT src/kpackagetool/CMakeFiles/kpackagetool6.dir/kpackagetool.cpp.o -MF CMakeFiles/kpackagetool6.dir/kpackagetool.cpp.o.d -o CMakeFiles/kpackagetool6.dir/kpackagetool.cpp.o -c /usr/src/RPM/BUILD/kpackage-6.7.0/src/kpackagetool/kpackagetool.cpp
make[2]: Leaving directory '/usr/src/RPM/BUILD/kpackage-6.7.0/BUILD'
make[2]: Entering directory '/usr/src/RPM/BUILD/kpackage-6.7.0/BUILD'
[ 96%] Linking CXX executable ../../bin/kpackagetool6
cd /usr/src/RPM/BUILD/kpackage-6.7.0/BUILD/src/kpackagetool && /usr/bin/cmake -E cmake_link_script CMakeFiles/kpackagetool6.dir/link.txt --verbose=1
/usr/bin/c++ -pipe -frecord-gcc-switches -Wall -g -O2 -flto=auto -march=i586 -mtune=generic -fno-operator-names -fno-exceptions -Wall -Wextra -Wcast-align -Wchar-subscripts -Wformat-security -Wno-long-long -Wpointer-arith -Wundef -Wnon-virtual-dtor -Woverloaded-virtual -Werror=return-type -Werror=init-self -Werror=undef -Wvla -Wdate-time -Wsuggest-override -Wlogical-op -pedantic -Wzero-as-null-pointer-constant -Wmissing-include-dirs -O2 -DNDEBUG -Wl,--enable-new-dtags -L/usr/lib -L/usr/lib/kf6/devel CMakeFiles/kpackagetool6.dir/kpackagetool6_autogen/mocs_compilation.cpp.o CMakeFiles/kpackagetool6.dir/main.cpp.o CMakeFiles/kpackagetool6.dir/kpackagetool.cpp.o CMakeFiles/kpackagetool6.dir/kpackage_debug.cpp.o -o ../../bin/kpackagetool6  ../../bin/libKF6Package.so.6.7.0 /usr/lib/libKF6I18n.so.6.7.0 /usr/lib/libKF6CoreAddons.so.6.7.0 /usr/lib/libKF6Archive.so.6.7.0 /usr/lib/libQt6Core.so.6.7.2
make[2]: Leaving directory '/usr/src/RPM/BUILD/kpackage-6.7.0/BUILD'
make[1]: Entering directory '/usr/src/RPM/BUILD/kpackage-6.7.0/BUILD'
[100%] Built target kpackagetool6
make[1]: Leaving directory '/usr/src/RPM/BUILD/kpackage-6.7.0/BUILD'
make: Entering directory '/usr/src/RPM/BUILD/kpackage-6.7.0/BUILD'
/usr/bin/cmake -E cmake_progress_start /usr/src/RPM/BUILD/kpackage-6.7.0/BUILD/CMakeFiles 0
make: Leaving directory '/usr/src/RPM/BUILD/kpackage-6.7.0/BUILD'
+ popd
~/RPM/BUILD/kpackage-6.7.0
+ exit 0
Executing(%install): /bin/sh -e /usr/src/tmp/rpm-tmp.75606
+ umask 022
+ /bin/mkdir -p /usr/src/RPM/BUILD
+ cd /usr/src/RPM/BUILD
+ /bin/chmod -Rf u+rwX -- /usr/src/tmp/kf6-kpackage-buildroot
+ :
+ /bin/rm -rf -- /usr/src/tmp/kf6-kpackage-buildroot
+ PATH=/usr/libexec/rpm-build:/usr/src/bin:/usr/bin:/bin:/usr/local/bin:/usr/games
+ cd kpackage-6.7.0
+ __kf6_install
+ make -C BUILD DESTDIR=/usr/src/tmp/kf6-kpackage-buildroot install
make: Entering directory '/usr/src/RPM/BUILD/kpackage-6.7.0/BUILD'
/usr/bin/cmake -S/usr/src/RPM/BUILD/kpackage-6.7.0 -B/usr/src/RPM/BUILD/kpackage-6.7.0/BUILD --check-build-system CMakeFiles/Makefile.cmake 0
/usr/bin/cmake -E cmake_progress_start /usr/src/RPM/BUILD/kpackage-6.7.0/BUILD/CMakeFiles /usr/src/RPM/BUILD/kpackage-6.7.0/BUILD//CMakeFiles/progress.marks
make  -f CMakeFiles/Makefile2 all
make[1]: Entering directory '/usr/src/RPM/BUILD/kpackage-6.7.0/BUILD'
make  -f CMakeFiles/pofiles-ed088cc3b180440eebf06fe1c22e644e.dir/build.make CMakeFiles/pofiles-ed088cc3b180440eebf06fe1c22e644e.dir/depend
make[2]: Entering directory '/usr/src/RPM/BUILD/kpackage-6.7.0/BUILD'
cd /usr/src/RPM/BUILD/kpackage-6.7.0/BUILD && /usr/bin/cmake -E cmake_depends "Unix Makefiles" /usr/src/RPM/BUILD/kpackage-6.7.0 /usr/src/RPM/BUILD/kpackage-6.7.0 /usr/src/RPM/BUILD/kpackage-6.7.0/BUILD /usr/src/RPM/BUILD/kpackage-6.7.0/BUILD /usr/src/RPM/BUILD/kpackage-6.7.0/BUILD/CMakeFiles/pofiles-ed088cc3b180440eebf06fe1c22e644e.dir/DependInfo.cmake "--color="
make[2]: Leaving directory '/usr/src/RPM/BUILD/kpackage-6.7.0/BUILD'
make  -f CMakeFiles/pofiles-ed088cc3b180440eebf06fe1c22e644e.dir/build.make CMakeFiles/pofiles-ed088cc3b180440eebf06fe1c22e644e.dir/build
make[2]: Entering directory '/usr/src/RPM/BUILD/kpackage-6.7.0/BUILD'
[  3%] Generating mo...
/usr/bin/cmake -DGETTEXT_MSGFMT_EXECUTABLE=/usr/bin/msgfmt -DCOPY_TO=/usr/src/RPM/BUILD/kpackage-6.7.0/BUILD/locale -DPO_DIR=/usr/src/RPM/BUILD/kpackage-6.7.0/po -P /usr/lib/cmake/KF6I18n/build-pofiles.cmake
make[2]: Leaving directory '/usr/src/RPM/BUILD/kpackage-6.7.0/BUILD'
[  3%] Built target pofiles-ed088cc3b180440eebf06fe1c22e644e
make  -f CMakeFiles/tsfiles-ed088cc3b180440eebf06fe1c22e644e.dir/build.make CMakeFiles/tsfiles-ed088cc3b180440eebf06fe1c22e644e.dir/depend
make[2]: Entering directory '/usr/src/RPM/BUILD/kpackage-6.7.0/BUILD'
cd /usr/src/RPM/BUILD/kpackage-6.7.0/BUILD && /usr/bin/cmake -E cmake_depends "Unix Makefiles" /usr/src/RPM/BUILD/kpackage-6.7.0 /usr/src/RPM/BUILD/kpackage-6.7.0 /usr/src/RPM/BUILD/kpackage-6.7.0/BUILD /usr/src/RPM/BUILD/kpackage-6.7.0/BUILD /usr/src/RPM/BUILD/kpackage-6.7.0/BUILD/CMakeFiles/tsfiles-ed088cc3b180440eebf06fe1c22e644e.dir/DependInfo.cmake "--color="
make[2]: Leaving directory '/usr/src/RPM/BUILD/kpackage-6.7.0/BUILD'
make  -f CMakeFiles/tsfiles-ed088cc3b180440eebf06fe1c22e644e.dir/build.make CMakeFiles/tsfiles-ed088cc3b180440eebf06fe1c22e644e.dir/build
make[2]: Entering directory '/usr/src/RPM/BUILD/kpackage-6.7.0/BUILD'
[  6%] Generating ts...
/usr/bin/cmake -DPython3_EXECUTABLE=/usr/bin/python3 -D_ki18n_pmap_compile_script=/usr/lib/cmake/KF6I18n/ts-pmap-compile.py -DCOPY_TO=/usr/src/RPM/BUILD/kpackage-6.7.0/BUILD/locale -DPO_DIR=/usr/src/RPM/BUILD/kpackage-6.7.0/po -P /usr/lib/cmake/KF6I18n/build-tsfiles.cmake
make[2]: Leaving directory '/usr/src/RPM/BUILD/kpackage-6.7.0/BUILD'
[  6%] Built target tsfiles-ed088cc3b180440eebf06fe1c22e644e
make  -f CMakeFiles/po-ca-docs-kpackagetool-kpackagetool6-1.dir/build.make CMakeFiles/po-ca-docs-kpackagetool-kpackagetool6-1.dir/depend
make[2]: Entering directory '/usr/src/RPM/BUILD/kpackage-6.7.0/BUILD'
cd /usr/src/RPM/BUILD/kpackage-6.7.0/BUILD && /usr/bin/cmake -E cmake_depends "Unix Makefiles" /usr/src/RPM/BUILD/kpackage-6.7.0 /usr/src/RPM/BUILD/kpackage-6.7.0 /usr/src/RPM/BUILD/kpackage-6.7.0/BUILD /usr/src/RPM/BUILD/kpackage-6.7.0/BUILD /usr/src/RPM/BUILD/kpackage-6.7.0/BUILD/CMakeFiles/po-ca-docs-kpackagetool-kpackagetool6-1.dir/DependInfo.cmake "--color="
make[2]: Leaving directory '/usr/src/RPM/BUILD/kpackage-6.7.0/BUILD'
make  -f CMakeFiles/po-ca-docs-kpackagetool-kpackagetool6-1.dir/build.make CMakeFiles/po-ca-docs-kpackagetool-kpackagetool6-1.dir/build
make[2]: Entering directory '/usr/src/RPM/BUILD/kpackage-6.7.0/BUILD'
make[2]: Nothing to be done for 'CMakeFiles/po-ca-docs-kpackagetool-kpackagetool6-1.dir/build'.
make[2]: Leaving directory '/usr/src/RPM/BUILD/kpackage-6.7.0/BUILD'
[ 10%] Built target po-ca-docs-kpackagetool-kpackagetool6-1
make  -f CMakeFiles/po-es-docs-kpackagetool-kpackagetool6-1.dir/build.make CMakeFiles/po-es-docs-kpackagetool-kpackagetool6-1.dir/depend
make[2]: Entering directory '/usr/src/RPM/BUILD/kpackage-6.7.0/BUILD'
cd /usr/src/RPM/BUILD/kpackage-6.7.0/BUILD && /usr/bin/cmake -E cmake_depends "Unix Makefiles" /usr/src/RPM/BUILD/kpackage-6.7.0 /usr/src/RPM/BUILD/kpackage-6.7.0 /usr/src/RPM/BUILD/kpackage-6.7.0/BUILD /usr/src/RPM/BUILD/kpackage-6.7.0/BUILD /usr/src/RPM/BUILD/kpackage-6.7.0/BUILD/CMakeFiles/po-es-docs-kpackagetool-kpackagetool6-1.dir/DependInfo.cmake "--color="
make[2]: Leaving directory '/usr/src/RPM/BUILD/kpackage-6.7.0/BUILD'
make  -f CMakeFiles/po-es-docs-kpackagetool-kpackagetool6-1.dir/build.make CMakeFiles/po-es-docs-kpackagetool-kpackagetool6-1.dir/build
make[2]: Entering directory '/usr/src/RPM/BUILD/kpackage-6.7.0/BUILD'
make[2]: Nothing to be done for 'CMakeFiles/po-es-docs-kpackagetool-kpackagetool6-1.dir/build'.
make[2]: Leaving directory '/usr/src/RPM/BUILD/kpackage-6.7.0/BUILD'
[ 13%] Built target po-es-docs-kpackagetool-kpackagetool6-1
make  -f CMakeFiles/po-fr-docs-kpackagetool-kpackagetool6-1.dir/build.make CMakeFiles/po-fr-docs-kpackagetool-kpackagetool6-1.dir/depend
make[2]: Entering directory '/usr/src/RPM/BUILD/kpackage-6.7.0/BUILD'
cd /usr/src/RPM/BUILD/kpackage-6.7.0/BUILD && /usr/bin/cmake -E cmake_depends "Unix Makefiles" /usr/src/RPM/BUILD/kpackage-6.7.0 /usr/src/RPM/BUILD/kpackage-6.7.0 /usr/src/RPM/BUILD/kpackage-6.7.0/BUILD /usr/src/RPM/BUILD/kpackage-6.7.0/BUILD /usr/src/RPM/BUILD/kpackage-6.7.0/BUILD/CMakeFiles/po-fr-docs-kpackagetool-kpackagetool6-1.dir/DependInfo.cmake "--color="
make[2]: Leaving directory '/usr/src/RPM/BUILD/kpackage-6.7.0/BUILD'
make  -f CMakeFiles/po-fr-docs-kpackagetool-kpackagetool6-1.dir/build.make CMakeFiles/po-fr-docs-kpackagetool-kpackagetool6-1.dir/build
make[2]: Entering directory '/usr/src/RPM/BUILD/kpackage-6.7.0/BUILD'
make[2]: Nothing to be done for 'CMakeFiles/po-fr-docs-kpackagetool-kpackagetool6-1.dir/build'.
make[2]: Leaving directory '/usr/src/RPM/BUILD/kpackage-6.7.0/BUILD'
[ 16%] Built target po-fr-docs-kpackagetool-kpackagetool6-1
make  -f CMakeFiles/po-it-docs-kpackagetool-kpackagetool6-1.dir/build.make CMakeFiles/po-it-docs-kpackagetool-kpackagetool6-1.dir/depend
make[2]: Entering directory '/usr/src/RPM/BUILD/kpackage-6.7.0/BUILD'
cd /usr/src/RPM/BUILD/kpackage-6.7.0/BUILD && /usr/bin/cmake -E cmake_depends "Unix Makefiles" /usr/src/RPM/BUILD/kpackage-6.7.0 /usr/src/RPM/BUILD/kpackage-6.7.0 /usr/src/RPM/BUILD/kpackage-6.7.0/BUILD /usr/src/RPM/BUILD/kpackage-6.7.0/BUILD /usr/src/RPM/BUILD/kpackage-6.7.0/BUILD/CMakeFiles/po-it-docs-kpackagetool-kpackagetool6-1.dir/DependInfo.cmake "--color="
make[2]: Leaving directory '/usr/src/RPM/BUILD/kpackage-6.7.0/BUILD'
make  -f CMakeFiles/po-it-docs-kpackagetool-kpackagetool6-1.dir/build.make CMakeFiles/po-it-docs-kpackagetool-kpackagetool6-1.dir/build
make[2]: Entering directory '/usr/src/RPM/BUILD/kpackage-6.7.0/BUILD'
make[2]: Nothing to be done for 'CMakeFiles/po-it-docs-kpackagetool-kpackagetool6-1.dir/build'.
make[2]: Leaving directory '/usr/src/RPM/BUILD/kpackage-6.7.0/BUILD'
[ 20%] Built target po-it-docs-kpackagetool-kpackagetool6-1
make  -f CMakeFiles/po-nl-docs-kpackagetool-kpackagetool6-1.dir/build.make CMakeFiles/po-nl-docs-kpackagetool-kpackagetool6-1.dir/depend
make[2]: Entering directory '/usr/src/RPM/BUILD/kpackage-6.7.0/BUILD'
cd /usr/src/RPM/BUILD/kpackage-6.7.0/BUILD && /usr/bin/cmake -E cmake_depends "Unix Makefiles" /usr/src/RPM/BUILD/kpackage-6.7.0 /usr/src/RPM/BUILD/kpackage-6.7.0 /usr/src/RPM/BUILD/kpackage-6.7.0/BUILD /usr/src/RPM/BUILD/kpackage-6.7.0/BUILD /usr/src/RPM/BUILD/kpackage-6.7.0/BUILD/CMakeFiles/po-nl-docs-kpackagetool-kpackagetool6-1.dir/DependInfo.cmake "--color="
make[2]: Leaving directory '/usr/src/RPM/BUILD/kpackage-6.7.0/BUILD'
make  -f CMakeFiles/po-nl-docs-kpackagetool-kpackagetool6-1.dir/build.make CMakeFiles/po-nl-docs-kpackagetool-kpackagetool6-1.dir/build
make[2]: Entering directory '/usr/src/RPM/BUILD/kpackage-6.7.0/BUILD'
make[2]: Nothing to be done for 'CMakeFiles/po-nl-docs-kpackagetool-kpackagetool6-1.dir/build'.
make[2]: Leaving directory '/usr/src/RPM/BUILD/kpackage-6.7.0/BUILD'
[ 23%] Built target po-nl-docs-kpackagetool-kpackagetool6-1
make  -f CMakeFiles/po-pt-BR-docs-kpackagetool-kpackagetool6-1.dir/build.make CMakeFiles/po-pt-BR-docs-kpackagetool-kpackagetool6-1.dir/depend
make[2]: Entering directory '/usr/src/RPM/BUILD/kpackage-6.7.0/BUILD'
cd /usr/src/RPM/BUILD/kpackage-6.7.0/BUILD && /usr/bin/cmake -E cmake_depends "Unix Makefiles" /usr/src/RPM/BUILD/kpackage-6.7.0 /usr/src/RPM/BUILD/kpackage-6.7.0 /usr/src/RPM/BUILD/kpackage-6.7.0/BUILD /usr/src/RPM/BUILD/kpackage-6.7.0/BUILD /usr/src/RPM/BUILD/kpackage-6.7.0/BUILD/CMakeFiles/po-pt-BR-docs-kpackagetool-kpackagetool6-1.dir/DependInfo.cmake "--color="
make[2]: Leaving directory '/usr/src/RPM/BUILD/kpackage-6.7.0/BUILD'
make  -f CMakeFiles/po-pt-BR-docs-kpackagetool-kpackagetool6-1.dir/build.make CMakeFiles/po-pt-BR-docs-kpackagetool-kpackagetool6-1.dir/build
make[2]: Entering directory '/usr/src/RPM/BUILD/kpackage-6.7.0/BUILD'
make[2]: Nothing to be done for 'CMakeFiles/po-pt-BR-docs-kpackagetool-kpackagetool6-1.dir/build'.
make[2]: Leaving directory '/usr/src/RPM/BUILD/kpackage-6.7.0/BUILD'
[ 26%] Built target po-pt-BR-docs-kpackagetool-kpackagetool6-1
make  -f CMakeFiles/po-sl-docs-kpackagetool-kpackagetool6-1.dir/build.make CMakeFiles/po-sl-docs-kpackagetool-kpackagetool6-1.dir/depend
make[2]: Entering directory '/usr/src/RPM/BUILD/kpackage-6.7.0/BUILD'
cd /usr/src/RPM/BUILD/kpackage-6.7.0/BUILD && /usr/bin/cmake -E cmake_depends "Unix Makefiles" /usr/src/RPM/BUILD/kpackage-6.7.0 /usr/src/RPM/BUILD/kpackage-6.7.0 /usr/src/RPM/BUILD/kpackage-6.7.0/BUILD /usr/src/RPM/BUILD/kpackage-6.7.0/BUILD /usr/src/RPM/BUILD/kpackage-6.7.0/BUILD/CMakeFiles/po-sl-docs-kpackagetool-kpackagetool6-1.dir/DependInfo.cmake "--color="
make[2]: Leaving directory '/usr/src/RPM/BUILD/kpackage-6.7.0/BUILD'
make  -f CMakeFiles/po-sl-docs-kpackagetool-kpackagetool6-1.dir/build.make CMakeFiles/po-sl-docs-kpackagetool-kpackagetool6-1.dir/build
make[2]: Entering directory '/usr/src/RPM/BUILD/kpackage-6.7.0/BUILD'
make[2]: Nothing to be done for 'CMakeFiles/po-sl-docs-kpackagetool-kpackagetool6-1.dir/build'.
make[2]: Leaving directory '/usr/src/RPM/BUILD/kpackage-6.7.0/BUILD'
[ 30%] Built target po-sl-docs-kpackagetool-kpackagetool6-1
make  -f CMakeFiles/po-tr-docs-kpackagetool-kpackagetool6-1.dir/build.make CMakeFiles/po-tr-docs-kpackagetool-kpackagetool6-1.dir/depend
make[2]: Entering directory '/usr/src/RPM/BUILD/kpackage-6.7.0/BUILD'
cd /usr/src/RPM/BUILD/kpackage-6.7.0/BUILD && /usr/bin/cmake -E cmake_depends "Unix Makefiles" /usr/src/RPM/BUILD/kpackage-6.7.0 /usr/src/RPM/BUILD/kpackage-6.7.0 /usr/src/RPM/BUILD/kpackage-6.7.0/BUILD /usr/src/RPM/BUILD/kpackage-6.7.0/BUILD /usr/src/RPM/BUILD/kpackage-6.7.0/BUILD/CMakeFiles/po-tr-docs-kpackagetool-kpackagetool6-1.dir/DependInfo.cmake "--color="
make[2]: Leaving directory '/usr/src/RPM/BUILD/kpackage-6.7.0/BUILD'
make  -f CMakeFiles/po-tr-docs-kpackagetool-kpackagetool6-1.dir/build.make CMakeFiles/po-tr-docs-kpackagetool-kpackagetool6-1.dir/build
make[2]: Entering directory '/usr/src/RPM/BUILD/kpackage-6.7.0/BUILD'
make[2]: Nothing to be done for 'CMakeFiles/po-tr-docs-kpackagetool-kpackagetool6-1.dir/build'.
make[2]: Leaving directory '/usr/src/RPM/BUILD/kpackage-6.7.0/BUILD'
[ 33%] Built target po-tr-docs-kpackagetool-kpackagetool6-1
make  -f CMakeFiles/po-uk-docs-kpackagetool-kpackagetool6-1.dir/build.make CMakeFiles/po-uk-docs-kpackagetool-kpackagetool6-1.dir/depend
make[2]: Entering directory '/usr/src/RPM/BUILD/kpackage-6.7.0/BUILD'
cd /usr/src/RPM/BUILD/kpackage-6.7.0/BUILD && /usr/bin/cmake -E cmake_depends "Unix Makefiles" /usr/src/RPM/BUILD/kpackage-6.7.0 /usr/src/RPM/BUILD/kpackage-6.7.0 /usr/src/RPM/BUILD/kpackage-6.7.0/BUILD /usr/src/RPM/BUILD/kpackage-6.7.0/BUILD /usr/src/RPM/BUILD/kpackage-6.7.0/BUILD/CMakeFiles/po-uk-docs-kpackagetool-kpackagetool6-1.dir/DependInfo.cmake "--color="
make[2]: Leaving directory '/usr/src/RPM/BUILD/kpackage-6.7.0/BUILD'
make  -f CMakeFiles/po-uk-docs-kpackagetool-kpackagetool6-1.dir/build.make CMakeFiles/po-uk-docs-kpackagetool-kpackagetool6-1.dir/build
make[2]: Entering directory '/usr/src/RPM/BUILD/kpackage-6.7.0/BUILD'
make[2]: Nothing to be done for 'CMakeFiles/po-uk-docs-kpackagetool-kpackagetool6-1.dir/build'.
make[2]: Leaving directory '/usr/src/RPM/BUILD/kpackage-6.7.0/BUILD'
[ 36%] Built target po-uk-docs-kpackagetool-kpackagetool6-1
make  -f docs/kpackagetool/CMakeFiles/docs-kpackagetool-kpackagetool6-1.dir/build.make docs/kpackagetool/CMakeFiles/docs-kpackagetool-kpackagetool6-1.dir/depend
make[2]: Entering directory '/usr/src/RPM/BUILD/kpackage-6.7.0/BUILD'
cd /usr/src/RPM/BUILD/kpackage-6.7.0/BUILD && /usr/bin/cmake -E cmake_depends "Unix Makefiles" /usr/src/RPM/BUILD/kpackage-6.7.0 /usr/src/RPM/BUILD/kpackage-6.7.0/docs/kpackagetool /usr/src/RPM/BUILD/kpackage-6.7.0/BUILD /usr/src/RPM/BUILD/kpackage-6.7.0/BUILD/docs/kpackagetool /usr/src/RPM/BUILD/kpackage-6.7.0/BUILD/docs/kpackagetool/CMakeFiles/docs-kpackagetool-kpackagetool6-1.dir/DependInfo.cmake "--color="
make[2]: Leaving directory '/usr/src/RPM/BUILD/kpackage-6.7.0/BUILD'
make  -f docs/kpackagetool/CMakeFiles/docs-kpackagetool-kpackagetool6-1.dir/build.make docs/kpackagetool/CMakeFiles/docs-kpackagetool-kpackagetool6-1.dir/build
make[2]: Entering directory '/usr/src/RPM/BUILD/kpackage-6.7.0/BUILD'
make[2]: Nothing to be done for 'docs/kpackagetool/CMakeFiles/docs-kpackagetool-kpackagetool6-1.dir/build'.
make[2]: Leaving directory '/usr/src/RPM/BUILD/kpackage-6.7.0/BUILD'
[ 40%] Built target docs-kpackagetool-kpackagetool6-1
make  -f src/kpackage/CMakeFiles/KF6Package_autogen_timestamp_deps.dir/build.make src/kpackage/CMakeFiles/KF6Package_autogen_timestamp_deps.dir/depend
make[2]: Entering directory '/usr/src/RPM/BUILD/kpackage-6.7.0/BUILD'
cd /usr/src/RPM/BUILD/kpackage-6.7.0/BUILD && /usr/bin/cmake -E cmake_depends "Unix Makefiles" /usr/src/RPM/BUILD/kpackage-6.7.0 /usr/src/RPM/BUILD/kpackage-6.7.0/src/kpackage /usr/src/RPM/BUILD/kpackage-6.7.0/BUILD /usr/src/RPM/BUILD/kpackage-6.7.0/BUILD/src/kpackage /usr/src/RPM/BUILD/kpackage-6.7.0/BUILD/src/kpackage/CMakeFiles/KF6Package_autogen_timestamp_deps.dir/DependInfo.cmake "--color="
make[2]: Leaving directory '/usr/src/RPM/BUILD/kpackage-6.7.0/BUILD'
make  -f src/kpackage/CMakeFiles/KF6Package_autogen_timestamp_deps.dir/build.make src/kpackage/CMakeFiles/KF6Package_autogen_timestamp_deps.dir/build
make[2]: Entering directory '/usr/src/RPM/BUILD/kpackage-6.7.0/BUILD'
make[2]: Nothing to be done for 'src/kpackage/CMakeFiles/KF6Package_autogen_timestamp_deps.dir/build'.
make[2]: Leaving directory '/usr/src/RPM/BUILD/kpackage-6.7.0/BUILD'
[ 40%] Built target KF6Package_autogen_timestamp_deps
make  -f src/kpackage/CMakeFiles/KF6Package_autogen.dir/build.make src/kpackage/CMakeFiles/KF6Package_autogen.dir/depend
make[2]: Entering directory '/usr/src/RPM/BUILD/kpackage-6.7.0/BUILD'
cd /usr/src/RPM/BUILD/kpackage-6.7.0/BUILD && /usr/bin/cmake -E cmake_depends "Unix Makefiles" /usr/src/RPM/BUILD/kpackage-6.7.0 /usr/src/RPM/BUILD/kpackage-6.7.0/src/kpackage /usr/src/RPM/BUILD/kpackage-6.7.0/BUILD /usr/src/RPM/BUILD/kpackage-6.7.0/BUILD/src/kpackage /usr/src/RPM/BUILD/kpackage-6.7.0/BUILD/src/kpackage/CMakeFiles/KF6Package_autogen.dir/DependInfo.cmake "--color="
make[2]: Leaving directory '/usr/src/RPM/BUILD/kpackage-6.7.0/BUILD'
make  -f src/kpackage/CMakeFiles/KF6Package_autogen.dir/build.make src/kpackage/CMakeFiles/KF6Package_autogen.dir/build
make[2]: Entering directory '/usr/src/RPM/BUILD/kpackage-6.7.0/BUILD'
make[2]: Nothing to be done for 'src/kpackage/CMakeFiles/KF6Package_autogen.dir/build'.
make[2]: Leaving directory '/usr/src/RPM/BUILD/kpackage-6.7.0/BUILD'
[ 43%] Built target KF6Package_autogen
make  -f src/kpackage/CMakeFiles/KF6Package.dir/build.make src/kpackage/CMakeFiles/KF6Package.dir/depend
make[2]: Entering directory '/usr/src/RPM/BUILD/kpackage-6.7.0/BUILD'
cd /usr/src/RPM/BUILD/kpackage-6.7.0/BUILD && /usr/bin/cmake -E cmake_depends "Unix Makefiles" /usr/src/RPM/BUILD/kpackage-6.7.0 /usr/src/RPM/BUILD/kpackage-6.7.0/src/kpackage /usr/src/RPM/BUILD/kpackage-6.7.0/BUILD /usr/src/RPM/BUILD/kpackage-6.7.0/BUILD/src/kpackage /usr/src/RPM/BUILD/kpackage-6.7.0/BUILD/src/kpackage/CMakeFiles/KF6Package.dir/DependInfo.cmake "--color="
make[2]: Leaving directory '/usr/src/RPM/BUILD/kpackage-6.7.0/BUILD'
make  -f src/kpackage/CMakeFiles/KF6Package.dir/build.make src/kpackage/CMakeFiles/KF6Package.dir/build
make[2]: Entering directory '/usr/src/RPM/BUILD/kpackage-6.7.0/BUILD'
make[2]: Nothing to be done for 'src/kpackage/CMakeFiles/KF6Package.dir/build'.
make[2]: Leaving directory '/usr/src/RPM/BUILD/kpackage-6.7.0/BUILD'
[ 76%] Built target KF6Package
make  -f src/kpackagetool/CMakeFiles/kpackagetool6_autogen_timestamp_deps.dir/build.make src/kpackagetool/CMakeFiles/kpackagetool6_autogen_timestamp_deps.dir/depend
make[2]: Entering directory '/usr/src/RPM/BUILD/kpackage-6.7.0/BUILD'
cd /usr/src/RPM/BUILD/kpackage-6.7.0/BUILD && /usr/bin/cmake -E cmake_depends "Unix Makefiles" /usr/src/RPM/BUILD/kpackage-6.7.0 /usr/src/RPM/BUILD/kpackage-6.7.0/src/kpackagetool /usr/src/RPM/BUILD/kpackage-6.7.0/BUILD /usr/src/RPM/BUILD/kpackage-6.7.0/BUILD/src/kpackagetool /usr/src/RPM/BUILD/kpackage-6.7.0/BUILD/src/kpackagetool/CMakeFiles/kpackagetool6_autogen_timestamp_deps.dir/DependInfo.cmake "--color="
make[2]: Leaving directory '/usr/src/RPM/BUILD/kpackage-6.7.0/BUILD'
make  -f src/kpackagetool/CMakeFiles/kpackagetool6_autogen_timestamp_deps.dir/build.make src/kpackagetool/CMakeFiles/kpackagetool6_autogen_timestamp_deps.dir/build
make[2]: Entering directory '/usr/src/RPM/BUILD/kpackage-6.7.0/BUILD'
make[2]: Nothing to be done for 'src/kpackagetool/CMakeFiles/kpackagetool6_autogen_timestamp_deps.dir/build'.
make[2]: Leaving directory '/usr/src/RPM/BUILD/kpackage-6.7.0/BUILD'
[ 76%] Built target kpackagetool6_autogen_timestamp_deps
make  -f src/kpackagetool/CMakeFiles/kpackagetool6_autogen.dir/build.make src/kpackagetool/CMakeFiles/kpackagetool6_autogen.dir/depend
make[2]: Entering directory '/usr/src/RPM/BUILD/kpackage-6.7.0/BUILD'
cd /usr/src/RPM/BUILD/kpackage-6.7.0/BUILD && /usr/bin/cmake -E cmake_depends "Unix Makefiles" /usr/src/RPM/BUILD/kpackage-6.7.0 /usr/src/RPM/BUILD/kpackage-6.7.0/src/kpackagetool /usr/src/RPM/BUILD/kpackage-6.7.0/BUILD /usr/src/RPM/BUILD/kpackage-6.7.0/BUILD/src/kpackagetool /usr/src/RPM/BUILD/kpackage-6.7.0/BUILD/src/kpackagetool/CMakeFiles/kpackagetool6_autogen.dir/DependInfo.cmake "--color="
make[2]: Leaving directory '/usr/src/RPM/BUILD/kpackage-6.7.0/BUILD'
make  -f src/kpackagetool/CMakeFiles/kpackagetool6_autogen.dir/build.make src/kpackagetool/CMakeFiles/kpackagetool6_autogen.dir/build
make[2]: Entering directory '/usr/src/RPM/BUILD/kpackage-6.7.0/BUILD'
make[2]: Nothing to be done for 'src/kpackagetool/CMakeFiles/kpackagetool6_autogen.dir/build'.
make[2]: Leaving directory '/usr/src/RPM/BUILD/kpackage-6.7.0/BUILD'
[ 80%] Built target kpackagetool6_autogen
make  -f src/kpackagetool/CMakeFiles/kpackagetool6.dir/build.make src/kpackagetool/CMakeFiles/kpackagetool6.dir/depend
make[2]: Entering directory '/usr/src/RPM/BUILD/kpackage-6.7.0/BUILD'
cd /usr/src/RPM/BUILD/kpackage-6.7.0/BUILD && /usr/bin/cmake -E cmake_depends "Unix Makefiles" /usr/src/RPM/BUILD/kpackage-6.7.0 /usr/src/RPM/BUILD/kpackage-6.7.0/src/kpackagetool /usr/src/RPM/BUILD/kpackage-6.7.0/BUILD /usr/src/RPM/BUILD/kpackage-6.7.0/BUILD/src/kpackagetool /usr/src/RPM/BUILD/kpackage-6.7.0/BUILD/src/kpackagetool/CMakeFiles/kpackagetool6.dir/DependInfo.cmake "--color="
make[2]: Leaving directory '/usr/src/RPM/BUILD/kpackage-6.7.0/BUILD'
make  -f src/kpackagetool/CMakeFiles/kpackagetool6.dir/build.make src/kpackagetool/CMakeFiles/kpackagetool6.dir/build
make[2]: Entering directory '/usr/src/RPM/BUILD/kpackage-6.7.0/BUILD'
make[2]: Nothing to be done for 'src/kpackagetool/CMakeFiles/kpackagetool6.dir/build'.
make[2]: Leaving directory '/usr/src/RPM/BUILD/kpackage-6.7.0/BUILD'
[100%] Built target kpackagetool6
make[1]: Leaving directory '/usr/src/RPM/BUILD/kpackage-6.7.0/BUILD'
/usr/bin/cmake -E cmake_progress_start /usr/src/RPM/BUILD/kpackage-6.7.0/BUILD/CMakeFiles 0
make  -f CMakeFiles/Makefile2 preinstall
make[1]: Entering directory '/usr/src/RPM/BUILD/kpackage-6.7.0/BUILD'
make[1]: Nothing to be done for 'preinstall'.
make[1]: Leaving directory '/usr/src/RPM/BUILD/kpackage-6.7.0/BUILD'
Install the project...
/usr/bin/cmake -P cmake_install.cmake
-- Install configuration: "Release"
-- Installing: /usr/src/tmp/kf6-kpackage-buildroot/usr/share/man/man1/kpackagetool6.1
-- Installing: /usr/src/tmp/kf6-kpackage-buildroot/usr/share/locale
-- Installing: /usr/src/tmp/kf6-kpackage-buildroot/usr/share/locale/zh_TW
-- Installing: /usr/src/tmp/kf6-kpackage-buildroot/usr/share/locale/zh_TW/LC_MESSAGES
-- Installing: /usr/src/tmp/kf6-kpackage-buildroot/usr/share/locale/zh_TW/LC_MESSAGES/libkpackage6.mo
-- Installing: /usr/src/tmp/kf6-kpackage-buildroot/usr/share/locale/zh_CN
-- Installing: /usr/src/tmp/kf6-kpackage-buildroot/usr/share/locale/zh_CN/LC_MESSAGES
-- Installing: /usr/src/tmp/kf6-kpackage-buildroot/usr/share/locale/zh_CN/LC_MESSAGES/libkpackage6.mo
-- Installing: /usr/src/tmp/kf6-kpackage-buildroot/usr/share/locale/uk
-- Installing: /usr/src/tmp/kf6-kpackage-buildroot/usr/share/locale/uk/LC_MESSAGES
-- Installing: /usr/src/tmp/kf6-kpackage-buildroot/usr/share/locale/uk/LC_MESSAGES/libkpackage6.mo
-- Installing: /usr/src/tmp/kf6-kpackage-buildroot/usr/share/locale/ug
-- Installing: /usr/src/tmp/kf6-kpackage-buildroot/usr/share/locale/ug/LC_MESSAGES
-- Installing: /usr/src/tmp/kf6-kpackage-buildroot/usr/share/locale/ug/LC_MESSAGES/libkpackage6.mo
-- Installing: /usr/src/tmp/kf6-kpackage-buildroot/usr/share/locale/tr
-- Installing: /usr/src/tmp/kf6-kpackage-buildroot/usr/share/locale/tr/LC_MESSAGES
-- Installing: /usr/src/tmp/kf6-kpackage-buildroot/usr/share/locale/tr/LC_MESSAGES/libkpackage6.mo
-- Installing: /usr/src/tmp/kf6-kpackage-buildroot/usr/share/locale/tg
-- Installing: /usr/src/tmp/kf6-kpackage-buildroot/usr/share/locale/tg/LC_MESSAGES
-- Installing: /usr/src/tmp/kf6-kpackage-buildroot/usr/share/locale/tg/LC_MESSAGES/libkpackage6.mo
-- Installing: /usr/src/tmp/kf6-kpackage-buildroot/usr/share/locale/ta
-- Installing: /usr/src/tmp/kf6-kpackage-buildroot/usr/share/locale/ta/LC_MESSAGES
-- Installing: /usr/src/tmp/kf6-kpackage-buildroot/usr/share/locale/ta/LC_MESSAGES/libkpackage6.mo
-- Installing: /usr/src/tmp/kf6-kpackage-buildroot/usr/share/locale/sv
-- Installing: /usr/src/tmp/kf6-kpackage-buildroot/usr/share/locale/sv/LC_MESSAGES
-- Installing: /usr/src/tmp/kf6-kpackage-buildroot/usr/share/locale/sv/LC_MESSAGES/libkpackage6.mo
-- Installing: /usr/src/tmp/kf6-kpackage-buildroot/usr/share/locale/sr@latin
-- Installing: /usr/src/tmp/kf6-kpackage-buildroot/usr/share/locale/sr@latin/LC_MESSAGES
-- Installing: /usr/src/tmp/kf6-kpackage-buildroot/usr/share/locale/sr@latin/LC_MESSAGES/libkpackage6.mo
-- Installing: /usr/src/tmp/kf6-kpackage-buildroot/usr/share/locale/sr@ijekavianlatin
-- Installing: /usr/src/tmp/kf6-kpackage-buildroot/usr/share/locale/sr@ijekavianlatin/LC_MESSAGES
-- Installing: /usr/src/tmp/kf6-kpackage-buildroot/usr/share/locale/sr@ijekavianlatin/LC_MESSAGES/libkpackage6.mo
-- Installing: /usr/src/tmp/kf6-kpackage-buildroot/usr/share/locale/sr@ijekavian
-- Installing: /usr/src/tmp/kf6-kpackage-buildroot/usr/share/locale/sr@ijekavian/LC_MESSAGES
-- Installing: /usr/src/tmp/kf6-kpackage-buildroot/usr/share/locale/sr@ijekavian/LC_MESSAGES/libkpackage6.mo
-- Installing: /usr/src/tmp/kf6-kpackage-buildroot/usr/share/locale/sr
-- Installing: /usr/src/tmp/kf6-kpackage-buildroot/usr/share/locale/sr/LC_MESSAGES
-- Installing: /usr/src/tmp/kf6-kpackage-buildroot/usr/share/locale/sr/LC_MESSAGES/libkpackage6.mo
-- Installing: /usr/src/tmp/kf6-kpackage-buildroot/usr/share/locale/sl
-- Installing: /usr/src/tmp/kf6-kpackage-buildroot/usr/share/locale/sl/LC_MESSAGES
-- Installing: /usr/src/tmp/kf6-kpackage-buildroot/usr/share/locale/sl/LC_MESSAGES/libkpackage6.mo
-- Installing: /usr/src/tmp/kf6-kpackage-buildroot/usr/share/locale/sk
-- Installing: /usr/src/tmp/kf6-kpackage-buildroot/usr/share/locale/sk/LC_MESSAGES
-- Installing: /usr/src/tmp/kf6-kpackage-buildroot/usr/share/locale/sk/LC_MESSAGES/libkpackage6.mo
-- Installing: /usr/src/tmp/kf6-kpackage-buildroot/usr/share/locale/ru
-- Installing: /usr/src/tmp/kf6-kpackage-buildroot/usr/share/locale/ru/LC_MESSAGES
-- Installing: /usr/src/tmp/kf6-kpackage-buildroot/usr/share/locale/ru/LC_MESSAGES/libkpackage6.mo
-- Installing: /usr/src/tmp/kf6-kpackage-buildroot/usr/share/locale/ro
-- Installing: /usr/src/tmp/kf6-kpackage-buildroot/usr/share/locale/ro/LC_MESSAGES
-- Installing: /usr/src/tmp/kf6-kpackage-buildroot/usr/share/locale/ro/LC_MESSAGES/libkpackage6.mo
-- Installing: /usr/src/tmp/kf6-kpackage-buildroot/usr/share/locale/pt_BR
-- Installing: /usr/src/tmp/kf6-kpackage-buildroot/usr/share/locale/pt_BR/LC_MESSAGES
-- Installing: /usr/src/tmp/kf6-kpackage-buildroot/usr/share/locale/pt_BR/LC_MESSAGES/libkpackage6.mo
-- Installing: /usr/src/tmp/kf6-kpackage-buildroot/usr/share/locale/pt
-- Installing: /usr/src/tmp/kf6-kpackage-buildroot/usr/share/locale/pt/LC_MESSAGES
-- Installing: /usr/src/tmp/kf6-kpackage-buildroot/usr/share/locale/pt/LC_MESSAGES/libkpackage6.mo
-- Installing: /usr/src/tmp/kf6-kpackage-buildroot/usr/share/locale/pl
-- Installing: /usr/src/tmp/kf6-kpackage-buildroot/usr/share/locale/pl/LC_MESSAGES
-- Installing: /usr/src/tmp/kf6-kpackage-buildroot/usr/share/locale/pl/LC_MESSAGES/libkpackage6.mo
-- Installing: /usr/src/tmp/kf6-kpackage-buildroot/usr/share/locale/pa
-- Installing: /usr/src/tmp/kf6-kpackage-buildroot/usr/share/locale/pa/LC_MESSAGES
-- Installing: /usr/src/tmp/kf6-kpackage-buildroot/usr/share/locale/pa/LC_MESSAGES/libkpackage6.mo
-- Installing: /usr/src/tmp/kf6-kpackage-buildroot/usr/share/locale/nn
-- Installing: /usr/src/tmp/kf6-kpackage-buildroot/usr/share/locale/nn/LC_MESSAGES
-- Installing: /usr/src/tmp/kf6-kpackage-buildroot/usr/share/locale/nn/LC_MESSAGES/libkpackage6.mo
-- Installing: /usr/src/tmp/kf6-kpackage-buildroot/usr/share/locale/nl
-- Installing: /usr/src/tmp/kf6-kpackage-buildroot/usr/share/locale/nl/LC_MESSAGES
-- Installing: /usr/src/tmp/kf6-kpackage-buildroot/usr/share/locale/nl/LC_MESSAGES/libkpackage6.mo
-- Installing: /usr/src/tmp/kf6-kpackage-buildroot/usr/share/locale/nds
-- Installing: /usr/src/tmp/kf6-kpackage-buildroot/usr/share/locale/nds/LC_MESSAGES
-- Installing: /usr/src/tmp/kf6-kpackage-buildroot/usr/share/locale/nds/LC_MESSAGES/libkpackage6.mo
-- Installing: /usr/src/tmp/kf6-kpackage-buildroot/usr/share/locale/nb
-- Installing: /usr/src/tmp/kf6-kpackage-buildroot/usr/share/locale/nb/LC_MESSAGES
-- Installing: /usr/src/tmp/kf6-kpackage-buildroot/usr/share/locale/nb/LC_MESSAGES/libkpackage6.mo
-- Installing: /usr/src/tmp/kf6-kpackage-buildroot/usr/share/locale/mr
-- Installing: /usr/src/tmp/kf6-kpackage-buildroot/usr/share/locale/mr/LC_MESSAGES
-- Installing: /usr/src/tmp/kf6-kpackage-buildroot/usr/share/locale/mr/LC_MESSAGES/libkpackage6.mo
-- Installing: /usr/src/tmp/kf6-kpackage-buildroot/usr/share/locale/ml
-- Installing: /usr/src/tmp/kf6-kpackage-buildroot/usr/share/locale/ml/LC_MESSAGES
-- Installing: /usr/src/tmp/kf6-kpackage-buildroot/usr/share/locale/ml/LC_MESSAGES/libkpackage6.mo
-- Installing: /usr/src/tmp/kf6-kpackage-buildroot/usr/share/locale/lv
-- Installing: /usr/src/tmp/kf6-kpackage-buildroot/usr/share/locale/lv/LC_MESSAGES
-- Installing: /usr/src/tmp/kf6-kpackage-buildroot/usr/share/locale/lv/LC_MESSAGES/libkpackage6.mo
-- Installing: /usr/src/tmp/kf6-kpackage-buildroot/usr/share/locale/lt
-- Installing: /usr/src/tmp/kf6-kpackage-buildroot/usr/share/locale/lt/LC_MESSAGES
-- Installing: /usr/src/tmp/kf6-kpackage-buildroot/usr/share/locale/lt/LC_MESSAGES/libkpackage6.mo
-- Installing: /usr/src/tmp/kf6-kpackage-buildroot/usr/share/locale/ko
-- Installing: /usr/src/tmp/kf6-kpackage-buildroot/usr/share/locale/ko/LC_MESSAGES
-- Installing: /usr/src/tmp/kf6-kpackage-buildroot/usr/share/locale/ko/LC_MESSAGES/libkpackage6.mo
-- Installing: /usr/src/tmp/kf6-kpackage-buildroot/usr/share/locale/ka
-- Installing: /usr/src/tmp/kf6-kpackage-buildroot/usr/share/locale/ka/LC_MESSAGES
-- Installing: /usr/src/tmp/kf6-kpackage-buildroot/usr/share/locale/ka/LC_MESSAGES/libkpackage6.mo
-- Installing: /usr/src/tmp/kf6-kpackage-buildroot/usr/share/locale/ja
-- Installing: /usr/src/tmp/kf6-kpackage-buildroot/usr/share/locale/ja/LC_MESSAGES
-- Installing: /usr/src/tmp/kf6-kpackage-buildroot/usr/share/locale/ja/LC_MESSAGES/libkpackage6.mo
-- Installing: /usr/src/tmp/kf6-kpackage-buildroot/usr/share/locale/it
-- Installing: /usr/src/tmp/kf6-kpackage-buildroot/usr/share/locale/it/LC_MESSAGES
-- Installing: /usr/src/tmp/kf6-kpackage-buildroot/usr/share/locale/it/LC_MESSAGES/libkpackage6.mo
-- Installing: /usr/src/tmp/kf6-kpackage-buildroot/usr/share/locale/id
-- Installing: /usr/src/tmp/kf6-kpackage-buildroot/usr/share/locale/id/LC_MESSAGES
-- Installing: /usr/src/tmp/kf6-kpackage-buildroot/usr/share/locale/id/LC_MESSAGES/libkpackage6.mo
-- Installing: /usr/src/tmp/kf6-kpackage-buildroot/usr/share/locale/ia
-- Installing: /usr/src/tmp/kf6-kpackage-buildroot/usr/share/locale/ia/LC_MESSAGES
-- Installing: /usr/src/tmp/kf6-kpackage-buildroot/usr/share/locale/ia/LC_MESSAGES/libkpackage6.mo
-- Installing: /usr/src/tmp/kf6-kpackage-buildroot/usr/share/locale/hu
-- Installing: /usr/src/tmp/kf6-kpackage-buildroot/usr/share/locale/hu/LC_MESSAGES
-- Installing: /usr/src/tmp/kf6-kpackage-buildroot/usr/share/locale/hu/LC_MESSAGES/libkpackage6.mo
-- Installing: /usr/src/tmp/kf6-kpackage-buildroot/usr/share/locale/he
-- Installing: /usr/src/tmp/kf6-kpackage-buildroot/usr/share/locale/he/LC_MESSAGES
-- Installing: /usr/src/tmp/kf6-kpackage-buildroot/usr/share/locale/he/LC_MESSAGES/libkpackage6.mo
-- Installing: /usr/src/tmp/kf6-kpackage-buildroot/usr/share/locale/gl
-- Installing: /usr/src/tmp/kf6-kpackage-buildroot/usr/share/locale/gl/LC_MESSAGES
-- Installing: /usr/src/tmp/kf6-kpackage-buildroot/usr/share/locale/gl/LC_MESSAGES/libkpackage6.mo
-- Installing: /usr/src/tmp/kf6-kpackage-buildroot/usr/share/locale/gd
-- Installing: /usr/src/tmp/kf6-kpackage-buildroot/usr/share/locale/gd/LC_MESSAGES
-- Installing: /usr/src/tmp/kf6-kpackage-buildroot/usr/share/locale/gd/LC_MESSAGES/libkpackage6.mo
-- Installing: /usr/src/tmp/kf6-kpackage-buildroot/usr/share/locale/fr
-- Installing: /usr/src/tmp/kf6-kpackage-buildroot/usr/share/locale/fr/LC_MESSAGES
-- Installing: /usr/src/tmp/kf6-kpackage-buildroot/usr/share/locale/fr/LC_MESSAGES/libkpackage6.mo
-- Installing: /usr/src/tmp/kf6-kpackage-buildroot/usr/share/locale/fi
-- Installing: /usr/src/tmp/kf6-kpackage-buildroot/usr/share/locale/fi/LC_MESSAGES
-- Installing: /usr/src/tmp/kf6-kpackage-buildroot/usr/share/locale/fi/LC_MESSAGES/libkpackage6.mo
-- Installing: /usr/src/tmp/kf6-kpackage-buildroot/usr/share/locale/eu
-- Installing: /usr/src/tmp/kf6-kpackage-buildroot/usr/share/locale/eu/LC_MESSAGES
-- Installing: /usr/src/tmp/kf6-kpackage-buildroot/usr/share/locale/eu/LC_MESSAGES/libkpackage6.mo
-- Installing: /usr/src/tmp/kf6-kpackage-buildroot/usr/share/locale/et
-- Installing: /usr/src/tmp/kf6-kpackage-buildroot/usr/share/locale/et/LC_MESSAGES
-- Installing: /usr/src/tmp/kf6-kpackage-buildroot/usr/share/locale/et/LC_MESSAGES/libkpackage6.mo
-- Installing: /usr/src/tmp/kf6-kpackage-buildroot/usr/share/locale/es
-- Installing: /usr/src/tmp/kf6-kpackage-buildroot/usr/share/locale/es/LC_MESSAGES
-- Installing: /usr/src/tmp/kf6-kpackage-buildroot/usr/share/locale/es/LC_MESSAGES/libkpackage6.mo
-- Installing: /usr/src/tmp/kf6-kpackage-buildroot/usr/share/locale/eo
-- Installing: /usr/src/tmp/kf6-kpackage-buildroot/usr/share/locale/eo/LC_MESSAGES
-- Installing: /usr/src/tmp/kf6-kpackage-buildroot/usr/share/locale/eo/LC_MESSAGES/libkpackage6.mo
-- Installing: /usr/src/tmp/kf6-kpackage-buildroot/usr/share/locale/en_GB
-- Installing: /usr/src/tmp/kf6-kpackage-buildroot/usr/share/locale/en_GB/LC_MESSAGES
-- Installing: /usr/src/tmp/kf6-kpackage-buildroot/usr/share/locale/en_GB/LC_MESSAGES/libkpackage6.mo
-- Installing: /usr/src/tmp/kf6-kpackage-buildroot/usr/share/locale/el
-- Installing: /usr/src/tmp/kf6-kpackage-buildroot/usr/share/locale/el/LC_MESSAGES
-- Installing: /usr/src/tmp/kf6-kpackage-buildroot/usr/share/locale/el/LC_MESSAGES/libkpackage6.mo
-- Installing: /usr/src/tmp/kf6-kpackage-buildroot/usr/share/locale/de
-- Installing: /usr/src/tmp/kf6-kpackage-buildroot/usr/share/locale/de/LC_MESSAGES
-- Installing: /usr/src/tmp/kf6-kpackage-buildroot/usr/share/locale/de/LC_MESSAGES/libkpackage6.mo
-- Installing: /usr/src/tmp/kf6-kpackage-buildroot/usr/share/locale/da
-- Installing: /usr/src/tmp/kf6-kpackage-buildroot/usr/share/locale/da/LC_MESSAGES
-- Installing: /usr/src/tmp/kf6-kpackage-buildroot/usr/share/locale/da/LC_MESSAGES/libkpackage6.mo
-- Installing: /usr/src/tmp/kf6-kpackage-buildroot/usr/share/locale/cs
-- Installing: /usr/src/tmp/kf6-kpackage-buildroot/usr/share/locale/cs/LC_MESSAGES
-- Installing: /usr/src/tmp/kf6-kpackage-buildroot/usr/share/locale/cs/LC_MESSAGES/libkpackage6.mo
-- Installing: /usr/src/tmp/kf6-kpackage-buildroot/usr/share/locale/ca@valencia
-- Installing: /usr/src/tmp/kf6-kpackage-buildroot/usr/share/locale/ca@valencia/LC_MESSAGES
-- Installing: /usr/src/tmp/kf6-kpackage-buildroot/usr/share/locale/ca@valencia/LC_MESSAGES/libkpackage6.mo
-- Installing: /usr/src/tmp/kf6-kpackage-buildroot/usr/share/locale/ca
-- Installing: /usr/src/tmp/kf6-kpackage-buildroot/usr/share/locale/ca/LC_MESSAGES
-- Installing: /usr/src/tmp/kf6-kpackage-buildroot/usr/share/locale/ca/LC_MESSAGES/libkpackage6.mo
-- Installing: /usr/src/tmp/kf6-kpackage-buildroot/usr/share/locale/bs
-- Installing: /usr/src/tmp/kf6-kpackage-buildroot/usr/share/locale/bs/LC_MESSAGES
-- Installing: /usr/src/tmp/kf6-kpackage-buildroot/usr/share/locale/bs/LC_MESSAGES/libkpackage6.mo
-- Installing: /usr/src/tmp/kf6-kpackage-buildroot/usr/share/locale/bg
-- Installing: /usr/src/tmp/kf6-kpackage-buildroot/usr/share/locale/bg/LC_MESSAGES
-- Installing: /usr/src/tmp/kf6-kpackage-buildroot/usr/share/locale/bg/LC_MESSAGES/libkpackage6.mo
-- Installing: /usr/src/tmp/kf6-kpackage-buildroot/usr/share/locale/az
-- Installing: /usr/src/tmp/kf6-kpackage-buildroot/usr/share/locale/az/LC_MESSAGES
-- Installing: /usr/src/tmp/kf6-kpackage-buildroot/usr/share/locale/az/LC_MESSAGES/libkpackage6.mo
-- Installing: /usr/src/tmp/kf6-kpackage-buildroot/usr/share/locale/ast
-- Installing: /usr/src/tmp/kf6-kpackage-buildroot/usr/share/locale/ast/LC_MESSAGES
-- Installing: /usr/src/tmp/kf6-kpackage-buildroot/usr/share/locale/ast/LC_MESSAGES/libkpackage6.mo
-- Installing: /usr/src/tmp/kf6-kpackage-buildroot/usr/share/locale/ar
-- Installing: /usr/src/tmp/kf6-kpackage-buildroot/usr/share/locale/ar/LC_MESSAGES
-- Installing: /usr/src/tmp/kf6-kpackage-buildroot/usr/share/locale/ar/LC_MESSAGES/libkpackage6.mo
-- Installing: /usr/src/tmp/kf6-kpackage-buildroot/usr/share/man/ca/man1/kpackagetool6.1
-- Installing: /usr/src/tmp/kf6-kpackage-buildroot/usr/share/man/es/man1/kpackagetool6.1
-- Installing: /usr/src/tmp/kf6-kpackage-buildroot/usr/share/man/fr/man1/kpackagetool6.1
-- Installing: /usr/src/tmp/kf6-kpackage-buildroot/usr/share/man/it/man1/kpackagetool6.1
-- Installing: /usr/src/tmp/kf6-kpackage-buildroot/usr/share/man/nl/man1/kpackagetool6.1
-- Installing: /usr/src/tmp/kf6-kpackage-buildroot/usr/share/man/pt_BR/man1/kpackagetool6.1
-- Installing: /usr/src/tmp/kf6-kpackage-buildroot/usr/share/man/sl/man1/kpackagetool6.1
-- Installing: /usr/src/tmp/kf6-kpackage-buildroot/usr/share/man/tr/man1/kpackagetool6.1
-- Installing: /usr/src/tmp/kf6-kpackage-buildroot/usr/share/man/uk/man1/kpackagetool6.1
-- Installing: /usr/src/tmp/kf6-kpackage-buildroot/usr/include/KF6/KPackage/kpackage/package.h
-- Installing: /usr/src/tmp/kf6-kpackage-buildroot/usr/include/KF6/KPackage/kpackage/packagestructure.h
-- Installing: /usr/src/tmp/kf6-kpackage-buildroot/usr/include/KF6/KPackage/kpackage/packageloader.h
-- Installing: /usr/src/tmp/kf6-kpackage-buildroot/usr/include/KF6/KPackage/kpackage/packagejob.h
-- Installing: /usr/src/tmp/kf6-kpackage-buildroot/usr/include/KF6/KPackage/kpackage/packagestructure_compat_p.h
-- Installing: /usr/src/tmp/kf6-kpackage-buildroot/usr/include/KF6/KPackage/kpackage/package_export.h
-- Installing: /usr/src/tmp/kf6-kpackage-buildroot/usr/include/KF6/KPackage/KPackage/Package
-- Installing: /usr/src/tmp/kf6-kpackage-buildroot/usr/include/KF6/KPackage/KPackage/PackageStructure
-- Installing: /usr/src/tmp/kf6-kpackage-buildroot/usr/include/KF6/KPackage/KPackage/PackageLoader
-- Installing: /usr/src/tmp/kf6-kpackage-buildroot/usr/include/KF6/KPackage/KPackage/PackageJob
-- Installing: /usr/src/tmp/kf6-kpackage-buildroot/usr/include/KF6/KPackage/KPackage/packagestructure_compat_p
-- Installing: /usr/src/tmp/kf6-kpackage-buildroot/usr/lib/libKF6Package.so.6.7.0
-- Installing: /usr/src/tmp/kf6-kpackage-buildroot/usr/lib/libKF6Package.so.6
-- Installing: /usr/src/tmp/kf6-kpackage-buildroot/usr/lib/libKF6Package.so
-- Installing: /usr/src/tmp/kf6-kpackage-buildroot/usr/lib/kf6/bin/kpackagetool6
-- Installing: /usr/src/tmp/kf6-kpackage-buildroot/usr/share/qlogging-categories6/kpackage.categories
-- Installing: /usr/src/tmp/kf6-kpackage-buildroot/usr/share/qlogging-categories6/kpackage.renamecategories
-- Installing: /usr/src/tmp/kf6-kpackage-buildroot/usr/lib/cmake/KF6Package/KF6PackageConfig.cmake
-- Installing: /usr/src/tmp/kf6-kpackage-buildroot/usr/lib/cmake/KF6Package/KF6PackageConfigVersion.cmake
-- Installing: /usr/src/tmp/kf6-kpackage-buildroot/usr/lib/cmake/KF6Package/KF6PackageMacros.cmake
-- Installing: /usr/src/tmp/kf6-kpackage-buildroot/usr/lib/cmake/KF6Package/KF6PackageTargets.cmake
-- Installing: /usr/src/tmp/kf6-kpackage-buildroot/usr/lib/cmake/KF6Package/KF6PackageTargets-release.cmake
-- Installing: /usr/src/tmp/kf6-kpackage-buildroot/usr/lib/cmake/KF6Package/KF6PackageToolsTargets.cmake
-- Installing: /usr/src/tmp/kf6-kpackage-buildroot/usr/lib/cmake/KF6Package/KF6PackageToolsTargets-release.cmake
-- Installing: /usr/src/tmp/kf6-kpackage-buildroot/usr/include/KF6/KPackage/kpackage_version.h
make: Leaving directory '/usr/src/RPM/BUILD/kpackage-6.7.0/BUILD'
+ '[' -d /usr/src/tmp/kf6-kpackage-buildroot//usr/share ']'
+ ls -1d '/usr/src/tmp/kf6-kpackage-buildroot//usr/share/kf6/*k*6'
+ read d
ls: cannot access '/usr/src/tmp/kf6-kpackage-buildroot//usr/share/kf6/*k*6': No such file or directory
+ '[' -d /usr/src/tmp/kf6-kpackage-buildroot//usr/share/kf6/lib64 ']'
+ '[' -d /usr/src/tmp/kf6-kpackage-buildroot//usr/share/kf6/lib ']'
+ '[' /usr/lib/kf6/devel '!=' /usr/lib ']'
+ ls -1 /usr/src/tmp/kf6-kpackage-buildroot//usr/lib/libKF6Package.so
+ read p
+ '[' -L /usr/src/tmp/kf6-kpackage-buildroot//usr/lib/libKF6Package.so ']'
+ mkdir -p /usr/src/tmp/kf6-kpackage-buildroot//usr/lib/kf6/devel
++ readlink /usr/src/tmp/kf6-kpackage-buildroot//usr/lib/libKF6Package.so
+ f=libKF6Package.so.6
++ basename /usr/src/tmp/kf6-kpackage-buildroot//usr/lib/libKF6Package.so
+ l=libKF6Package.so
++ relative /usr/src/tmp/kf6-kpackage-buildroot//usr/lib/libKF6Package.so.6 /usr/src/tmp/kf6-kpackage-buildroot//usr/lib/kf6/devel/libKF6Package.so.6
+ ln -sf ../../libKF6Package.so.6 /usr/src/tmp/kf6-kpackage-buildroot//usr/lib/kf6/devel/libKF6Package.so
+ rm -f /usr/src/tmp/kf6-kpackage-buildroot//usr/lib/libKF6Package.so
+ read p
+ '[' -d /usr/src/tmp/kf6-kpackage-buildroot//usr/share/kf6/bin ']'
+ '[' -d /usr/src/tmp/kf6-kpackage-buildroot//usr/share/kf6/include ']'
+ '[' -d /usr/src/tmp/kf6-kpackage-buildroot//usr/lib/kf6/bin -a true == true ']'
+ mkdir -p /usr/src/tmp/kf6-kpackage-buildroot//usr/bin
+ ls -1d /usr/src/tmp/kf6-kpackage-buildroot//usr/lib/kf6/bin/kpackagetool6
+ read b
++ relative /usr/src/tmp/kf6-kpackage-buildroot//usr/lib/kf6/bin/kpackagetool6 /usr/src/tmp/kf6-kpackage-buildroot//usr/bin/
+ ln -s ../lib/kf6/bin/kpackagetool6 /usr/src/tmp/kf6-kpackage-buildroot//usr/bin/
+ read b
+ ls -1 '/usr/src/tmp/kf6-kpackage-buildroot//usr/share/dbus-1/services/*6*.service'
+ read s
+ '[' -d /usr/src/tmp/kf6-kpackage-buildroot//usr/share/man -a remove == remove ']'
+ rm -rf /usr/src/tmp/kf6-kpackage-buildroot//usr/share/man/ca /usr/src/tmp/kf6-kpackage-buildroot//usr/share/man/es /usr/src/tmp/kf6-kpackage-buildroot//usr/share/man/fr /usr/src/tmp/kf6-kpackage-buildroot//usr/share/man/it /usr/src/tmp/kf6-kpackage-buildroot//usr/share/man/man1 /usr/src/tmp/kf6-kpackage-buildroot//usr/share/man/nl /usr/src/tmp/kf6-kpackage-buildroot//usr/share/man/pt_BR /usr/src/tmp/kf6-kpackage-buildroot//usr/share/man/sl /usr/src/tmp/kf6-kpackage-buildroot//usr/share/man/tr /usr/src/tmp/kf6-kpackage-buildroot//usr/share/man/uk
+ '[' -d /usr/src/tmp/kf6-kpackage-buildroot//usr/share/appdata -a keep == remove ']'
+ '[' -d /usr/src/tmp/kf6-kpackage-buildroot//usr/share/metainfo -a keep == remove ']'
+ '[' -d /usr/src/tmp/kf6-kpackage-buildroot//usr/lib/cmake/ ']'
+ find /usr/src/tmp/kf6-kpackage-buildroot//usr/lib/cmake/ -type f -name '*.cmake'
+ read f
+ sed -i -e 's|\(set(.*\)${PACKAGE_PREFIX_DIR}//usr/|\1${PACKAGE_PREFIX_DIR}/|' /usr/src/tmp/kf6-kpackage-buildroot//usr/lib/cmake/KF6Package/KF6PackageToolsTargets-release.cmake
+ sed -i -e 's|/usr//usr/|/usr/|' /usr/src/tmp/kf6-kpackage-buildroot//usr/lib/cmake/KF6Package/KF6PackageToolsTargets-release.cmake
+ read f
+ sed -i -e 's|\(set(.*\)${PACKAGE_PREFIX_DIR}//usr/|\1${PACKAGE_PREFIX_DIR}/|' /usr/src/tmp/kf6-kpackage-buildroot//usr/lib/cmake/KF6Package/KF6PackageToolsTargets.cmake
+ sed -i -e 's|/usr//usr/|/usr/|' /usr/src/tmp/kf6-kpackage-buildroot//usr/lib/cmake/KF6Package/KF6PackageToolsTargets.cmake
+ read f
+ sed -i -e 's|\(set(.*\)${PACKAGE_PREFIX_DIR}//usr/|\1${PACKAGE_PREFIX_DIR}/|' /usr/src/tmp/kf6-kpackage-buildroot//usr/lib/cmake/KF6Package/KF6PackageTargets-release.cmake
+ sed -i -e 's|/usr//usr/|/usr/|' /usr/src/tmp/kf6-kpackage-buildroot//usr/lib/cmake/KF6Package/KF6PackageTargets-release.cmake
+ read f
+ sed -i -e 's|\(set(.*\)${PACKAGE_PREFIX_DIR}//usr/|\1${PACKAGE_PREFIX_DIR}/|' /usr/src/tmp/kf6-kpackage-buildroot//usr/lib/cmake/KF6Package/KF6PackageTargets.cmake
+ sed -i -e 's|/usr//usr/|/usr/|' /usr/src/tmp/kf6-kpackage-buildroot//usr/lib/cmake/KF6Package/KF6PackageTargets.cmake
+ read f
+ sed -i -e 's|\(set(.*\)${PACKAGE_PREFIX_DIR}//usr/|\1${PACKAGE_PREFIX_DIR}/|' /usr/src/tmp/kf6-kpackage-buildroot//usr/lib/cmake/KF6Package/KF6PackageMacros.cmake
+ sed -i -e 's|/usr//usr/|/usr/|' /usr/src/tmp/kf6-kpackage-buildroot//usr/lib/cmake/KF6Package/KF6PackageMacros.cmake
+ read f
+ sed -i -e 's|\(set(.*\)${PACKAGE_PREFIX_DIR}//usr/|\1${PACKAGE_PREFIX_DIR}/|' /usr/src/tmp/kf6-kpackage-buildroot//usr/lib/cmake/KF6Package/KF6PackageConfigVersion.cmake
+ sed -i -e 's|/usr//usr/|/usr/|' /usr/src/tmp/kf6-kpackage-buildroot//usr/lib/cmake/KF6Package/KF6PackageConfigVersion.cmake
+ read f
+ sed -i -e 's|\(set(.*\)${PACKAGE_PREFIX_DIR}//usr/|\1${PACKAGE_PREFIX_DIR}/|' /usr/src/tmp/kf6-kpackage-buildroot//usr/lib/cmake/KF6Package/KF6PackageConfig.cmake
+ sed -i -e 's|/usr//usr/|/usr/|' /usr/src/tmp/kf6-kpackage-buildroot//usr/lib/cmake/KF6Package/KF6PackageConfig.cmake
+ read f
+ /usr/lib/rpm/find-lang kf6-kpackage --all-name
+ rpm-build-kf6-find-qtlang kf6-kpackage --all-name
+ /usr/lib/rpm/brp-alt
Cleaning files in /usr/src/tmp/kf6-kpackage-buildroot (auto)
mode of './usr/lib/libKF6Package.so.6.7.0' changed from 0755 (rwxr-xr-x) to 0644 (rw-r--r--)
Verifying and fixing files in /usr/src/tmp/kf6-kpackage-buildroot (binconfig,pkgconfig,libtool,desktop,gnuconfig)
Checking contents of files in /usr/src/tmp/kf6-kpackage-buildroot/ (default)
Compressing files in /usr/src/tmp/kf6-kpackage-buildroot (auto)
Adjusting library links in /usr/src/tmp/kf6-kpackage-buildroot
./usr/lib: (from <cmdline>:0)
	libKF6Package.so.6 -> libKF6Package.so.6.7.0
Verifying ELF objects in /usr/src/tmp/kf6-kpackage-buildroot (arch=normal,fhs=normal,lfs=relaxed,lint=relaxed,rpath=normal,stack=normal,textrel=normal,unresolved=normal)
Splitting links to aliased files under /{,s}bin in /usr/src/tmp/kf6-kpackage-buildroot
Processing files: kf6-kpackage-common-6.7.0-alt1
Executing(%doc): /bin/sh -e /usr/src/tmp/rpm-tmp.39885
+ umask 022
+ /bin/mkdir -p /usr/src/RPM/BUILD
+ cd /usr/src/RPM/BUILD
+ cd kpackage-6.7.0
+ DOCDIR=/usr/src/tmp/kf6-kpackage-buildroot/usr/share/doc/kf6-kpackage-common-6.7.0
+ export DOCDIR
+ rm -rf /usr/src/tmp/kf6-kpackage-buildroot/usr/share/doc/kf6-kpackage-common-6.7.0
+ /bin/mkdir -p /usr/src/tmp/kf6-kpackage-buildroot/usr/share/doc/kf6-kpackage-common-6.7.0
+ cp -prL LICENSES/CC0-1.0.txt LICENSES/GPL-2.0-or-later.txt LICENSES/LGPL-2.0-or-later.txt README.md /usr/src/tmp/kf6-kpackage-buildroot/usr/share/doc/kf6-kpackage-common-6.7.0
+ chmod -R go-w /usr/src/tmp/kf6-kpackage-buildroot/usr/share/doc/kf6-kpackage-common-6.7.0
+ chmod -R a+rX /usr/src/tmp/kf6-kpackage-buildroot/usr/share/doc/kf6-kpackage-common-6.7.0
+ exit 0
Finding Provides (using /usr/lib/rpm/find-provides)
Executing: /bin/sh -e /usr/src/tmp/rpm-tmp.P11PrT
find-provides: running scripts (alternatives,debuginfo,lib,pam,perl,pkgconfig,python,python3,qml6,shell)
Finding Requires (using /usr/lib/rpm/find-requires)
Executing: /bin/sh -e /usr/src/tmp/rpm-tmp.A7Mejm
find-requires: running scripts (cpp,debuginfo,files,lib,pam,perl,pkgconfig,pkgconfiglib,python,python3,qml6,rpmlib,shebang,shell,static,symlinks,systemd-services)
Requires: kde-common
Processing files: kf6-kpackage-devel-6.7.0-alt1
Finding Provides (using /usr/lib/rpm/find-provides)
Executing: /bin/sh -e /usr/src/tmp/rpm-tmp.9cfdsq
find-provides: running scripts (alternatives,debuginfo,lib,pam,perl,pkgconfig,python,python3,qml6,shell)
Finding Requires (using /usr/lib/rpm/find-requires)
Executing: /bin/sh -e /usr/src/tmp/rpm-tmp.k0UeCt
find-requires: running scripts (cpp,debuginfo,files,lib,pam,perl,pkgconfig,pkgconfiglib,python,python3,qml6,rpmlib,shebang,shell,static,symlinks,systemd-services)
/usr/src/tmp/kf6-kpackage-buildroot/usr/include/KF6/KPackage/kpackage/package.h:10:10: fatal error: QCryptographicHash: No such file or directory
   10 | #include <QCryptographicHash>
      |          ^~~~~~~~~~~~~~~~~~~~
compilation terminated.
cpp.req: /usr/src/tmp/kf6-kpackage-buildroot/usr/include/KF6/KPackage/kpackage/package.h: cpp failed, trying c++ mode
/usr/src/tmp/kf6-kpackage-buildroot/usr/include/KF6/KPackage/kpackage/package.h:10:10: fatal error: QCryptographicHash: No such file or directory
   10 | #include <QCryptographicHash>
      |          ^~~~~~~~~~~~~~~~~~~~
compilation terminated.
cpp.req: WARNING: /usr/src/tmp/kf6-kpackage-buildroot/usr/include/KF6/KPackage/kpackage/package.h: cpp failed
/usr/src/tmp/kf6-kpackage-buildroot/usr/include/KF6/KPackage/kpackage/packagejob.h:13:10: fatal error: KJob: No such file or directory
   13 | #include <KJob>
      |          ^~~~~~
compilation terminated.
cpp.req: /usr/src/tmp/kf6-kpackage-buildroot/usr/include/KF6/KPackage/kpackage/packagejob.h: cpp failed, trying c++ mode
/usr/src/tmp/kf6-kpackage-buildroot/usr/include/KF6/KPackage/kpackage/packagejob.h:13:10: fatal error: KJob: No such file or directory
   13 | #include <KJob>
      |          ^~~~~~
compilation terminated.
cpp.req: WARNING: /usr/src/tmp/kf6-kpackage-buildroot/usr/include/KF6/KPackage/kpackage/packagejob.h: cpp failed
In file included from /usr/src/tmp/kf6-kpackage-buildroot/usr/include/KF6/KPackage/kpackage/packageloader.h:10:
/usr/src/tmp/kf6-kpackage-buildroot/usr/include/KF6/KPackage/kpackage/package.h:10:10: fatal error: QCryptographicHash: No such file or directory
   10 | #include <QCryptographicHash>
      |          ^~~~~~~~~~~~~~~~~~~~
compilation terminated.
cpp.req: /usr/src/tmp/kf6-kpackage-buildroot/usr/include/KF6/KPackage/kpackage/packageloader.h: cpp failed, trying c++ mode
In file included from /usr/src/tmp/kf6-kpackage-buildroot/usr/include/KF6/KPackage/kpackage/packageloader.h:10:
/usr/src/tmp/kf6-kpackage-buildroot/usr/include/KF6/KPackage/kpackage/package.h:10:10: fatal error: QCryptographicHash: No such file or directory
   10 | #include <QCryptographicHash>
      |          ^~~~~~~~~~~~~~~~~~~~
compilation terminated.
cpp.req: WARNING: /usr/src/tmp/kf6-kpackage-buildroot/usr/include/KF6/KPackage/kpackage/packageloader.h: cpp failed
/usr/src/tmp/kf6-kpackage-buildroot/usr/include/KF6/KPackage/kpackage/packagestructure.h:11:10: fatal error: QStringList: No such file or directory
   11 | #include <QStringList>
      |          ^~~~~~~~~~~~~
compilation terminated.
cpp.req: /usr/src/tmp/kf6-kpackage-buildroot/usr/include/KF6/KPackage/kpackage/packagestructure.h: cpp failed, trying c++ mode
/usr/src/tmp/kf6-kpackage-buildroot/usr/include/KF6/KPackage/kpackage/packagestructure.h:11:10: fatal error: QStringList: No such file or directory
   11 | #include <QStringList>
      |          ^~~~~~~~~~~~~
compilation terminated.
cpp.req: WARNING: /usr/src/tmp/kf6-kpackage-buildroot/usr/include/KF6/KPackage/kpackage/packagestructure.h: cpp failed
In file included from /usr/src/tmp/kf6-kpackage-buildroot/usr/include/KF6/KPackage/KPackage/Package:1,
                 from /usr/src/tmp/kf6-kpackage-buildroot/usr/include/KF6/KPackage/kpackage/packagestructure_compat_p.h:7:
/usr/src/tmp/kf6-kpackage-buildroot/usr/include/KF6/KPackage/kpackage/package.h:10:10: fatal error: QCryptographicHash: No such file or directory
   10 | #include <QCryptographicHash>
      |          ^~~~~~~~~~~~~~~~~~~~
compilation terminated.
cpp.req: /usr/src/tmp/kf6-kpackage-buildroot/usr/include/KF6/KPackage/kpackage/packagestructure_compat_p.h: cpp failed, trying c++ mode
In file included from /usr/src/tmp/kf6-kpackage-buildroot/usr/include/KF6/KPackage/KPackage/Package:1,
                 from /usr/src/tmp/kf6-kpackage-buildroot/usr/include/KF6/KPackage/kpackage/packagestructure_compat_p.h:7:
/usr/src/tmp/kf6-kpackage-buildroot/usr/include/KF6/KPackage/kpackage/package.h:10:10: fatal error: QCryptographicHash: No such file or directory
   10 | #include <QCryptographicHash>
      |          ^~~~~~~~~~~~~~~~~~~~
compilation terminated.
cpp.req: WARNING: /usr/src/tmp/kf6-kpackage-buildroot/usr/include/KF6/KPackage/kpackage/packagestructure_compat_p.h: cpp failed
Requires: /usr/lib/libKF6Package.so.6
Finding debuginfo files (using /usr/lib/rpm/find-debuginfo-files)
Executing: /bin/sh -e /usr/src/tmp/rpm-tmp.U181ea
Processing files: libkf6package-6.7.0-alt1
Finding Provides (using /usr/lib/rpm/find-provides)
Executing: /bin/sh -e /usr/src/tmp/rpm-tmp.tno5kT
find-provides: running scripts (alternatives,debuginfo,lib,pam,perl,pkgconfig,python,python3,qml6,shell)
lib.prov: /usr/src/tmp/kf6-kpackage-buildroot/usr/lib/libKF6Package.so.6: 86 symbols, 17 bpp
Finding Requires (using /usr/lib/rpm/find-requires)
Executing: /bin/sh -e /usr/src/tmp/rpm-tmp.wRgbc7
find-requires: running scripts (cpp,debuginfo,files,lib,pam,perl,pkgconfig,pkgconfiglib,python,python3,qml6,rpmlib,shebang,shell,static,symlinks,systemd-services)
Provides: libKF6Package.so.6 = set:kdZ00Pw9AJh6uZjymzryIGbYJlwbvnI7yVX0arZcV7osS7YyX5alNYnrXBRPoLp4qHkeyAzQSo3mMMM5t1byNjn7PZg4RpK1m6G0ff4X8w2W0XZswxhYZ8ZsFEZENqG7SxvBZGE5DYabrnIfKlbFcsuio1mZcIY7nUx19m10B0plCYP0H0
Requires: kf6-kpackage-common = 6.7.0-alt1, /lib/ld-linux.so.2, libKF6Archive.so.6 >= set:liFSGwqXIdQh1LyArriVo0, libKF6CoreAddons.so.6 >= set:nh05AoMhI2ZqMPyKMuZeAdTj9hp8abZrqA9HnwFwMDuqjyFoVFCtKzZxZkBNYZ8uKKbMftpG8X5OX3umUSJzyLSL51lxMAMIA9C0gM2Cn5Q80lZvAYcMsXjYcNZ4DigXM0, libKF6I18n.so.6 >= set:khLpdLkksXFmtM4, libQt6Core.so.6 >= set:qi2w6hFGsZ66GzOJGdmWUgahhzrYqbSXH4koDiUzHUTDfssFmsJ8M2Z8mowpbbbIK2UQ6Ia4Qg0LqrM2wzbXTaC1ONOgLxNiilS1NBSluAyzVSnoVEskXCXl54hjTYy4YgGbrHvVrn0zdhYyppByFOluVL6MQrBQ7VCNdDCbnNwUK0gdPZlkED96ATmMd0dkrkHKaBvNP7jZ7hLBuevmC8iuMwOsfkZzQ83jOXpJfpP3YFxdANibumXhTjTkeEFdjA329lszPAd6iBXQcBSNUipE3i9EQzsNKwwI68XmONAuDda5G31ZpHOkEgPMlruKssSuWs7BpzKNpMGVae4JTqmJ3P19pgrrmt6Gj4ryRiZBEz7WZpqcXnphZ4NlvNm2mcQvtmdwgq0B7i3tWHbYvBg4lBfjH7khcuKJyD8yfZEs3BoF7NNtOfCyNKwi15Z0QaHtrczZjBWQTaJuJn4EpCfyI1NIiNnhntwrY0l5EroAhEgNrvqNT9jGTQZld3yuc93zmbMEZF3xXrHQdrgZvrfcxqV349jZl2VZAjpcoVZuK6n1QgdWuUkz7XSPtKwZGImtFoHEGBab7ZkX2DwIvNUAv31e0vhlVeCRha8JkXiziayn7sJUAJSzIp5poHeI74sDGOtMU4ZAkLgnqZB45xz1h51ih8Zsb0, libQt6Core.so.6(Qt_6), libQt6Core.so.6(Qt_6.7), libQt6DBus.so.6 >= set:nkLDyWngWLBFXjtFtzaVa, libQt6DBus.so.6(Qt_6), libc.so.6(GLIBC_2.0), libc.so.6(GLIBC_2.1.3), libc.so.6(GLIBC_2.3.4), libc.so.6(GLIBC_2.34), libc.so.6(GLIBC_2.4), libstdc++.so.6(CXXABI_1.3), libstdc++.so.6(CXXABI_1.3.9), libstdc++.so.6(GLIBCXX_3.4), libstdc++.so.6(GLIBCXX_3.4.11), libstdc++.so.6(GLIBCXX_3.4.14), libstdc++.so.6(GLIBCXX_3.4.18), libstdc++.so.6(GLIBCXX_3.4.29), libstdc++.so.6(GLIBCXX_3.4.32), libstdc++.so.6(GLIBCXX_3.4.9), rtld(GNU_HASH)
Requires(rpmlib): rpmlib(SetVersions)
Finding debuginfo files (using /usr/lib/rpm/find-debuginfo-files)
Executing: /bin/sh -e /usr/src/tmp/rpm-tmp.otdEdx
Creating libkf6package-debuginfo package
Processing files: libkf6package-debuginfo-6.7.0-alt1
Finding Provides (using /usr/lib/rpm/find-provides)
Executing: /bin/sh -e /usr/src/tmp/rpm-tmp.M4bimc
find-provides: running scripts (debuginfo)
Finding Requires (using /usr/lib/rpm/find-requires)
Executing: /bin/sh -e /usr/src/tmp/rpm-tmp.QKGf09
find-requires: running scripts (debuginfo)
Provides: debug(libKF6Package.so.6)
Requires: libkf6package = 6.7.0-alt1, /usr/lib/debug/lib/ld-linux.so.2.debug, debug(libKF6Archive.so.6), debug(libKF6CoreAddons.so.6), debug(libKF6I18n.so.6), debug(libQt6Core.so.6), debug(libQt6DBus.so.6), debug(libc.so.6), debug(libstdc++.so.6)
Adding to libkf6package a strict dependency on kf6-kpackage-common
Adding to libkf6package-debuginfo a strict dependency on libkf6package
Adding to kf6-kpackage-devel a strict dependency on libkf6package
Removing 1 extra deps from kf6-kpackage-devel due to dependency on libkf6package
Wrote: /usr/src/RPM/RPMS/noarch/kf6-kpackage-common-6.7.0-alt1.noarch.rpm (w2.lzdio)
Wrote: /usr/src/RPM/RPMS/i586/kf6-kpackage-devel-6.7.0-alt1.i586.rpm (w2.lzdio)
Wrote: /usr/src/RPM/RPMS/i586/libkf6package-6.7.0-alt1.i586.rpm (w2.lzdio)
Wrote: /usr/src/RPM/RPMS/i586/libkf6package-debuginfo-6.7.0-alt1.i586.rpm (w2.lzdio)
37.98user 9.01system 0:25.97elapsed 180%CPU (0avgtext+0avgdata 325720maxresident)k
0inputs+0outputs (0major+2095332minor)pagefaults 0swaps
4.75user 3.50system 0:54.43elapsed 15%CPU (0avgtext+0avgdata 132784maxresident)k
1104inputs+0outputs (0major+360935minor)pagefaults 0swaps
--- libkf6package-6.7.0-alt1.i586.rpm.repo	2024-10-14 16:07:53.000000000 +0000
+++ libkf6package-6.7.0-alt1.i586.rpm.hasher	2024-11-02 08:55:56.417095349 +0000
@@ -34,5 +34,5 @@
 File: /usr/bin/kpackagetool6	120777	root:root		../lib/kf6/bin/kpackagetool6
-File: /usr/lib/kf6/bin/kpackagetool6	100755	root:root	c2322edc770b93543d14632e8b69835e	
+File: /usr/lib/kf6/bin/kpackagetool6	100755	root:root	872f6fd540e934490870027d782e87c0	
 File: /usr/lib/libKF6Package.so.6	120777	root:root		libKF6Package.so.6.7.0
-File: /usr/lib/libKF6Package.so.6.7.0	100644	root:root	698a0ca0f36d756b25549acdee324890	
-RPMIdentity: a24c46c00e3458839bd58a77fd758b9031b1b38f316898b6546511197fb839018feecad63dfa74adf59a7ee53b93aa9814f95d93a3c8c4c2e384580934727f86
+File: /usr/lib/libKF6Package.so.6.7.0	100644	root:root	d5e34f176bc308ad76f3c2384563dd8c	
+RPMIdentity: 7e71f7341a138f74d6414e00660d73116ea36af4eb64759196efb6ebcc72a46205da26c3415b137c3e94aec95e6c3914b6f023c723c33ebfaeaa6ed04603c48c
--- libkf6package-debuginfo-6.7.0-alt1.i586.rpm.repo	2024-10-14 16:07:53.000000000 +0000
+++ libkf6package-debuginfo-6.7.0-alt1.i586.rpm.hasher	2024-11-02 08:55:56.657099556 +0000
@@ -1,7 +1,7 @@
-/usr/lib/debug/.build-id/5d	40755	root:root	
-/usr/lib/debug/.build-id/5d/b37716d47c1eeb49c883f71263cb2a97805983	120777	root:root	../../../kf6/bin/kpackagetool6
-/usr/lib/debug/.build-id/5d/b37716d47c1eeb49c883f71263cb2a97805983.debug	120777	root:root	../../usr/lib/kf6/bin/kpackagetool6.debug
-/usr/lib/debug/.build-id/6b	40755	root:root	
-/usr/lib/debug/.build-id/6b/06417fade09f62abb434f03b5bd136910617c1	120777	root:root	../../../libKF6Package.so.6.7.0
-/usr/lib/debug/.build-id/6b/06417fade09f62abb434f03b5bd136910617c1.debug	120777	root:root	../../usr/lib/libKF6Package.so.6.7.0.debug
+/usr/lib/debug/.build-id/4c	40755	root:root	
+/usr/lib/debug/.build-id/4c/7e94c98e9857b72098d0025ca463beef0d4d44	120777	root:root	../../../kf6/bin/kpackagetool6
+/usr/lib/debug/.build-id/4c/7e94c98e9857b72098d0025ca463beef0d4d44.debug	120777	root:root	../../usr/lib/kf6/bin/kpackagetool6.debug
+/usr/lib/debug/.build-id/76	40755	root:root	
+/usr/lib/debug/.build-id/76/f0d6286d11e142a2917b29e8b7d6ed07cba7ea	120777	root:root	../../../libKF6Package.so.6.7.0
+/usr/lib/debug/.build-id/76/f0d6286d11e142a2917b29e8b7d6ed07cba7ea.debug	120777	root:root	../../usr/lib/libKF6Package.so.6.7.0.debug
 /usr/lib/debug/usr/bin/kpackagetool6.debug	120777	root:root	../lib/kf6/bin/kpackagetool6.debug
@@ -66,8 +66,8 @@
 Provides: libkf6package-debuginfo = 6.7.0-alt1:sisyphus+359691.5200.1.2
-File: /usr/lib/debug/.build-id/5d	40755	root:root		
-File: /usr/lib/debug/.build-id/5d/b37716d47c1eeb49c883f71263cb2a97805983	120777	root:root		../../../kf6/bin/kpackagetool6
-File: /usr/lib/debug/.build-id/5d/b37716d47c1eeb49c883f71263cb2a97805983.debug	120777	root:root		../../usr/lib/kf6/bin/kpackagetool6.debug
-File: /usr/lib/debug/.build-id/6b	40755	root:root		
-File: /usr/lib/debug/.build-id/6b/06417fade09f62abb434f03b5bd136910617c1	120777	root:root		../../../libKF6Package.so.6.7.0
-File: /usr/lib/debug/.build-id/6b/06417fade09f62abb434f03b5bd136910617c1.debug	120777	root:root		../../usr/lib/libKF6Package.so.6.7.0.debug
+File: /usr/lib/debug/.build-id/4c	40755	root:root		
+File: /usr/lib/debug/.build-id/4c/7e94c98e9857b72098d0025ca463beef0d4d44	120777	root:root		../../../kf6/bin/kpackagetool6
+File: /usr/lib/debug/.build-id/4c/7e94c98e9857b72098d0025ca463beef0d4d44.debug	120777	root:root		../../usr/lib/kf6/bin/kpackagetool6.debug
+File: /usr/lib/debug/.build-id/76	40755	root:root		
+File: /usr/lib/debug/.build-id/76/f0d6286d11e142a2917b29e8b7d6ed07cba7ea	120777	root:root		../../../libKF6Package.so.6.7.0
+File: /usr/lib/debug/.build-id/76/f0d6286d11e142a2917b29e8b7d6ed07cba7ea.debug	120777	root:root		../../usr/lib/libKF6Package.so.6.7.0.debug
 File: /usr/lib/debug/usr/bin/kpackagetool6.debug	120777	root:root		../lib/kf6/bin/kpackagetool6.debug
@@ -75,4 +75,4 @@
 File: /usr/lib/debug/usr/lib/kf6/bin	40755	root:root		
-File: /usr/lib/debug/usr/lib/kf6/bin/kpackagetool6.debug	100644	root:root	a3bee45a0a203d142d6a2ae69c916efe	
-File: /usr/lib/debug/usr/lib/libKF6Package.so.6.7.0.debug	100644	root:root	9fe4f5732e4052e93a56cc92095942e5	
+File: /usr/lib/debug/usr/lib/kf6/bin/kpackagetool6.debug	100644	root:root	d4e874bc9391980b3d270e3d7fe8b490	
+File: /usr/lib/debug/usr/lib/libKF6Package.so.6.7.0.debug	100644	root:root	d96a31fe16a782b3f6f40a21dbc85fb6	
 File: /usr/lib/debug/usr/lib/libKF6Package.so.6.debug	120777	root:root		libKF6Package.so.6.7.0.debug
@@ -120,2 +120,2 @@
 File: /usr/src/debug/kpackage-6.7.0/src/kpackagetool/options.h	100644	root:root	ed1af6e8421197eb7ac21561e46d7a68	
-RPMIdentity: 35eca4a42a96e17fa4a421ed652faaea680208b128054bdff7e7d144b409ec75974966bdf6b706463907e32dc5c34006975c272ffcb39044759a9df9e7862ce1
+RPMIdentity: 2ba8898aa5de6cf972b429cfb352f1ffedbb94bdc84d84054193d1e292db45eda7312a0aee77a3e77bc3a97671a3836fe4e59dc915b1205b742b1706e9c6f276