<86>May 11 06:51:03 userdel[3074657]: delete user 'rooter'
<86>May 11 06:51:03 userdel[3074657]: removed group 'rooter' owned by 'rooter'
<86>May 11 06:51:03 userdel[3074657]: removed shadow group 'rooter' owned by 'rooter'
<86>May 11 06:51:03 groupadd[3074691]: group added to /etc/group: name=rooter, GID=1829
<86>May 11 06:51:03 groupadd[3074691]: group added to /etc/gshadow: name=rooter
<86>May 11 06:51:03 groupadd[3074691]: new group: name=rooter, GID=1829
<86>May 11 06:51:03 useradd[3074738]: new user: name=rooter, UID=1829, GID=1829, home=/root, shell=/bin/bash, from=none
<86>May 11 06:51:03 userdel[3074814]: delete user 'builder'
<86>May 11 06:51:03 userdel[3074814]: removed group 'builder' owned by 'builder'
<86>May 11 06:51:03 userdel[3074814]: removed shadow group 'builder' owned by 'builder'
<86>May 11 06:51:03 groupadd[3074872]: group added to /etc/group: name=builder, GID=1830
<86>May 11 06:51:03 groupadd[3074872]: group added to /etc/gshadow: name=builder
<86>May 11 06:51:03 groupadd[3074872]: new group: name=builder, GID=1830
<86>May 11 06:51:03 useradd[3074911]: new user: name=builder, UID=1830, GID=1830, home=/usr/src, shell=/bin/bash, from=none
/usr/src/in/srpm/libdbus-tqt-3.5.13.2-alt1.1.src.rpm: The use of such a license name is ambiguous: GPL
/usr/src/in/srpm/libdbus-tqt-3.5.13.2-alt1.1.src.rpm: license not found in '/usr/share/license' directory: Academic
/usr/src/in/srpm/libdbus-tqt-3.5.13.2-alt1.1.src.rpm: license not found in '/usr/share/license' directory: Free
/usr/src/in/srpm/libdbus-tqt-3.5.13.2-alt1.1.src.rpm: license not found in '/usr/share/license' directory: License
warning: Macro %Kbuild not found
warning: Macro %Kinstall not found
<13>May 11 06:51:08 rpmi: xorg-proto-devel-2024.1-alt1 sisyphus+343583.40.1.1 1711440649 installed
<13>May 11 06:51:08 rpmi: libexpat-2.5.0-alt1 sisyphus+309227.100.1.1 1667075766 installed
<13>May 11 06:51:08 rpmi: libICE-1.1.1-alt1 sisyphus+311428.500.1.1 1670577559 installed
<13>May 11 06:51:08 rpmi: libglvnd-7:1.7.0-alt1 sisyphus+330949.100.1.1 1696424894 installed
<13>May 11 06:51:08 rpmi: libpng16-1.6.42-alt2 sisyphus+339555.100.1.1 1706781690 installed
<13>May 11 06:51:08 rpmi: libSM-1.2.4-alt1 sisyphus+312057.200.1.1 1671526918 installed
<13>May 11 06:51:08 rpmi: libjpeg-2:3.0.2-alt2.1 sisyphus+340135.100.1.1 1707449053 installed
<13>May 11 06:51:08 rpmi: zlib-devel-1.3.1-alt1 sisyphus+342532.100.1.1 1710232285 installed
<13>May 11 06:51:08 rpmi: libidn2-2.3.7-alt1 sisyphus+339505.100.1.2 1706718975 installed
<13>May 11 06:51:08 rpmi: libnettle8-3.9.1-alt1 sisyphus+322548.100.1.2 1686176897 installed
<13>May 11 06:51:08 rpmi: libICE-devel-1.1.1-alt1 sisyphus+311428.500.1.1 1670577559 installed
<13>May 11 06:51:08 rpmi: libSM-devel-1.2.4-alt1 sisyphus+312057.200.1.1 1671526918 installed
<13>May 11 06:51:08 rpmi: libwayland-server-1.22.0-alt1.1 sisyphus+318010.100.1.1 1680606300 installed
<13>May 11 06:51:08 rpmi: libicu74-1:7.4.2-alt1 sisyphus+336372.200.1.1 1702422879 installed
<13>May 11 06:51:08 rpmi: libgraphite2-1.3.14-alt2.1 sisyphus+279571.100.1.2 1626605157 installed
<13>May 11 06:51:08 rpmi: libXau-1.0.11-alt1 sisyphus+311428.100.1.1 1670577440 installed
<13>May 11 06:51:08 rpmi: xml-utils-1:2.12.6-alt1 sisyphus+347327.100.1.1 1714660890 installed
<13>May 11 06:51:08 rpmi: libp11-kit-1:0.25.3-alt2 sisyphus+336533.100.1.1 1702645575 installed
<13>May 11 06:51:08 rpmi: libtasn1-4.19.0-alt3 sisyphus+327816.100.1.1 1692802618 installed
<13>May 11 06:51:08 rpmi: rpm-build-gir-0.7.3-alt3.1 sisyphus+319393.100.1.1 1682538783 installed
<13>May 11 06:51:08 rpmi: libXau-devel-1.0.11-alt1 sisyphus+311428.100.1.1 1670577440 installed
<13>May 11 06:51:08 rpmi: libgraphite2-devel-1.3.14-alt2.1 sisyphus+279571.100.1.2 1626605157 installed
<13>May 11 06:51:08 rpmi: icu-utils-1:7.4.2-alt1 sisyphus+336372.200.1.1 1702422879 installed
<13>May 11 06:51:09 rpmi: libicu-devel-1:7.4.2-alt1 sisyphus+336372.200.1.1 1702422879 installed
<13>May 11 06:51:09 rpmi: libhogweed6-3.9.1-alt1 sisyphus+322548.100.1.2 1686176897 installed
<13>May 11 06:51:09 rpmi: libgnutls30-3.8.4-alt1 sisyphus+343729.100.2.1 1711570650 installed
<13>May 11 06:51:09 rpmi: libngtcp2.16-1.4.0-alt1 sisyphus+343912.100.1.1 1711714686 installed
<13>May 11 06:51:09 rpmi: libngtcp2_crypto_gnutls8-1.4.0-alt1 sisyphus+343912.100.1.1 1711714686 installed
<13>May 11 06:51:09 rpmi: libpng-devel-1.6.42-alt2 sisyphus+339555.100.1.1 1706781690 installed
<13>May 11 06:51:09 rpmi: libturbojpeg-2:3.0.2-alt2.1 sisyphus+340135.100.1.1 1707449053 installed
<13>May 11 06:51:09 rpmi: libOpenGL-7:1.7.0-alt1 sisyphus+330949.100.1.1 1696424894 installed
<13>May 11 06:51:09 rpmi: libGLES-7:1.7.0-alt1 sisyphus+330949.100.1.1 1696424894 installed
<13>May 11 06:51:09 rpmi: rpm-macros-qt3-3.3.8d-alt16.1 sisyphus+295448.100.1.1 1644980710 installed
<13>May 11 06:51:09 rpmi: libqt3-settings-3.3-alt5 1393236356 installed
<13>May 11 06:51:09 rpmi: libltdl7-2.4.7-alt5 sisyphus+341963.200.3.1 1711659248 installed
<13>May 11 06:51:09 rpmi: libunixODBC2-2.3.12-alt1 sisyphus+341576.100.1.1 1709080926 installed
<13>May 11 06:51:09 rpmi: libunixODBC-devel-compat-2.3.12-alt1 sisyphus+341576.100.1.1 1709080926 installed
<13>May 11 06:51:09 rpmi: libunixODBC-devel-2.3.12-alt1 sisyphus+341576.100.1.1 1709080926 installed
<13>May 11 06:51:09 rpmi: liblcms2-2.16-alt1 sisyphus+335676.100.1.1 1701682605 installed
<13>May 11 06:51:09 rpmi: libmng-2.0.3-alt2 sisyphus+275730.100.1.1 1624750903 installed
<13>May 11 06:51:09 rpmi: liblz4-1:1.9.4-alt1 sisyphus+309416.100.1.1 1667413000 installed
<13>May 11 06:51:09 rpmi: libsystemd-1:254.10-alt2 sisyphus+345302.400.3.1 1713818601 installed
<13>May 11 06:51:09 rpmi: libdbus-1.14.10-alt1 sisyphus+327286.5700.14.1 1711487513 installed
<13>May 11 06:51:09 rpmi: libxshmfence-1.3.2-alt1 sisyphus+311428.400.1.1 1670577529 installed
<13>May 11 06:51:09 rpmi: libwayland-client-1.22.0-alt1.1 sisyphus+318010.100.1.1 1680606300 installed
<13>May 11 06:51:09 rpmi: libpciaccess-1:0.18.1-alt1 sisyphus+343583.300.1.1 1711440792 installed
<13>May 11 06:51:09 rpmi: libdrm-1:2.4.120-alt1 sisyphus+338137.100.1.2 1705653180 installed
<13>May 11 06:51:09 rpmi: rpm-macros-kde-common-devel-14.12.1-alt1 1422279175 installed
<13>May 11 06:51:09 rpmi: strace-6.8-alt1 sisyphus+343145.100.1.1 1710923000 installed
<13>May 11 06:51:09 rpmi: gcc-c++-common-1.4.27-alt1 sisyphus+278099.1300.1.1 1626028636 installed
<13>May 11 06:51:09 rpmi: libstdc++13-devel-13.2.1-alt3 sisyphus+339335.100.1.1 1706563095 installed
<13>May 11 06:51:10 rpmi: gcc13-c++-13.2.1-alt3 sisyphus+339335.100.1.1 1706563095 installed
<13>May 11 06:51:10 rpmi: libpixman-3:0.43.4-alt2 sisyphus+344164.100.1.1 1711987947 installed
<13>May 11 06:51:10 rpmi: libX11-locales-3:1.8.8-alt1 sisyphus+343583.100.1.1 1711440719 installed
<13>May 11 06:51:10 rpmi: libXdmcp-1.1.5-alt1 sisyphus+343583.700.1.1 1711441073 installed
<13>May 11 06:51:10 rpmi: libxcb-1.17.0-alt1 sisyphus+345308.200.1.1 1713342009 installed
<13>May 11 06:51:10 rpmi: libX11-3:1.8.8-alt1 sisyphus+343583.100.1.1 1711440722 installed
<13>May 11 06:51:10 rpmi: libXext-1.3.6-alt1 sisyphus+343583.1000.1.1 1711441114 installed
<13>May 11 06:51:10 rpmi: libXrender-0.9.11-alt1 sisyphus+308841.100.1.1 1666436131 installed
<13>May 11 06:51:10 rpmi: libXfixes-6.0.1-alt1 sisyphus+331490.300.1.1 1697023235 installed
<13>May 11 06:51:10 rpmi: libXcursor-1.2.2-alt1 sisyphus+343583.600.1.1 1711441036 installed
<13>May 11 06:51:10 rpmi: libXrandr-1.5.4-alt1 sisyphus+330992.100.1.1 1696485401 installed
<13>May 11 06:51:10 rpmi: libXi-1.8-alt1 sisyphus+285490.200.1.1 1632124180 installed
<13>May 11 06:51:10 rpmi: libXinerama-1.1.5-alt1 sisyphus+309287.100.1.1 1667213209 installed
<13>May 11 06:51:10 rpmi: libXt-1.3.0-alt1 sisyphus+331490.500.1.1 1697023316 installed
<13>May 11 06:51:11 rpmi: libxcb-devel-1.17.0-alt1 sisyphus+345308.200.1.1 1713342009 installed
<13>May 11 06:51:11 rpmi: libX11-devel-3:1.8.8-alt1 sisyphus+343583.100.1.1 1711440722 installed
<13>May 11 06:51:11 rpmi: libXrender-devel-0.9.11-alt1 sisyphus+308841.100.1.1 1666436131 installed
<13>May 11 06:51:11 rpmi: libXext-devel-1.3.6-alt1 sisyphus+343583.1000.1.1 1711441114 installed
<13>May 11 06:51:11 rpmi: libXfixes-devel-6.0.1-alt1 sisyphus+331490.300.1.1 1697023235 installed
<13>May 11 06:51:11 rpmi: libXi-devel-1.8-alt1 sisyphus+285490.200.1.1 1632124180 installed
<13>May 11 06:51:11 rpmi: libXrandr-devel-1.5.4-alt1 sisyphus+330992.100.1.1 1696485401 installed
<13>May 11 06:51:11 rpmi: libXcursor-devel-1.2.2-alt1 sisyphus+343583.600.1.1 1711441036 installed
<13>May 11 06:51:11 rpmi: libXinerama-devel-1.1.5-alt1 sisyphus+309287.100.1.1 1667213209 installed
<13>May 11 06:51:12 rpmi: libXt-devel-1.3.0-alt1 sisyphus+331490.500.1.1 1697023316 installed
<13>May 11 06:51:12 rpmi: libXmu-1.2.0-alt1 sisyphus+343583.1200.1.1 1711441186 installed
<13>May 11 06:51:12 rpmi: libXmu-devel-1.2.0-alt1 sisyphus+343583.1200.1.1 1711441186 installed
<13>May 11 06:51:12 rpmi: libXxf86vm-1.1.5-alt1 sisyphus+308663.1400.1.1 1666168534 installed
<13>May 11 06:51:12 rpmi: libGLX-mesa-4:24.0.6-alt1 sisyphus+345881.100.1.1 1714144957 installed
<13>May 11 06:51:12 rpmi: libGLX-7:1.7.0-alt1 sisyphus+330949.100.1.1 1696424894 installed
<13>May 11 06:51:12 rpmi: libGL-7:1.7.0-alt1 sisyphus+330949.100.1.1 1696424894 installed
<13>May 11 06:51:12 rpmi: libGLU-4:9.0.1-alt1 sisyphus+278350.100.1.2 1626174378 installed
<13>May 11 06:51:12 rpmi: libXv-1.0.12-alt1 sisyphus+311188.600.1.1 1670233801 installed
<13>May 11 06:51:12 rpmi: libXv-devel-1.0.12-alt1 sisyphus+311188.600.1.1 1670233801 installed
<13>May 11 06:51:12 rpmi: libgbm-4:24.0.6-alt1 sisyphus+345881.100.1.1 1714144957 installed
<13>May 11 06:51:12 rpmi: libEGL-mesa-4:24.0.6-alt1 sisyphus+345881.100.1.1 1714144957 installed
<13>May 11 06:51:12 rpmi: libEGL-7:1.7.0-alt1 sisyphus+330949.100.1.1 1696424894 installed
<13>May 11 06:51:12 rpmi: libglvnd-devel-7:1.7.0-alt1 sisyphus+330949.100.1.1 1696424894 installed
<13>May 11 06:51:12 rpmi: libGL-devel-4:24.0.6-alt1 sisyphus+345881.100.1.1 1714144957 installed
<13>May 11 06:51:12 rpmi: libGLU-devel-4:9.0.1-alt1 sisyphus+278350.100.1.2 1626174378 installed
<13>May 11 06:51:12 rpmi: desktop-file-utils-0.26-alt6 sisyphus+331944.100.1.3 1697550035 installed
<13>May 11 06:51:12 rpmi: shared-mime-info-2.4-alt1 sisyphus+334259.100.1.1 1699787317 installed
<13>May 11 06:51:12 rpmi: gsettings-desktop-schemas-data-46.0-alt1 sisyphus+343025.100.4.2 1710847127 installed
<13>May 11 06:51:12 rpmi: libgio-2.80.2-alt1 sisyphus+347748.200.2.1 1715237858 installed
<13>May 11 06:51:12 rpmi: gsettings-desktop-schemas-46.0-alt1 sisyphus+343025.100.4.2 1710847126 installed
<13>May 11 06:51:12 rpmi: libmpdec3-2.5.1-alt3 sisyphus+314490.500.5.1 1675432033 installed
<13>May 11 06:51:12 rpmi: libgdbm-1.8.3-alt10 sisyphus+278100.1600.1.1 1626059138 installed
<13>May 11 06:51:12 rpmi: libb2-0.98.1-alt1_1 sisyphus+291614.100.1.1 1638962878 installed
<13>May 11 06:51:12 rpmi: ed-1:0.2-alt10 sisyphus+278100.1100.1.1 1626056857 installed
<13>May 11 06:51:12 rpmi: rpm-utils-0.10.4-alt1 sisyphus+301046.100.1.1 1654119066 installed
<13>May 11 06:51:12 rpmi: cmake-modules-3.29.1-alt1 sisyphus+344518.200.3.1 1712379665 installed
<13>May 11 06:51:12 rpmi: libuv-1.48.0-alt1 sisyphus+340945.100.1.1 1708265067 installed
<13>May 11 06:51:12 rpmi: librhash-1.3.5-alt3 sisyphus+286141.40.2.1 1632982456 installed
<13>May 11 06:51:12 rpmi: libjsoncpp24-1.9.4-alt2 sisyphus+286441.100.1.1 1633444234 installed
<13>May 11 06:51:12 rpmi: publicsuffix-list-dafsa-20240415-alt1 sisyphus+345249.100.1.1 1713270235 installed
<13>May 11 06:51:12 rpmi: libpsl-0.21.5-alt1 sisyphus+338474.100.1.1 1705684771 installed
<13>May 11 06:51:12 rpmi: libnghttp3.9-1.2.0-alt1 sisyphus+343912.200.1.1 1711714731 installed
<13>May 11 06:51:12 rpmi: libnghttp2-1.61.0-alt1 sisyphus+344450.100.1.1 1712304122 installed
<13>May 11 06:51:12 rpmi: openldap-common-2.6.7-alt2 sisyphus+347731.100.1.1 1715194911 installed
<13>May 11 06:51:12 rpmi: libntlm-1.5-alt1 sisyphus+278100.3300.1.1 1626059663 installed
<13>May 11 06:51:12 rpmi: libidn-1.37-alt2 sisyphus+300849.100.1.1 1653769693 installed
<13>May 11 06:51:12 rpmi: libverto-0.3.2-alt1_1 sisyphus+321176.2200.10.2 1684806164 installed
<13>May 11 06:51:12 rpmi: liblmdb-0.9.32-alt1 sisyphus+342426.100.1.1 1710124284 installed
<13>May 11 06:51:12 rpmi: libkeyutils-1.6.3-alt1 sisyphus+266061.100.1.1 1612919567 installed
<13>May 11 06:51:12 rpmi: libcom_err-1.46.4.0.5.4cda-alt1 sisyphus+283826.100.1.1 1629975361 installed
<13>May 11 06:51:12 rpmi: libbrotlicommon-1.1.0-alt1 sisyphus+328501.100.1.1 1693598420 installed
<13>May 11 06:51:12 rpmi: libbrotlidec-1.1.0-alt1 sisyphus+328501.100.1.1 1693598420 installed
<13>May 11 06:51:12 rpmi: libharfbuzz-8.4.0-alt1 sisyphus+344161.100.1.1 1711987969 installed
<13>May 11 06:51:12 rpmi: libfreetype-2.13.2-alt1 sisyphus+328677.100.1.1 1693834346 installed
<13>May 11 06:51:12 rpmi: libfontconfig1-2.14.2-alt8 sisyphus+328444.100.1.1 1693553407 installed
<13>May 11 06:51:12 rpmi: libcairo-1:1.18.0-alt1 sisyphus+330227.100.1.1 1695539082 installed
<13>May 11 06:51:12 rpmi: libXft-2.3.8-alt1 sisyphus+331490.400.1.1 1697023273 installed
<13>May 11 06:51:12 rpmi: libqt3-3.3.8d-alt16.1 sisyphus+295448.100.1.1 1644980710 installed
<13>May 11 06:51:12 rpmi: libtqt-3.5.13.2-alt2 1477555312 installed
<13>May 11 06:51:12 rpmi: libharfbuzz-cairo-8.4.0-alt1 sisyphus+344161.100.1.1 1711987969 installed
<13>May 11 06:51:12 rpmi: fontconfig-2.14.2-alt8 sisyphus+328444.100.1.1 1693553407 installed
Updating fonts cache: <29>May 11 06:51:13 fontconfig: Updating fonts cache: succeeded
[ DONE ]
<13>May 11 06:51:13 rpmi: libharfbuzz-icu-8.4.0-alt1 sisyphus+344161.100.1.1 1711987969 installed
<13>May 11 06:51:13 rpmi: libharfbuzz-gobject-8.4.0-alt1 sisyphus+344161.100.1.1 1711987969 installed
<13>May 11 06:51:13 rpmi: rpm-macros-cmake-3.29.1-alt1 sisyphus+344518.300.3.1 1712379787 installed
<13>May 11 06:51:13 rpmi: rpm-macros-alternatives-0.5.2-alt2 sisyphus+315270.200.2.1 1676457367 installed
<13>May 11 06:51:13 rpmi: alternatives-0.5.2-alt2 sisyphus+315270.200.2.1 1676457367 installed
<13>May 11 06:51:13 rpmi: ca-certificates-2024.02.24-alt1 sisyphus+341362.100.1.1 1708791001 installed
<13>May 11 06:51:13 rpmi: ca-trust-0.2.0-alt1 sisyphus+344843.100.1.1 1712743326 installed
<13>May 11 06:51:13 rpmi: p11-kit-trust-1:0.25.3-alt2 sisyphus+336533.100.1.1 1702645575 installed
<13>May 11 06:51:14 rpmi: libcrypto3-3.1.5-alt2 sisyphus+343320.140.3.1 1711982452 installed
<13>May 11 06:51:14 rpmi: libssl3-3.1.5-alt2 sisyphus+343320.140.3.1 1711982452 installed
<86>May 11 06:51:14 groupadd[3133483]: group added to /etc/group: name=_keytab, GID=999
<86>May 11 06:51:14 groupadd[3133483]: group added to /etc/gshadow: name=_keytab
<86>May 11 06:51:14 groupadd[3133483]: new group: name=_keytab, GID=999
<13>May 11 06:51:14 rpmi: libkrb5-1.21.2-alt2 sisyphus+338902.100.2.1 1706700985 installed
<13>May 11 06:51:14 rpmi: python3-3.12.2-alt1 sisyphus+341702.200.1.1 1709232959 installed
<13>May 11 06:51:15 rpmi: python3-base-3.12.2-alt1 sisyphus+341702.200.1.1 1709232959 installed
<13>May 11 06:51:15 rpmi: python3-module-packaging-24.0-alt1 sisyphus+342487.100.2.1 1710407438 installed
<13>May 11 06:51:15 rpmi: glib2-devel-2.80.2-alt1 sisyphus+347748.200.2.1 1715237858 installed
<13>May 11 06:51:15 rpmi: libcairo-devel-1:1.18.0-alt1 sisyphus+330227.100.1.1 1695539082 installed
<13>May 11 06:51:15 rpmi: fontconfig-devel-2.14.2-alt8 sisyphus+328444.100.1.1 1693553407 installed
<13>May 11 06:51:15 rpmi: libfreetype-devel-2.13.2-alt1 sisyphus+328677.100.1.1 1693834346 installed
<13>May 11 06:51:15 rpmi: libharfbuzz-devel-8.4.0-alt1 sisyphus+344161.100.1.1 1711987969 installed
<13>May 11 06:51:15 rpmi: libXft-devel-2.3.8-alt1 sisyphus+331490.400.1.1 1697023273 installed
<13>May 11 06:51:15 rpmi: libqt3-devel-3.3.8d-alt16.1 sisyphus+295448.100.1.1 1644980710 installed
<13>May 11 06:51:15 rpmi: libgsasl-2.2.0-alt1 sisyphus+333173.100.1.1 1698696961 installed
<86>May 11 06:51:15 groupadd[3140804]: group added to /etc/group: name=sasl, GID=998
<86>May 11 06:51:15 groupadd[3140804]: group added to /etc/gshadow: name=sasl
<86>May 11 06:51:15 groupadd[3140804]: new group: name=sasl, GID=998
<13>May 11 06:51:15 rpmi: libsasl2-3-2.1.28-alt2 sisyphus+343335.100.1.1 1711112524 installed
<13>May 11 06:51:15 rpmi: libldap2-2.6.7-alt2 sisyphus+347731.100.1.1 1715194925 installed
<13>May 11 06:51:15 rpmi: libarchive13-3.6.1-alt2 sisyphus+324359.1300.6.1 1689326414 installed
<13>May 11 06:51:15 rpmi: libssh2-1.11.0-alt2 sisyphus+339356.100.1.1 1706593140 installed
<13>May 11 06:51:15 rpmi: libcurl-8.7.1-alt2 sisyphus+345773.100.1.1 1713974756 installed
<13>May 11 06:51:16 rpmi: cmake-3.29.1-alt1 sisyphus+344518.200.3.1 1712379679 installed
<13>May 11 06:51:16 rpmi: libtqt-devel-3.5.13.2-alt2 1477555312 installed
<13>May 11 06:51:16 rpmi: kde-common-devel-14.12.1-alt1 1422279175 installed
<13>May 11 06:51:16 rpmi: gcc-c++-13-alt1 sisyphus+323337.300.1.1 1687268227 installed
<13>May 11 06:51:16 rpmi: libdbus-devel-1.14.10-alt1 sisyphus+327286.5700.14.1 1711487513 installed
<13>May 11 06:51:16 rpmi: libjpeg-devel-2:3.0.2-alt2.1 sisyphus+340135.100.1.1 1707449053 installed
Building target platforms: i586
Building for target i586
Wrote: /usr/src/in/nosrpm/libdbus-tqt-3.5.13.2-alt1.1.nosrc.rpm (w1.gzdio)
Installing libdbus-tqt-3.5.13.2-alt1.1.src.rpm
Building target platforms: i586
Building for target i586
Executing(%prep): /bin/sh -e /usr/src/tmp/rpm-tmp.32063
+ umask 022
+ /bin/mkdir -p /usr/src/RPM/BUILD
+ cd /usr/src/RPM/BUILD
+ cd /usr/src/RPM/BUILD
+ rm -rf dbus-tqt-3.5.13.2
+ echo 'Source #0 (dbus-tqt-3.5.13.2.tar):'
Source #0 (dbus-tqt-3.5.13.2.tar):
+ /bin/tar -xf /usr/src/RPM/SOURCES/dbus-tqt-3.5.13.2.tar
+ cd dbus-tqt-3.5.13.2
+ /bin/chmod -c -Rf u+rwX,go-w .
+ exit 0
Executing(%build): /bin/sh -e /usr/src/tmp/rpm-tmp.32063
+ umask 022
+ /bin/mkdir -p /usr/src/RPM/BUILD
+ cd /usr/src/RPM/BUILD
+ cd dbus-tqt-3.5.13.2
+ __kde_build -DCMAKE_BUILD_TYPE=RelWithDebInfo -DPKGCONFIG_INSTALL_DIR=/usr/lib/pkgconfig
+ mkdir -p BUILD-i586-alt-linux
+ __kde4_cmake -DINCLUDE_INSTALL_DIR=/usr/include -DSOUND_INSTALL_DIR=/usr/share/sounds -DAUTOSTART_INSTALL_DIR=/etc/xdg/autostart -DXDG_DIRECTORY_INSTALL_DIR=/usr/share/desktop-directories -DXDG_APPS_INSTALL_DIR=/usr/share/applications -DCMAKE_BUILD_TYPE=RelWithDebInfo -DPKGCONFIG_INSTALL_DIR=/usr/lib/pkgconfig
+ export PATH=/usr/lib/kde4/bin:/usr/src/bin:/usr/bin:/bin:/usr/local/bin:/usr/games
+ PATH=/usr/lib/kde4/bin:/usr/src/bin:/usr/bin:/bin:/usr/local/bin:/usr/games
+ pushd BUILD-i586-alt-linux
~/RPM/BUILD/dbus-tqt-3.5.13.2/BUILD-i586-alt-linux ~/RPM/BUILD/dbus-tqt-3.5.13.2
+ cmake .. -DCMAKE_SKIP_RPATH:BOOL=yes -DCMAKE_BUILD_TYPE=Release '-DCMAKE_C_FLAGS:STRING=-pipe -frecord-gcc-switches -Wall -g -O2 -flto=auto -march=i586 -mtune=generic' '-DCMAKE_CXX_FLAGS:STRING=-pipe -frecord-gcc-switches -Wall -g -O2 -flto=auto -march=i586 -mtune=generic' '-DCMAKE_EXE_LINKER_FLAGS:STRING=-L/usr/lib/kde4link -L/usr/lib/kde4/devel' '-DCMAKE_MODULE_LINKER_FLAGS:STRING=-L/usr/lib/kde4link -L/usr/lib/kde4/devel' '-DCMAKE_SHARED_LINKER_FLAGS:STRING=-L/usr/lib/kde4link -L/usr/lib/kde4/devel' '-DCMAKE_LIBRARY_PATH:LIST=/usr/lib/kde4/devel;/usr/lib/kde4link;/usr/lib;/lib' -DLIB_DESTINATION=lib -DLIB_SUFFIX= -DCMAKE_INSTALL_PREFIX=/usr -DBIN_INSTALL_DIR=/usr/bin -DSBIN_INSTALL_DIR=/usr/sbin -DICON_INSTALL_DIR=/usr/share/icons -DXDG_APPS_INSTALL_DIR=/usr/share/applications/kde4 -DXDG_DIRECTORY_INSTALL_DIR=/usr/share/desktop-directories -DLIB_INSTALL_DIR=/usr/lib -DLIBEXEC_INSTALL_DIR=/usr/lib/kde4/libexec -DINCLUDE_INSTALL_DIR=/usr/include/kde4 -DKDE4_INCLUDE_INSTALL_DIR=/usr/include/kde4 -DSYSCONF_INSTALL_DIR=/etc -DDATA_INSTALL_DIR=/usr/share/kde4/apps -DCONFIG_INSTALL_DIR=/usr/share/kde4/config -DKCFG_INSTALL_DIR=/usr/share/kde4/config.kcfg -DHTML_INSTALL_DIR=/usr/share/kde4/doc/HTML -DAPPLNK_INSTALL_DIR=/usr/share/applnk -DLOCALE_INSTALL_DIR=/usr/share/kde4/locale -DSERVICES_INSTALL_DIR=/usr/share/kde4/services -DSERVICETYPES_INSTALL_DIR=/usr/share/kde4/servicetypes -DKCONF_UPDATE_INSTALL_DIR=/usr/share/kde4/apps/kconf_update -DXDG_MIME_INSTALL_DIR=/usr/share/mime/packages -DAUTOSTART_INSTALL_DIR=/usr/share/kde4/autostart -DSOUND_INSTALL_DIR=/usr/share/kde4/sounds -DTEMPLATES_INSTALL_DIR=/usr/share/kde4/templates -DWALLPAPER_INSTALL_DIR=/usr/share/wallpapers -DDBUS_INTERFACES_INSTALL_DIR=/usr/share/dbus-1/interfaces -DDBUS_SERVICES_INSTALL_DIR=/usr/share/dbus-1/services -DDBUS_SYSTEM_SERVICES_INSTALL_DIR=/usr/share/dbus-1/system-services -DMAN_INSTALL_DIR=/usr/share/man -DINFO_INSTALL_DIR=/usr/share/info -DINSTALL_PYTHON_FILES_IN_PYTHON_PREFIX:BOOL=yes -DINCLUDE_INSTALL_DIR=/usr/include -DSOUND_INSTALL_DIR=/usr/share/sounds -DAUTOSTART_INSTALL_DIR=/etc/xdg/autostart -DXDG_DIRECTORY_INSTALL_DIR=/usr/share/desktop-directories -DXDG_APPS_INSTALL_DIR=/usr/share/applications -DCMAKE_BUILD_TYPE=RelWithDebInfo -DPKGCONFIG_INSTALL_DIR=/usr/lib/pkgconfig
CMake Warning (dev) at CMakeLists.txt:12 (project):
  cmake_minimum_required() should be called prior to this top-level project()
  call.  Please see the cmake-commands(7) manual for usage documentation of
  both commands.
This warning is for project developers.  Use -Wno-dev to suppress it.

-- The C compiler identification is GNU 13.2.1
-- The CXX compiler identification is GNU 13.2.1
-- Detecting C compiler ABI info
-- Detecting C compiler ABI info - done
-- Check for working C compiler: /usr/bin/cc - skipped
-- Detecting C compile features
-- Detecting C compile features - done
-- Detecting CXX compiler ABI info
-- Detecting CXX compiler ABI info - done
-- Check for working CXX compiler: /usr/bin/c++ - skipped
-- Detecting CXX compile features
-- Detecting CXX compile features - done
CMake Deprecation Warning at CMakeLists.txt:18 (cmake_minimum_required):
  Compatibility with CMake < 3.5 will be removed from a future version of
  CMake.

  Update the VERSION argument <min> value or use a ...<max> suffix to tell
  CMake that the project does not need compatibility with older versions.


-- Found PkgConfig: /usr/bin/pkg-config (found version "0.29.2")
-- Checking for one of the modules 'dbus-1'
-- Checking for one of the modules 'tqt'
--   tmoc path: /usr/bin/tmoc
--   moc path: /usr/bin/moc-qt3
--   uic path: /usr/bin/uic-qt3
-- Performing Test HAVE_USABLE_TQT
-- Performing Test HAVE_USABLE_TQT - Success
CMake Warning (dev) at cmake/modules/TDEMacros.cmake:523 (if):
  Policy CMP0054 is not set: Only interpret if() arguments as variables or
  keywords when unquoted.  Run "cmake --help-policy CMP0054" for policy
  details.  Use the cmake_policy command to set the policy and suppress this
  warning.

  Quoted variables like "VERSION" will no longer be dereferenced when the
  policy is set to NEW.  Since the policy is not set the OLD behavior will be
  used.
Call Stack (most recent call first):
  CMakeLists.txt:81 (tde_add_library)
This warning is for project developers.  Use -Wno-dev to suppress it.

CMake Warning (dev) at cmake/modules/TDEMacros.cmake:486 (if):
  Policy CMP0054 is not set: Only interpret if() arguments as variables or
  keywords when unquoted.  Run "cmake --help-policy CMP0054" for policy
  details.  Use the cmake_policy command to set the policy and suppress this
  warning.

  Quoted variables like "VERSION" will no longer be dereferenced when the
  policy is set to NEW.  Since the policy is not set the OLD behavior will be
  used.
Call Stack (most recent call first):
  CMakeLists.txt:81 (tde_add_library)
This warning is for project developers.  Use -Wno-dev to suppress it.

CMake Warning (dev) at cmake/modules/TDEMacros.cmake:492 (if):
  Policy CMP0054 is not set: Only interpret if() arguments as variables or
  keywords when unquoted.  Run "cmake --help-policy CMP0054" for policy
  details.  Use the cmake_policy command to set the policy and suppress this
  warning.

  Quoted variables like "VERSION" will no longer be dereferenced when the
  policy is set to NEW.  Since the policy is not set the OLD behavior will be
  used.
Call Stack (most recent call first):
  CMakeLists.txt:81 (tde_add_library)
This warning is for project developers.  Use -Wno-dev to suppress it.

CMake Warning (dev) at cmake/modules/TDEMacros.cmake:499 (if):
  Policy CMP0054 is not set: Only interpret if() arguments as variables or
  keywords when unquoted.  Run "cmake --help-policy CMP0054" for policy
  details.  Use the cmake_policy command to set the policy and suppress this
  warning.

  Quoted variables like "VERSION" will no longer be dereferenced when the
  policy is set to NEW.  Since the policy is not set the OLD behavior will be
  used.
Call Stack (most recent call first):
  CMakeLists.txt:81 (tde_add_library)
This warning is for project developers.  Use -Wno-dev to suppress it.

CMake Warning (dev) at cmake/modules/TDEMacros.cmake:505 (if):
  Policy CMP0054 is not set: Only interpret if() arguments as variables or
  keywords when unquoted.  Run "cmake --help-policy CMP0054" for policy
  details.  Use the cmake_policy command to set the policy and suppress this
  warning.

  Quoted variables like "VERSION" will no longer be dereferenced when the
  policy is set to NEW.  Since the policy is not set the OLD behavior will be
  used.
Call Stack (most recent call first):
  CMakeLists.txt:81 (tde_add_library)
This warning is for project developers.  Use -Wno-dev to suppress it.

CMake Warning (dev) at cmake/modules/TDEMacros.cmake:511 (if):
  Policy CMP0054 is not set: Only interpret if() arguments as variables or
  keywords when unquoted.  Run "cmake --help-policy CMP0054" for policy
  details.  Use the cmake_policy command to set the policy and suppress this
  warning.

  Quoted variables like "VERSION" will no longer be dereferenced when the
  policy is set to NEW.  Since the policy is not set the OLD behavior will be
  used.
Call Stack (most recent call first):
  CMakeLists.txt:81 (tde_add_library)
This warning is for project developers.  Use -Wno-dev to suppress it.

CMake Warning (dev) at cmake/modules/TDEMacros.cmake:517 (if):
  Policy CMP0054 is not set: Only interpret if() arguments as variables or
  keywords when unquoted.  Run "cmake --help-policy CMP0054" for policy
  details.  Use the cmake_policy command to set the policy and suppress this
  warning.

  Quoted variables like "VERSION" will no longer be dereferenced when the
  policy is set to NEW.  Since the policy is not set the OLD behavior will be
  used.
Call Stack (most recent call first):
  CMakeLists.txt:81 (tde_add_library)
This warning is for project developers.  Use -Wno-dev to suppress it.

CMake Warning (dev) at cmake/modules/TDEMacros.cmake:529 (if):
  Policy CMP0054 is not set: Only interpret if() arguments as variables or
  keywords when unquoted.  Run "cmake --help-policy CMP0054" for policy
  details.  Use the cmake_policy command to set the policy and suppress this
  warning.

  Quoted variables like "VERSION" will no longer be dereferenced when the
  policy is set to NEW.  Since the policy is not set the OLD behavior will be
  used.
Call Stack (most recent call first):
  CMakeLists.txt:81 (tde_add_library)
This warning is for project developers.  Use -Wno-dev to suppress it.

CMake Warning (dev) at cmake/modules/TDEMacros.cmake:535 (if):
  Policy CMP0054 is not set: Only interpret if() arguments as variables or
  keywords when unquoted.  Run "cmake --help-policy CMP0054" for policy
  details.  Use the cmake_policy command to set the policy and suppress this
  warning.

  Quoted variables like "VERSION" will no longer be dereferenced when the
  policy is set to NEW.  Since the policy is not set the OLD behavior will be
  used.
Call Stack (most recent call first):
  CMakeLists.txt:81 (tde_add_library)
This warning is for project developers.  Use -Wno-dev to suppress it.

CMake Warning (dev) at cmake/modules/TDEMacros.cmake:541 (if):
  Policy CMP0054 is not set: Only interpret if() arguments as variables or
  keywords when unquoted.  Run "cmake --help-policy CMP0054" for policy
  details.  Use the cmake_policy command to set the policy and suppress this
  warning.

  Quoted variables like "VERSION" will no longer be dereferenced when the
  policy is set to NEW.  Since the policy is not set the OLD behavior will be
  used.
Call Stack (most recent call first):
  CMakeLists.txt:81 (tde_add_library)
This warning is for project developers.  Use -Wno-dev to suppress it.

CMake Warning (dev) at cmake/modules/TDEMacros.cmake:547 (if):
  Policy CMP0054 is not set: Only interpret if() arguments as variables or
  keywords when unquoted.  Run "cmake --help-policy CMP0054" for policy
  details.  Use the cmake_policy command to set the policy and suppress this
  warning.

  Quoted variables like "VERSION" will no longer be dereferenced when the
  policy is set to NEW.  Since the policy is not set the OLD behavior will be
  used.
Call Stack (most recent call first):
  CMakeLists.txt:81 (tde_add_library)
This warning is for project developers.  Use -Wno-dev to suppress it.

CMake Warning (dev) at cmake/modules/TDEMacros.cmake:553 (if):
  Policy CMP0054 is not set: Only interpret if() arguments as variables or
  keywords when unquoted.  Run "cmake --help-policy CMP0054" for policy
  details.  Use the cmake_policy command to set the policy and suppress this
  warning.

  Quoted variables like "VERSION" will no longer be dereferenced when the
  policy is set to NEW.  Since the policy is not set the OLD behavior will be
  used.
Call Stack (most recent call first):
  CMakeLists.txt:81 (tde_add_library)
This warning is for project developers.  Use -Wno-dev to suppress it.

CMake Warning (dev) at cmake/modules/TDEMacros.cmake:660 (get_target_property):
  Policy CMP0026 is not set: Disallow use of the LOCATION target property.
  Run "cmake --help-policy CMP0026" for policy details.  Use the cmake_policy
  command to set the policy and suppress this warning.

  The LOCATION property should not be read from target "dbus-tqt-1-shared".
  Use the target name directly with add_custom_command, or use the generator
  expression $<TARGET_FILE>, as appropriate.

Call Stack (most recent call first):
  CMakeLists.txt:81 (tde_add_library)
This warning is for project developers.  Use -Wno-dev to suppress it.

CMake Warning (dev) at cmake/modules/TDEMacros.cmake:373 (get_target_property):
  Policy CMP0026 is not set: Disallow use of the LOCATION target property.
  Run "cmake --help-policy CMP0026" for policy details.  Use the cmake_policy
  command to set the policy and suppress this warning.

  The LOCATION property should not be read from target "dbus-tqt-1-shared".
  Use the target name directly with add_custom_command, or use the generator
  expression $<TARGET_FILE>, as appropriate.

Call Stack (most recent call first):
  cmake/modules/TDEMacros.cmake:681 (tde_install_libtool_file)
  CMakeLists.txt:81 (tde_add_library)
This warning is for project developers.  Use -Wno-dev to suppress it.

-- Configuring done (1.4s)
-- Generating done (0.0s)
CMake Warning:
  Manually-specified variables were not used by the project:

    APPLNK_INSTALL_DIR
    AUTOSTART_INSTALL_DIR
    BIN_INSTALL_DIR
    CMAKE_EXE_LINKER_FLAGS
    CMAKE_LIBRARY_PATH
    CMAKE_MODULE_LINKER_FLAGS
    CONFIG_INSTALL_DIR
    DATA_INSTALL_DIR
    DBUS_INTERFACES_INSTALL_DIR
    DBUS_SERVICES_INSTALL_DIR
    DBUS_SYSTEM_SERVICES_INSTALL_DIR
    HTML_INSTALL_DIR
    ICON_INSTALL_DIR
    INFO_INSTALL_DIR
    INSTALL_PYTHON_FILES_IN_PYTHON_PREFIX
    KCFG_INSTALL_DIR
    KCONF_UPDATE_INSTALL_DIR
    KDE4_INCLUDE_INSTALL_DIR
    LIBEXEC_INSTALL_DIR
    LIB_DESTINATION
    LOCALE_INSTALL_DIR
    MAN_INSTALL_DIR
    SBIN_INSTALL_DIR
    SERVICES_INSTALL_DIR
    SERVICETYPES_INSTALL_DIR
    SOUND_INSTALL_DIR
    SYSCONF_INSTALL_DIR
    TEMPLATES_INSTALL_DIR
    WALLPAPER_INSTALL_DIR
    XDG_APPS_INSTALL_DIR
    XDG_MIME_INSTALL_DIR


-- Build files have been written to: /usr/src/RPM/BUILD/dbus-tqt-3.5.13.2/BUILD-i586-alt-linux
+ popd
~/RPM/BUILD/dbus-tqt-3.5.13.2
+ __kde4_make
+ pushd BUILD-i586-alt-linux
~/RPM/BUILD/dbus-tqt-3.5.13.2/BUILD-i586-alt-linux ~/RPM/BUILD/dbus-tqt-3.5.13.2
+ make -j16
make[2]: Entering directory '/usr/src/RPM/BUILD/dbus-tqt-3.5.13.2/BUILD-i586-alt-linux'
[ 22%] Generating server.moc
make[2]: Leaving directory '/usr/src/RPM/BUILD/dbus-tqt-3.5.13.2/BUILD-i586-alt-linux'
make[2]: Entering directory '/usr/src/RPM/BUILD/dbus-tqt-3.5.13.2/BUILD-i586-alt-linux'
[ 22%] Generating connection.moc
make[2]: Leaving directory '/usr/src/RPM/BUILD/dbus-tqt-3.5.13.2/BUILD-i586-alt-linux'
make[2]: Entering directory '/usr/src/RPM/BUILD/dbus-tqt-3.5.13.2/BUILD-i586-alt-linux'
[ 33%] Generating integrator.moc
make[2]: Leaving directory '/usr/src/RPM/BUILD/dbus-tqt-3.5.13.2/BUILD-i586-alt-linux'
make[2]: Entering directory '/usr/src/RPM/BUILD/dbus-tqt-3.5.13.2/BUILD-i586-alt-linux'
[ 55%] Building CXX object CMakeFiles/dbus-tqt-1-shared.dir/dbus-qthread.cpp.o
make[2]: Leaving directory '/usr/src/RPM/BUILD/dbus-tqt-3.5.13.2/BUILD-i586-alt-linux'
make[2]: Entering directory '/usr/src/RPM/BUILD/dbus-tqt-3.5.13.2/BUILD-i586-alt-linux'
[ 55%] Building CXX object CMakeFiles/dbus-tqt-1-shared.dir/message.cpp.o
make[2]: Leaving directory '/usr/src/RPM/BUILD/dbus-tqt-3.5.13.2/BUILD-i586-alt-linux'
make[2]: Entering directory '/usr/src/RPM/BUILD/dbus-tqt-3.5.13.2/BUILD-i586-alt-linux'
[ 77%] Building CXX object CMakeFiles/dbus-tqt-1-shared.dir/connection.cpp.o
make[2]: Leaving directory '/usr/src/RPM/BUILD/dbus-tqt-3.5.13.2/BUILD-i586-alt-linux'
make[2]: Entering directory '/usr/src/RPM/BUILD/dbus-tqt-3.5.13.2/BUILD-i586-alt-linux'
[ 88%] Building CXX object CMakeFiles/dbus-tqt-1-shared.dir/server.cpp.o
make[2]: Leaving directory '/usr/src/RPM/BUILD/dbus-tqt-3.5.13.2/BUILD-i586-alt-linux'
make[2]: Entering directory '/usr/src/RPM/BUILD/dbus-tqt-3.5.13.2/BUILD-i586-alt-linux'
[ 66%] Building CXX object CMakeFiles/dbus-tqt-1-shared.dir/integrator.cpp.o
/usr/src/RPM/BUILD/dbus-tqt-3.5.13.2/integrator.cpp: In member function 'void DBusQt::Internal::Integrator::addWatch(DBusWatch*)':
/usr/src/RPM/BUILD/dbus-tqt-3.5.13.2/integrator.cpp:193:29: warning: 'int dbus_watch_get_fd(DBusWatch*)' is deprecated [-Wdeprecated-declarations]
  193 |   int fd = dbus_watch_get_fd( watch );
      |            ~~~~~~~~~~~~~~~~~^~~~~~~~~
In file included from /usr/include/dbus-1.0/dbus/dbus-bus.h:30,
                 from /usr/include/dbus-1.0/dbus/dbus.h:31,
                 from /usr/src/RPM/BUILD/dbus-tqt-3.5.13.2/integrator.h:31,
                 from /usr/src/RPM/BUILD/dbus-tqt-3.5.13.2/integrator.cpp:23:
/usr/include/dbus-1.0/dbus/dbus-connection.h:481:21: note: declared here
  481 | DBUS_DEPRECATED int dbus_watch_get_fd      (DBusWatch        *watch);
      |                     ^~~~~~~~~~~~~~~~~
/usr/src/RPM/BUILD/dbus-tqt-3.5.13.2/integrator.cpp: In member function 'void DBusQt::Internal::Integrator::removeWatch(DBusWatch*)':
/usr/src/RPM/BUILD/dbus-tqt-3.5.13.2/integrator.cpp:210:30: warning: 'int dbus_watch_get_fd(DBusWatch*)' is deprecated [-Wdeprecated-declarations]
  210 |   int key = dbus_watch_get_fd( watch );
      |             ~~~~~~~~~~~~~~~~~^~~~~~~~~
/usr/include/dbus-1.0/dbus/dbus-connection.h:481:21: note: declared here
  481 | DBUS_DEPRECATED int dbus_watch_get_fd      (DBusWatch        *watch);
      |                     ^~~~~~~~~~~~~~~~~
make[2]: Leaving directory '/usr/src/RPM/BUILD/dbus-tqt-3.5.13.2/BUILD-i586-alt-linux'
make[2]: Entering directory '/usr/src/RPM/BUILD/dbus-tqt-3.5.13.2/BUILD-i586-alt-linux'
[100%] Linking CXX shared library libdbus-tqt-1.so
make[2]: Leaving directory '/usr/src/RPM/BUILD/dbus-tqt-3.5.13.2/BUILD-i586-alt-linux'
make[1]: Entering directory '/usr/src/RPM/BUILD/dbus-tqt-3.5.13.2/BUILD-i586-alt-linux'
[100%] Built target dbus-tqt-1-shared
make[1]: Leaving directory '/usr/src/RPM/BUILD/dbus-tqt-3.5.13.2/BUILD-i586-alt-linux'
+ popd
~/RPM/BUILD/dbus-tqt-3.5.13.2
+ exit 0
Executing(%install): /bin/sh -e /usr/src/tmp/rpm-tmp.88136
+ umask 022
+ /bin/mkdir -p /usr/src/RPM/BUILD
+ cd /usr/src/RPM/BUILD
+ /bin/chmod -Rf u+rwX -- /usr/src/tmp/libdbus-tqt-buildroot
+ :
+ /bin/rm -rf -- /usr/src/tmp/libdbus-tqt-buildroot
+ PATH=/usr/libexec/rpm-build:/usr/src/bin:/usr/bin:/bin:/usr/local/bin:/usr/games
+ cd dbus-tqt-3.5.13.2
+ __kde_install
+ make -C BUILD-i586-alt-linux DESTDIR=/usr/src/tmp/libdbus-tqt-buildroot install
make: Entering directory '/usr/src/RPM/BUILD/dbus-tqt-3.5.13.2/BUILD-i586-alt-linux'
make[1]: Entering directory '/usr/src/RPM/BUILD/dbus-tqt-3.5.13.2/BUILD-i586-alt-linux'
make[2]: Entering directory '/usr/src/RPM/BUILD/dbus-tqt-3.5.13.2/BUILD-i586-alt-linux'
make[2]: Leaving directory '/usr/src/RPM/BUILD/dbus-tqt-3.5.13.2/BUILD-i586-alt-linux'
[100%] Built target dbus-tqt-1-shared
make[1]: Leaving directory '/usr/src/RPM/BUILD/dbus-tqt-3.5.13.2/BUILD-i586-alt-linux'
Install the project...
-- Install configuration: "RelWithDebInfo"
-- Installing: /usr/src/tmp/libdbus-tqt-buildroot/usr/include/dbus-1.0/dbus/dbus-qt.h
-- Installing: /usr/src/tmp/libdbus-tqt-buildroot/usr/include/dbus-1.0/dbus/message.h
-- Installing: /usr/src/tmp/libdbus-tqt-buildroot/usr/include/dbus-1.0/dbus/connection.h
-- Installing: /usr/src/tmp/libdbus-tqt-buildroot/usr/include/dbus-1.0/dbus/server.h
-- Installing: /usr/src/tmp/libdbus-tqt-buildroot/usr/lib/pkgconfig/dbus-tqt.pc
-- Installing: /usr/src/tmp/libdbus-tqt-buildroot/usr/lib/libdbus-tqt-1.so.0.0.0
-- Installing: /usr/src/tmp/libdbus-tqt-buildroot/usr/lib/libdbus-tqt-1.so.0
-- Installing: /usr/src/tmp/libdbus-tqt-buildroot/usr/lib/libdbus-tqt-1.so
-- Installing: /usr/src/tmp/libdbus-tqt-buildroot/usr/lib/libdbus-tqt-1.la
make: Leaving directory '/usr/src/RPM/BUILD/dbus-tqt-3.5.13.2/BUILD-i586-alt-linux'
+ /usr/lib/rpm/brp-alt
Cleaning files in /usr/src/tmp/libdbus-tqt-buildroot (auto)
removed './usr/lib/libdbus-tqt-1.la'
mode of './usr/lib/libdbus-tqt-1.so.0.0.0' changed from 0755 (rwxr-xr-x) to 0644 (rw-r--r--)
Verifying and fixing files in /usr/src/tmp/libdbus-tqt-buildroot (binconfig,pkgconfig,libtool,desktop,gnuconfig)
/usr/lib/pkgconfig/dbus-tqt.pc: Cflags: '-I${includedir} -I${includedir}/dbus-1.0' --> '-I${includedir}/dbus-1.0'
/usr/lib/pkgconfig/dbus-tqt.pc: Libs: '-L${libdir}  -ldbus-tqt-1 -ldbus-1' --> '-ldbus-tqt-1 -ldbus-1'
Checking contents of files in /usr/src/tmp/libdbus-tqt-buildroot/ (default)
Compressing files in /usr/src/tmp/libdbus-tqt-buildroot (auto)
Adjusting library links in /usr/src/tmp/libdbus-tqt-buildroot
./usr/lib: (from <cmdline>:0)
	libdbus-tqt-1.so.0 -> libdbus-tqt-1.so.0.0.0
Verifying ELF objects in /usr/src/tmp/libdbus-tqt-buildroot (arch=normal,fhs=normal,lfs=relaxed,lint=relaxed,rpath=normal,stack=normal,textrel=normal,unresolved=normal)
Splitting links to aliased files under /{,s}bin in /usr/src/tmp/libdbus-tqt-buildroot
Processing files: libdbus-tqt-3.5.13.2-alt1.1
Finding Provides (using /usr/lib/rpm/find-provides)
Executing: /bin/sh -e /usr/src/tmp/rpm-tmp.NPPAOJ
find-provides: running scripts (alternatives,debuginfo,gir,lib,pam,perl,pkgconfig,python,python3,shell,typelib)
lib.prov: /usr/src/tmp/libdbus-tqt-buildroot/usr/lib/libdbus-tqt-1.so.0: 175 symbols, 18 bpp
Finding Requires (using /usr/lib/rpm/find-requires)
Executing: /bin/sh -e /usr/src/tmp/rpm-tmp.EznaAb
find-requires: running scripts (cpp,debuginfo,files,gir-js,gir-python,gir,lib,pam,perl,pkgconfig,pkgconfiglib,python,python3,rpmlib,shebang,shell,static,symlinks,systemd-services,typelib)
Provides: libdbus-tqt-1.so.0 = set:ldO0zrAeMWYwlx8DmzZLhrkA5ApycjNZFRW0NTFcxyp3mR3asqVhsBl5tKrFAoRGQU3v5jKez3PjQZf3H8Nuu0esIgGvMWqCk4sTc7B2ZDugnzPXaV1BSRYZCViXJe1MRhDPZGbqGoHVGNNuY0NDrOAZxQZtDHlWKVAy6scXOZcyLjgZhsjbNZtDDFCKk63FcSFLbua2RrrSR00OK5uYmYcOYpx8BFmKiqPqxszuitpMet268986xCSETXByJimV8NJ9jZggEZ1GL0QrXCPLaQGAysVQpoe7oG9kM7AfoQsuPg3G1zwb5Dv8GoUYFqJIl7zIRtypNisAu8zPwowMtXg1YrDCgUQs4kc1
Requires: libc.so.6(GLIBC_2.0), libc.so.6(GLIBC_2.1.3), libc.so.6(GLIBC_2.4), libdbus-1.so.3 >= set:nhkDECYUZf4d2P6LOyrxeuSRpNGKTJh1m3wZBBu4m6nA0Sw6yJ2BLiSbZ6FGLbIDTKaV79TZq74MYHSYgcOx37PAIQyBZKflNAG0XN9uF9mxgji6Bkii0l8UI8Veh1ijggJBskXytXNrYPHw0kMWDe1, libdbus-1.so.3(LIBDBUS_1_3), libgcc_s.so.1(GCC_3.0), libgcc_s.so.1(GCC_3.3.1), libqt-mt.so.3 >= set:slty9S1qZn2gRn3dTOeZHbaLL26ApAa7Ni7AUx9f0u94SElQHPQFwPf7bJmFEZmD8jHVM0dqant0Nr5YwxWkr5FHQWipAV3pUE51QrZze8eUIist1ODyd40OuhgF6Hoesgt3ZjD9oGvmAHJPQziw6Z2X0Th735yPqUhtwwcukxaxcHEYf6OBDm0iOhoXY2neZ2JgqguZy5XwjcgbiYl34BQEwvYk9ZikxnlMDT1MaQhlJ9KBUNCpilrMC1kSwV2lR6oLz0, libqt-mt.so.3(CXX3), libstdc++.so.6(CXXABI_1.3), libstdc++.so.6(CXXABI_1.3.9), libstdc++.so.6(GLIBCXX_3.4), rtld(GNU_HASH)
Requires(rpmlib): rpmlib(SetVersions)
Finding debuginfo files (using /usr/lib/rpm/find-debuginfo-files)
Executing: /bin/sh -e /usr/src/tmp/rpm-tmp.QgJn8N
Creating libdbus-tqt-debuginfo package
Processing files: libdbus-tqt-devel-3.5.13.2-alt1.1
Finding Provides (using /usr/lib/rpm/find-provides)
Executing: /bin/sh -e /usr/src/tmp/rpm-tmp.n8qipf
find-provides: running scripts (alternatives,debuginfo,gir,lib,pam,perl,pkgconfig,python,python3,shell,typelib)
Finding Requires (using /usr/lib/rpm/find-requires)
Executing: /bin/sh -e /usr/src/tmp/rpm-tmp.J6clo6
find-requires: running scripts (cpp,debuginfo,files,gir-js,gir-python,gir,lib,pam,perl,pkgconfig,pkgconfiglib,python,python3,rpmlib,shebang,shell,static,symlinks,systemd-services,typelib)
/usr/src/tmp/libdbus-tqt-buildroot/usr/include/dbus-1.0/dbus/server.h:26:10: fatal error: tqobject.h: No such file or directory
   26 | #include <tqobject.h>
      |          ^~~~~~~~~~~~
compilation terminated.
cpp.req: /usr/src/tmp/libdbus-tqt-buildroot/usr/include/dbus-1.0/dbus/server.h: cpp failed, trying c++ mode
/usr/src/tmp/libdbus-tqt-buildroot/usr/include/dbus-1.0/dbus/server.h:26:10: fatal error: tqobject.h: No such file or directory
   26 | #include <tqobject.h>
      |          ^~~~~~~~~~~~
compilation terminated.
cpp.req: WARNING: /usr/src/tmp/libdbus-tqt-buildroot/usr/include/dbus-1.0/dbus/server.h: cpp failed
/usr/src/tmp/libdbus-tqt-buildroot/usr/include/dbus-1.0/dbus/message.h:26:10: fatal error: tqvariant.h: No such file or directory
   26 | #include <tqvariant.h>
      |          ^~~~~~~~~~~~~
compilation terminated.
cpp.req: /usr/src/tmp/libdbus-tqt-buildroot/usr/include/dbus-1.0/dbus/message.h: cpp failed, trying c++ mode
/usr/src/tmp/libdbus-tqt-buildroot/usr/include/dbus-1.0/dbus/message.h:26:10: fatal error: tqvariant.h: No such file or directory
   26 | #include <tqvariant.h>
      |          ^~~~~~~~~~~~~
compilation terminated.
cpp.req: WARNING: /usr/src/tmp/libdbus-tqt-buildroot/usr/include/dbus-1.0/dbus/message.h: cpp failed
In file included from /usr/src/tmp/libdbus-tqt-buildroot/usr/include/dbus-1.0/dbus/connection.h:26:
/usr/src/tmp/libdbus-tqt-buildroot/usr/include/dbus-1.0/dbus/message.h:26:10: fatal error: tqvariant.h: No such file or directory
   26 | #include <tqvariant.h>
      |          ^~~~~~~~~~~~~
compilation terminated.
cpp.req: /usr/src/tmp/libdbus-tqt-buildroot/usr/include/dbus-1.0/dbus/connection.h: cpp failed, trying c++ mode
In file included from /usr/src/tmp/libdbus-tqt-buildroot/usr/include/dbus-1.0/dbus/connection.h:26:
/usr/src/tmp/libdbus-tqt-buildroot/usr/include/dbus-1.0/dbus/message.h:26:10: fatal error: tqvariant.h: No such file or directory
   26 | #include <tqvariant.h>
      |          ^~~~~~~~~~~~~
compilation terminated.
cpp.req: WARNING: /usr/src/tmp/libdbus-tqt-buildroot/usr/include/dbus-1.0/dbus/connection.h: cpp failed
Provides: pkgconfig(dbus-tqt) = 0.7
Requires: libdbus-tqt = 3.5.13.2-alt1.1, libdbus-devel >= 0.94, libtqt-devel, /usr/lib/libdbus-tqt-1.so.0, /usr/lib/pkgconfig, pkgconfig(dbus-1)
Finding debuginfo files (using /usr/lib/rpm/find-debuginfo-files)
Executing: /bin/sh -e /usr/src/tmp/rpm-tmp.uP86dG
Processing files: libdbus-tqt-debuginfo-3.5.13.2-alt1.1
Finding Provides (using /usr/lib/rpm/find-provides)
Executing: /bin/sh -e /usr/src/tmp/rpm-tmp.gpSS5E
find-provides: running scripts (debuginfo)
Finding Requires (using /usr/lib/rpm/find-requires)
Executing: /bin/sh -e /usr/src/tmp/rpm-tmp.LNUYFs
find-requires: running scripts (debuginfo)
Provides: debug(libdbus-tqt-1.so.0)
Requires: libdbus-tqt = 3.5.13.2-alt1.1, debug(libc.so.6), debug(libdbus-1.so.3), debug(libgcc_s.so.1), debug(libqt-mt.so.3), debug(libstdc++.so.6)
Removing 1 extra deps from libdbus-tqt-devel due to dependency on libdbus-tqt
Wrote: /usr/src/RPM/RPMS/i586/libdbus-tqt-3.5.13.2-alt1.1.i586.rpm (w2.lzdio)
Wrote: /usr/src/RPM/RPMS/i586/libdbus-tqt-devel-3.5.13.2-alt1.1.i586.rpm (w2.lzdio)
Wrote: /usr/src/RPM/RPMS/i586/libdbus-tqt-debuginfo-3.5.13.2-alt1.1.i586.rpm (w2.lzdio)
3.12user 4.81system 0:12.64elapsed 62%CPU (0avgtext+0avgdata 61740maxresident)k
0inputs+0outputs (0major+537048minor)pagefaults 0swaps
/.out/libdbus-tqt-3.5.13.2-alt1.1.i586.rpm: The use of such a license name is ambiguous: GPL
/.out/libdbus-tqt-3.5.13.2-alt1.1.i586.rpm: license not found in '/usr/share/license' directory: Academic
/.out/libdbus-tqt-3.5.13.2-alt1.1.i586.rpm: license not found in '/usr/share/license' directory: Free
/.out/libdbus-tqt-3.5.13.2-alt1.1.i586.rpm: license not found in '/usr/share/license' directory: License
/.out/libdbus-tqt-devel-3.5.13.2-alt1.1.i586.rpm: The use of such a license name is ambiguous: GPL
/.out/libdbus-tqt-devel-3.5.13.2-alt1.1.i586.rpm: license not found in '/usr/share/license' directory: Academic
/.out/libdbus-tqt-devel-3.5.13.2-alt1.1.i586.rpm: license not found in '/usr/share/license' directory: Free
/.out/libdbus-tqt-devel-3.5.13.2-alt1.1.i586.rpm: license not found in '/usr/share/license' directory: License
/.out/libdbus-tqt-debuginfo-3.5.13.2-alt1.1.i586.rpm: The use of such a license name is ambiguous: GPL
/.out/libdbus-tqt-debuginfo-3.5.13.2-alt1.1.i586.rpm: license not found in '/usr/share/license' directory: Academic
/.out/libdbus-tqt-debuginfo-3.5.13.2-alt1.1.i586.rpm: license not found in '/usr/share/license' directory: Free
/.out/libdbus-tqt-debuginfo-3.5.13.2-alt1.1.i586.rpm: license not found in '/usr/share/license' directory: License
3.94user 3.24system 0:34.84elapsed 20%CPU (0avgtext+0avgdata 127436maxresident)k
9128inputs+0outputs (0major+260598minor)pagefaults 0swaps
--- libdbus-tqt-3.5.13.2-alt1.1.i586.rpm.repo	2015-11-13 00:43:41.000000000 +0000
+++ libdbus-tqt-3.5.13.2-alt1.1.i586.rpm.hasher	2024-05-11 06:51:35.186077918 +0000
@@ -4,5 +4,8 @@
 Requires: libc.so.6(GLIBC_2.1.3)  
-Requires: libdbus-1.so.3 >= set:lf6cSAsZcVGii2WZ4jZoQL2dqH7BKu4diZmZE8JkH9HDJe3jZGOMAOj2YiW0ZBtEWZ9uigA1EeraL4eKZd32MJCtrb0ERNjOBNRySYgWOwa9E5hZfF6xVueqLgfHw0kUbMJDe
+Requires: libc.so.6(GLIBC_2.4)  
+Requires: libdbus-1.so.3 >= set:nhkDECYUZf4d2P6LOyrxeuSRpNGKTJh1m3wZBBu4m6nA0Sw6yJ2BLiSbZ6FGLbIDTKaV79TZq74MYHSYgcOx37PAIQyBZKflNAG0XN9uF9mxgji6Bkii0l8UI8Veh1ijggJBskXytXNrYPHw0kMWDe1
 Requires: rpmlib(SetVersions)  
+Requires: libdbus-1.so.3(LIBDBUS_1_3)  
 Requires: libgcc_s.so.1(GCC_3.0)  
+Requires: libgcc_s.so.1(GCC_3.3.1)  
 Requires: libqt-mt.so.3 >= set:slty9S1qZn2gRn3dTOeZHbaLL26ApAa7Ni7AUx9f0u94SElQHPQFwPf7bJmFEZmD8jHVM0dqant0Nr5YwxWkr5FHQWipAV3pUE51QrZze8eUIist1ODyd40OuhgF6Hoesgt3ZjD9oGvmAHJPQziw6Z2X0Th735yPqUhtwwcukxaxcHEYf6OBDm0iOhoXY2neZ2JgqguZy5XwjcgbiYl34BQEwvYk9ZikxnlMDT1MaQhlJ9KBUNCpilrMC1kSwV2lR6oLz0
@@ -10,2 +13,3 @@
 Requires: libstdc++.so.6(CXXABI_1.3)  
+Requires: libstdc++.so.6(CXXABI_1.3.9)  
 Requires: libstdc++.so.6(GLIBCXX_3.4)  
@@ -13,6 +17,6 @@
 Requires: rpmlib(PayloadIsLzma)  
-Provides: libdbus-tqt-1.so.0 = set:ldDEVXU6FzZmUJcMa0l8OFRUZDQ6l5WF4S877pCyZzHR1yLjp25P6IG7kUQOXSR0Bl5tKrFAoRGQU3v59DBjDNxV9WZvxdG5kTPlKTMMN2FZhFs3LpihMtPskaYvugnzPXaV1BSRYZCViXJe1IJRLQVYLKEFyJCH67X4OS0yfTAptU8lsmSLXIaldOZatP95zQRhcXOZcyVgr98fMqodJ4rzoGPPkjnazxk6XQT5f5xWJdXq00pT2fubu6pZs2hajJsBQCNg2xszuitpMet26HmZk96Z0DvUETXByJimV8NJ9jZg2v8UYgXU358GS6WCPLaQGAysVQpoe7oG9kMv7lKNkHbPwqMrZp4ZtTwhMByPf4lcsZkRqpHe6pHX4PyBU8Z0ps6434Kr7GInT0oxcdVHrMqe2aC
+Provides: libdbus-tqt-1.so.0 = set:ldO0zrAeMWYwlx8DmzZLhrkA5ApycjNZFRW0NTFcxyp3mR3asqVhsBl5tKrFAoRGQU3v5jKez3PjQZf3H8Nuu0esIgGvMWqCk4sTc7B2ZDugnzPXaV1BSRYZCViXJe1MRhDPZGbqGoHVGNNuY0NDrOAZxQZtDHlWKVAy6scXOZcyLjgZhsjbNZtDDFCKk63FcSFLbua2RrrSR00OK5uYmYcOYpx8BFmKiqPqxszuitpMet268986xCSETXByJimV8NJ9jZggEZ1GL0QrXCPLaQGAysVQpoe7oG9kM7AfoQsuPg3G1zwb5Dv8GoUYFqJIl7zIRtypNisAu8zPwowMtXg1YrDCgUQs4kc1
 Provides: libdbus-tqt = 3.5.13.2-alt1.1
 File: /usr/lib/libdbus-tqt-1.so.0	120777	root:root		libdbus-tqt-1.so.0.0.0
-File: /usr/lib/libdbus-tqt-1.so.0.0.0	100644	root:root	ad9452f69667d372683e76817da500fb	
-RPMIdentity: 28d865dbe7e9da11af8768d4cc9e0be1df663a3430bcbb5b084e1bfa39947f2ccb5b4d9db92d8a78235d493ce4d68b77ccbf2cdd92685efe026bad19e137a583
+File: /usr/lib/libdbus-tqt-1.so.0.0.0	100644	root:root	76c1659146151480ac453c98de624db3	
+RPMIdentity: ae7dc7ccac840874e84107ca84afc43054c0312b89f19aa28916d242fe2a8fef0551938fa689e4532a362cc84ec808f73acff7c1bf2fb735b252582f6e9224e1
--- libdbus-tqt-debuginfo-3.5.13.2-alt1.1.i586.rpm.repo	2015-11-13 00:43:41.000000000 +0000
+++ libdbus-tqt-debuginfo-3.5.13.2-alt1.1.i586.rpm.hasher	2024-05-11 06:51:35.275079548 +0000
@@ -1,4 +1,4 @@
-/usr/lib/debug/.build-id/3e	40755	root:root	
-/usr/lib/debug/.build-id/3e/3cb04592639d16b0c65a0753a3822cf140f6b4	120777	root:root	../../../libdbus-tqt-1.so.0.0.0
-/usr/lib/debug/.build-id/3e/3cb04592639d16b0c65a0753a3822cf140f6b4.debug	120777	root:root	../../usr/lib/libdbus-tqt-1.so.0.0.0.debug
+/usr/lib/debug/.build-id/34	40755	root:root	
+/usr/lib/debug/.build-id/34/b09010e9a4823f5ba7346b9d49ee6ba4e9504a	120777	root:root	../../../libdbus-tqt-1.so.0.0.0
+/usr/lib/debug/.build-id/34/b09010e9a4823f5ba7346b9d49ee6ba4e9504a.debug	120777	root:root	../../usr/lib/libdbus-tqt-1.so.0.0.0.debug
 /usr/lib/debug/usr/lib/libdbus-tqt-1.so.0.0.0.debug	100644	root:root	
@@ -12,2 +12,3 @@
 /usr/src/debug/dbus-tqt-3.5.13.2/connection.h	100644	root:root	
+/usr/src/debug/dbus-tqt-3.5.13.2/dbus-qthread.cpp	100644	root:root	
 /usr/src/debug/dbus-tqt-3.5.13.2/integrator.cpp	100644	root:root	
@@ -27,6 +28,6 @@
 Provides: libdbus-tqt-debuginfo = 3.5.13.2-alt1.1
-File: /usr/lib/debug/.build-id/3e	40755	root:root		
-File: /usr/lib/debug/.build-id/3e/3cb04592639d16b0c65a0753a3822cf140f6b4	120777	root:root		../../../libdbus-tqt-1.so.0.0.0
-File: /usr/lib/debug/.build-id/3e/3cb04592639d16b0c65a0753a3822cf140f6b4.debug	120777	root:root		../../usr/lib/libdbus-tqt-1.so.0.0.0.debug
-File: /usr/lib/debug/usr/lib/libdbus-tqt-1.so.0.0.0.debug	100644	root:root	83ff5c34bf15638c8467106c8b7eb239	
+File: /usr/lib/debug/.build-id/34	40755	root:root		
+File: /usr/lib/debug/.build-id/34/b09010e9a4823f5ba7346b9d49ee6ba4e9504a	120777	root:root		../../../libdbus-tqt-1.so.0.0.0
+File: /usr/lib/debug/.build-id/34/b09010e9a4823f5ba7346b9d49ee6ba4e9504a.debug	120777	root:root		../../usr/lib/libdbus-tqt-1.so.0.0.0.debug
+File: /usr/lib/debug/usr/lib/libdbus-tqt-1.so.0.0.0.debug	100644	root:root	b544a9da3b223ece39a805008646a144	
 File: /usr/lib/debug/usr/lib/libdbus-tqt-1.so.0.debug	120777	root:root		libdbus-tqt-1.so.0.0.0.debug
@@ -34,7 +35,8 @@
 File: /usr/src/debug/dbus-tqt-3.5.13.2/BUILD-i586-alt-linux	40755	root:root		
-File: /usr/src/debug/dbus-tqt-3.5.13.2/BUILD-i586-alt-linux/connection.moc	100644	root:root	10fc886d31dd7f1fc8f530bb08cde916	
-File: /usr/src/debug/dbus-tqt-3.5.13.2/BUILD-i586-alt-linux/integrator.moc	100644	root:root	e8ba525936316f6e031a605e208cc5fb	
-File: /usr/src/debug/dbus-tqt-3.5.13.2/BUILD-i586-alt-linux/server.moc	100644	root:root	e47d729e011647840862968ce4912166	
+File: /usr/src/debug/dbus-tqt-3.5.13.2/BUILD-i586-alt-linux/connection.moc	100644	root:root	56881e25fddf0d9c3cff073416fb9d88	
+File: /usr/src/debug/dbus-tqt-3.5.13.2/BUILD-i586-alt-linux/integrator.moc	100644	root:root	207fa3756ffb35f6b9cd1f1ced1f7808	
+File: /usr/src/debug/dbus-tqt-3.5.13.2/BUILD-i586-alt-linux/server.moc	100644	root:root	5f3f2fb778fae8d3f6b096f2529e0852	
 File: /usr/src/debug/dbus-tqt-3.5.13.2/connection.cpp	100644	root:root	f23caddf079806aedc2bd60ed2bbd8d9	
 File: /usr/src/debug/dbus-tqt-3.5.13.2/connection.h	100644	root:root	7375e14d5605443b3a192c680f6335e5	
+File: /usr/src/debug/dbus-tqt-3.5.13.2/dbus-qthread.cpp	100644	root:root	5454cf82145db4566f6bf7f18436f091	
 File: /usr/src/debug/dbus-tqt-3.5.13.2/integrator.cpp	100644	root:root	356319f9ff3ff9d40b75bb0b9e450a85	
@@ -45,2 +47,2 @@
 File: /usr/src/debug/dbus-tqt-3.5.13.2/server.h	100644	root:root	b940c0f83a81236240310c2e5ebe0b53	
-RPMIdentity: f082b715897faf6abc4254e32a7326ed625f2bde02501cbb5d36b9940f9fa4e45f51bdd08bfc09d9e53a9192d9b292cd9d97f5df3c035115fd3b976ec1e34608
+RPMIdentity: ca72cf648e1bf29890b9d8c4d78ee2f33046377b4f3c1ab4277258fb3581b787704ea5760ea9fb937cc8fafe3903371a0c7577bc1c5f375c514caafe67bac1eb
--- libdbus-tqt-devel-3.5.13.2-alt1.1.i586.rpm.repo	2015-11-13 00:43:41.000000000 +0000
+++ libdbus-tqt-devel-3.5.13.2-alt1.1.i586.rpm.hasher	2024-05-11 06:51:35.359081085 +0000
@@ -20,2 +20,2 @@
 File: /usr/lib/pkgconfig/dbus-tqt.pc	100644	root:root	0100094e72bcdb3174b03c09f6114b3c	
-RPMIdentity: 2e70162ca540694159a4ebb3422cb44e68e43d8391f313baf29eb7a25d661baae2b0089d3d6bf605f20e5cfa8c24056c70533cbe1a616aa3ba78c0ff7681c9f7
+RPMIdentity: 65fdf5cd793ba1a0440c5e4f0781ed199c84462b45370928b38df97a6063b7d8607cf657f54b011266ea1b6570a1a2e20ec36f6db5dedca672adc1d9e45384e1