<86>Apr 13 06:42:11 userdel[1107251]: delete user 'rooter'
<86>Apr 13 06:42:11 userdel[1107251]: removed group 'rooter' owned by 'rooter'
<86>Apr 13 06:42:11 userdel[1107251]: removed shadow group 'rooter' owned by 'rooter'
<86>Apr 13 06:42:11 groupadd[1107277]: group added to /etc/group: name=rooter, GID=1853
<86>Apr 13 06:42:11 groupadd[1107277]: group added to /etc/gshadow: name=rooter
<86>Apr 13 06:42:11 groupadd[1107277]: new group: name=rooter, GID=1853
<86>Apr 13 06:42:11 useradd[1107294]: new user: name=rooter, UID=1853, GID=1853, home=/root, shell=/bin/bash, from=none
<86>Apr 13 06:42:11 userdel[1107334]: delete user 'builder'
<86>Apr 13 06:42:11 userdel[1107334]: removed group 'builder' owned by 'builder'
<86>Apr 13 06:42:11 userdel[1107334]: removed shadow group 'builder' owned by 'builder'
<86>Apr 13 06:42:11 groupadd[1107358]: group added to /etc/group: name=builder, GID=1854
<86>Apr 13 06:42:11 groupadd[1107358]: group added to /etc/gshadow: name=builder
<86>Apr 13 06:42:11 groupadd[1107358]: new group: name=builder, GID=1854
<86>Apr 13 06:42:11 useradd[1107379]: new user: name=builder, UID=1854, GID=1854, home=/usr/src, shell=/bin/bash, from=none
<13>Apr 13 06:42:14 rpmi: libruby-3.1.4-alt4.1 sisyphus+343529.70.9.8 1711477922 installed
<13>Apr 13 06:42:14 rpmi: libruby-devel-3.1.4-alt4.1 sisyphus+343529.70.9.8 1711477922 installed
<13>Apr 13 06:42:14 rpmi: rpm-macros-ruby-1:3.1.4-alt4.1 sisyphus+343529.70.9.8 1711477922 installed
<13>Apr 13 06:42:14 rpmi: libyaml2-0.2.5-alt1 sisyphus+278391.100.1.1 1626094932 installed
<13>Apr 13 06:42:14 rpmi: libncurses6-6.3.20220618-alt4 sisyphus+327286.4600.14.1 1711486782 installed
<13>Apr 13 06:42:14 rpmi: chrpath-0.16-alt1 sisyphus+278100.500.1.1 1626056638 installed
<13>Apr 13 06:42:14 rpmi: setup-rb-5.999.6-alt10 sisyphus+342746.62.8.1 1710630324 installed
<13>Apr 13 06:42:14 rpmi: gem-setup-5.999.6-alt10 sisyphus+342746.62.8.1 1710630324 installed
<13>Apr 13 06:42:14 rpmi: libp11-kit-1:0.25.3-alt2 sisyphus+336533.100.1.1 1702645575 installed
<13>Apr 13 06:42:14 rpmi: libtasn1-4.19.0-alt3 sisyphus+327816.100.1.1 1692802618 installed
<13>Apr 13 06:42:14 rpmi: rpm-macros-alternatives-0.5.2-alt2 sisyphus+315270.200.2.1 1676457367 installed
<13>Apr 13 06:42:14 rpmi: alternatives-0.5.2-alt2 sisyphus+315270.200.2.1 1676457367 installed
<13>Apr 13 06:42:14 rpmi: ca-certificates-2024.02.24-alt1 sisyphus+341362.100.1.1 1708791001 installed
<13>Apr 13 06:42:14 rpmi: ca-trust-0.2.0-alt1 sisyphus+344843.100.1.1 1712743326 installed
<13>Apr 13 06:42:14 rpmi: p11-kit-trust-1:0.25.3-alt2 sisyphus+336533.100.1.1 1702645575 installed
<13>Apr 13 06:42:15 rpmi: libcrypto3-3.1.5-alt2 sisyphus+343320.140.3.1 1711982452 installed
<13>Apr 13 06:42:15 rpmi: libssl3-3.1.5-alt2 sisyphus+343320.140.3.1 1711982452 installed
<13>Apr 13 06:42:15 rpmi: irb-3.1.4-alt4.1 sisyphus+343529.70.9.8 1711477881 installed
<13>Apr 13 06:42:15 rpmi: gem-2:3.3.26-alt4.1 sisyphus+343529.70.9.8 1711477881 installed
<86>Apr 13 06:42:15 groupadd[1115843]: group added to /etc/group: name=ruby, GID=999
<86>Apr 13 06:42:15 groupadd[1115843]: group added to /etc/gshadow: name=ruby
<86>Apr 13 06:42:15 groupadd[1115843]: new group: name=ruby, GID=999
<86>Apr 13 06:42:15 usermod[1115862]: add 'root' to group 'ruby'
<86>Apr 13 06:42:15 usermod[1115862]: add 'root' to shadow group 'ruby'
<13>Apr 13 06:42:15 rpmi: ruby-3.1.4-alt4.1 sisyphus+343529.70.9.8 1711477922 installed
NOTE: to make the environment variable changes come into effect, please relogin the terminal session
<13>Apr 13 06:42:15 rpmi: ruby-stdlibs-3.1.4-alt4.1 sisyphus+343529.70.9.8 1711477922 installed
<13>Apr 13 06:42:15 rpmi: erb-3.1.4-alt4.1 sisyphus+343529.70.9.8 1711477881 installed
<13>Apr 13 06:42:15 rpmi: gem-rake-13.1.0-alt1.1 sisyphus+343176.100.1.1 1710938591 installed
<13>Apr 13 06:42:15 rpmi: rake-13.1.0-alt1.1 sisyphus+343176.100.1.1 1710938591 installed
<13>Apr 13 06:42:15 rpmi: rpm-build-ruby-1:1.1.1-alt1 sisyphus+334339.50.37.1 1702423926 installed
Building target platforms: i586
Building for target i586
Wrote: /usr/src/in/nosrpm/gem-cbor-0.5.9.6-alt1.1.nosrc.rpm (w1.gzdio)
Installing gem-cbor-0.5.9.6-alt1.1.src.rpm
Building target platforms: i586
Building for target i586
Executing(%prep): /bin/sh -e /usr/src/tmp/rpm-tmp.12019
+ umask 022
+ /bin/mkdir -p /usr/src/RPM/BUILD
+ cd /usr/src/RPM/BUILD
+ cd /usr/src/RPM/BUILD
+ rm -rf gem-cbor-0.5.9.6
+ echo 'Source #0 (gem-cbor-0.5.9.6.tar):'
Source #0 (gem-cbor-0.5.9.6.tar):
+ /bin/tar -xf /usr/src/RPM/SOURCES/gem-cbor-0.5.9.6.tar
+ cd gem-cbor-0.5.9.6
+ /bin/chmod -c -Rf u+rwX,go-w .
+ exit 0
Executing(%build): /bin/sh -e /usr/src/tmp/rpm-tmp.12019
+ umask 022
+ /bin/mkdir -p /usr/src/RPM/BUILD
+ cd /usr/src/RPM/BUILD
+ cd gem-cbor-0.5.9.6
+ rm -f Gemfile.lock
+ GEM_HOME=/usr/lib/ruby/gemie
+ /usr/bin/ruby /usr/lib/ruby/bin/setup-rb build --shebang=auto --bindir=/usr/bin --prefixes=gem,ruby,rails-engine --gem-version-replace= --ignore-names= --regard-names= --alias=:: '--use-gem-dependencies=,rake >= 13.0.1,rake < 14,rspec >= 3.10.0,rspec < 4,rake-compiler >= 1.1.2,rake-compiler < 2,json >= 2.3.0,json < 3,yard >= 0.9.27,yard < 1' --pre= --use-gem-version= --ignore-path-tokens=templates,example,examples,sample,samples,spec,test,features,fixtures,doc,docs,contrib,demo,acceptance,conformance,myapp,website,benchmarks,benchmark,gemfiles,misc,steer --debug-io=/usr/src/tmp/debug.log --verbose=debug
(ruby 3.1.4 i686-linux)
sh: line 1: git: command not found
###### NameError: uninitialized constant #<Class:Setup::Source::Gem::M103977825394771633425185808951083507240>::RSpec
sh: line 1: git: command not found
[setup.rb][INFO]> Source list are the following:
[setup.rb][INFO]> V *cbor:0.5.9.6 [/usr/src/RPM/BUILD/gem-cbor-0.5.9.6/cbor.gemspec]
[setup.rb][INFO]> = *cbor:0.5.9.6 [/usr/src/RPM/BUILD/gem-cbor-0.5.9.6/Rakefile]
[setup.rb][INFO]> = *cbor:0.5.9.6 [/usr/src/RPM/BUILD/gem-cbor-0.5.9.6/Rakefile]
[setup.rb][INFO]> = *cbor:0.5.9.6 [/usr/src/RPM/BUILD/gem-cbor-0.5.9.6/Rakefile]

- - PRECONFIG - - - - - - - - - - - - - - - - - - - - - - - - - - - - 

SetupConfig was saved. Edit to customize configuration.

- - COMPILE - - - - - - - - - - - - - - - - - - - - - - - - - - - - - 

checking for ruby/st.h... yes
checking for st.h... no
checking for rb_str_replace() in ruby.h... yes
checking for rb_big_new() in ruby.h... yes
checking for rb_intern_str() in ruby.h... yes
checking for rb_sym2str() in ruby.h... yes
checking for rb_str_intern() in ruby.h... yes
checking for rb_integer_unpack() in ruby.h... yes
creating Makefile
make: Entering directory '/usr/src/RPM/BUILD/gem-cbor-0.5.9.6/ext/cbor'
compiling buffer.c
In file included from sysdep.h:30,
                 from buffer.h:33,
                 from buffer.c:28:
buffer.c: In function 'CBOR_buffer_static_init':
renamer.h:32:36: warning: old-style function definition [-Wold-style-definition]
   32 | #define msgpack_buffer_static_init CBOR_buffer_static_init
      |                                    ^~~~~~~~~~~~~~~~~~~~~~~
buffer.c:46:6: note: in expansion of macro 'msgpack_buffer_static_init'
   46 | void msgpack_buffer_static_init()
      |      ^~~~~~~~~~~~~~~~~~~~~~~~~~
buffer.c: In function 'CBOR_buffer_static_destroy':
renamer.h:31:39: warning: old-style function definition [-Wold-style-definition]
   31 | #define msgpack_buffer_static_destroy CBOR_buffer_static_destroy
      |                                       ^~~~~~~~~~~~~~~~~~~~~~~~~~
buffer.c:63:6: note: in expansion of macro 'msgpack_buffer_static_destroy'
   63 | void msgpack_buffer_static_destroy()
      |      ^~~~~~~~~~~~~~~~~~~~~~~~~~~~~
At top level:
cc1: note: unrecognized command-line option '-Wno-self-assign' may have been intended to silence earlier diagnostics
cc1: note: unrecognized command-line option '-Wno-parentheses-equality' may have been intended to silence earlier diagnostics
cc1: note: unrecognized command-line option '-Wno-constant-logical-operand' may have been intended to silence earlier diagnostics
compiling buffer_class.c
buffer_class.c: In function 'read_until_eof':
buffer_class.c:270:17: warning: passing argument 3 of 'rb_rescue2' from incompatible pointer type [-Wincompatible-pointer-types]
  270 |                 read_until_eof_error, (VALUE)(void*) args,
      |                 ^~~~~~~~~~~~~~~~~~~~
      |                 |
      |                 VALUE (*)(VALUE) {aka long unsigned int (*)(long unsigned int)}
In file included from /usr/include/ruby/ruby.h:40,
                 from /usr/include/ruby.h:38,
                 from compat.h:30,
                 from buffer_class.c:28:
/usr/include/ruby/internal/iterator.h:388:63: note: expected 'VALUE (*)(VALUE,  VALUE)' {aka 'long unsigned int (*)(long unsigned int,  long unsigned int)'} but argument is of type 'VALUE (*)(VALUE)' {aka 'long unsigned int (*)(long unsigned int)'}
  388 | VALUE rb_rescue2(VALUE (*b_proc)(VALUE), VALUE data1, VALUE (*r_proc)(VALUE, VALUE), VALUE data2, ...);
      |                                                       ~~~~~~~~^~~~~~~~~~~~~~~~~~~~~
At top level:
cc1: note: unrecognized command-line option '-Wno-self-assign' may have been intended to silence earlier diagnostics
cc1: note: unrecognized command-line option '-Wno-parentheses-equality' may have been intended to silence earlier diagnostics
cc1: note: unrecognized command-line option '-Wno-constant-logical-operand' may have been intended to silence earlier diagnostics
compiling core_ext.c
In file included from sysdep.h:30,
                 from buffer.h:33,
                 from packer.h:30,
                 from core_ext.c:29:
core_ext.c: In function 'CBOR_core_ext_module_init':
renamer.h:6:42: warning: old-style function definition [-Wold-style-definition]
    6 | #define MessagePack_core_ext_module_init CBOR_core_ext_module_init
      |                                          ^~~~~~~~~~~~~~~~~~~~~~~~~
core_ext.c:176:6: note: in expansion of macro 'MessagePack_core_ext_module_init'
  176 | void MessagePack_core_ext_module_init()
      |      ^~~~~~~~~~~~~~~~~~~~~~~~~~~~~~~~
At top level:
cc1: note: unrecognized command-line option '-Wno-self-assign' may have been intended to silence earlier diagnostics
cc1: note: unrecognized command-line option '-Wno-parentheses-equality' may have been intended to silence earlier diagnostics
cc1: note: unrecognized command-line option '-Wno-constant-logical-operand' may have been intended to silence earlier diagnostics
compiling packer.c
In file included from sysdep.h:30,
                 from buffer.h:33,
                 from packer.h:30,
                 from packer.c:28:
packer.c: In function 'CBOR_packer_static_init':
renamer.h:38:36: warning: old-style function definition [-Wold-style-definition]
   38 | #define msgpack_packer_static_init CBOR_packer_static_init
      |                                    ^~~~~~~~~~~~~~~~~~~~~~~
packer.c:37:6: note: in expansion of macro 'msgpack_packer_static_init'
   37 | void msgpack_packer_static_init()
      |      ^~~~~~~~~~~~~~~~~~~~~~~~~~
packer.c: In function 'CBOR_packer_static_destroy':
renamer.h:37:39: warning: old-style function definition [-Wold-style-definition]
   37 | #define msgpack_packer_static_destroy CBOR_packer_static_destroy
      |                                       ^~~~~~~~~~~~~~~~~~~~~~~~~~
packer.c:47:6: note: in expansion of macro 'msgpack_packer_static_destroy'
   47 | void msgpack_packer_static_destroy()
      |      ^~~~~~~~~~~~~~~~~~~~~~~~~~~~~
At top level:
cc1: note: unrecognized command-line option '-Wno-self-assign' may have been intended to silence earlier diagnostics
cc1: note: unrecognized command-line option '-Wno-parentheses-equality' may have been intended to silence earlier diagnostics
cc1: note: unrecognized command-line option '-Wno-constant-logical-operand' may have been intended to silence earlier diagnostics
compiling packer_class.c
compiling rbinit.c
compiling rmem.c
compiling unpacker.c
In file included from sysdep.h:30,
                 from buffer.h:33,
                 from unpacker.h:30,
                 from unpacker.c:28:
unpacker.c: In function 'CBOR_unpacker_static_init':
renamer.h:56:38: warning: old-style function definition [-Wold-style-definition]
   56 | #define msgpack_unpacker_static_init CBOR_unpacker_static_init
      |                                      ^~~~~~~~~~~~~~~~~~~~~~~~~
unpacker.c:48:6: note: in expansion of macro 'msgpack_unpacker_static_init'
   48 | void msgpack_unpacker_static_init()
      |      ^~~~~~~~~~~~~~~~~~~~~~~~~~~~
unpacker.c: In function 'CBOR_unpacker_static_destroy':
renamer.h:55:41: warning: old-style function definition [-Wold-style-definition]
   55 | #define msgpack_unpacker_static_destroy CBOR_unpacker_static_destroy
      |                                         ^~~~~~~~~~~~~~~~~~~~~~~~~~~~
unpacker.c:59:6: note: in expansion of macro 'msgpack_unpacker_static_destroy'
   59 | void msgpack_unpacker_static_destroy()
      |      ^~~~~~~~~~~~~~~~~~~~~~~~~~~~~~~
unpacker.c: In function 'ldexp11':
unpacker.c:305:5: warning: "SOMEBODY_FIXED_LDEXP" is not defined, evaluates to 0 [-Wundef]
  305 | #if SOMEBODY_FIXED_LDEXP
      |     ^~~~~~~~~~~~~~~~~~~~
At top level:
cc1: note: unrecognized command-line option '-Wno-self-assign' may have been intended to silence earlier diagnostics
cc1: note: unrecognized command-line option '-Wno-parentheses-equality' may have been intended to silence earlier diagnostics
cc1: note: unrecognized command-line option '-Wno-constant-logical-operand' may have been intended to silence earlier diagnostics
compiling unpacker_class.c
unpacker_class.c: In function 'Unpacker_each':
unpacker_class.c:281:17: warning: passing argument 3 of 'rb_rescue2' from incompatible pointer type [-Wincompatible-pointer-types]
  281 |                 Unpacker_rescue_EOFError, self,
      |                 ^~~~~~~~~~~~~~~~~~~~~~~~
      |                 |
      |                 VALUE (*)(VALUE) {aka long unsigned int (*)(long unsigned int)}
In file included from /usr/include/ruby/ruby.h:40,
                 from /usr/include/ruby.h:38,
                 from compat.h:30,
                 from buffer.h:32,
                 from unpacker.h:30,
                 from unpacker_class.c:28:
/usr/include/ruby/internal/iterator.h:388:63: note: expected 'VALUE (*)(VALUE,  VALUE)' {aka 'long unsigned int (*)(long unsigned int,  long unsigned int)'} but argument is of type 'VALUE (*)(VALUE)' {aka 'long unsigned int (*)(long unsigned int)'}
  388 | VALUE rb_rescue2(VALUE (*b_proc)(VALUE), VALUE data1, VALUE (*r_proc)(VALUE, VALUE), VALUE data2, ...);
      |                                                       ~~~~~~~~^~~~~~~~~~~~~~~~~~~~~
At top level:
cc1: note: unrecognized command-line option '-Wno-self-assign' may have been intended to silence earlier diagnostics
cc1: note: unrecognized command-line option '-Wno-parentheses-equality' may have been intended to silence earlier diagnostics
cc1: note: unrecognized command-line option '-Wno-constant-logical-operand' may have been intended to silence earlier diagnostics
linking shared-object cbor/cbor.so
make: Leaving directory '/usr/src/RPM/BUILD/gem-cbor-0.5.9.6/ext/cbor'
make: Entering directory '/usr/src/RPM/BUILD/gem-cbor-0.5.9.6/ext/cbor'
/bin/install -m 0755 cbor.so /usr/src/RPM/BUILD/gem-cbor-0.5.9.6/.so.cbor/usr/local/lib/ruby/cbor
make: Leaving directory '/usr/src/RPM/BUILD/gem-cbor-0.5.9.6/ext/cbor'

- - DOCUMENT- - - - - - - - - - - - - - - - - - - - - - - - - - - - - 


+ exit 0
Executing(%install): /bin/sh -e /usr/src/tmp/rpm-tmp.69480
+ umask 022
+ /bin/mkdir -p /usr/src/RPM/BUILD
+ cd /usr/src/RPM/BUILD
+ /bin/chmod -Rf u+rwX -- /usr/src/tmp/gem-cbor-buildroot
+ :
+ /bin/rm -rf -- /usr/src/tmp/gem-cbor-buildroot
+ PATH=/usr/libexec/rpm-build:/usr/src/bin:/bin:/usr/bin:/usr/X11R6/bin:/usr/games
+ cd gem-cbor-0.5.9.6
+ GEM_HOME=/usr/lib/ruby/gemie
+ /usr/bin/ruby /usr/lib/ruby/bin/setup-rb install --install_prefix=/usr/src/tmp/gem-cbor-buildroot --gem-version-replace=
(ruby 3.1.4 i686-linux)
[setup.rb][INFO]> Source list are the following:
[setup.rb][INFO]> V *cbor:0.5.9.6 [/usr/src/RPM/BUILD/gem-cbor-0.5.9.6/cbor.gemspec]
[setup.rb][INFO]> = *cbor:0.5.9.6 [/usr/src/RPM/BUILD/gem-cbor-0.5.9.6/Rakefile]
[setup.rb][INFO]> = *cbor:0.5.9.6 [/usr/src/RPM/BUILD/gem-cbor-0.5.9.6/Rakefile]
[setup.rb][INFO]> = *cbor:0.5.9.6 [/usr/src/RPM/BUILD/gem-cbor-0.5.9.6/Rakefile]

- - INSTALL - - - - - - - - - - - - - - - - - - - - - - - - - - - - - 

sh: line 1: git: command not found
* {exe} ->
* {lib} ->
  % cbor < lib
    cbor/version.rb => [/usr/src/tmp/gem-cbor-buildroot]/usr/lib/ruby/gemie/gems/cbor-0.5.9.6/lib/cbor/version.rb
    cbor.rb => [/usr/src/tmp/gem-cbor-buildroot]/usr/lib/ruby/gemie/gems/cbor-0.5.9.6/lib/cbor.rb
* {man} ->
* {ri} ->
  % cbor < .ri.cbor
    CBOR/cdesc-CBOR.ri => [/usr/src/tmp/gem-cbor-buildroot]/usr/lib/ruby/gemie/ri/cbor-0.5.9.6/CBOR/cdesc-CBOR.ri
    cache.ri => [/usr/src/tmp/gem-cbor-buildroot]/usr/lib/ruby/gemie/ri/cbor-0.5.9.6/cache.ri
* {inc} ->
  % cbor < ext
    cbor/buffer.h => [/usr/src/tmp/gem-cbor-buildroot]/usr/include/cbor/buffer.h
    cbor/buffer_class.h => [/usr/src/tmp/gem-cbor-buildroot]/usr/include/cbor/buffer_class.h
    cbor/cbor.h => [/usr/src/tmp/gem-cbor-buildroot]/usr/include/cbor/cbor.h
    cbor/compat.h => [/usr/src/tmp/gem-cbor-buildroot]/usr/include/cbor/compat.h
    cbor/core_ext.h => [/usr/src/tmp/gem-cbor-buildroot]/usr/include/cbor/core_ext.h
    cbor/packer.h => [/usr/src/tmp/gem-cbor-buildroot]/usr/include/cbor/packer.h
    cbor/packer_class.h => [/usr/src/tmp/gem-cbor-buildroot]/usr/include/cbor/packer_class.h
    cbor/renamer.h => [/usr/src/tmp/gem-cbor-buildroot]/usr/include/cbor/renamer.h
    cbor/rmem.h => [/usr/src/tmp/gem-cbor-buildroot]/usr/include/cbor/rmem.h
    cbor/sysdep.h => [/usr/src/tmp/gem-cbor-buildroot]/usr/include/cbor/sysdep.h
    cbor/sysdep_endian.h => [/usr/src/tmp/gem-cbor-buildroot]/usr/include/cbor/sysdep_endian.h
    cbor/sysdep_types.h => [/usr/src/tmp/gem-cbor-buildroot]/usr/include/cbor/sysdep_types.h
    cbor/unpacker.h => [/usr/src/tmp/gem-cbor-buildroot]/usr/include/cbor/unpacker.h
    cbor/unpacker_class.h => [/usr/src/tmp/gem-cbor-buildroot]/usr/include/cbor/unpacker_class.h
    /usr/include -> [/usr/src/tmp/gem-cbor-buildroot]/usr/lib/ruby/gemie/gems/cbor-0.5.9.6/ext
* {app} ->
* {log} ->
* {state} ->
* {test} ->
  % cbor < spec
    buffer_io_spec.rb => [/usr/src/tmp/gem-cbor-buildroot]/usr/lib/ruby/gemie/gems/cbor-0.5.9.6/spec/buffer_io_spec.rb
    buffer_spec.rb => [/usr/src/tmp/gem-cbor-buildroot]/usr/lib/ruby/gemie/gems/cbor-0.5.9.6/spec/buffer_spec.rb
    cases.cbor => [/usr/src/tmp/gem-cbor-buildroot]/usr/lib/ruby/gemie/gems/cbor-0.5.9.6/spec/cases.cbor
    cases.cbor_stream => [/usr/src/tmp/gem-cbor-buildroot]/usr/lib/ruby/gemie/gems/cbor-0.5.9.6/spec/cases.cbor_stream
    cases.json => [/usr/src/tmp/gem-cbor-buildroot]/usr/lib/ruby/gemie/gems/cbor-0.5.9.6/spec/cases.json
    cases.msg => [/usr/src/tmp/gem-cbor-buildroot]/usr/lib/ruby/gemie/gems/cbor-0.5.9.6/spec/cases.msg
    cases_compact.msg => [/usr/src/tmp/gem-cbor-buildroot]/usr/lib/ruby/gemie/gems/cbor-0.5.9.6/spec/cases_compact.msg
    cases_spec.rb => [/usr/src/tmp/gem-cbor-buildroot]/usr/lib/ruby/gemie/gems/cbor-0.5.9.6/spec/cases_spec.rb
    format_spec.rb => [/usr/src/tmp/gem-cbor-buildroot]/usr/lib/ruby/gemie/gems/cbor-0.5.9.6/spec/format_spec.rb
    packer_spec.rb => [/usr/src/tmp/gem-cbor-buildroot]/usr/lib/ruby/gemie/gems/cbor-0.5.9.6/spec/packer_spec.rb
    random_compat.rb => [/usr/src/tmp/gem-cbor-buildroot]/usr/lib/ruby/gemie/gems/cbor-0.5.9.6/spec/random_compat.rb
    spec_helper.rb => [/usr/src/tmp/gem-cbor-buildroot]/usr/lib/ruby/gemie/gems/cbor-0.5.9.6/spec/spec_helper.rb
    unpacker_spec.rb => [/usr/src/tmp/gem-cbor-buildroot]/usr/lib/ruby/gemie/gems/cbor-0.5.9.6/spec/unpacker_spec.rb
* {sup} ->
* {conf} ->
* {data} ->
  % cbor < .
    .gitignore => [/usr/src/tmp/gem-cbor-buildroot]/usr/lib/ruby/gemie/gems/cbor-0.5.9.6/.gitignore
    .travis.yml => [/usr/src/tmp/gem-cbor-buildroot]/usr/lib/ruby/gemie/gems/cbor-0.5.9.6/.travis.yml
    ChangeLog => [/usr/src/tmp/gem-cbor-buildroot]/usr/lib/ruby/gemie/gems/cbor-0.5.9.6/ChangeLog
    Gemfile => [/usr/src/tmp/gem-cbor-buildroot]/usr/lib/ruby/gemie/gems/cbor-0.5.9.6/Gemfile
    README.rdoc => [/usr/src/tmp/gem-cbor-buildroot]/usr/lib/ruby/gemie/gems/cbor-0.5.9.6/README.rdoc
    Rakefile => [/usr/src/tmp/gem-cbor-buildroot]/usr/lib/ruby/gemie/gems/cbor-0.5.9.6/Rakefile
    cbor.gemspec => [/usr/src/tmp/gem-cbor-buildroot]/usr/lib/ruby/gemie/gems/cbor-0.5.9.6/cbor.gemspec
    doclib/cbor.rb => [/usr/src/tmp/gem-cbor-buildroot]/usr/lib/ruby/gemie/gems/cbor-0.5.9.6/doclib/cbor.rb
    doclib/cbor/buffer.rb => [/usr/src/tmp/gem-cbor-buildroot]/usr/lib/ruby/gemie/gems/cbor-0.5.9.6/doclib/cbor/buffer.rb
    doclib/cbor/core_ext.rb => [/usr/src/tmp/gem-cbor-buildroot]/usr/lib/ruby/gemie/gems/cbor-0.5.9.6/doclib/cbor/core_ext.rb
    doclib/cbor/error.rb => [/usr/src/tmp/gem-cbor-buildroot]/usr/lib/ruby/gemie/gems/cbor-0.5.9.6/doclib/cbor/error.rb
    doclib/cbor/packer.rb => [/usr/src/tmp/gem-cbor-buildroot]/usr/lib/ruby/gemie/gems/cbor-0.5.9.6/doclib/cbor/packer.rb
    doclib/cbor/simple.rb => [/usr/src/tmp/gem-cbor-buildroot]/usr/lib/ruby/gemie/gems/cbor-0.5.9.6/doclib/cbor/simple.rb
    doclib/cbor/tagged.rb => [/usr/src/tmp/gem-cbor-buildroot]/usr/lib/ruby/gemie/gems/cbor-0.5.9.6/doclib/cbor/tagged.rb
    doclib/cbor/unpacker.rb => [/usr/src/tmp/gem-cbor-buildroot]/usr/lib/ruby/gemie/gems/cbor-0.5.9.6/doclib/cbor/unpacker.rb
* {.gemspec} ->
  %cbor
    /usr/src/tmp/gemspec.20240413-1141621-laelv4 => [/usr/src/tmp/gem-cbor-buildroot]/usr/lib/ruby/gemie/specifications/cbor-0.5.9.6.gemspec
* {gemfile} ->
  %cbor
    /usr/src/tmp/Gemfile.20240413-1141621-dmbzzr => [/usr/src/tmp/gem-cbor-buildroot]/usr/lib/ruby/gemie/gems/cbor-0.5.9.6/Gemfile
* scheme
{cbor}
  /usr/src/RPM/BUILD/gem-cbor-0.5.9.6/.so.cbor/usr/local/lib/ruby/cbor/cbor.so => /usr/src/tmp/gem-cbor-buildroot/usr/lib/ruby/gemie/extensions/cbor-0.5.9.6/cbor/cbor.so
  /usr/lib/ruby/gemie/extensions/cbor-0.5.9.6/cbor/cbor.so -> /usr/src/tmp/gem-cbor-buildroot/usr/lib/ruby/gemie/gems/cbor-0.5.9.6/lib/cbor/cbor.so
  >> /usr/src/tmp/gem-cbor-buildroot/usr/lib/ruby/gemie/extensions/cbor-0.5.9.6/gem.build_complete

+ /usr/lib/rpm/brp-alt
Cleaning files in /usr/src/tmp/gem-cbor-buildroot (auto)
removed './usr/lib/ruby/gemie/gems/cbor-0.5.9.6/.gitignore'
mode of './usr/lib/ruby/gemie/extensions/cbor-0.5.9.6/cbor/cbor.so' changed from 0755 (rwxr-xr-x) to 0644 (rw-r--r--)
Verifying and fixing files in /usr/src/tmp/gem-cbor-buildroot (binconfig,pkgconfig,libtool,desktop,gnuconfig)
Checking contents of files in /usr/src/tmp/gem-cbor-buildroot/ (default)
Compressing files in /usr/src/tmp/gem-cbor-buildroot (auto)
Adjusting library links in /usr/src/tmp/gem-cbor-buildroot
./usr/lib: (from <cmdline>:0)
./usr/lib/ruby/gemie/gems/cbor-0.5.9.6/lib: (from <cmdline>:0)
debugedit: ./usr/lib/ruby/gemie/extensions/cbor-0.5.9.6/cbor/cbor.so: DWARF version 30936 unhandled
Verifying ELF objects in /usr/src/tmp/gem-cbor-buildroot (arch=normal,fhs=normal,lfs=relaxed,lint=relaxed,rpath=normal,stack=normal,textrel=normal,unresolved=normal)
Splitting links to aliased files under /{,s}bin in /usr/src/tmp/gem-cbor-buildroot
Executing(%check): /bin/sh -e /usr/src/tmp/rpm-tmp.6865
+ umask 022
+ /bin/mkdir -p /usr/src/RPM/BUILD
+ cd /usr/src/RPM/BUILD
+ cd gem-cbor-0.5.9.6
+ GEM_HOME=/usr/lib/ruby/gemie
+ /usr/bin/ruby /usr/lib/ruby/bin/setup-rb test
(ruby 3.1.4 i686-linux)
[setup.rb][INFO]> Source list are the following:
[setup.rb][INFO]> V *cbor:0.5.9.6 [/usr/src/RPM/BUILD/gem-cbor-0.5.9.6/cbor.gemspec]
[setup.rb][INFO]> = *cbor:0.5.9.6 [/usr/src/RPM/BUILD/gem-cbor-0.5.9.6/Rakefile]
[setup.rb][INFO]> = *cbor:0.5.9.6 [/usr/src/RPM/BUILD/gem-cbor-0.5.9.6/Rakefile]
[setup.rb][INFO]> = *cbor:0.5.9.6 [/usr/src/RPM/BUILD/gem-cbor-0.5.9.6/Rakefile]
sh: line 1: git: command not found

+ exit 0
Processing files: gem-cbor-0.5.9.6-alt1.1
Executing(%doc): /bin/sh -e /usr/src/tmp/rpm-tmp.67966
+ umask 022
+ /bin/mkdir -p /usr/src/RPM/BUILD
+ cd /usr/src/RPM/BUILD
+ cd gem-cbor-0.5.9.6
+ DOCDIR=/usr/src/tmp/gem-cbor-buildroot/usr/share/doc/gem-cbor-0.5.9.6
+ export DOCDIR
+ rm -rf /usr/src/tmp/gem-cbor-buildroot/usr/share/doc/gem-cbor-0.5.9.6
+ /bin/mkdir -p /usr/src/tmp/gem-cbor-buildroot/usr/share/doc/gem-cbor-0.5.9.6
+ cp -prL README.rdoc /usr/src/tmp/gem-cbor-buildroot/usr/share/doc/gem-cbor-0.5.9.6
+ chmod -R go-w /usr/src/tmp/gem-cbor-buildroot/usr/share/doc/gem-cbor-0.5.9.6
+ chmod -R a+rX /usr/src/tmp/gem-cbor-buildroot/usr/share/doc/gem-cbor-0.5.9.6
+ exit 0
warning: absolute symlink: /usr/src/tmp/gem-cbor-buildroot/usr/lib/ruby/gemie/gems/cbor-0.5.9.6/ext -> /usr/include
warning: absolute symlink: /usr/src/tmp/gem-cbor-buildroot/usr/lib/ruby/gemie/gems/cbor-0.5.9.6/lib/cbor/cbor.so -> /usr/lib/ruby/gemie/extensions/cbor-0.5.9.6/cbor/cbor.so
Finding Provides (using /usr/lib/rpm/find-provides)
Executing: /bin/sh -e /usr/src/tmp/rpm-tmp.a7pO9f
find-provides: running scripts (alternatives,debuginfo,lib,pam,perl,pkgconfig,python,python3,ruby,shell)
ruby.prov: detecting ruby provides for gem-cbor...
ruby.prov: project file is '/usr/src/RPM/BUILD/gem-cbor-0.5.9.6/SetupConfig'
ruby.prov: /usr/bin/ruby /usr/lib/ruby/bin/setup-rb provides --install_prefix=/usr/src/tmp/gem-cbor-buildroot --package=gem-cbor -q
(ruby 3.1.4 i686-linux)
sh: line 1: git: command not found
* provs ->
  - [cbor]
    [lib]:
      gem(cbor) = 0.5.9.6
Finding Requires (using /usr/lib/rpm/find-requires)
Executing: /bin/sh -e /usr/src/tmp/rpm-tmp.0aEiVR
find-requires: running scripts (cpp,debuginfo,files,lib,pam,perl,pkgconfig,pkgconfiglib,python,python3,rpmlib,ruby,shebang,shell,static,symlinks,systemd-services)
ruby.req: detecting ruby requires for gem-cbor...
ruby.req: ruby project file is '/usr/src/RPM/BUILD/gem-cbor-0.5.9.6/SetupConfig'
ruby.req: /usr/bin/ruby /usr/lib/ruby/bin/setup-rb requires --install_prefix=/usr/src/tmp/gem-cbor-buildroot --package=gem-cbor -q
(ruby 3.1.4 i686-linux)
sh: line 1: git: command not found
* reqs ->
  - [cbor]
    [lib]:
      
      ruby >= 0
      rubygems >= 0
Provides: gem(cbor) = 0.5.9.6
Requires: libc.so.6(GLIBC_2.0), libc.so.6(GLIBC_2.1.3), libc.so.6(GLIBC_2.4), libm.so.6(GLIBC_2.0), libruby.so.3.1 >= set:ohCw0DlNZKmrNaG1athqWo0wo72KOGD8OFTxYb4ZnFdxU8fZFfLzodKy3h63KZ2S2SRjACB90WL783Fd2Si5or7PLIZdUrgits6XQf3fqpsU6sZFQw72XOAiPqa6sCfHd9jg40LfHtljjXZ1NzZxqwx2GJ0kZhPiQOug8L4jOqr7LItRfyv8xpWNsgyCFXNe4iEbK61ZJ7lKL27ae8Ly20d8eSBrQ2MLDGcz9VgpoqzBZJa, rtld(GNU_HASH), ruby >= 0, rubygems >= 0
Requires(rpmlib): rpmlib(SetVersions)
Finding debuginfo files (using /usr/lib/rpm/find-debuginfo-files)
Executing: /bin/sh -e /usr/src/tmp/rpm-tmp.EQqdG3
Creating gem-cbor-debuginfo package
Processing files: gem-cbor-doc-0.5.9.6-alt1.1
Executing(%doc): /bin/sh -e /usr/src/tmp/rpm-tmp.67770
+ umask 022
+ /bin/mkdir -p /usr/src/RPM/BUILD
+ cd /usr/src/RPM/BUILD
+ cd gem-cbor-0.5.9.6
+ DOCDIR=/usr/src/tmp/gem-cbor-buildroot/usr/share/doc/gem-cbor-doc-0.5.9.6
+ export DOCDIR
+ rm -rf /usr/src/tmp/gem-cbor-buildroot/usr/share/doc/gem-cbor-doc-0.5.9.6
+ /bin/mkdir -p /usr/src/tmp/gem-cbor-buildroot/usr/share/doc/gem-cbor-doc-0.5.9.6
+ cp -prL README.rdoc /usr/src/tmp/gem-cbor-buildroot/usr/share/doc/gem-cbor-doc-0.5.9.6
+ chmod -R go-w /usr/src/tmp/gem-cbor-buildroot/usr/share/doc/gem-cbor-doc-0.5.9.6
+ chmod -R a+rX /usr/src/tmp/gem-cbor-buildroot/usr/share/doc/gem-cbor-doc-0.5.9.6
+ exit 0
Finding Provides (using /usr/lib/rpm/find-provides)
Executing: /bin/sh -e /usr/src/tmp/rpm-tmp.n6dEZM
find-provides: running scripts (alternatives,debuginfo,lib,pam,perl,pkgconfig,python,python3,ruby,shell)
ruby.prov: detecting ruby provides for gem-cbor-doc...
ruby.prov: project file is '/usr/src/RPM/BUILD/gem-cbor-0.5.9.6/SetupConfig'
ruby.prov: /usr/bin/ruby /usr/lib/ruby/bin/setup-rb provides --install_prefix=/usr/src/tmp/gem-cbor-buildroot --package=gem-cbor-doc -q
(ruby 3.1.4 i686-linux)
sh: line 1: git: command not found
* provs ->
  - [cbor]
Finding Requires (using /usr/lib/rpm/find-requires)
Executing: /bin/sh -e /usr/src/tmp/rpm-tmp.EN0WBU
find-requires: running scripts (cpp,debuginfo,files,lib,pam,perl,pkgconfig,pkgconfiglib,python,python3,rpmlib,ruby,shebang,shell,static,symlinks,systemd-services)
ruby.req: detecting ruby requires for gem-cbor-doc...
ruby.req: ruby project file is '/usr/src/RPM/BUILD/gem-cbor-0.5.9.6/SetupConfig'
ruby.req: /usr/bin/ruby /usr/lib/ruby/bin/setup-rb requires --install_prefix=/usr/src/tmp/gem-cbor-buildroot --package=gem-cbor-doc -q
(ruby 3.1.4 i686-linux)
sh: line 1: git: command not found
* reqs ->
  - [cbor]
    [doc]:
      gem(cbor) = 0.5.9.6
Requires: gem(cbor) = 0.5.9.6
Processing files: gem-cbor-devel-0.5.9.6-alt1.1
Executing(%doc): /bin/sh -e /usr/src/tmp/rpm-tmp.14642
+ umask 022
+ /bin/mkdir -p /usr/src/RPM/BUILD
+ cd /usr/src/RPM/BUILD
+ cd gem-cbor-0.5.9.6
+ DOCDIR=/usr/src/tmp/gem-cbor-buildroot/usr/share/doc/gem-cbor-devel-0.5.9.6
+ export DOCDIR
+ rm -rf /usr/src/tmp/gem-cbor-buildroot/usr/share/doc/gem-cbor-devel-0.5.9.6
+ /bin/mkdir -p /usr/src/tmp/gem-cbor-buildroot/usr/share/doc/gem-cbor-devel-0.5.9.6
+ cp -prL README.rdoc /usr/src/tmp/gem-cbor-buildroot/usr/share/doc/gem-cbor-devel-0.5.9.6
+ chmod -R go-w /usr/src/tmp/gem-cbor-buildroot/usr/share/doc/gem-cbor-devel-0.5.9.6
+ chmod -R a+rX /usr/src/tmp/gem-cbor-buildroot/usr/share/doc/gem-cbor-devel-0.5.9.6
+ exit 0
Finding Provides (using /usr/lib/rpm/find-provides)
Executing: /bin/sh -e /usr/src/tmp/rpm-tmp.mNqBye
find-provides: running scripts (alternatives,debuginfo,lib,pam,perl,pkgconfig,python,python3,ruby,shell)
ruby.prov: detecting ruby provides for gem-cbor-devel...
ruby.prov: project file is '/usr/src/RPM/BUILD/gem-cbor-0.5.9.6/SetupConfig'
ruby.prov: /usr/bin/ruby /usr/lib/ruby/bin/setup-rb provides --install_prefix=/usr/src/tmp/gem-cbor-buildroot --package=gem-cbor-devel -q
(ruby 3.1.4 i686-linux)
sh: line 1: git: command not found
* provs ->
  - [cbor]
Finding Requires (using /usr/lib/rpm/find-requires)
Executing: /bin/sh -e /usr/src/tmp/rpm-tmp.TC5Gat
find-requires: running scripts (cpp,debuginfo,files,lib,pam,perl,pkgconfig,pkgconfiglib,python,python3,rpmlib,ruby,shebang,shell,static,symlinks,systemd-services)
In file included from /usr/include/ruby/ruby.h:15,
                 from /usr/include/ruby.h:38,
                 from /usr/src/tmp/gem-cbor-buildroot/usr/include/cbor/compat.h:30,
                 from /usr/src/tmp/gem-cbor-buildroot/usr/include/cbor/rmem.h:30:
/usr/include/ruby/internal/config.h:22:10: fatal error: ruby/config.h: No such file or directory
   22 | #include "ruby/config.h"
      |          ^~~~~~~~~~~~~~~
compilation terminated.
cpp.req: /usr/src/tmp/gem-cbor-buildroot/usr/include/cbor/rmem.h: cpp failed, trying c++ mode
i586-alt-linux-cpp: fatal error: cannot execute 'cc1plus': execvp: No such file or directory
compilation terminated.
cpp.req: WARNING: /usr/src/tmp/gem-cbor-buildroot/usr/include/cbor/rmem.h: cpp failed
In file included from /usr/include/ruby/ruby.h:15,
                 from /usr/include/ruby.h:38,
                 from /usr/src/tmp/gem-cbor-buildroot/usr/include/cbor/compat.h:30,
                 from /usr/src/tmp/gem-cbor-buildroot/usr/include/cbor/buffer.h:32:
/usr/include/ruby/internal/config.h:22:10: fatal error: ruby/config.h: No such file or directory
   22 | #include "ruby/config.h"
      |          ^~~~~~~~~~~~~~~
compilation terminated.
cpp.req: WARNING: /usr/src/tmp/gem-cbor-buildroot/usr/include/cbor/buffer.h: cpp failed
In file included from /usr/include/ruby/ruby.h:15,
                 from /usr/include/ruby.h:38,
                 from /usr/src/tmp/gem-cbor-buildroot/usr/include/cbor/compat.h:30:
/usr/include/ruby/internal/config.h:22:10: fatal error: ruby/config.h: No such file or directory
   22 | #include "ruby/config.h"
      |          ^~~~~~~~~~~~~~~
compilation terminated.
cpp.req: WARNING: /usr/src/tmp/gem-cbor-buildroot/usr/include/cbor/compat.h: cpp failed
In file included from /usr/include/ruby/ruby.h:15,
                 from /usr/include/ruby.h:38,
                 from /usr/src/tmp/gem-cbor-buildroot/usr/include/cbor/compat.h:30,
                 from /usr/src/tmp/gem-cbor-buildroot/usr/include/cbor/buffer.h:32,
                 from /usr/src/tmp/gem-cbor-buildroot/usr/include/cbor/packer.h:30:
/usr/include/ruby/internal/config.h:22:10: fatal error: ruby/config.h: No such file or directory
   22 | #include "ruby/config.h"
      |          ^~~~~~~~~~~~~~~
compilation terminated.
cpp.req: WARNING: /usr/src/tmp/gem-cbor-buildroot/usr/include/cbor/packer.h: cpp failed
/usr/src/tmp/gem-cbor-buildroot/usr/include/cbor/sysdep.h:133:2: error: #error this size of bignum digits SIZEOF_BDIGITS not implemented
  133 | #error this size of bignum digits SIZEOF_BDIGITS not implemented
      |  ^~~~~
cpp.req: WARNING: /usr/src/tmp/gem-cbor-buildroot/usr/include/cbor/sysdep.h: cpp failed
In file included from /usr/include/ruby/ruby.h:15,
                 from /usr/include/ruby.h:38,
                 from /usr/src/tmp/gem-cbor-buildroot/usr/include/cbor/compat.h:30,
                 from /usr/src/tmp/gem-cbor-buildroot/usr/include/cbor/core_ext.h:30:
/usr/include/ruby/internal/config.h:22:10: fatal error: ruby/config.h: No such file or directory
   22 | #include "ruby/config.h"
      |          ^~~~~~~~~~~~~~~
compilation terminated.
cpp.req: WARNING: /usr/src/tmp/gem-cbor-buildroot/usr/include/cbor/core_ext.h: cpp failed
In file included from /usr/include/ruby/ruby.h:15,
                 from /usr/include/ruby.h:38,
                 from /usr/src/tmp/gem-cbor-buildroot/usr/include/cbor/compat.h:30,
                 from /usr/src/tmp/gem-cbor-buildroot/usr/include/cbor/buffer.h:32,
                 from /usr/src/tmp/gem-cbor-buildroot/usr/include/cbor/unpacker.h:30:
/usr/include/ruby/internal/config.h:22:10: fatal error: ruby/config.h: No such file or directory
   22 | #include "ruby/config.h"
      |          ^~~~~~~~~~~~~~~
compilation terminated.
cpp.req: WARNING: /usr/src/tmp/gem-cbor-buildroot/usr/include/cbor/unpacker.h: cpp failed
In file included from /usr/include/ruby/ruby.h:15,
                 from /usr/include/ruby.h:38,
                 from /usr/src/tmp/gem-cbor-buildroot/usr/include/cbor/compat.h:30,
                 from /usr/src/tmp/gem-cbor-buildroot/usr/include/cbor/buffer.h:32,
                 from /usr/src/tmp/gem-cbor-buildroot/usr/include/cbor/buffer_class.h:30:
/usr/include/ruby/internal/config.h:22:10: fatal error: ruby/config.h: No such file or directory
   22 | #include "ruby/config.h"
      |          ^~~~~~~~~~~~~~~
compilation terminated.
cpp.req: WARNING: /usr/src/tmp/gem-cbor-buildroot/usr/include/cbor/buffer_class.h: cpp failed
In file included from /usr/include/ruby/ruby.h:15,
                 from /usr/include/ruby.h:38,
                 from /usr/src/tmp/gem-cbor-buildroot/usr/include/cbor/compat.h:30,
                 from /usr/src/tmp/gem-cbor-buildroot/usr/include/cbor/buffer.h:32,
                 from /usr/src/tmp/gem-cbor-buildroot/usr/include/cbor/packer.h:30,
                 from /usr/src/tmp/gem-cbor-buildroot/usr/include/cbor/packer_class.h:30:
/usr/include/ruby/internal/config.h:22:10: fatal error: ruby/config.h: No such file or directory
   22 | #include "ruby/config.h"
      |          ^~~~~~~~~~~~~~~
compilation terminated.
cpp.req: WARNING: /usr/src/tmp/gem-cbor-buildroot/usr/include/cbor/packer_class.h: cpp failed
In file included from /usr/include/ruby/ruby.h:15,
                 from /usr/include/ruby.h:38,
                 from /usr/src/tmp/gem-cbor-buildroot/usr/include/cbor/compat.h:30,
                 from /usr/src/tmp/gem-cbor-buildroot/usr/include/cbor/buffer.h:32,
                 from /usr/src/tmp/gem-cbor-buildroot/usr/include/cbor/unpacker.h:30,
                 from /usr/src/tmp/gem-cbor-buildroot/usr/include/cbor/unpacker_class.h:30:
/usr/include/ruby/internal/config.h:22:10: fatal error: ruby/config.h: No such file or directory
   22 | #include "ruby/config.h"
      |          ^~~~~~~~~~~~~~~
compilation terminated.
cpp.req: WARNING: /usr/src/tmp/gem-cbor-buildroot/usr/include/cbor/unpacker_class.h: cpp failed
ruby.req: detecting ruby requires for gem-cbor-devel...
ruby.req: ruby project file is '/usr/src/RPM/BUILD/gem-cbor-0.5.9.6/SetupConfig'
ruby.req: /usr/bin/ruby /usr/lib/ruby/bin/setup-rb requires --install_prefix=/usr/src/tmp/gem-cbor-buildroot --package=gem-cbor-devel -q
(ruby 3.1.4 i686-linux)
sh: line 1: git: command not found
* reqs ->
  - [cbor]
    [devel]:
      gem(bundler) >= 0
      gem(rake)
      gem(rake-compiler)
      gem(rspec)
      gem(json)
      gem(yard)
Requires: gem(cbor) = 0.5.9.6, gem(bundler) >= 0, gem(rake) >= 0, gem(rake-compiler) >= 0, gem(rspec) >= 0, gem(json) >= 0, gem(yard) >= 0
Conflicts: gem(yard) >= 1
Processing files: gem-cbor-debuginfo-0.5.9.6-alt1.1
Finding Provides (using /usr/lib/rpm/find-provides)
Executing: /bin/sh -e /usr/src/tmp/rpm-tmp.9nafIV
find-provides: running scripts (debuginfo)
Finding Requires (using /usr/lib/rpm/find-requires)
Executing: /bin/sh -e /usr/src/tmp/rpm-tmp.V8rJDC
find-requires: running scripts (debuginfo)
objdump: '/usr/src/tmp/gem-cbor-buildroot/usr/lib/ruby/gemie/gems/cbor-0.5.9.6/lib/cbor/cbor.so': No such file
debuginfo.req: WARNING: /usr/src/tmp/gem-cbor-buildroot/usr/lib/ruby/gemie/gems/cbor-0.5.9.6/lib/cbor/cbor.so: objdump failed
Requires: gem-cbor = 0.5.9.6-alt1.1, debug(libc.so.6), debug(libm.so.6), debug(libruby.so.3.1)
Adding to gem-cbor-debuginfo a strict dependency on gem-cbor
warning: gem-cbor-doc: non-strict dependency on gem-cbor
warning: gem-cbor-devel: non-strict dependency on gem-cbor
Wrote: /usr/src/RPM/RPMS/i586/gem-cbor-0.5.9.6-alt1.1.i586.rpm (w2.lzdio)
Wrote: /usr/src/RPM/RPMS/noarch/gem-cbor-doc-0.5.9.6-alt1.1.noarch.rpm (w2.lzdio)
Wrote: /usr/src/RPM/RPMS/noarch/gem-cbor-devel-0.5.9.6-alt1.1.noarch.rpm (w2.lzdio)
Wrote: /usr/src/RPM/RPMS/i586/gem-cbor-debuginfo-0.5.9.6-alt1.1.i586.rpm (w2.lzdio)
6.57user 3.85system 0:15.90elapsed 65%CPU (0avgtext+0avgdata 44952maxresident)k
0inputs+0outputs (0major+536685minor)pagefaults 0swaps
3.62user 2.96system 0:27.11elapsed 24%CPU (0avgtext+0avgdata 126916maxresident)k
0inputs+0outputs (0major+250940minor)pagefaults 0swaps
--- gem-cbor-0.5.9.6-alt1.1.i586.rpm.repo	2023-02-22 15:26:41.000000000 +0000
+++ gem-cbor-0.5.9.6-alt1.1.i586.rpm.hasher	2024-04-13 06:42:35.342959643 +0000
@@ -58,3 +58,3 @@
 File: /usr/lib/ruby/gemie/extensions/cbor-0.5.9.6/cbor	40755	root:root		
-File: /usr/lib/ruby/gemie/extensions/cbor-0.5.9.6/cbor/cbor.so	100644	root:root	ecc8bed5a476ef64d7123572e8b1afdc	
+File: /usr/lib/ruby/gemie/extensions/cbor-0.5.9.6/cbor/cbor.so	100644	root:root	08674436257840414801285c310e9651	
 File: /usr/lib/ruby/gemie/extensions/cbor-0.5.9.6/gem.build_complete	100644	root:root		
@@ -97,5 +97,5 @@
 File: /usr/lib/ruby/gemie/gems/cbor-0.5.9.6/spec/unpacker_spec.rb	100755	root:root	077b2a97a2f33d24bd601c763ce14672	
-File: /usr/lib/ruby/gemie/specifications/cbor-0.5.9.6.gemspec	100644	root:root	d12dcb0a6a3ba4acb655756eaccf5bd4	
+File: /usr/lib/ruby/gemie/specifications/cbor-0.5.9.6.gemspec	100644	root:root	914afe1f8c028e46b0f5a9b900749db3	
 File: /usr/share/doc/gem-cbor-0.5.9.6	40755	root:root		
 File: /usr/share/doc/gem-cbor-0.5.9.6/README.rdoc	100644	root:root	8159109627f8782ec06a15014c9f2a13	
-RPMIdentity: 27a2d7b62d8f420c4f7316737da60098bdaf030bff340b64841ba3610be9e1affec14c52c97059cc471147db8c0d738372d1a1ca4d453b00acea0884661974a6
+RPMIdentity: 1fa2b9693f98c11bcc5ecb67320b0667449dcd0240514b1863ea2f38e58579bc7f93ec11689f69dd7e1e80b069f43a5876695bbe223d337dc877ac0df240c013
--- gem-cbor-debuginfo-0.5.9.6-alt1.1.i586.rpm.repo	2023-02-22 15:26:41.000000000 +0000
+++ gem-cbor-debuginfo-0.5.9.6-alt1.1.i586.rpm.hasher	2024-04-13 06:42:35.572963115 +0000
@@ -1,4 +1,4 @@
-/usr/lib/debug/.build-id/cc	40755	root:root	
-/usr/lib/debug/.build-id/cc/951129a0b7c99301cb403d0726a81a691082ce	120777	root:root	../../../ruby/gemie/extensions/cbor-0.5.9.6/cbor/cbor.so
-/usr/lib/debug/.build-id/cc/951129a0b7c99301cb403d0726a81a691082ce.debug	120777	root:root	../../usr/lib/ruby/gemie/extensions/cbor-0.5.9.6/cbor/cbor.so.debug
+/usr/lib/debug/.build-id/65	40755	root:root	
+/usr/lib/debug/.build-id/65/77211304d914478e07fc3ed7f3e9888a1d4acc	120777	root:root	../../../ruby/gemie/extensions/cbor-0.5.9.6/cbor/cbor.so
+/usr/lib/debug/.build-id/65/77211304d914478e07fc3ed7f3e9888a1d4acc.debug	120777	root:root	../../usr/lib/ruby/gemie/extensions/cbor-0.5.9.6/cbor/cbor.so.debug
 /usr/lib/debug/usr/lib/ruby	40755	root:root	
@@ -21,2 +21,4 @@
 /usr/src/debug/gem-cbor-0.5.9.6/ext/cbor/buffer_class.h	100644	root:root	
+/usr/src/debug/gem-cbor-0.5.9.6/ext/cbor/cbor.h	100644	root:root	
+/usr/src/debug/gem-cbor-0.5.9.6/ext/cbor/compat.h	100644	root:root	
 /usr/src/debug/gem-cbor-0.5.9.6/ext/cbor/core_ext.c	100644	root:root	
@@ -28,4 +30,8 @@
 /usr/src/debug/gem-cbor-0.5.9.6/ext/cbor/rbinit.c	100644	root:root	
+/usr/src/debug/gem-cbor-0.5.9.6/ext/cbor/renamer.h	100644	root:root	
 /usr/src/debug/gem-cbor-0.5.9.6/ext/cbor/rmem.c	100644	root:root	
 /usr/src/debug/gem-cbor-0.5.9.6/ext/cbor/rmem.h	100644	root:root	
+/usr/src/debug/gem-cbor-0.5.9.6/ext/cbor/sysdep.h	100644	root:root	
+/usr/src/debug/gem-cbor-0.5.9.6/ext/cbor/sysdep_endian.h	100644	root:root	
+/usr/src/debug/gem-cbor-0.5.9.6/ext/cbor/sysdep_types.h	100644	root:root	
 /usr/src/debug/gem-cbor-0.5.9.6/ext/cbor/unpacker.c	100644	root:root	
@@ -40,5 +46,5 @@
 Provides: gem-cbor-debuginfo = 0.5.9.6-alt1.1:sisyphus+313736.46200.47.3
-File: /usr/lib/debug/.build-id/cc	40755	root:root		
-File: /usr/lib/debug/.build-id/cc/951129a0b7c99301cb403d0726a81a691082ce	120777	root:root		../../../ruby/gemie/extensions/cbor-0.5.9.6/cbor/cbor.so
-File: /usr/lib/debug/.build-id/cc/951129a0b7c99301cb403d0726a81a691082ce.debug	120777	root:root		../../usr/lib/ruby/gemie/extensions/cbor-0.5.9.6/cbor/cbor.so.debug
+File: /usr/lib/debug/.build-id/65	40755	root:root		
+File: /usr/lib/debug/.build-id/65/77211304d914478e07fc3ed7f3e9888a1d4acc	120777	root:root		../../../ruby/gemie/extensions/cbor-0.5.9.6/cbor/cbor.so
+File: /usr/lib/debug/.build-id/65/77211304d914478e07fc3ed7f3e9888a1d4acc.debug	120777	root:root		../../usr/lib/ruby/gemie/extensions/cbor-0.5.9.6/cbor/cbor.so.debug
 File: /usr/lib/debug/usr/lib/ruby	40755	root:root		
@@ -48,3 +54,3 @@
 File: /usr/lib/debug/usr/lib/ruby/gemie/extensions/cbor-0.5.9.6/cbor	40755	root:root		
-File: /usr/lib/debug/usr/lib/ruby/gemie/extensions/cbor-0.5.9.6/cbor/cbor.so.debug	100644	root:root	33af5d1c1c98ee8be0856c94722f5060	
+File: /usr/lib/debug/usr/lib/ruby/gemie/extensions/cbor-0.5.9.6/cbor/cbor.so.debug	100644	root:root	a6c47d111bbb2cd7fe7bba0d8ab77ad6	
 File: /usr/lib/debug/usr/lib/ruby/gemie/gems	40755	root:root		
@@ -61,2 +67,4 @@
 File: /usr/src/debug/gem-cbor-0.5.9.6/ext/cbor/buffer_class.h	100644	root:root	6bccbe5c1e6be2cd0173788f23679390	
+File: /usr/src/debug/gem-cbor-0.5.9.6/ext/cbor/cbor.h	100644	root:root	064cb564835585eefec23f60a237724d	
+File: /usr/src/debug/gem-cbor-0.5.9.6/ext/cbor/compat.h	100644	root:root	7ad60ab436ee9983bcbfff7cecb3cfa3	
 File: /usr/src/debug/gem-cbor-0.5.9.6/ext/cbor/core_ext.c	100644	root:root	6c9f5c673fdc6d7d4b12e8cb0661f6b7	
@@ -68,4 +76,8 @@
 File: /usr/src/debug/gem-cbor-0.5.9.6/ext/cbor/rbinit.c	100644	root:root	ca175730f58a6781a30666e0753dad67	
+File: /usr/src/debug/gem-cbor-0.5.9.6/ext/cbor/renamer.h	100644	root:root	72770d8adf4ebd87bd9924faccb8b92d	
 File: /usr/src/debug/gem-cbor-0.5.9.6/ext/cbor/rmem.c	100644	root:root	95750226c285df968bb118253fc60539	
 File: /usr/src/debug/gem-cbor-0.5.9.6/ext/cbor/rmem.h	100644	root:root	e146e565932a75d90a2d4bbe8d0f5e34	
+File: /usr/src/debug/gem-cbor-0.5.9.6/ext/cbor/sysdep.h	100644	root:root	12f75abbe81a98cb53d96699415d122c	
+File: /usr/src/debug/gem-cbor-0.5.9.6/ext/cbor/sysdep_endian.h	100644	root:root	f61e0c2270fd7a06b578e97f8998618c	
+File: /usr/src/debug/gem-cbor-0.5.9.6/ext/cbor/sysdep_types.h	100644	root:root	a482efc960d1ad25ced7c5ff946dbdee	
 File: /usr/src/debug/gem-cbor-0.5.9.6/ext/cbor/unpacker.c	100644	root:root	59521cd0369e39a825516e329d5e7d3f	
@@ -74,2 +86,2 @@
 File: /usr/src/debug/gem-cbor-0.5.9.6/ext/cbor/unpacker_class.h	100644	root:root	f96c38eb64b005e3e855db7f2ac86a74	
-RPMIdentity: 30f2a8e718be4c7b735ff88b8572a1773bb4c7a3e633c47cdf30e6fd98e272311daf69baffea4dc43d391cb95a54e3f3069b16cc25ba852ca3647252359ed7b3
+RPMIdentity: 50df65d36798ffd71f05fcb8ab773aa3d1ae730efbbce28dc402819e00db30e9f570f9ce5ebadeb5ed23a3852e36e8067d9885b814eacb0ee4029ce649bb1765
--- gem-cbor-doc-0.5.9.6-alt1.1.noarch.rpm.repo	2023-02-22 15:04:46.000000000 +0000
+++ gem-cbor-doc-0.5.9.6-alt1.1.noarch.rpm.hasher	2024-04-13 06:42:35.787966360 +0000
@@ -1,7 +1,7 @@
+/usr/lib/ruby/gemie/ri/cbor-0.5.9.6	40755	root:root	
+/usr/lib/ruby/gemie/ri/cbor-0.5.9.6/CBOR	40755	root:root	
+/usr/lib/ruby/gemie/ri/cbor-0.5.9.6/CBOR/cdesc-CBOR.ri	100644	root:root	
+/usr/lib/ruby/gemie/ri/cbor-0.5.9.6/cache.ri	100644	root:root	
 /usr/share/doc/gem-cbor-doc-0.5.9.6	40755	root:root	
 /usr/share/doc/gem-cbor-doc-0.5.9.6/README.rdoc	100644	root:root	
-/usr/share/ri/cbor-0.5.9.6	40755	root:root	
-/usr/share/ri/cbor-0.5.9.6/CBOR	40755	root:root	
-/usr/share/ri/cbor-0.5.9.6/CBOR/cdesc-CBOR.ri	100644	root:root	
-/usr/share/ri/cbor-0.5.9.6/cache.ri	100644	root:root	
 Requires: gem(cbor) = 0.5.9.6
@@ -9,8 +9,8 @@
 Provides: gem-cbor-doc = 0.5.9.6-alt1.1:sisyphus+313736.46200.47.3
+File: /usr/lib/ruby/gemie/ri/cbor-0.5.9.6	40755	root:root		
+File: /usr/lib/ruby/gemie/ri/cbor-0.5.9.6/CBOR	40755	root:root		
+File: /usr/lib/ruby/gemie/ri/cbor-0.5.9.6/CBOR/cdesc-CBOR.ri	100644	root:root	3e4fef82f726a04b0236e8752629a729	
+File: /usr/lib/ruby/gemie/ri/cbor-0.5.9.6/cache.ri	100644	root:root	961171edf35271d606d2b88227433deb	
 File: /usr/share/doc/gem-cbor-doc-0.5.9.6	40755	root:root		
 File: /usr/share/doc/gem-cbor-doc-0.5.9.6/README.rdoc	100644	root:root	8159109627f8782ec06a15014c9f2a13	
-File: /usr/share/ri/cbor-0.5.9.6	40755	root:root		
-File: /usr/share/ri/cbor-0.5.9.6/CBOR	40755	root:root		
-File: /usr/share/ri/cbor-0.5.9.6/CBOR/cdesc-CBOR.ri	100644	root:root	3e4fef82f726a04b0236e8752629a729	
-File: /usr/share/ri/cbor-0.5.9.6/cache.ri	100644	root:root	961171edf35271d606d2b88227433deb	
-RPMIdentity: 1988f7cb8dba326ceb8519c70ae1f689e4f5ec82f307c8f6f58942f356b89e3e90e105f307b126c12b605a5faf0a5a7bd9ae3e899a409cd55d8fd541875613d6
+RPMIdentity: 0ddd1e05e4b4ff91e61c84395d5f876d61e76cc18a0c6c2d34b2b9fbadd458e2d86a328925efb9565e04f04c61b16de9bd1d456b43f6434f4236f292b4be3d9b