<86>Mar  9 07:51:29 userdel[2554370]: delete user 'rooter'
<86>Mar  9 07:51:29 userdel[2554370]: removed group 'rooter' owned by 'rooter'
<86>Mar  9 07:51:29 userdel[2554370]: removed shadow group 'rooter' owned by 'rooter'
<86>Mar  9 07:51:29 groupadd[2554392]: group added to /etc/group: name=rooter, GID=1820
<86>Mar  9 07:51:29 groupadd[2554392]: group added to /etc/gshadow: name=rooter
<86>Mar  9 07:51:29 groupadd[2554392]: new group: name=rooter, GID=1820
<86>Mar  9 07:51:29 useradd[2554417]: new user: name=rooter, UID=1820, GID=1820, home=/root, shell=/bin/bash, from=none
<86>Mar  9 07:51:29 userdel[2554444]: delete user 'builder'
<86>Mar  9 07:51:29 userdel[2554444]: removed group 'builder' owned by 'builder'
<86>Mar  9 07:51:29 userdel[2554444]: removed shadow group 'builder' owned by 'builder'
<86>Mar  9 07:51:29 groupadd[2554477]: group added to /etc/group: name=builder, GID=1821
<86>Mar  9 07:51:29 groupadd[2554477]: group added to /etc/gshadow: name=builder
<86>Mar  9 07:51:29 groupadd[2554477]: new group: name=builder, GID=1821
<86>Mar  9 07:51:29 useradd[2554495]: new user: name=builder, UID=1821, GID=1821, home=/usr/src, shell=/bin/bash, from=none
/usr/src/in/srpm/kde5-libkexiv2-23.08.5-alt1.src.rpm: bad symbols in the license tag: /
<13>Mar  9 07:51:32 rpmi: libxkbcommon-1.6.0-alt1 sisyphus+331300.100.1.1 1696855236 installed
<13>Mar  9 07:51:32 rpmi: libexpat-2.5.0-alt1 sisyphus+309227.100.1.1 1667075766 installed
<13>Mar  9 07:51:32 rpmi: libidn2-2.3.7-alt1 sisyphus+339505.100.1.2 1706718975 installed
<13>Mar  9 07:51:32 rpmi: libnettle8-3.9.1-alt1 sisyphus+322548.100.1.2 1686176897 installed
<13>Mar  9 07:51:32 rpmi: libts0-1.22-alt3 sisyphus+278442.100.1.2 1626216683 installed
<13>Mar  9 07:51:32 rpmi: qt5-base-common-5.15.12-alt1 sisyphus+339486.100.1.3 1706722028 installed
<13>Mar  9 07:51:32 rpmi: qt5-declarative-common-5.15.12-alt1 sisyphus+339487.100.1.1 1706707055 installed
<13>Mar  9 07:51:32 rpmi: libmtdev-1.1.6-alt1 sisyphus+278361.100.1.1 1626091636 installed
<13>Mar  9 07:51:32 rpmi: libpng16-1.6.42-alt2 sisyphus+339555.100.1.1 1706781690 installed
<13>Mar  9 07:51:32 rpmi: libevdev-1.13.1-alt1 sisyphus+319955.100.1.1 1683290015 installed
<13>Mar  9 07:51:32 rpmi: libICE-1.1.1-alt1 sisyphus+311428.500.1.1 1670577559 installed
<13>Mar  9 07:51:32 rpmi: libglvnd-7:1.7.0-alt1 sisyphus+330949.100.1.1 1696424894 installed
<13>Mar  9 07:51:32 rpmi: libwayland-server-1.22.0-alt1.1 sisyphus+318010.100.1.1 1680606300 installed
<13>Mar  9 07:51:32 rpmi: libp11-kit-1:0.25.3-alt2 sisyphus+336533.100.1.1 1702645575 installed
<13>Mar  9 07:51:32 rpmi: libtasn1-4.19.0-alt3 sisyphus+327816.100.1.1 1692802618 installed
<13>Mar  9 07:51:32 rpmi: libSM-1.2.4-alt1 sisyphus+312057.200.1.1 1671526918 installed
<13>Mar  9 07:51:32 rpmi: libhogweed6-3.9.1-alt1 sisyphus+322548.100.1.2 1686176897 installed
<13>Mar  9 07:51:32 rpmi: libgnutls30-3.8.3-alt1 sisyphus+338392.100.2.1 1705655794 installed
<13>Mar  9 07:51:32 rpmi: libngtcp2.16-1.2.0-alt1 sisyphus+339162.100.1.1 1706355121 installed
<13>Mar  9 07:51:32 rpmi: libngtcp2_crypto_gnutls8-1.2.0-alt1 sisyphus+339162.100.1.1 1706355121 installed
<13>Mar  9 07:51:32 rpmi: rpm-macros-ubt-0.4-alt1 sisyphus+279939.100.1.1 1626950850 installed
<13>Mar  9 07:51:32 rpmi: rpm-macros-qt5-5.15.12-alt1 sisyphus+339486.100.1.3 1706721806 installed
<13>Mar  9 07:51:32 rpmi: rpm-build-xdg-0.2-alt1 1250461503 installed
<13>Mar  9 07:51:32 rpmi: libsqlite3-3.44.2-alt1 sisyphus+335409.100.3.3 1701347861 installed
<13>Mar  9 07:51:32 rpmi: libjpeg-2:3.0.2-alt2.1 sisyphus+340135.100.1.1 1707449053 installed
<13>Mar  9 07:51:32 rpmi: libwacom-data-2.10.0-alt1 sisyphus+340046.100.1.1 1707325574 installed
<13>Mar  9 07:51:32 rpmi: libmpdec3-2.5.1-alt3 sisyphus+314490.500.5.1 1675432033 installed
<13>Mar  9 07:51:33 rpmi: libicu74-1:7.4.2-alt1 sisyphus+336372.200.1.1 1702422879 installed
<13>Mar  9 07:51:33 rpmi: libgudev-1:238-alt1 sisyphus+324364.100.1.1 1688646145 installed
<13>Mar  9 07:51:33 rpmi: desktop-file-utils-0.26-alt6 sisyphus+331944.100.1.3 1697550035 installed
<13>Mar  9 07:51:33 rpmi: shared-mime-info-2.4-alt1 sisyphus+334259.100.1.1 1699787317 installed
<13>Mar  9 07:51:33 rpmi: libgdbm-1.8.3-alt10 sisyphus+278100.1600.1.1 1626059138 installed
<13>Mar  9 07:51:33 rpmi: libgraphite2-1.3.14-alt2.1 sisyphus+279571.100.1.2 1626605157 installed
<13>Mar  9 07:51:33 rpmi: libdouble-conversion3-3.3.0-alt1 sisyphus+333410.100.1.1 1698928792 installed
<13>Mar  9 07:51:33 rpmi: libqt5-core-5.15.12-alt1 sisyphus+339486.100.1.3 1706722028 installed
<13>Mar  9 07:51:33 rpmi: libqt5-sql-5.15.12-alt1 sisyphus+339486.100.1.3 1706722028 installed
<13>Mar  9 07:51:33 rpmi: liblz4-1:1.9.4-alt1 sisyphus+309416.100.1.1 1667413000 installed
<13>Mar  9 07:51:33 rpmi: libsystemd-1:254.10-alt1 sisyphus+342118.200.2.1 1709660646 installed
<13>Mar  9 07:51:33 rpmi: libdbus-1.14.10-alt1 sisyphus+328676.100.1.1 1693833782 installed
<13>Mar  9 07:51:33 rpmi: libqt5-dbus-5.15.12-alt1 sisyphus+339486.100.1.3 1706722028 installed
<13>Mar  9 07:51:33 rpmi: publicsuffix-list-dafsa-20240130-alt1 sisyphus+339506.100.1.1 1706719111 installed
<13>Mar  9 07:51:33 rpmi: libpsl-0.21.5-alt1 sisyphus+338474.100.1.1 1705684771 installed
<13>Mar  9 07:51:33 rpmi: libnghttp3.9-1.1.0-alt1 sisyphus+339163.100.1.1 1706355268 installed
<13>Mar  9 07:51:33 rpmi: libnghttp2-1.59.0-alt1 sisyphus+339160.100.1.1 1706354724 installed
<13>Mar  9 07:51:33 rpmi: openldap-common-2.6.6-alt1 sisyphus+330946.100.2.1 1696432854 installed
<13>Mar  9 07:51:33 rpmi: libntlm-1.5-alt1 sisyphus+278100.3300.1.1 1626059663 installed
<13>Mar  9 07:51:33 rpmi: libidn-1.37-alt2 sisyphus+300849.100.1.1 1653769693 installed
<13>Mar  9 07:51:33 rpmi: libverto-0.3.2-alt1_1 sisyphus+321176.2200.10.2 1684806164 installed
<13>Mar  9 07:51:33 rpmi: liblmdb-0.9.31-alt1 sisyphus+330946.40.2.1 1696431544 installed
<13>Mar  9 07:51:33 rpmi: libkeyutils-1.6.3-alt1 sisyphus+266061.100.1.1 1612919567 installed
<13>Mar  9 07:51:33 rpmi: libcom_err-1.46.4.0.5.4cda-alt1 sisyphus+283826.100.1.1 1629975361 installed
<13>Mar  9 07:51:33 rpmi: libbrotlicommon-1.1.0-alt1 sisyphus+328501.100.1.1 1693598420 installed
<13>Mar  9 07:51:33 rpmi: libbrotlidec-1.1.0-alt1 sisyphus+328501.100.1.1 1693598420 installed
<13>Mar  9 07:51:33 rpmi: libharfbuzz-8.3.0-alt1 sisyphus+334471.200.2.1 1700075833 installed
<13>Mar  9 07:51:33 rpmi: libfreetype-2.13.2-alt1 sisyphus+328677.100.1.1 1693834346 installed
<13>Mar  9 07:51:33 rpmi: libfontconfig1-2.14.2-alt8 sisyphus+328444.100.1.1 1693553407 installed
<13>Mar  9 07:51:33 rpmi: libb2-0.98.1-alt1_1 sisyphus+291614.100.1.1 1638962878 installed
<13>Mar  9 07:51:33 rpmi: libSDL2-2.30.1-alt1 sisyphus+342186.100.1.2 1709739787 installed
<13>Mar  9 07:51:33 rpmi: tslib-1.22-alt3 sisyphus+278442.100.1.2 1626216683 installed
<13>Mar  9 07:51:33 rpmi: libxshmfence-1.3.2-alt1 sisyphus+311428.400.1.1 1670577529 installed
<13>Mar  9 07:51:34 rpmi: libX11-locales-3:1.8.7-alt1 sisyphus+330921.200.1.1 1696400315 installed
<13>Mar  9 07:51:34 rpmi: libXdmcp-1.1.4-alt1 sisyphus+311188.1000.1.1 1670233860 installed
<13>Mar  9 07:51:34 rpmi: libXau-1.0.11-alt1 sisyphus+311428.100.1.1 1670577440 installed
<13>Mar  9 07:51:34 rpmi: libxcb-1.16-alt1 sisyphus+327325.200.1.1 1692276267 installed
<13>Mar  9 07:51:34 rpmi: libX11-3:1.8.7-alt1 sisyphus+330921.200.1.1 1696400319 installed
<13>Mar  9 07:51:34 rpmi: libXext-1.3.5-alt1 sisyphus+309285.100.1.1 1667212413 installed
<13>Mar  9 07:51:34 rpmi: libXxf86vm-1.1.5-alt1 sisyphus+308663.1400.1.1 1666168534 installed
<13>Mar  9 07:51:34 rpmi: libXfixes-6.0.1-alt1 sisyphus+331490.300.1.1 1697023235 installed
<13>Mar  9 07:51:34 rpmi: libXrender-0.9.11-alt1 sisyphus+308841.100.1.1 1666436131 installed
<13>Mar  9 07:51:34 rpmi: libxcbutil-icccm-0.4.1-alt2 sisyphus+278275.100.1.2 1626148617 installed
<13>Mar  9 07:51:34 rpmi: libxcbutil-1:0.4.1-alt1 sisyphus+312057.100.1.1 1671526889 installed
<13>Mar  9 07:51:34 rpmi: libxcbutil-image-0.4.0-alt1 sisyphus+275413.100.1.3 1624505806 installed
<13>Mar  9 07:51:34 rpmi: libxcbutil-keysyms-0.4.0-alt1 sisyphus+278187.100.1.1 1626075950 installed
<13>Mar  9 07:51:34 rpmi: libxcb-render-util-0.3.9-alt3 sisyphus+276916.100.1.2 1625275237 installed
<13>Mar  9 07:51:34 rpmi: libxkbcommon-x11-1.6.0-alt1 sisyphus+331300.100.1.1 1696855236 installed
<13>Mar  9 07:51:34 rpmi: libwayland-client-1.22.0-alt1.1 sisyphus+318010.100.1.1 1680606300 installed
<13>Mar  9 07:51:34 rpmi: libpciaccess-1:0.17-alt1 sisyphus+308663.300.1.1 1666168262 installed
<13>Mar  9 07:51:34 rpmi: libdrm-1:2.4.120-alt1 sisyphus+338137.100.1.2 1705653180 installed
<13>Mar  9 07:51:34 rpmi: libGLX-mesa-4:24.0.2-alt1 sisyphus+341665.100.1.2 1709201179 installed
<13>Mar  9 07:51:34 rpmi: libgbm-4:24.0.2-alt1 sisyphus+341665.100.1.2 1709201179 installed
<13>Mar  9 07:51:34 rpmi: libEGL-mesa-4:24.0.2-alt1 sisyphus+341665.100.1.2 1709201179 installed
<13>Mar  9 07:51:34 rpmi: libEGL-7:1.7.0-alt1 sisyphus+330949.100.1.1 1696424894 installed
<13>Mar  9 07:51:34 rpmi: libGLX-7:1.7.0-alt1 sisyphus+330949.100.1.1 1696424894 installed
<13>Mar  9 07:51:34 rpmi: libGL-7:1.7.0-alt1 sisyphus+330949.100.1.1 1696424894 installed
<13>Mar  9 07:51:34 rpmi: gsettings-desktop-schemas-data-45.0-alt1 sisyphus+325066.400.6.2 1695203930 installed
<13>Mar  9 07:51:34 rpmi: libgio-2.78.4-alt1 sisyphus+338600.100.1.1 1705881097 installed
<13>Mar  9 07:51:34 rpmi: gsettings-desktop-schemas-45.0-alt1 sisyphus+325066.400.6.2 1695203930 installed
<13>Mar  9 07:51:34 rpmi: libdevmapper-1.02.196-alt1 sisyphus+328928.400.3.1 1694103939 installed
<13>Mar  9 07:51:34 rpmi: mount-2.39.2-alt1 sisyphus+329530.100.1.1 1694630203 installed
<13>Mar  9 07:51:34 rpmi: losetup-2.39.2-alt1 sisyphus+329530.100.1.1 1694630203 installed
<13>Mar  9 07:51:34 rpmi: lsblk-2.39.2-alt1 sisyphus+329530.100.1.1 1694630203 installed
<13>Mar  9 07:51:34 rpmi: rpm-macros-alternatives-0.5.2-alt2 sisyphus+315270.200.2.1 1676457367 installed
<13>Mar  9 07:51:34 rpmi: alternatives-0.5.2-alt2 sisyphus+315270.200.2.1 1676457367 installed
<13>Mar  9 07:51:34 rpmi: ca-certificates-2024.02.24-alt1 sisyphus+341362.100.1.1 1708791001 installed
<13>Mar  9 07:51:34 rpmi: ca-trust-0.1.5-alt1 sisyphus+340049.100.1.1 1707326464 installed
<13>Mar  9 07:51:34 rpmi: p11-kit-trust-1:0.25.3-alt2 sisyphus+336533.100.1.1 1702645575 installed
<13>Mar  9 07:51:34 rpmi: libcrypto3-3.1.5-alt1 sisyphus+339669.100.1.1 1706908706 installed
<13>Mar  9 07:51:34 rpmi: libssl3-3.1.5-alt1 sisyphus+339669.100.1.1 1706908706 installed
<86>Mar  9 07:51:34 groupadd[2578397]: group added to /etc/group: name=_keytab, GID=999
<86>Mar  9 07:51:34 groupadd[2578397]: group added to /etc/gshadow: name=_keytab
<86>Mar  9 07:51:34 groupadd[2578397]: new group: name=_keytab, GID=999
<13>Mar  9 07:51:34 rpmi: libkrb5-1.21.2-alt2 sisyphus+338902.100.2.1 1706700985 installed
<13>Mar  9 07:51:34 rpmi: python3-3.12.2-alt1 sisyphus+341702.200.1.1 1709232959 installed
<13>Mar  9 07:51:35 rpmi: python3-base-3.12.2-alt1 sisyphus+341702.200.1.1 1709232959 installed
<13>Mar  9 07:51:35 rpmi: libkmod-31-alt1 sisyphus+330699.100.1.1 1696072426 installed
<13>Mar  9 07:51:35 rpmi: kmod-31-alt1 sisyphus+330699.100.1.1 1696072426 installed
<13>Mar  9 07:51:35 rpmi: dmsetup-1.02.196-alt1 sisyphus+328928.400.3.1 1694103939 installed
<86>Mar  9 07:51:35 groupadd[2581255]: group added to /etc/group: name=tape, GID=998
<86>Mar  9 07:51:35 groupadd[2581255]: group added to /etc/gshadow: name=tape
<86>Mar  9 07:51:35 groupadd[2581255]: new group: name=tape, GID=998
<86>Mar  9 07:51:35 groupadd[2581303]: group added to /etc/group: name=dialout, GID=997
<86>Mar  9 07:51:35 groupadd[2581303]: group added to /etc/gshadow: name=dialout
<86>Mar  9 07:51:35 groupadd[2581303]: new group: name=dialout, GID=997
<86>Mar  9 07:51:35 groupadd[2581335]: group added to /etc/group: name=input, GID=996
<86>Mar  9 07:51:35 groupadd[2581335]: group added to /etc/gshadow: name=input
<86>Mar  9 07:51:35 groupadd[2581335]: new group: name=input, GID=996
<86>Mar  9 07:51:35 groupadd[2581358]: group added to /etc/group: name=video, GID=995
<86>Mar  9 07:51:35 groupadd[2581358]: group added to /etc/gshadow: name=video
<86>Mar  9 07:51:35 groupadd[2581358]: new group: name=video, GID=995
<86>Mar  9 07:51:35 groupadd[2581407]: group added to /etc/group: name=render, GID=994
<86>Mar  9 07:51:35 groupadd[2581407]: group added to /etc/gshadow: name=render
<86>Mar  9 07:51:35 groupadd[2581407]: new group: name=render, GID=994
<86>Mar  9 07:51:35 groupadd[2581452]: group added to /etc/group: name=sgx, GID=993
<86>Mar  9 07:51:35 groupadd[2581452]: group added to /etc/gshadow: name=sgx
<86>Mar  9 07:51:35 groupadd[2581452]: new group: name=sgx, GID=993
<13>Mar  9 07:51:35 rpmi: udev-1:254.10-alt1 sisyphus+342118.200.2.1 1709660646 installed
<13>Mar  9 07:51:35 rpmi: python3-module-pyudev-0.24.0-alt1 sisyphus+307006.100.1.1 1663406384 installed
<13>Mar  9 07:51:35 rpmi: python3-module-libevdev-0.11-alt1 sisyphus+300877.100.1.1 1653893962 installed
<13>Mar  9 07:51:35 rpmi: libwacom-2.10.0-alt1 sisyphus+340046.100.1.1 1707325574 installed
<13>Mar  9 07:51:35 rpmi: libinput-1.25.0-alt1.1 sisyphus+340565.100.1.1 1707817201 installed
<13>Mar  9 07:51:35 rpmi: libgsasl-2.2.0-alt1 sisyphus+333173.100.1.1 1698696961 installed
<86>Mar  9 07:51:35 groupadd[2583144]: group added to /etc/group: name=sasl, GID=992
<86>Mar  9 07:51:35 groupadd[2583144]: group added to /etc/gshadow: name=sasl
<86>Mar  9 07:51:35 groupadd[2583144]: new group: name=sasl, GID=992
<13>Mar  9 07:51:35 rpmi: libsasl2-3-2.1.28-alt1 sisyphus+341396.100.1.1 1708892220 installed
<13>Mar  9 07:51:35 rpmi: libldap2-2.6.6-alt1 sisyphus+330946.100.2.1 1696432858 installed
<13>Mar  9 07:51:35 rpmi: libssh2-1.11.0-alt2 sisyphus+339356.100.1.1 1706593140 installed
<13>Mar  9 07:51:35 rpmi: libcurl-8.6.0-alt1 sisyphus+339478.100.2.2 1706721224 installed
<13>Mar  9 07:51:35 rpmi: libproxy-0.5.3-alt1.2 sisyphus+335980.100.1.1 1701900058 installed
<13>Mar  9 07:51:35 rpmi: libqt5-network-5.15.12-alt1 sisyphus+339486.100.1.3 1706722028 installed
<13>Mar  9 07:51:35 rpmi: libqt5-xcbqpa-5.15.12-alt1 sisyphus+339486.100.1.3 1706722028 installed
<13>Mar  9 07:51:35 rpmi: libqt5-eglfskmssupport-5.15.12-alt1 sisyphus+339486.100.1.3 1706722028 installed
<13>Mar  9 07:51:35 rpmi: libqt5-eglfsdeviceintegration-5.15.12-alt1 sisyphus+339486.100.1.3 1706722028 installed
<13>Mar  9 07:51:36 rpmi: libqt5-gui-5.15.12-alt1 sisyphus+339486.100.1.3 1706722028 installed
<13>Mar  9 07:51:36 rpmi: libqt5-qmlmodels-5.15.12-alt1 sisyphus+339487.100.1.1 1706707055 installed
<13>Mar  9 07:51:36 rpmi: libqt5-qmlworkerscript-5.15.12-alt1 sisyphus+339487.100.1.1 1706707055 installed
<13>Mar  9 07:51:36 rpmi: libqt5-quick-5.15.12-alt1 sisyphus+339487.100.1.1 1706707055 installed
<13>Mar  9 07:51:36 rpmi: libqt5-quickshapes-5.15.12-alt1 sisyphus+339487.100.1.1 1706707055 installed
<13>Mar  9 07:51:36 rpmi: libqt5-qml-5.15.12-alt1 sisyphus+339487.100.1.1 1706707055 installed
<13>Mar  9 07:51:36 rpmi: rpm-build-qml-5.15.12-alt1 sisyphus+339487.100.1.1 1706707055 installed
<13>Mar  9 07:51:36 rpmi: rpm-build-kf5-5.101.0-alt1 sisyphus+336971.100.1.1 1703161556 installed
<13>Mar  9 07:51:36 rpmi: rpm-build-ubt-0.3.1-alt3 sisyphus+277013.100.1.2 1625346631 installed
<13>Mar  9 07:51:38 rpmi: vulkan-filesystem-1.3.277-alt1 sisyphus+342281.1100.5.1 1709910912 installed
<13>Mar  9 07:51:38 rpmi: libqt5-widgets-5.15.12-alt1 sisyphus+339486.100.1.3 1706722028 installed
<13>Mar  9 07:51:38 rpmi: xorg-proto-devel-2023.2-alt1.1 sisyphus+330960.100.2.1 1696609218 installed
<13>Mar  9 07:51:40 rpmi: libxcb-devel-1.16-alt1 sisyphus+327325.200.1.1 1692276267 installed
<13>Mar  9 07:51:40 rpmi: libX11-devel-3:1.8.7-alt1 sisyphus+330921.200.1.1 1696400319 installed
<13>Mar  9 07:51:40 rpmi: libqt5-opengl-5.15.12-alt1 sisyphus+339486.100.1.3 1706722028 installed
<13>Mar  9 07:51:40 rpmi: libvulkan1-1.3.277-alt1 sisyphus+342281.1100.5.1 1709910919 installed
<13>Mar  9 07:51:40 rpmi: xxd-4:9.1.0050-alt2 sisyphus+338959.100.2.2 1706192608 installed
<13>Mar  9 07:51:40 rpmi: libxkbcommon-devel-1.6.0-alt1 sisyphus+331300.100.1.1 1696855236 installed
<13>Mar  9 07:51:40 rpmi: python3-module-railroad-diagrams-1.1.1-alt1 sisyphus+294587.100.1.1 1643813088 installed
<13>Mar  9 07:51:40 rpmi: python3-module-markupsafe-1:2.1.5-alt1 sisyphus+339663.100.1.1 1706899589 installed
<13>Mar  9 07:51:40 rpmi: python3-module-jinja2-3.1.3-alt1 sisyphus+338371.3500.8.1 1706006785 installed
<13>Mar  9 07:51:40 rpmi: python3-module-pyparsing-3.1.2-alt1 sisyphus+342155.100.2.1 1709806916 installed
<13>Mar  9 07:51:40 rpmi: vulkan-registry-1.3.277-alt1 sisyphus+342281.100.1.1 1709847574 installed
<13>Mar  9 07:51:40 rpmi: vulkan-headers-1.3.277-alt1 sisyphus+342281.100.1.1 1709847574 installed
<13>Mar  9 07:51:40 rpmi: libvulkan-devel-1.3.277-alt1 sisyphus+342281.1100.5.1 1709910919 installed
<13>Mar  9 07:51:40 rpmi: libudev-devel-1:254.10-alt1 sisyphus+342118.200.2.1 1709660646 installed
<13>Mar  9 07:51:40 rpmi: libssl-devel-3.1.5-alt1 sisyphus+339669.100.1.1 1706908706 installed
<13>Mar  9 07:51:40 rpmi: libqt5-xml-5.15.12-alt1 sisyphus+339486.100.1.3 1706722028 installed
<13>Mar  9 07:51:40 rpmi: libqt5-test-5.15.12-alt1 sisyphus+339486.100.1.3 1706722028 installed
<13>Mar  9 07:51:40 rpmi: libqt5-concurrent-5.15.12-alt1 sisyphus+339486.100.1.3 1706722028 installed
<13>Mar  9 07:51:40 rpmi: libinih0-1:58-alt1 sisyphus+340664.100.1.1 1707901011 installed
<13>Mar  9 07:51:40 rpmi: libexiv2-0.28.2-alt1 sisyphus+340673.100.1.1 1707906399 installed
<13>Mar  9 07:51:40 rpmi: libdouble-conversion-devel-3.3.0-alt1 sisyphus+333410.100.1.1 1698928792 installed
<13>Mar  9 07:51:40 rpmi: libavahi-0.8-alt2 sisyphus+321176.300.10.2 1684803998 installed
<13>Mar  9 07:51:40 rpmi: libcups-2.4.7-alt2 sisyphus+333092.100.1.1 1698654164 installed
<13>Mar  9 07:51:40 rpmi: libqt5-printsupport-5.15.12-alt1 sisyphus+339486.100.1.3 1706722028 installed
<13>Mar  9 07:51:40 rpmi: libOpenGL-7:1.7.0-alt1 sisyphus+330949.100.1.1 1696424894 installed
<13>Mar  9 07:51:40 rpmi: libGLES-7:1.7.0-alt1 sisyphus+330949.100.1.1 1696424894 installed
<13>Mar  9 07:51:40 rpmi: libglvnd-devel-7:1.7.0-alt1 sisyphus+330949.100.1.1 1696424894 installed
<13>Mar  9 07:51:40 rpmi: icu-utils-1:7.4.2-alt1 sisyphus+336372.200.1.1 1702422879 installed
<13>Mar  9 07:51:40 rpmi: libicu-devel-1:7.4.2-alt1 sisyphus+336372.200.1.1 1702422879 installed
<13>Mar  9 07:51:40 rpmi: gcc-c++-common-1.4.27-alt1 sisyphus+278099.1300.1.1 1626028636 installed
<13>Mar  9 07:51:40 rpmi: libstdc++13-devel-13.2.1-alt3 sisyphus+339335.100.1.1 1706563095 installed
<13>Mar  9 07:51:41 rpmi: gcc13-c++-13.2.1-alt3 sisyphus+339335.100.1.1 1706563095 installed
<13>Mar  9 07:51:41 rpmi: gcc-c++-13-alt1 sisyphus+323337.300.1.1 1687268227 installed
<13>Mar  9 07:51:41 rpmi: libyaml2-0.2.5-alt1 sisyphus+278391.100.1.1 1626094932 installed
<13>Mar  9 07:51:41 rpmi: python3-module-yaml-6.0.1-alt1.1 sisyphus+333513.45640.73.1 1704640302 installed
<13>Mar  9 07:51:41 rpmi: python3-module-pyxdg-0.28-alt1.2 sisyphus+341065.100.1.1 1708351562 installed
<13>Mar  9 07:51:41 rpmi: python3-module-urllib3-2:2.2.1-alt1 sisyphus+341073.200.1.1 1708356525 installed
<13>Mar  9 07:51:41 rpmi: python3-module-idna-3.6-alt1 sisyphus+335330.100.1.2 1701263518 installed
<13>Mar  9 07:51:41 rpmi: python3-module-charset-normalizer-2.1.1-alt1 sisyphus+311047.100.1.1 1669992940 installed
<13>Mar  9 07:51:41 rpmi: python3-module-requests-2.31.0-alt1 sisyphus+321663.100.2.1 1684917021 installed
<13>Mar  9 07:51:41 rpmi: libxxhash-0.8.2-alt1 sisyphus+336514.200.7.1 1702672120 installed
<13>Mar  9 07:51:41 rpmi: rsync-3.2.7-alt1 sisyphus+325006.2000.1.1 1689498390 installed
<13>Mar  9 07:51:41 rpmi: openssh-common-9.6p1-alt1 sisyphus+338324.200.2.1 1706093727 installed
<13>Mar  9 07:51:41 rpmi: libedit3-3.1.20230828-alt1 sisyphus+330914.200.3.1 1696922745 installed
<86>Mar  9 07:51:41 groupadd[2602685]: group added to /etc/group: name=sshagent, GID=991
<86>Mar  9 07:51:41 groupadd[2602685]: group added to /etc/gshadow: name=sshagent
<86>Mar  9 07:51:41 groupadd[2602685]: new group: name=sshagent, GID=991
<13>Mar  9 07:51:41 rpmi: openssh-clients-9.6p1-alt1 sisyphus+338324.200.2.1 1706093727 installed
<13>Mar  9 07:51:41 rpmi: less-633-alt1 sisyphus+328181.300.2.1 1693321749 installed
<13>Mar  9 07:51:41 rpmi: diffstat-1.64-alt1 sisyphus+278100.700.1.1 1626056686 installed
<13>Mar  9 07:51:41 rpmi: git-core-2.42.1-alt1 sisyphus+333661.100.1.1 1699193194 installed
<13>Mar  9 07:51:41 rpmi: rpm-macros-cmake-3.28.3-alt1.1 sisyphus+340934.100.1.1 1708243649 installed
<13>Mar  9 07:51:42 rpmi: cmake-modules-3.28.3-alt1.1 sisyphus+340934.100.1.1 1708243593 installed
<13>Mar  9 07:51:42 rpmi: libuv-1.48.0-alt1 sisyphus+340945.100.1.1 1708265067 installed
<13>Mar  9 07:51:42 rpmi: librhash-1.3.5-alt3 sisyphus+286141.40.2.1 1632982456 installed
<13>Mar  9 07:51:42 rpmi: libjsoncpp24-1.9.4-alt2 sisyphus+286441.100.1.1 1633444234 installed
<13>Mar  9 07:51:42 rpmi: libarchive13-3.6.1-alt2 sisyphus+324359.1300.6.1 1689326414 installed
<13>Mar  9 07:51:42 rpmi: cmake-3.28.3-alt1.1 sisyphus+340934.100.1.1 1708243649 installed
<13>Mar  9 07:51:42 rpmi: extra-cmake-modules-5.115.0-alt1 sisyphus+340490.100.1.2 1707781974 installed
<13>Mar  9 07:51:42 rpmi: qt5-base-devel-5.15.12-alt1 sisyphus+339486.100.1.3 1706722028 installed
<13>Mar  9 07:51:42 rpmi: libexiv2-devel-0.28.2-alt1 sisyphus+340673.100.1.1 1707906399 installed
Building target platforms: i586
Building for target i586
Wrote: /usr/src/in/nosrpm/kde5-libkexiv2-23.08.5-alt1.nosrc.rpm (w1.gzdio)
Installing kde5-libkexiv2-23.08.5-alt1.src.rpm
Building target platforms: i586
Building for target i586
Executing(%prep): /bin/sh -e /usr/src/tmp/rpm-tmp.3812
+ umask 022
+ /bin/mkdir -p /usr/src/RPM/BUILD
+ cd /usr/src/RPM/BUILD
+ cd /usr/src/RPM/BUILD
+ rm -rf libkexiv2-23.08.5
+ echo 'Source #0 (libkexiv2-23.08.5.tar):'
Source #0 (libkexiv2-23.08.5.tar):
+ /bin/tar -xf /usr/src/RPM/SOURCES/libkexiv2-23.08.5.tar
+ cd libkexiv2-23.08.5
+ /bin/chmod -c -Rf u+rwX,go-w .
+ exit 0
Executing(%build): /bin/sh -e /usr/src/tmp/rpm-tmp.3812
+ umask 022
+ /bin/mkdir -p /usr/src/RPM/BUILD
+ cd /usr/src/RPM/BUILD
+ cd libkexiv2-23.08.5
+ __kf5_build
+ mkdir -p BUILD
+ __kf5_cmake
+ export PATH=/usr/lib/kf5/bin:/usr/src/bin:/bin:/usr/bin:/usr/X11R6/bin:/usr/games
+ PATH=/usr/lib/kf5/bin:/usr/src/bin:/bin:/usr/bin:/usr/X11R6/bin:/usr/games
+ export QTDIR=/usr/share/qt5
+ QTDIR=/usr/share/qt5
+ export 'CFLAGS=-pipe -frecord-gcc-switches -Wall -g -O2 -flto=auto -march=i586 -mtune=generic'
+ CFLAGS='-pipe -frecord-gcc-switches -Wall -g -O2 -flto=auto -march=i586 -mtune=generic'
+ export 'CXXFLAGS=-pipe -frecord-gcc-switches -Wall -g -O2 -flto=auto -march=i586 -mtune=generic'
+ CXXFLAGS='-pipe -frecord-gcc-switches -Wall -g -O2 -flto=auto -march=i586 -mtune=generic'
+ pushd BUILD
~/RPM/BUILD/libkexiv2-23.08.5/BUILD ~/RPM/BUILD/libkexiv2-23.08.5
+ cmake .. -DCMAKE_USE_RELATIVE_PATHS:BOOL=ON -DCMAKE_VERBOSE_MAKEFILE:BOOL=ON -DCMAKE_SKIP_RPATH:BOOL=ON -DBUILD_TESTING:BOOL=FALSE -DKDE_INSTALL_USE_QT_SYS_PATHS:BOOL=ON -DCMAKE_BUILD_TYPE=Release '-DCMAKE_EXE_LINKER_FLAGS:STRING=-L/usr/lib -L/usr/lib/kf5/devel' '-DCMAKE_MODULE_LINKER_FLAGS:STRING=-L/usr/lib -L/usr/lib/kf5/devel' '-DCMAKE_SHARED_LINKER_FLAGS:STRING=-L/usr/lib -L/usr/lib/kf5/devel' '-DCMAKE_LIBRARY_PATH=/usr/lib/kf5/devel;/usr/lib;/lib' '-DCMAKE_INCLUDE_PATH=/usr/include/KF5;/usr/include' -DCMAKE_INSTALL_PREFIX=/usr -DCMAKE_PREFIX_PATH=/usr -DCMAKE_INSTALL_BINDIR=/usr/lib/kf5/bin -DCMAKE_INSTALL_FULL_BINDIR=/usr/lib/kf5/bin -DBIN_INSTALL_DIR:PATH=/usr/lib/kf5/bin -DCMAKE_INSTALL_SBINDIR=/usr/lib/kf5/sbin -DCMAKE_INSTALL_FULL_SBINDIR=/usr/lib/kf5/sbin -DSBIN_INSTALL_DIR:PATH=/usr/lib/kf5/sbin -DLIBEXEC_INSTALL_DIR:PATH=/usr/libexec -DINCLUDE_INSTALL_DIR:PATH=/usr/include -DCMAKE_INSTALL_INCLUDEDIR_KF5=/usr/include/KF5 -DDATA_INSTALL_DIR:PATH=/usr/share -DCONFIG_INSTALL_DIR:PATH=/etc/kf5/xdg -DSERVICES_INSTALL_DIR:PATH=/usr/share/kservices5 -DSERVICETYPES_INSTALL_DIR:PATH=/usr/share/kservicetypes5 -DKNOTIFYRC_INSTALL_DIR:PATH=/usr/share/knotifications5 -DKXMLGUI_INSTALL_DIR:PATH=/usr/share/kxmlgui5 -DLIB_INSTALL_DIR:PATH=/usr/lib -DLIB_DESTINATION=lib -DLIB_SUFFIX= -DSYSCONF_INSTALL_DIR:PATH=/etc -DAUTOSTART_INSTALL_DIR=/etc/kf5/xdg/autostart -DHTML_INSTALL_DIR=/usr/share/kf5/doc/HTML -DICON_INSTALL_DIR=/usr/share/kf5/icons -DXDG_MIME_INSTALL_DIR=/usr/share/mime/packages -DXDG_APPS_INSTALL_DIR=/usr/share/kf5/applications -DECM_MKSPECS_INSTALL_DIR:PATH=/usr/lib/qt5/mkspecs/modules -DKCFG_INSTALL_DIR:PATH=/usr/share/kf5/config.kcfg -DPLUGIN_INSTALL_DIR:PATH=/usr/lib/qt5/plugins -DQT_PLUGIN_INSTALL_DIR:PATH=/usr/lib/qt5/plugins -DQML_INSTALL_DIR:PATH=/usr/lib/qt5/qml -DIMPORTS_INSTALL_DIR:PATH=/usr/lib/qt5/imports -DDBUS_INTERFACES_INSTALL_DIR=/usr/share/kf5/dbus-1/interfaces -DDBUS_SERVICES_INSTALL_DIR=/usr/share/kf5/dbus-1/services -DDBUS_SYSTEM_SERVICES_INSTALL_DIR=/lib/dbus-1/system-services
-- The C compiler identification is GNU 13.2.1
-- The CXX compiler identification is GNU 13.2.1
-- Detecting C compiler ABI info
-- Detecting C compiler ABI info - done
-- Check for working C compiler: /usr/bin/cc - skipped
-- Detecting C compile features
-- Detecting C compile features - done
-- Detecting CXX compiler ABI info
-- Detecting CXX compiler ABI info - done
-- Check for working CXX compiler: /usr/bin/c++ - skipped
-- Detecting CXX compile features
-- Detecting CXX compile features - done
-- ----------------------------------------------------------------------------------
-- Starting CMake configuration for: libkexiv2
CMake Deprecation Warning at /usr/share/ECM/kde-modules/KDEInstallDirsCommon.cmake:135 (message):
  BIN_INSTALL_DIR is deprecated, use KDE_INSTALL_BINDIR instead.
Call Stack (most recent call first):
  /usr/share/ECM/kde-modules/KDEInstallDirsCommon.cmake:236 (_define_relative)
  /usr/share/ECM/kde-modules/KDEInstallDirs5.cmake:229 (include)
  /usr/share/ECM/kde-modules/KDEInstallDirs.cmake:15 (include)
  CMakeLists.txt:68 (include)


CMake Deprecation Warning at /usr/share/ECM/kde-modules/KDEInstallDirsCommon.cmake:135 (message):
  SBIN_INSTALL_DIR is deprecated, use KDE_INSTALL_SBINDIR instead.
Call Stack (most recent call first):
  /usr/share/ECM/kde-modules/KDEInstallDirsCommon.cmake:239 (_define_relative)
  /usr/share/ECM/kde-modules/KDEInstallDirs5.cmake:229 (include)
  /usr/share/ECM/kde-modules/KDEInstallDirs.cmake:15 (include)
  CMakeLists.txt:68 (include)


CMake Deprecation Warning at /usr/share/ECM/kde-modules/KDEInstallDirsCommon.cmake:135 (message):
  LIB_INSTALL_DIR is deprecated, use KDE_INSTALL_LIBDIR instead.
Call Stack (most recent call first):
  /usr/share/ECM/kde-modules/KDEInstallDirsCommon.cmake:242 (_define_relative)
  /usr/share/ECM/kde-modules/KDEInstallDirs5.cmake:229 (include)
  /usr/share/ECM/kde-modules/KDEInstallDirs.cmake:15 (include)
  CMakeLists.txt:68 (include)


CMake Deprecation Warning at /usr/share/ECM/kde-modules/KDEInstallDirsCommon.cmake:135 (message):
  LIBEXEC_INSTALL_DIR is deprecated, use KDE_INSTALL_LIBEXECDIR instead.
Call Stack (most recent call first):
  /usr/share/ECM/kde-modules/KDEInstallDirsCommon.cmake:251 (_define_relative)
  /usr/share/ECM/kde-modules/KDEInstallDirs5.cmake:229 (include)
  /usr/share/ECM/kde-modules/KDEInstallDirs.cmake:15 (include)
  CMakeLists.txt:68 (include)


CMake Deprecation Warning at /usr/share/ECM/kde-modules/KDEInstallDirsCommon.cmake:135 (message):
  INCLUDE_INSTALL_DIR is deprecated, use KDE_INSTALL_INCLUDEDIR instead.
Call Stack (most recent call first):
  /usr/share/ECM/kde-modules/KDEInstallDirsCommon.cmake:200 (_define_relative)
  /usr/share/ECM/kde-modules/KDEInstallDirsCommon.cmake:260 (_define_absolute)
  /usr/share/ECM/kde-modules/KDEInstallDirs5.cmake:229 (include)
  /usr/share/ECM/kde-modules/KDEInstallDirs.cmake:15 (include)
  CMakeLists.txt:68 (include)


CMake Deprecation Warning at /usr/share/ECM/kde-modules/KDEInstallDirsCommon.cmake:135 (message):
  DATA_INSTALL_DIR is deprecated, use KDE_INSTALL_DATADIR instead.
Call Stack (most recent call first):
  /usr/share/ECM/kde-modules/KDEInstallDirsCommon.cmake:280 (_define_relative)
  /usr/share/ECM/kde-modules/KDEInstallDirs5.cmake:229 (include)
  /usr/share/ECM/kde-modules/KDEInstallDirs.cmake:15 (include)
  CMakeLists.txt:68 (include)


CMake Deprecation Warning at /usr/share/ECM/kde-modules/KDEInstallDirsCommon.cmake:135 (message):
  HTML_INSTALL_DIR is deprecated, use KDE_INSTALL_DOCBUNDLEDIR instead.
Call Stack (most recent call first):
  /usr/share/ECM/kde-modules/KDEInstallDirsCommon.cmake:285 (_define_relative)
  /usr/share/ECM/kde-modules/KDEInstallDirs5.cmake:229 (include)
  /usr/share/ECM/kde-modules/KDEInstallDirs.cmake:15 (include)
  CMakeLists.txt:68 (include)


CMake Deprecation Warning at /usr/share/ECM/kde-modules/KDEInstallDirsCommon.cmake:135 (message):
  KCFG_INSTALL_DIR is deprecated, use KDE_INSTALL_KCFGDIR instead.
Call Stack (most recent call first):
  /usr/share/ECM/kde-modules/KDEInstallDirsCommon.cmake:288 (_define_relative)
  /usr/share/ECM/kde-modules/KDEInstallDirs5.cmake:229 (include)
  /usr/share/ECM/kde-modules/KDEInstallDirs.cmake:15 (include)
  CMakeLists.txt:68 (include)


CMake Deprecation Warning at /usr/share/ECM/kde-modules/KDEInstallDirsCommon.cmake:135 (message):
  ICON_INSTALL_DIR is deprecated, use KDE_INSTALL_ICONDIR instead.
Call Stack (most recent call first):
  /usr/share/ECM/kde-modules/KDEInstallDirsCommon.cmake:305 (_define_relative)
  /usr/share/ECM/kde-modules/KDEInstallDirs5.cmake:229 (include)
  /usr/share/ECM/kde-modules/KDEInstallDirs.cmake:15 (include)
  CMakeLists.txt:68 (include)


CMake Deprecation Warning at /usr/share/ECM/kde-modules/KDEInstallDirsCommon.cmake:135 (message):
  XDG_APPS_INSTALL_DIR is deprecated, use KDE_INSTALL_APPDIR instead.
Call Stack (most recent call first):
  /usr/share/ECM/kde-modules/KDEInstallDirsCommon.cmake:320 (_define_relative)
  /usr/share/ECM/kde-modules/KDEInstallDirs5.cmake:229 (include)
  /usr/share/ECM/kde-modules/KDEInstallDirs.cmake:15 (include)
  CMakeLists.txt:68 (include)


CMake Deprecation Warning at /usr/share/ECM/kde-modules/KDEInstallDirsCommon.cmake:135 (message):
  XDG_MIME_INSTALL_DIR is deprecated, use KDE_INSTALL_MIMEDIR instead.
Call Stack (most recent call first):
  /usr/share/ECM/kde-modules/KDEInstallDirsCommon.cmake:326 (_define_relative)
  /usr/share/ECM/kde-modules/KDEInstallDirs5.cmake:229 (include)
  /usr/share/ECM/kde-modules/KDEInstallDirs.cmake:15 (include)
  CMakeLists.txt:68 (include)


CMake Deprecation Warning at /usr/share/ECM/kde-modules/KDEInstallDirsCommon.cmake:135 (message):
  DBUS_INTERFACES_INSTALL_DIR is deprecated, use KDE_INSTALL_DBUSINTERFACEDIR
  instead.
Call Stack (most recent call first):
  /usr/share/ECM/kde-modules/KDEInstallDirsCommon.cmake:340 (_define_relative)
  /usr/share/ECM/kde-modules/KDEInstallDirs5.cmake:229 (include)
  /usr/share/ECM/kde-modules/KDEInstallDirs.cmake:15 (include)
  CMakeLists.txt:68 (include)


CMake Deprecation Warning at /usr/share/ECM/kde-modules/KDEInstallDirsCommon.cmake:135 (message):
  DBUS_SERVICES_INSTALL_DIR is deprecated, use KDE_INSTALL_DBUSSERVICEDIR
  instead.
Call Stack (most recent call first):
  /usr/share/ECM/kde-modules/KDEInstallDirsCommon.cmake:343 (_define_relative)
  /usr/share/ECM/kde-modules/KDEInstallDirs5.cmake:229 (include)
  /usr/share/ECM/kde-modules/KDEInstallDirs.cmake:15 (include)
  CMakeLists.txt:68 (include)


CMake Deprecation Warning at /usr/share/ECM/kde-modules/KDEInstallDirsCommon.cmake:135 (message):
  DBUS_SYSTEM_SERVICES_INSTALL_DIR is deprecated, use
  KDE_INSTALL_DBUSSYSTEMSERVICEDIR instead.
Call Stack (most recent call first):
  /usr/share/ECM/kde-modules/KDEInstallDirsCommon.cmake:346 (_define_relative)
  /usr/share/ECM/kde-modules/KDEInstallDirs5.cmake:229 (include)
  /usr/share/ECM/kde-modules/KDEInstallDirs.cmake:15 (include)
  CMakeLists.txt:68 (include)


CMake Deprecation Warning at /usr/share/ECM/kde-modules/KDEInstallDirsCommon.cmake:135 (message):
  SYSCONF_INSTALL_DIR is deprecated, use KDE_INSTALL_SYSCONFDIR instead.
Call Stack (most recent call first):
  /usr/share/ECM/kde-modules/KDEInstallDirsCommon.cmake:200 (_define_relative)
  /usr/share/ECM/kde-modules/KDEInstallDirsCommon.cmake:363 (_define_absolute)
  /usr/share/ECM/kde-modules/KDEInstallDirs5.cmake:229 (include)
  /usr/share/ECM/kde-modules/KDEInstallDirs.cmake:15 (include)
  CMakeLists.txt:68 (include)


CMake Deprecation Warning at /usr/share/ECM/kde-modules/KDEInstallDirsCommon.cmake:135 (message):
  CONFIG_INSTALL_DIR is deprecated, use KDE_INSTALL_CONFDIR instead.
Call Stack (most recent call first):
  /usr/share/ECM/kde-modules/KDEInstallDirsCommon.cmake:366 (_define_relative)
  /usr/share/ECM/kde-modules/KDEInstallDirs5.cmake:229 (include)
  /usr/share/ECM/kde-modules/KDEInstallDirs.cmake:15 (include)
  CMakeLists.txt:68 (include)


CMake Deprecation Warning at /usr/share/ECM/kde-modules/KDEInstallDirsCommon.cmake:135 (message):
  AUTOSTART_INSTALL_DIR is deprecated, use KDE_INSTALL_AUTOSTARTDIR instead.
Call Stack (most recent call first):
  /usr/share/ECM/kde-modules/KDEInstallDirsCommon.cmake:369 (_define_relative)
  /usr/share/ECM/kde-modules/KDEInstallDirs5.cmake:229 (include)
  /usr/share/ECM/kde-modules/KDEInstallDirs.cmake:15 (include)
  CMakeLists.txt:68 (include)


CMake Deprecation Warning at /usr/share/ECM/kde-modules/KDEInstallDirsCommon.cmake:135 (message):
  QT_PLUGIN_INSTALL_DIR is deprecated, use KDE_INSTALL_QTPLUGINDIR instead.
Call Stack (most recent call first):
  /usr/share/ECM/kde-modules/KDEInstallDirsCommon.cmake:200 (_define_relative)
  /usr/share/ECM/kde-modules/KDEInstallDirs5.cmake:260 (_define_absolute)
  /usr/share/ECM/kde-modules/KDEInstallDirs.cmake:15 (include)
  CMakeLists.txt:68 (include)


CMake Deprecation Warning at /usr/share/ECM/kde-modules/KDEInstallDirsCommon.cmake:135 (message):
  IMPORTS_INSTALL_DIR is deprecated, use KDE_INSTALL_QTQUICKIMPORTSDIR
  instead.
Call Stack (most recent call first):
  /usr/share/ECM/kde-modules/KDEInstallDirsCommon.cmake:200 (_define_relative)
  /usr/share/ECM/kde-modules/KDEInstallDirs5.cmake:269 (_define_absolute)
  /usr/share/ECM/kde-modules/KDEInstallDirs.cmake:15 (include)
  CMakeLists.txt:68 (include)


CMake Deprecation Warning at /usr/share/ECM/kde-modules/KDEInstallDirsCommon.cmake:135 (message):
  QML_INSTALL_DIR is deprecated, use KDE_INSTALL_QMLDIR instead.
Call Stack (most recent call first):
  /usr/share/ECM/kde-modules/KDEInstallDirsCommon.cmake:200 (_define_relative)
  /usr/share/ECM/kde-modules/KDEInstallDirs5.cmake:278 (_define_absolute)
  /usr/share/ECM/kde-modules/KDEInstallDirs.cmake:15 (include)
  CMakeLists.txt:68 (include)


CMake Deprecation Warning at /usr/share/ECM/kde-modules/KDEInstallDirsCommon.cmake:135 (message):
  PLUGIN_INSTALL_DIR is deprecated, use KDE_INSTALL_PLUGINDIR instead.
Call Stack (most recent call first):
  /usr/share/ECM/kde-modules/KDEInstallDirs5.cmake:300 (_define_relative)
  /usr/share/ECM/kde-modules/KDEInstallDirs.cmake:15 (include)
  CMakeLists.txt:68 (include)


CMake Deprecation Warning at /usr/share/ECM/kde-modules/KDEInstallDirsCommon.cmake:135 (message):
  SERVICES_INSTALL_DIR is deprecated, use KDE_INSTALL_KSERVICES5DIR instead.
Call Stack (most recent call first):
  /usr/share/ECM/kde-modules/KDEInstallDirs5.cmake:328 (_define_relative)
  /usr/share/ECM/kde-modules/KDEInstallDirs.cmake:15 (include)
  CMakeLists.txt:68 (include)


CMake Deprecation Warning at /usr/share/ECM/kde-modules/KDEInstallDirsCommon.cmake:135 (message):
  SERVICETYPES_INSTALL_DIR is deprecated, use KDE_INSTALL_KSERVICETYPES5DIR
  instead.
Call Stack (most recent call first):
  /usr/share/ECM/kde-modules/KDEInstallDirs5.cmake:331 (_define_relative)
  /usr/share/ECM/kde-modules/KDEInstallDirs.cmake:15 (include)
  CMakeLists.txt:68 (include)


CMake Deprecation Warning at /usr/share/ECM/kde-modules/KDEInstallDirsCommon.cmake:135 (message):
  KNOTIFYRC_INSTALL_DIR is deprecated, use KDE_INSTALL_KNOTIFY5RCDIR instead.
Call Stack (most recent call first):
  /usr/share/ECM/kde-modules/KDEInstallDirs5.cmake:334 (_define_relative)
  /usr/share/ECM/kde-modules/KDEInstallDirs.cmake:15 (include)
  CMakeLists.txt:68 (include)


CMake Deprecation Warning at /usr/share/ECM/kde-modules/KDEInstallDirsCommon.cmake:135 (message):
  KXMLGUI_INSTALL_DIR is deprecated, use KDE_INSTALL_KXMLGUI5DIR instead.
Call Stack (most recent call first):
  /usr/share/ECM/kde-modules/KDEInstallDirs5.cmake:337 (_define_relative)
  /usr/share/ECM/kde-modules/KDEInstallDirs.cmake:15 (include)
  CMakeLists.txt:68 (include)


fatal: not a git repository (or any of the parent directories): .git
fatal: not a git repository (or any of the parent directories): .git
-- Looking for __GLIBC__
-- Looking for __GLIBC__ - found
-- Performing Test _OFFT_IS_64BIT
-- Performing Test _OFFT_IS_64BIT - Failed
-- Performing Test HAVE_DATE_TIME
-- Performing Test HAVE_DATE_TIME - Success
Package INIReader was not found in the pkg-config search path.
Perhaps you should add the directory containing `INIReader.pc'
to the PKG_CONFIG_PATH environment variable
Package 'INIReader', required by 'exiv2', not found
Package INIReader was not found in the pkg-config search path.
Perhaps you should add the directory containing `INIReader.pc'
to the PKG_CONFIG_PATH environment variable
Package 'INIReader', required by 'exiv2', not found
Package INIReader was not found in the pkg-config search path.
Perhaps you should add the directory containing `INIReader.pc'
to the PKG_CONFIG_PATH environment variable
Package 'INIReader', required by 'exiv2', not found
Package INIReader was not found in the pkg-config search path.
Perhaps you should add the directory containing `INIReader.pc'
to the PKG_CONFIG_PATH environment variable
Package 'INIReader', required by 'exiv2', not found
-- Found LibExiv2: /usr/lib/libexiv2.so (found suitable version "0.28.2", minimum required is "0.25") 
-- Performing Test COMPILER_HAS_HIDDEN_VISIBILITY
-- Performing Test COMPILER_HAS_HIDDEN_VISIBILITY - Success
-- Performing Test COMPILER_HAS_HIDDEN_INLINE_VISIBILITY
-- Performing Test COMPILER_HAS_HIDDEN_INLINE_VISIBILITY - Success
-- Performing Test COMPILER_HAS_DEPRECATED_ATTR
-- Performing Test COMPILER_HAS_DEPRECATED_ATTR - Success
-- The following REQUIRED packages have been found:

 * ECM (required version >= 5.90.0)
 * Qt5Core
 * Qt5Gui
 * Qt5 (required version >= 5.15.0)
 * LibExiv2 (required version >= 0.25), Image metadata support, <https://www.exiv2.org>

-- Configuring done (1.1s)
-- Generating done (0.0s)
CMake Warning:
  Manually-specified variables were not used by the project:

    CMAKE_USE_RELATIVE_PATHS
    ECM_MKSPECS_INSTALL_DIR
    LIB_DESTINATION
    LIB_SUFFIX


-- Build files have been written to: /usr/src/RPM/BUILD/libkexiv2-23.08.5/BUILD
+ popd
~/RPM/BUILD/libkexiv2-23.08.5
+ __kf5_make
+ pushd BUILD
~/RPM/BUILD/libkexiv2-23.08.5/BUILD ~/RPM/BUILD/libkexiv2-23.08.5
+ make -j16
make: Entering directory '/usr/src/RPM/BUILD/libkexiv2-23.08.5/BUILD'
/usr/bin/cmake -S/usr/src/RPM/BUILD/libkexiv2-23.08.5 -B/usr/src/RPM/BUILD/libkexiv2-23.08.5/BUILD --check-build-system CMakeFiles/Makefile.cmake 0
make: Leaving directory '/usr/src/RPM/BUILD/libkexiv2-23.08.5/BUILD'
make: Entering directory '/usr/src/RPM/BUILD/libkexiv2-23.08.5/BUILD'
/usr/bin/cmake -E cmake_progress_start /usr/src/RPM/BUILD/libkexiv2-23.08.5/BUILD/CMakeFiles /usr/src/RPM/BUILD/libkexiv2-23.08.5/BUILD//CMakeFiles/progress.marks
make: Leaving directory '/usr/src/RPM/BUILD/libkexiv2-23.08.5/BUILD'
make  -f CMakeFiles/Makefile2 all
make  -f src/CMakeFiles/KExiv2_autogen_timestamp_deps.dir/build.make src/CMakeFiles/KExiv2_autogen_timestamp_deps.dir/depend
make[2]: Entering directory '/usr/src/RPM/BUILD/libkexiv2-23.08.5/BUILD'
cd /usr/src/RPM/BUILD/libkexiv2-23.08.5/BUILD && /usr/bin/cmake -E cmake_depends "Unix Makefiles" /usr/src/RPM/BUILD/libkexiv2-23.08.5 /usr/src/RPM/BUILD/libkexiv2-23.08.5/src /usr/src/RPM/BUILD/libkexiv2-23.08.5/BUILD /usr/src/RPM/BUILD/libkexiv2-23.08.5/BUILD/src /usr/src/RPM/BUILD/libkexiv2-23.08.5/BUILD/src/CMakeFiles/KExiv2_autogen_timestamp_deps.dir/DependInfo.cmake "--color="
make[2]: Leaving directory '/usr/src/RPM/BUILD/libkexiv2-23.08.5/BUILD'
make  -f src/CMakeFiles/KExiv2_autogen_timestamp_deps.dir/build.make src/CMakeFiles/KExiv2_autogen_timestamp_deps.dir/build
make[2]: Nothing to be done for 'src/CMakeFiles/KExiv2_autogen_timestamp_deps.dir/build'.
make[1]: Entering directory '/usr/src/RPM/BUILD/libkexiv2-23.08.5/BUILD'
[  0%] Built target KExiv2_autogen_timestamp_deps
make[1]: Leaving directory '/usr/src/RPM/BUILD/libkexiv2-23.08.5/BUILD'
make  -f src/CMakeFiles/KExiv2_autogen.dir/build.make src/CMakeFiles/KExiv2_autogen.dir/depend
make[2]: Entering directory '/usr/src/RPM/BUILD/libkexiv2-23.08.5/BUILD'
cd /usr/src/RPM/BUILD/libkexiv2-23.08.5/BUILD && /usr/bin/cmake -E cmake_depends "Unix Makefiles" /usr/src/RPM/BUILD/libkexiv2-23.08.5 /usr/src/RPM/BUILD/libkexiv2-23.08.5/src /usr/src/RPM/BUILD/libkexiv2-23.08.5/BUILD /usr/src/RPM/BUILD/libkexiv2-23.08.5/BUILD/src /usr/src/RPM/BUILD/libkexiv2-23.08.5/BUILD/src/CMakeFiles/KExiv2_autogen.dir/DependInfo.cmake "--color="
make[2]: Leaving directory '/usr/src/RPM/BUILD/libkexiv2-23.08.5/BUILD'
make  -f src/CMakeFiles/KExiv2_autogen.dir/build.make src/CMakeFiles/KExiv2_autogen.dir/build
make[2]: Entering directory '/usr/src/RPM/BUILD/libkexiv2-23.08.5/BUILD'
[  6%] Automatic MOC for target KExiv2
cd /usr/src/RPM/BUILD/libkexiv2-23.08.5/BUILD/src && /usr/bin/cmake -E cmake_autogen /usr/src/RPM/BUILD/libkexiv2-23.08.5/BUILD/src/CMakeFiles/KExiv2_autogen.dir/AutogenInfo.json Release
cd /usr/src/RPM/BUILD/libkexiv2-23.08.5/BUILD/src && /usr/bin/cmake -E touch /usr/src/RPM/BUILD/libkexiv2-23.08.5/BUILD/src/KExiv2_autogen/timestamp
make[2]: Leaving directory '/usr/src/RPM/BUILD/libkexiv2-23.08.5/BUILD'
make[1]: Entering directory '/usr/src/RPM/BUILD/libkexiv2-23.08.5/BUILD'
[  6%] Built target KExiv2_autogen
make[1]: Leaving directory '/usr/src/RPM/BUILD/libkexiv2-23.08.5/BUILD'
make  -f src/CMakeFiles/KExiv2.dir/build.make src/CMakeFiles/KExiv2.dir/depend
make[2]: Entering directory '/usr/src/RPM/BUILD/libkexiv2-23.08.5/BUILD'
cd /usr/src/RPM/BUILD/libkexiv2-23.08.5/BUILD && /usr/bin/cmake -E cmake_depends "Unix Makefiles" /usr/src/RPM/BUILD/libkexiv2-23.08.5 /usr/src/RPM/BUILD/libkexiv2-23.08.5/src /usr/src/RPM/BUILD/libkexiv2-23.08.5/BUILD /usr/src/RPM/BUILD/libkexiv2-23.08.5/BUILD/src /usr/src/RPM/BUILD/libkexiv2-23.08.5/BUILD/src/CMakeFiles/KExiv2.dir/DependInfo.cmake "--color="
make[2]: Leaving directory '/usr/src/RPM/BUILD/libkexiv2-23.08.5/BUILD'
make  -f src/CMakeFiles/KExiv2.dir/build.make src/CMakeFiles/KExiv2.dir/build
make[2]: Entering directory '/usr/src/RPM/BUILD/libkexiv2-23.08.5/BUILD'
[ 12%] Building CXX object src/CMakeFiles/KExiv2.dir/KExiv2_autogen/mocs_compilation.cpp.o
cd /usr/src/RPM/BUILD/libkexiv2-23.08.5/BUILD/src && /usr/bin/c++ -DKEXIV2_DEPRECATED_WARNINGS_SINCE=0x0 -DKEXIV2_DISABLE_DEPRECATED_BEFORE_AND_AT=0x0 -DKExiv2_EXPORTS -DQT_CORE_LIB -DQT_DEPRECATED_WARNINGS -DQT_DEPRECATED_WARNINGS_SINCE=0x060000 -DQT_DISABLE_DEPRECATED_BEFORE=0x050E00 -DQT_GUI_LIB -DQT_NO_CAST_FROM_ASCII -DQT_NO_CAST_FROM_BYTEARRAY -DQT_NO_CAST_TO_ASCII -DQT_NO_DEBUG -DQT_NO_FOREACH -DQT_NO_KEYWORDS -DQT_NO_NARROWING_CONVERSIONS_IN_CONNECT -DQT_NO_URL_CAST_FROM_STRING -DQT_STRICT_ITERATORS -DQT_USE_QSTRINGBUILDER -D_FILE_OFFSET_BITS=64 -D_GNU_SOURCE -D_LARGEFILE64_SOURCE -I/usr/src/RPM/BUILD/libkexiv2-23.08.5/BUILD/src -I/usr/src/RPM/BUILD/libkexiv2-23.08.5/src -I/usr/src/RPM/BUILD/libkexiv2-23.08.5/BUILD/src/KExiv2_autogen/include -isystem /usr/include/qt5 -isystem /usr/include/qt5/QtGui -isystem /usr/include/qt5/QtCore -isystem /usr/share/qt5/../../lib/qt5/mkspecs/linux-g++ -pipe -frecord-gcc-switches -Wall -g -O2 -flto=auto -march=i586 -mtune=generic -fno-operator-names -Wall -Wextra -Wcast-align -Wchar-subscripts -Wformat-security -Wno-long-long -Wpointer-arith -Wundef -Wnon-virtual-dtor -Woverloaded-virtual -Werror=return-type -Werror=init-self -Wvla -Wdate-time -Wsuggest-override -Wlogical-op -pedantic -Wzero-as-null-pointer-constant -Wmissing-include-dirs -fexceptions -O2 -DNDEBUG -std=gnu++14 -fPIC -fvisibility=hidden -fvisibility-inlines-hidden -fPIC -MD -MT src/CMakeFiles/KExiv2.dir/KExiv2_autogen/mocs_compilation.cpp.o -MF CMakeFiles/KExiv2.dir/KExiv2_autogen/mocs_compilation.cpp.o.d -o CMakeFiles/KExiv2.dir/KExiv2_autogen/mocs_compilation.cpp.o -c /usr/src/RPM/BUILD/libkexiv2-23.08.5/BUILD/src/KExiv2_autogen/mocs_compilation.cpp
make[2]: Leaving directory '/usr/src/RPM/BUILD/libkexiv2-23.08.5/BUILD'
make[2]: Entering directory '/usr/src/RPM/BUILD/libkexiv2-23.08.5/BUILD'
[ 75%] Building CXX object src/CMakeFiles/KExiv2.dir/libkexiv2_debug.cpp.o
cd /usr/src/RPM/BUILD/libkexiv2-23.08.5/BUILD/src && /usr/bin/c++ -DKEXIV2_DEPRECATED_WARNINGS_SINCE=0x0 -DKEXIV2_DISABLE_DEPRECATED_BEFORE_AND_AT=0x0 -DKExiv2_EXPORTS -DQT_CORE_LIB -DQT_DEPRECATED_WARNINGS -DQT_DEPRECATED_WARNINGS_SINCE=0x060000 -DQT_DISABLE_DEPRECATED_BEFORE=0x050E00 -DQT_GUI_LIB -DQT_NO_CAST_FROM_ASCII -DQT_NO_CAST_FROM_BYTEARRAY -DQT_NO_CAST_TO_ASCII -DQT_NO_DEBUG -DQT_NO_FOREACH -DQT_NO_KEYWORDS -DQT_NO_NARROWING_CONVERSIONS_IN_CONNECT -DQT_NO_URL_CAST_FROM_STRING -DQT_STRICT_ITERATORS -DQT_USE_QSTRINGBUILDER -D_FILE_OFFSET_BITS=64 -D_GNU_SOURCE -D_LARGEFILE64_SOURCE -I/usr/src/RPM/BUILD/libkexiv2-23.08.5/BUILD/src -I/usr/src/RPM/BUILD/libkexiv2-23.08.5/src -I/usr/src/RPM/BUILD/libkexiv2-23.08.5/BUILD/src/KExiv2_autogen/include -isystem /usr/include/qt5 -isystem /usr/include/qt5/QtGui -isystem /usr/include/qt5/QtCore -isystem /usr/share/qt5/../../lib/qt5/mkspecs/linux-g++ -pipe -frecord-gcc-switches -Wall -g -O2 -flto=auto -march=i586 -mtune=generic -fno-operator-names -Wall -Wextra -Wcast-align -Wchar-subscripts -Wformat-security -Wno-long-long -Wpointer-arith -Wundef -Wnon-virtual-dtor -Woverloaded-virtual -Werror=return-type -Werror=init-self -Wvla -Wdate-time -Wsuggest-override -Wlogical-op -pedantic -Wzero-as-null-pointer-constant -Wmissing-include-dirs -fexceptions -O2 -DNDEBUG -std=gnu++14 -fPIC -fvisibility=hidden -fvisibility-inlines-hidden -fPIC -MD -MT src/CMakeFiles/KExiv2.dir/libkexiv2_debug.cpp.o -MF CMakeFiles/KExiv2.dir/libkexiv2_debug.cpp.o.d -o CMakeFiles/KExiv2.dir/libkexiv2_debug.cpp.o -c /usr/src/RPM/BUILD/libkexiv2-23.08.5/BUILD/src/libkexiv2_debug.cpp
make[2]: Leaving directory '/usr/src/RPM/BUILD/libkexiv2-23.08.5/BUILD'
make[2]: Entering directory '/usr/src/RPM/BUILD/libkexiv2-23.08.5/BUILD'
[ 87%] Building CXX object src/CMakeFiles/KExiv2.dir/rotationmatrix.cpp.o
cd /usr/src/RPM/BUILD/libkexiv2-23.08.5/BUILD/src && /usr/bin/c++ -DKEXIV2_DEPRECATED_WARNINGS_SINCE=0x0 -DKEXIV2_DISABLE_DEPRECATED_BEFORE_AND_AT=0x0 -DKExiv2_EXPORTS -DQT_CORE_LIB -DQT_DEPRECATED_WARNINGS -DQT_DEPRECATED_WARNINGS_SINCE=0x060000 -DQT_DISABLE_DEPRECATED_BEFORE=0x050E00 -DQT_GUI_LIB -DQT_NO_CAST_FROM_ASCII -DQT_NO_CAST_FROM_BYTEARRAY -DQT_NO_CAST_TO_ASCII -DQT_NO_DEBUG -DQT_NO_FOREACH -DQT_NO_KEYWORDS -DQT_NO_NARROWING_CONVERSIONS_IN_CONNECT -DQT_NO_URL_CAST_FROM_STRING -DQT_STRICT_ITERATORS -DQT_USE_QSTRINGBUILDER -D_FILE_OFFSET_BITS=64 -D_GNU_SOURCE -D_LARGEFILE64_SOURCE -I/usr/src/RPM/BUILD/libkexiv2-23.08.5/BUILD/src -I/usr/src/RPM/BUILD/libkexiv2-23.08.5/src -I/usr/src/RPM/BUILD/libkexiv2-23.08.5/BUILD/src/KExiv2_autogen/include -isystem /usr/include/qt5 -isystem /usr/include/qt5/QtGui -isystem /usr/include/qt5/QtCore -isystem /usr/share/qt5/../../lib/qt5/mkspecs/linux-g++ -pipe -frecord-gcc-switches -Wall -g -O2 -flto=auto -march=i586 -mtune=generic -fno-operator-names -Wall -Wextra -Wcast-align -Wchar-subscripts -Wformat-security -Wno-long-long -Wpointer-arith -Wundef -Wnon-virtual-dtor -Woverloaded-virtual -Werror=return-type -Werror=init-self -Wvla -Wdate-time -Wsuggest-override -Wlogical-op -pedantic -Wzero-as-null-pointer-constant -Wmissing-include-dirs -fexceptions -O2 -DNDEBUG -std=gnu++14 -fPIC -fvisibility=hidden -fvisibility-inlines-hidden -fPIC -MD -MT src/CMakeFiles/KExiv2.dir/rotationmatrix.cpp.o -MF CMakeFiles/KExiv2.dir/rotationmatrix.cpp.o.d -o CMakeFiles/KExiv2.dir/rotationmatrix.cpp.o -c /usr/src/RPM/BUILD/libkexiv2-23.08.5/src/rotationmatrix.cpp
make[2]: Leaving directory '/usr/src/RPM/BUILD/libkexiv2-23.08.5/BUILD'
make[2]: Entering directory '/usr/src/RPM/BUILD/libkexiv2-23.08.5/BUILD'
[ 56%] Building CXX object src/CMakeFiles/KExiv2.dir/kexiv2comments.cpp.o
cd /usr/src/RPM/BUILD/libkexiv2-23.08.5/BUILD/src && /usr/bin/c++ -DKEXIV2_DEPRECATED_WARNINGS_SINCE=0x0 -DKEXIV2_DISABLE_DEPRECATED_BEFORE_AND_AT=0x0 -DKExiv2_EXPORTS -DQT_CORE_LIB -DQT_DEPRECATED_WARNINGS -DQT_DEPRECATED_WARNINGS_SINCE=0x060000 -DQT_DISABLE_DEPRECATED_BEFORE=0x050E00 -DQT_GUI_LIB -DQT_NO_CAST_FROM_ASCII -DQT_NO_CAST_FROM_BYTEARRAY -DQT_NO_CAST_TO_ASCII -DQT_NO_DEBUG -DQT_NO_FOREACH -DQT_NO_KEYWORDS -DQT_NO_NARROWING_CONVERSIONS_IN_CONNECT -DQT_NO_URL_CAST_FROM_STRING -DQT_STRICT_ITERATORS -DQT_USE_QSTRINGBUILDER -D_FILE_OFFSET_BITS=64 -D_GNU_SOURCE -D_LARGEFILE64_SOURCE -I/usr/src/RPM/BUILD/libkexiv2-23.08.5/BUILD/src -I/usr/src/RPM/BUILD/libkexiv2-23.08.5/src -I/usr/src/RPM/BUILD/libkexiv2-23.08.5/BUILD/src/KExiv2_autogen/include -isystem /usr/include/qt5 -isystem /usr/include/qt5/QtGui -isystem /usr/include/qt5/QtCore -isystem /usr/share/qt5/../../lib/qt5/mkspecs/linux-g++ -pipe -frecord-gcc-switches -Wall -g -O2 -flto=auto -march=i586 -mtune=generic -fno-operator-names -Wall -Wextra -Wcast-align -Wchar-subscripts -Wformat-security -Wno-long-long -Wpointer-arith -Wundef -Wnon-virtual-dtor -Woverloaded-virtual -Werror=return-type -Werror=init-self -Wvla -Wdate-time -Wsuggest-override -Wlogical-op -pedantic -Wzero-as-null-pointer-constant -Wmissing-include-dirs -fexceptions -O2 -DNDEBUG -std=gnu++14 -fPIC -fvisibility=hidden -fvisibility-inlines-hidden -fPIC -MD -MT src/CMakeFiles/KExiv2.dir/kexiv2comments.cpp.o -MF CMakeFiles/KExiv2.dir/kexiv2comments.cpp.o.d -o CMakeFiles/KExiv2.dir/kexiv2comments.cpp.o -c /usr/src/RPM/BUILD/libkexiv2-23.08.5/src/kexiv2comments.cpp
make[2]: Leaving directory '/usr/src/RPM/BUILD/libkexiv2-23.08.5/BUILD'
make[2]: Entering directory '/usr/src/RPM/BUILD/libkexiv2-23.08.5/BUILD'
[ 62%] Building CXX object src/CMakeFiles/KExiv2.dir/kexiv2xmp.cpp.o
cd /usr/src/RPM/BUILD/libkexiv2-23.08.5/BUILD/src && /usr/bin/c++ -DKEXIV2_DEPRECATED_WARNINGS_SINCE=0x0 -DKEXIV2_DISABLE_DEPRECATED_BEFORE_AND_AT=0x0 -DKExiv2_EXPORTS -DQT_CORE_LIB -DQT_DEPRECATED_WARNINGS -DQT_DEPRECATED_WARNINGS_SINCE=0x060000 -DQT_DISABLE_DEPRECATED_BEFORE=0x050E00 -DQT_GUI_LIB -DQT_NO_CAST_FROM_ASCII -DQT_NO_CAST_FROM_BYTEARRAY -DQT_NO_CAST_TO_ASCII -DQT_NO_DEBUG -DQT_NO_FOREACH -DQT_NO_KEYWORDS -DQT_NO_NARROWING_CONVERSIONS_IN_CONNECT -DQT_NO_URL_CAST_FROM_STRING -DQT_STRICT_ITERATORS -DQT_USE_QSTRINGBUILDER -D_FILE_OFFSET_BITS=64 -D_GNU_SOURCE -D_LARGEFILE64_SOURCE -I/usr/src/RPM/BUILD/libkexiv2-23.08.5/BUILD/src -I/usr/src/RPM/BUILD/libkexiv2-23.08.5/src -I/usr/src/RPM/BUILD/libkexiv2-23.08.5/BUILD/src/KExiv2_autogen/include -isystem /usr/include/qt5 -isystem /usr/include/qt5/QtGui -isystem /usr/include/qt5/QtCore -isystem /usr/share/qt5/../../lib/qt5/mkspecs/linux-g++ -pipe -frecord-gcc-switches -Wall -g -O2 -flto=auto -march=i586 -mtune=generic -fno-operator-names -Wall -Wextra -Wcast-align -Wchar-subscripts -Wformat-security -Wno-long-long -Wpointer-arith -Wundef -Wnon-virtual-dtor -Woverloaded-virtual -Werror=return-type -Werror=init-self -Wvla -Wdate-time -Wsuggest-override -Wlogical-op -pedantic -Wzero-as-null-pointer-constant -Wmissing-include-dirs -fexceptions -O2 -DNDEBUG -std=gnu++14 -fPIC -fvisibility=hidden -fvisibility-inlines-hidden -fPIC -MD -MT src/CMakeFiles/KExiv2.dir/kexiv2xmp.cpp.o -MF CMakeFiles/KExiv2.dir/kexiv2xmp.cpp.o.d -o CMakeFiles/KExiv2.dir/kexiv2xmp.cpp.o -c /usr/src/RPM/BUILD/libkexiv2-23.08.5/src/kexiv2xmp.cpp
/usr/src/RPM/BUILD/libkexiv2-23.08.5/src/kexiv2xmp.cpp: In member function 'QString KExiv2Iface::KExiv2::getXmpTagStringLangAlt(const char*, const QString&, bool) const':
/usr/src/RPM/BUILD/libkexiv2-23.08.5/src/kexiv2xmp.cpp:585:35: warning: comparison of integer expressions of different signedness: 'int' and 'size_t' {aka 'unsigned int'} [-Wsign-compare]
  585 |                 for (int i = 0; i < it->count(); i++)
      |                                 ~~^~~~~~~~~~~~~
/usr/src/RPM/BUILD/libkexiv2-23.08.5/src/kexiv2xmp.cpp: In member function 'QStringList KExiv2Iface::KExiv2::getXmpTagStringSeq(const char*, bool) const':
/usr/src/RPM/BUILD/libkexiv2-23.08.5/src/kexiv2xmp.cpp:707:35: warning: comparison of integer expressions of different signedness: 'int' and 'size_t' {aka 'unsigned int'} [-Wsign-compare]
  707 |                 for (int i = 0; i < it->count(); i++)
      |                                 ~~^~~~~~~~~~~~~
/usr/src/RPM/BUILD/libkexiv2-23.08.5/src/kexiv2xmp.cpp: In member function 'QStringList KExiv2Iface::KExiv2::getXmpTagStringBag(const char*, bool) const':
/usr/src/RPM/BUILD/libkexiv2-23.08.5/src/kexiv2xmp.cpp:812:35: warning: comparison of integer expressions of different signedness: 'int' and 'size_t' {aka 'unsigned int'} [-Wsign-compare]
  812 |                 for (int i = 0; i < it->count(); i++)
      |                                 ~~^~~~~~~~~~~~~
/usr/src/RPM/BUILD/libkexiv2-23.08.5/src/kexiv2xmp.cpp: In member function 'QVariant KExiv2Iface::KExiv2::getXmpTagVariant(const char*, bool, bool) const':
/usr/src/RPM/BUILD/libkexiv2-23.08.5/src/kexiv2xmp.cpp:1023:37: warning: comparison of integer expressions of different signedness: 'int' and 'size_t' {aka 'unsigned int'} [-Wsign-compare]
 1023 |                     for (int i=0; i < it->count(); i++)
      |                                   ~~^~~~~~~~~~~~~
make[2]: Leaving directory '/usr/src/RPM/BUILD/libkexiv2-23.08.5/BUILD'
make[2]: Entering directory '/usr/src/RPM/BUILD/libkexiv2-23.08.5/BUILD'
[ 50%] Building CXX object src/CMakeFiles/KExiv2.dir/kexiv2data.cpp.o
cd /usr/src/RPM/BUILD/libkexiv2-23.08.5/BUILD/src && /usr/bin/c++ -DKEXIV2_DEPRECATED_WARNINGS_SINCE=0x0 -DKEXIV2_DISABLE_DEPRECATED_BEFORE_AND_AT=0x0 -DKExiv2_EXPORTS -DQT_CORE_LIB -DQT_DEPRECATED_WARNINGS -DQT_DEPRECATED_WARNINGS_SINCE=0x060000 -DQT_DISABLE_DEPRECATED_BEFORE=0x050E00 -DQT_GUI_LIB -DQT_NO_CAST_FROM_ASCII -DQT_NO_CAST_FROM_BYTEARRAY -DQT_NO_CAST_TO_ASCII -DQT_NO_DEBUG -DQT_NO_FOREACH -DQT_NO_KEYWORDS -DQT_NO_NARROWING_CONVERSIONS_IN_CONNECT -DQT_NO_URL_CAST_FROM_STRING -DQT_STRICT_ITERATORS -DQT_USE_QSTRINGBUILDER -D_FILE_OFFSET_BITS=64 -D_GNU_SOURCE -D_LARGEFILE64_SOURCE -I/usr/src/RPM/BUILD/libkexiv2-23.08.5/BUILD/src -I/usr/src/RPM/BUILD/libkexiv2-23.08.5/src -I/usr/src/RPM/BUILD/libkexiv2-23.08.5/BUILD/src/KExiv2_autogen/include -isystem /usr/include/qt5 -isystem /usr/include/qt5/QtGui -isystem /usr/include/qt5/QtCore -isystem /usr/share/qt5/../../lib/qt5/mkspecs/linux-g++ -pipe -frecord-gcc-switches -Wall -g -O2 -flto=auto -march=i586 -mtune=generic -fno-operator-names -Wall -Wextra -Wcast-align -Wchar-subscripts -Wformat-security -Wno-long-long -Wpointer-arith -Wundef -Wnon-virtual-dtor -Woverloaded-virtual -Werror=return-type -Werror=init-self -Wvla -Wdate-time -Wsuggest-override -Wlogical-op -pedantic -Wzero-as-null-pointer-constant -Wmissing-include-dirs -fexceptions -O2 -DNDEBUG -std=gnu++14 -fPIC -fvisibility=hidden -fvisibility-inlines-hidden -fPIC -MD -MT src/CMakeFiles/KExiv2.dir/kexiv2data.cpp.o -MF CMakeFiles/KExiv2.dir/kexiv2data.cpp.o.d -o CMakeFiles/KExiv2.dir/kexiv2data.cpp.o -c /usr/src/RPM/BUILD/libkexiv2-23.08.5/src/kexiv2data.cpp
make[2]: Leaving directory '/usr/src/RPM/BUILD/libkexiv2-23.08.5/BUILD'
make[2]: Entering directory '/usr/src/RPM/BUILD/libkexiv2-23.08.5/BUILD'
[ 37%] Building CXX object src/CMakeFiles/KExiv2.dir/kexiv2exif.cpp.o
cd /usr/src/RPM/BUILD/libkexiv2-23.08.5/BUILD/src && /usr/bin/c++ -DKEXIV2_DEPRECATED_WARNINGS_SINCE=0x0 -DKEXIV2_DISABLE_DEPRECATED_BEFORE_AND_AT=0x0 -DKExiv2_EXPORTS -DQT_CORE_LIB -DQT_DEPRECATED_WARNINGS -DQT_DEPRECATED_WARNINGS_SINCE=0x060000 -DQT_DISABLE_DEPRECATED_BEFORE=0x050E00 -DQT_GUI_LIB -DQT_NO_CAST_FROM_ASCII -DQT_NO_CAST_FROM_BYTEARRAY -DQT_NO_CAST_TO_ASCII -DQT_NO_DEBUG -DQT_NO_FOREACH -DQT_NO_KEYWORDS -DQT_NO_NARROWING_CONVERSIONS_IN_CONNECT -DQT_NO_URL_CAST_FROM_STRING -DQT_STRICT_ITERATORS -DQT_USE_QSTRINGBUILDER -D_FILE_OFFSET_BITS=64 -D_GNU_SOURCE -D_LARGEFILE64_SOURCE -I/usr/src/RPM/BUILD/libkexiv2-23.08.5/BUILD/src -I/usr/src/RPM/BUILD/libkexiv2-23.08.5/src -I/usr/src/RPM/BUILD/libkexiv2-23.08.5/BUILD/src/KExiv2_autogen/include -isystem /usr/include/qt5 -isystem /usr/include/qt5/QtGui -isystem /usr/include/qt5/QtCore -isystem /usr/share/qt5/../../lib/qt5/mkspecs/linux-g++ -pipe -frecord-gcc-switches -Wall -g -O2 -flto=auto -march=i586 -mtune=generic -fno-operator-names -Wall -Wextra -Wcast-align -Wchar-subscripts -Wformat-security -Wno-long-long -Wpointer-arith -Wundef -Wnon-virtual-dtor -Woverloaded-virtual -Werror=return-type -Werror=init-self -Wvla -Wdate-time -Wsuggest-override -Wlogical-op -pedantic -Wzero-as-null-pointer-constant -Wmissing-include-dirs -fexceptions -O2 -DNDEBUG -std=gnu++14 -fPIC -fvisibility=hidden -fvisibility-inlines-hidden -fPIC -MD -MT src/CMakeFiles/KExiv2.dir/kexiv2exif.cpp.o -MF CMakeFiles/KExiv2.dir/kexiv2exif.cpp.o.d -o CMakeFiles/KExiv2.dir/kexiv2exif.cpp.o -c /usr/src/RPM/BUILD/libkexiv2-23.08.5/src/kexiv2exif.cpp
/usr/src/RPM/BUILD/libkexiv2-23.08.5/src/kexiv2exif.cpp: In member function 'QVariant KExiv2Iface::KExiv2::getExifTagVariant(const char*, bool, bool, int) const':
/usr/src/RPM/BUILD/libkexiv2-23.08.5/src/kexiv2exif.cpp:738:37: warning: comparison of integer expressions of different signedness: 'size_t' {aka 'unsigned int'} and 'int' [-Wsign-compare]
  738 |                     if (it->count() > component)
      |                         ~~~~~~~~~~~~^~~~~~~~~~~
/usr/src/RPM/BUILD/libkexiv2-23.08.5/src/kexiv2exif.cpp:751:41: warning: comparison of integer expressions of different signedness: 'size_t' {aka 'unsigned int'} and 'int' [-Wsign-compare]
  751 |                         if (it->count() <= component)
      |                             ~~~~~~~~~~~~^~~~~~~~~~~~
/usr/src/RPM/BUILD/libkexiv2-23.08.5/src/kexiv2exif.cpp:762:41: warning: comparison of integer expressions of different signedness: 'size_t' {aka 'unsigned int'} and 'int' [-Wsign-compare]
  762 |                         if (it->count() <= component)
      |                             ~~~~~~~~~~~~^~~~~~~~~~~~
make[2]: Leaving directory '/usr/src/RPM/BUILD/libkexiv2-23.08.5/BUILD'
make[2]: Entering directory '/usr/src/RPM/BUILD/libkexiv2-23.08.5/BUILD'
[ 81%] Building CXX object src/CMakeFiles/KExiv2.dir/kexiv2previews.cpp.o
cd /usr/src/RPM/BUILD/libkexiv2-23.08.5/BUILD/src && /usr/bin/c++ -DKEXIV2_DEPRECATED_WARNINGS_SINCE=0x0 -DKEXIV2_DISABLE_DEPRECATED_BEFORE_AND_AT=0x0 -DKExiv2_EXPORTS -DQT_CORE_LIB -DQT_DEPRECATED_WARNINGS -DQT_DEPRECATED_WARNINGS_SINCE=0x060000 -DQT_DISABLE_DEPRECATED_BEFORE=0x050E00 -DQT_GUI_LIB -DQT_NO_CAST_FROM_ASCII -DQT_NO_CAST_FROM_BYTEARRAY -DQT_NO_CAST_TO_ASCII -DQT_NO_DEBUG -DQT_NO_FOREACH -DQT_NO_KEYWORDS -DQT_NO_NARROWING_CONVERSIONS_IN_CONNECT -DQT_NO_URL_CAST_FROM_STRING -DQT_STRICT_ITERATORS -DQT_USE_QSTRINGBUILDER -D_FILE_OFFSET_BITS=64 -D_GNU_SOURCE -D_LARGEFILE64_SOURCE -I/usr/src/RPM/BUILD/libkexiv2-23.08.5/BUILD/src -I/usr/src/RPM/BUILD/libkexiv2-23.08.5/src -I/usr/src/RPM/BUILD/libkexiv2-23.08.5/BUILD/src/KExiv2_autogen/include -isystem /usr/include/qt5 -isystem /usr/include/qt5/QtGui -isystem /usr/include/qt5/QtCore -isystem /usr/share/qt5/../../lib/qt5/mkspecs/linux-g++ -pipe -frecord-gcc-switches -Wall -g -O2 -flto=auto -march=i586 -mtune=generic -fno-operator-names -Wall -Wextra -Wcast-align -Wchar-subscripts -Wformat-security -Wno-long-long -Wpointer-arith -Wundef -Wnon-virtual-dtor -Woverloaded-virtual -Werror=return-type -Werror=init-self -Wvla -Wdate-time -Wsuggest-override -Wlogical-op -pedantic -Wzero-as-null-pointer-constant -Wmissing-include-dirs -fexceptions -O2 -DNDEBUG -std=gnu++14 -fPIC -fvisibility=hidden -fvisibility-inlines-hidden -fPIC -MD -MT src/CMakeFiles/KExiv2.dir/kexiv2previews.cpp.o -MF CMakeFiles/KExiv2.dir/kexiv2previews.cpp.o.d -o CMakeFiles/KExiv2.dir/kexiv2previews.cpp.o -c /usr/src/RPM/BUILD/libkexiv2-23.08.5/src/kexiv2previews.cpp
make[2]: Leaving directory '/usr/src/RPM/BUILD/libkexiv2-23.08.5/BUILD'
make[2]: Entering directory '/usr/src/RPM/BUILD/libkexiv2-23.08.5/BUILD'
[ 31%] Building CXX object src/CMakeFiles/KExiv2.dir/kexiv2image.cpp.o
cd /usr/src/RPM/BUILD/libkexiv2-23.08.5/BUILD/src && /usr/bin/c++ -DKEXIV2_DEPRECATED_WARNINGS_SINCE=0x0 -DKEXIV2_DISABLE_DEPRECATED_BEFORE_AND_AT=0x0 -DKExiv2_EXPORTS -DQT_CORE_LIB -DQT_DEPRECATED_WARNINGS -DQT_DEPRECATED_WARNINGS_SINCE=0x060000 -DQT_DISABLE_DEPRECATED_BEFORE=0x050E00 -DQT_GUI_LIB -DQT_NO_CAST_FROM_ASCII -DQT_NO_CAST_FROM_BYTEARRAY -DQT_NO_CAST_TO_ASCII -DQT_NO_DEBUG -DQT_NO_FOREACH -DQT_NO_KEYWORDS -DQT_NO_NARROWING_CONVERSIONS_IN_CONNECT -DQT_NO_URL_CAST_FROM_STRING -DQT_STRICT_ITERATORS -DQT_USE_QSTRINGBUILDER -D_FILE_OFFSET_BITS=64 -D_GNU_SOURCE -D_LARGEFILE64_SOURCE -I/usr/src/RPM/BUILD/libkexiv2-23.08.5/BUILD/src -I/usr/src/RPM/BUILD/libkexiv2-23.08.5/src -I/usr/src/RPM/BUILD/libkexiv2-23.08.5/BUILD/src/KExiv2_autogen/include -isystem /usr/include/qt5 -isystem /usr/include/qt5/QtGui -isystem /usr/include/qt5/QtCore -isystem /usr/share/qt5/../../lib/qt5/mkspecs/linux-g++ -pipe -frecord-gcc-switches -Wall -g -O2 -flto=auto -march=i586 -mtune=generic -fno-operator-names -Wall -Wextra -Wcast-align -Wchar-subscripts -Wformat-security -Wno-long-long -Wpointer-arith -Wundef -Wnon-virtual-dtor -Woverloaded-virtual -Werror=return-type -Werror=init-self -Wvla -Wdate-time -Wsuggest-override -Wlogical-op -pedantic -Wzero-as-null-pointer-constant -Wmissing-include-dirs -fexceptions -O2 -DNDEBUG -std=gnu++14 -fPIC -fvisibility=hidden -fvisibility-inlines-hidden -fPIC -MD -MT src/CMakeFiles/KExiv2.dir/kexiv2image.cpp.o -MF CMakeFiles/KExiv2.dir/kexiv2image.cpp.o.d -o CMakeFiles/KExiv2.dir/kexiv2image.cpp.o -c /usr/src/RPM/BUILD/libkexiv2-23.08.5/src/kexiv2image.cpp
make[2]: Leaving directory '/usr/src/RPM/BUILD/libkexiv2-23.08.5/BUILD'
make[2]: Entering directory '/usr/src/RPM/BUILD/libkexiv2-23.08.5/BUILD'
[ 43%] Building CXX object src/CMakeFiles/KExiv2.dir/kexiv2gps.cpp.o
cd /usr/src/RPM/BUILD/libkexiv2-23.08.5/BUILD/src && /usr/bin/c++ -DKEXIV2_DEPRECATED_WARNINGS_SINCE=0x0 -DKEXIV2_DISABLE_DEPRECATED_BEFORE_AND_AT=0x0 -DKExiv2_EXPORTS -DQT_CORE_LIB -DQT_DEPRECATED_WARNINGS -DQT_DEPRECATED_WARNINGS_SINCE=0x060000 -DQT_DISABLE_DEPRECATED_BEFORE=0x050E00 -DQT_GUI_LIB -DQT_NO_CAST_FROM_ASCII -DQT_NO_CAST_FROM_BYTEARRAY -DQT_NO_CAST_TO_ASCII -DQT_NO_DEBUG -DQT_NO_FOREACH -DQT_NO_KEYWORDS -DQT_NO_NARROWING_CONVERSIONS_IN_CONNECT -DQT_NO_URL_CAST_FROM_STRING -DQT_STRICT_ITERATORS -DQT_USE_QSTRINGBUILDER -D_FILE_OFFSET_BITS=64 -D_GNU_SOURCE -D_LARGEFILE64_SOURCE -I/usr/src/RPM/BUILD/libkexiv2-23.08.5/BUILD/src -I/usr/src/RPM/BUILD/libkexiv2-23.08.5/src -I/usr/src/RPM/BUILD/libkexiv2-23.08.5/BUILD/src/KExiv2_autogen/include -isystem /usr/include/qt5 -isystem /usr/include/qt5/QtGui -isystem /usr/include/qt5/QtCore -isystem /usr/share/qt5/../../lib/qt5/mkspecs/linux-g++ -pipe -frecord-gcc-switches -Wall -g -O2 -flto=auto -march=i586 -mtune=generic -fno-operator-names -Wall -Wextra -Wcast-align -Wchar-subscripts -Wformat-security -Wno-long-long -Wpointer-arith -Wundef -Wnon-virtual-dtor -Woverloaded-virtual -Werror=return-type -Werror=init-self -Wvla -Wdate-time -Wsuggest-override -Wlogical-op -pedantic -Wzero-as-null-pointer-constant -Wmissing-include-dirs -fexceptions -O2 -DNDEBUG -std=gnu++14 -fPIC -fvisibility=hidden -fvisibility-inlines-hidden -fPIC -MD -MT src/CMakeFiles/KExiv2.dir/kexiv2gps.cpp.o -MF CMakeFiles/KExiv2.dir/kexiv2gps.cpp.o.d -o CMakeFiles/KExiv2.dir/kexiv2gps.cpp.o -c /usr/src/RPM/BUILD/libkexiv2-23.08.5/src/kexiv2gps.cpp
make[2]: Leaving directory '/usr/src/RPM/BUILD/libkexiv2-23.08.5/BUILD'
make[2]: Entering directory '/usr/src/RPM/BUILD/libkexiv2-23.08.5/BUILD'
[ 18%] Building CXX object src/CMakeFiles/KExiv2.dir/kexiv2.cpp.o
cd /usr/src/RPM/BUILD/libkexiv2-23.08.5/BUILD/src && /usr/bin/c++ -DKEXIV2_DEPRECATED_WARNINGS_SINCE=0x0 -DKEXIV2_DISABLE_DEPRECATED_BEFORE_AND_AT=0x0 -DKExiv2_EXPORTS -DQT_CORE_LIB -DQT_DEPRECATED_WARNINGS -DQT_DEPRECATED_WARNINGS_SINCE=0x060000 -DQT_DISABLE_DEPRECATED_BEFORE=0x050E00 -DQT_GUI_LIB -DQT_NO_CAST_FROM_ASCII -DQT_NO_CAST_FROM_BYTEARRAY -DQT_NO_CAST_TO_ASCII -DQT_NO_DEBUG -DQT_NO_FOREACH -DQT_NO_KEYWORDS -DQT_NO_NARROWING_CONVERSIONS_IN_CONNECT -DQT_NO_URL_CAST_FROM_STRING -DQT_STRICT_ITERATORS -DQT_USE_QSTRINGBUILDER -D_FILE_OFFSET_BITS=64 -D_GNU_SOURCE -D_LARGEFILE64_SOURCE -I/usr/src/RPM/BUILD/libkexiv2-23.08.5/BUILD/src -I/usr/src/RPM/BUILD/libkexiv2-23.08.5/src -I/usr/src/RPM/BUILD/libkexiv2-23.08.5/BUILD/src/KExiv2_autogen/include -isystem /usr/include/qt5 -isystem /usr/include/qt5/QtGui -isystem /usr/include/qt5/QtCore -isystem /usr/share/qt5/../../lib/qt5/mkspecs/linux-g++ -pipe -frecord-gcc-switches -Wall -g -O2 -flto=auto -march=i586 -mtune=generic -fno-operator-names -Wall -Wextra -Wcast-align -Wchar-subscripts -Wformat-security -Wno-long-long -Wpointer-arith -Wundef -Wnon-virtual-dtor -Woverloaded-virtual -Werror=return-type -Werror=init-self -Wvla -Wdate-time -Wsuggest-override -Wlogical-op -pedantic -Wzero-as-null-pointer-constant -Wmissing-include-dirs -fexceptions -O2 -DNDEBUG -std=gnu++14 -fPIC -fvisibility=hidden -fvisibility-inlines-hidden -fPIC -MD -MT src/CMakeFiles/KExiv2.dir/kexiv2.cpp.o -MF CMakeFiles/KExiv2.dir/kexiv2.cpp.o.d -o CMakeFiles/KExiv2.dir/kexiv2.cpp.o -c /usr/src/RPM/BUILD/libkexiv2-23.08.5/src/kexiv2.cpp
make[2]: Leaving directory '/usr/src/RPM/BUILD/libkexiv2-23.08.5/BUILD'
make[2]: Entering directory '/usr/src/RPM/BUILD/libkexiv2-23.08.5/BUILD'
[ 25%] Building CXX object src/CMakeFiles/KExiv2.dir/kexiv2_p.cpp.o
cd /usr/src/RPM/BUILD/libkexiv2-23.08.5/BUILD/src && /usr/bin/c++ -DKEXIV2_DEPRECATED_WARNINGS_SINCE=0x0 -DKEXIV2_DISABLE_DEPRECATED_BEFORE_AND_AT=0x0 -DKExiv2_EXPORTS -DQT_CORE_LIB -DQT_DEPRECATED_WARNINGS -DQT_DEPRECATED_WARNINGS_SINCE=0x060000 -DQT_DISABLE_DEPRECATED_BEFORE=0x050E00 -DQT_GUI_LIB -DQT_NO_CAST_FROM_ASCII -DQT_NO_CAST_FROM_BYTEARRAY -DQT_NO_CAST_TO_ASCII -DQT_NO_DEBUG -DQT_NO_FOREACH -DQT_NO_KEYWORDS -DQT_NO_NARROWING_CONVERSIONS_IN_CONNECT -DQT_NO_URL_CAST_FROM_STRING -DQT_STRICT_ITERATORS -DQT_USE_QSTRINGBUILDER -D_FILE_OFFSET_BITS=64 -D_GNU_SOURCE -D_LARGEFILE64_SOURCE -I/usr/src/RPM/BUILD/libkexiv2-23.08.5/BUILD/src -I/usr/src/RPM/BUILD/libkexiv2-23.08.5/src -I/usr/src/RPM/BUILD/libkexiv2-23.08.5/BUILD/src/KExiv2_autogen/include -isystem /usr/include/qt5 -isystem /usr/include/qt5/QtGui -isystem /usr/include/qt5/QtCore -isystem /usr/share/qt5/../../lib/qt5/mkspecs/linux-g++ -pipe -frecord-gcc-switches -Wall -g -O2 -flto=auto -march=i586 -mtune=generic -fno-operator-names -Wall -Wextra -Wcast-align -Wchar-subscripts -Wformat-security -Wno-long-long -Wpointer-arith -Wundef -Wnon-virtual-dtor -Woverloaded-virtual -Werror=return-type -Werror=init-self -Wvla -Wdate-time -Wsuggest-override -Wlogical-op -pedantic -Wzero-as-null-pointer-constant -Wmissing-include-dirs -fexceptions -O2 -DNDEBUG -std=gnu++14 -fPIC -fvisibility=hidden -fvisibility-inlines-hidden -fPIC -MD -MT src/CMakeFiles/KExiv2.dir/kexiv2_p.cpp.o -MF CMakeFiles/KExiv2.dir/kexiv2_p.cpp.o.d -o CMakeFiles/KExiv2.dir/kexiv2_p.cpp.o -c /usr/src/RPM/BUILD/libkexiv2-23.08.5/src/kexiv2_p.cpp
make[2]: Leaving directory '/usr/src/RPM/BUILD/libkexiv2-23.08.5/BUILD'
make[2]: Entering directory '/usr/src/RPM/BUILD/libkexiv2-23.08.5/BUILD'
[ 68%] Building CXX object src/CMakeFiles/KExiv2.dir/kexiv2iptc.cpp.o
cd /usr/src/RPM/BUILD/libkexiv2-23.08.5/BUILD/src && /usr/bin/c++ -DKEXIV2_DEPRECATED_WARNINGS_SINCE=0x0 -DKEXIV2_DISABLE_DEPRECATED_BEFORE_AND_AT=0x0 -DKExiv2_EXPORTS -DQT_CORE_LIB -DQT_DEPRECATED_WARNINGS -DQT_DEPRECATED_WARNINGS_SINCE=0x060000 -DQT_DISABLE_DEPRECATED_BEFORE=0x050E00 -DQT_GUI_LIB -DQT_NO_CAST_FROM_ASCII -DQT_NO_CAST_FROM_BYTEARRAY -DQT_NO_CAST_TO_ASCII -DQT_NO_DEBUG -DQT_NO_FOREACH -DQT_NO_KEYWORDS -DQT_NO_NARROWING_CONVERSIONS_IN_CONNECT -DQT_NO_URL_CAST_FROM_STRING -DQT_STRICT_ITERATORS -DQT_USE_QSTRINGBUILDER -D_FILE_OFFSET_BITS=64 -D_GNU_SOURCE -D_LARGEFILE64_SOURCE -I/usr/src/RPM/BUILD/libkexiv2-23.08.5/BUILD/src -I/usr/src/RPM/BUILD/libkexiv2-23.08.5/src -I/usr/src/RPM/BUILD/libkexiv2-23.08.5/BUILD/src/KExiv2_autogen/include -isystem /usr/include/qt5 -isystem /usr/include/qt5/QtGui -isystem /usr/include/qt5/QtCore -isystem /usr/share/qt5/../../lib/qt5/mkspecs/linux-g++ -pipe -frecord-gcc-switches -Wall -g -O2 -flto=auto -march=i586 -mtune=generic -fno-operator-names -Wall -Wextra -Wcast-align -Wchar-subscripts -Wformat-security -Wno-long-long -Wpointer-arith -Wundef -Wnon-virtual-dtor -Woverloaded-virtual -Werror=return-type -Werror=init-self -Wvla -Wdate-time -Wsuggest-override -Wlogical-op -pedantic -Wzero-as-null-pointer-constant -Wmissing-include-dirs -fexceptions -O2 -DNDEBUG -std=gnu++14 -fPIC -fvisibility=hidden -fvisibility-inlines-hidden -fPIC -MD -MT src/CMakeFiles/KExiv2.dir/kexiv2iptc.cpp.o -MF CMakeFiles/KExiv2.dir/kexiv2iptc.cpp.o.d -o CMakeFiles/KExiv2.dir/kexiv2iptc.cpp.o -c /usr/src/RPM/BUILD/libkexiv2-23.08.5/src/kexiv2iptc.cpp
make[2]: Leaving directory '/usr/src/RPM/BUILD/libkexiv2-23.08.5/BUILD'
make[2]: Entering directory '/usr/src/RPM/BUILD/libkexiv2-23.08.5/BUILD'
[ 93%] Linking CXX shared library ../bin/libKF5KExiv2.so
cd /usr/src/RPM/BUILD/libkexiv2-23.08.5/BUILD/src && /usr/bin/cmake -E cmake_link_script CMakeFiles/KExiv2.dir/link.txt --verbose=1
/usr/bin/c++ -fPIC -pipe -frecord-gcc-switches -Wall -g -O2 -flto=auto -march=i586 -mtune=generic -fno-operator-names -Wall -Wextra -Wcast-align -Wchar-subscripts -Wformat-security -Wno-long-long -Wpointer-arith -Wundef -Wnon-virtual-dtor -Woverloaded-virtual -Werror=return-type -Werror=init-self -Wvla -Wdate-time -Wsuggest-override -Wlogical-op -pedantic -Wzero-as-null-pointer-constant -Wmissing-include-dirs -fexceptions -O2 -DNDEBUG -Wl,--no-undefined -Wl,--fatal-warnings -Wl,--enable-new-dtags -L/usr/lib -L/usr/lib/kf5/devel -shared -Wl,-soname,libKF5KExiv2.so.15.0.0 -o ../bin/libKF5KExiv2.so.5.0.0 CMakeFiles/KExiv2.dir/KExiv2_autogen/mocs_compilation.cpp.o CMakeFiles/KExiv2.dir/kexiv2.cpp.o CMakeFiles/KExiv2.dir/kexiv2_p.cpp.o CMakeFiles/KExiv2.dir/kexiv2data.cpp.o CMakeFiles/KExiv2.dir/kexiv2image.cpp.o CMakeFiles/KExiv2.dir/kexiv2comments.cpp.o CMakeFiles/KExiv2.dir/kexiv2exif.cpp.o CMakeFiles/KExiv2.dir/kexiv2iptc.cpp.o CMakeFiles/KExiv2.dir/kexiv2gps.cpp.o CMakeFiles/KExiv2.dir/kexiv2xmp.cpp.o CMakeFiles/KExiv2.dir/kexiv2previews.cpp.o CMakeFiles/KExiv2.dir/rotationmatrix.cpp.o CMakeFiles/KExiv2.dir/libkexiv2_debug.cpp.o  /usr/lib/libexiv2.so /usr/lib/libQt5Gui.so.5.15.12 /usr/lib/libQt5Core.so.5.15.12 
cd /usr/src/RPM/BUILD/libkexiv2-23.08.5/BUILD/src && /usr/bin/cmake -E cmake_symlink_library ../bin/libKF5KExiv2.so.5.0.0 ../bin/libKF5KExiv2.so.15.0.0 ../bin/libKF5KExiv2.so
make[2]: Leaving directory '/usr/src/RPM/BUILD/libkexiv2-23.08.5/BUILD'
make[1]: Entering directory '/usr/src/RPM/BUILD/libkexiv2-23.08.5/BUILD'
[100%] Built target KExiv2
make[1]: Leaving directory '/usr/src/RPM/BUILD/libkexiv2-23.08.5/BUILD'
make: Entering directory '/usr/src/RPM/BUILD/libkexiv2-23.08.5/BUILD'
/usr/bin/cmake -E cmake_progress_start /usr/src/RPM/BUILD/libkexiv2-23.08.5/BUILD/CMakeFiles 0
make: Leaving directory '/usr/src/RPM/BUILD/libkexiv2-23.08.5/BUILD'
+ popd
~/RPM/BUILD/libkexiv2-23.08.5
+ exit 0
Executing(%install): /bin/sh -e /usr/src/tmp/rpm-tmp.92319
+ umask 022
+ /bin/mkdir -p /usr/src/RPM/BUILD
+ cd /usr/src/RPM/BUILD
+ /bin/chmod -Rf u+rwX -- /usr/src/tmp/kde5-libkexiv2-buildroot
+ :
+ /bin/rm -rf -- /usr/src/tmp/kde5-libkexiv2-buildroot
+ PATH=/usr/libexec/rpm-build:/usr/src/bin:/bin:/usr/bin:/usr/X11R6/bin:/usr/games
+ cd libkexiv2-23.08.5
+ __kf5_install
+ make -C BUILD DESTDIR=/usr/src/tmp/kde5-libkexiv2-buildroot install
make: Entering directory '/usr/src/RPM/BUILD/libkexiv2-23.08.5/BUILD'
/usr/bin/cmake -S/usr/src/RPM/BUILD/libkexiv2-23.08.5 -B/usr/src/RPM/BUILD/libkexiv2-23.08.5/BUILD --check-build-system CMakeFiles/Makefile.cmake 0
/usr/bin/cmake -E cmake_progress_start /usr/src/RPM/BUILD/libkexiv2-23.08.5/BUILD/CMakeFiles /usr/src/RPM/BUILD/libkexiv2-23.08.5/BUILD//CMakeFiles/progress.marks
make  -f CMakeFiles/Makefile2 all
make[1]: Entering directory '/usr/src/RPM/BUILD/libkexiv2-23.08.5/BUILD'
make  -f src/CMakeFiles/KExiv2_autogen_timestamp_deps.dir/build.make src/CMakeFiles/KExiv2_autogen_timestamp_deps.dir/depend
make[2]: Entering directory '/usr/src/RPM/BUILD/libkexiv2-23.08.5/BUILD'
cd /usr/src/RPM/BUILD/libkexiv2-23.08.5/BUILD && /usr/bin/cmake -E cmake_depends "Unix Makefiles" /usr/src/RPM/BUILD/libkexiv2-23.08.5 /usr/src/RPM/BUILD/libkexiv2-23.08.5/src /usr/src/RPM/BUILD/libkexiv2-23.08.5/BUILD /usr/src/RPM/BUILD/libkexiv2-23.08.5/BUILD/src /usr/src/RPM/BUILD/libkexiv2-23.08.5/BUILD/src/CMakeFiles/KExiv2_autogen_timestamp_deps.dir/DependInfo.cmake "--color="
make[2]: Leaving directory '/usr/src/RPM/BUILD/libkexiv2-23.08.5/BUILD'
make  -f src/CMakeFiles/KExiv2_autogen_timestamp_deps.dir/build.make src/CMakeFiles/KExiv2_autogen_timestamp_deps.dir/build
make[2]: Entering directory '/usr/src/RPM/BUILD/libkexiv2-23.08.5/BUILD'
make[2]: Nothing to be done for 'src/CMakeFiles/KExiv2_autogen_timestamp_deps.dir/build'.
make[2]: Leaving directory '/usr/src/RPM/BUILD/libkexiv2-23.08.5/BUILD'
[  0%] Built target KExiv2_autogen_timestamp_deps
make  -f src/CMakeFiles/KExiv2_autogen.dir/build.make src/CMakeFiles/KExiv2_autogen.dir/depend
make[2]: Entering directory '/usr/src/RPM/BUILD/libkexiv2-23.08.5/BUILD'
cd /usr/src/RPM/BUILD/libkexiv2-23.08.5/BUILD && /usr/bin/cmake -E cmake_depends "Unix Makefiles" /usr/src/RPM/BUILD/libkexiv2-23.08.5 /usr/src/RPM/BUILD/libkexiv2-23.08.5/src /usr/src/RPM/BUILD/libkexiv2-23.08.5/BUILD /usr/src/RPM/BUILD/libkexiv2-23.08.5/BUILD/src /usr/src/RPM/BUILD/libkexiv2-23.08.5/BUILD/src/CMakeFiles/KExiv2_autogen.dir/DependInfo.cmake "--color="
make[2]: Leaving directory '/usr/src/RPM/BUILD/libkexiv2-23.08.5/BUILD'
make  -f src/CMakeFiles/KExiv2_autogen.dir/build.make src/CMakeFiles/KExiv2_autogen.dir/build
make[2]: Entering directory '/usr/src/RPM/BUILD/libkexiv2-23.08.5/BUILD'
make[2]: Nothing to be done for 'src/CMakeFiles/KExiv2_autogen.dir/build'.
make[2]: Leaving directory '/usr/src/RPM/BUILD/libkexiv2-23.08.5/BUILD'
[  6%] Built target KExiv2_autogen
make  -f src/CMakeFiles/KExiv2.dir/build.make src/CMakeFiles/KExiv2.dir/depend
make[2]: Entering directory '/usr/src/RPM/BUILD/libkexiv2-23.08.5/BUILD'
cd /usr/src/RPM/BUILD/libkexiv2-23.08.5/BUILD && /usr/bin/cmake -E cmake_depends "Unix Makefiles" /usr/src/RPM/BUILD/libkexiv2-23.08.5 /usr/src/RPM/BUILD/libkexiv2-23.08.5/src /usr/src/RPM/BUILD/libkexiv2-23.08.5/BUILD /usr/src/RPM/BUILD/libkexiv2-23.08.5/BUILD/src /usr/src/RPM/BUILD/libkexiv2-23.08.5/BUILD/src/CMakeFiles/KExiv2.dir/DependInfo.cmake "--color="
make[2]: Leaving directory '/usr/src/RPM/BUILD/libkexiv2-23.08.5/BUILD'
make  -f src/CMakeFiles/KExiv2.dir/build.make src/CMakeFiles/KExiv2.dir/build
make[2]: Entering directory '/usr/src/RPM/BUILD/libkexiv2-23.08.5/BUILD'
make[2]: Nothing to be done for 'src/CMakeFiles/KExiv2.dir/build'.
make[2]: Leaving directory '/usr/src/RPM/BUILD/libkexiv2-23.08.5/BUILD'
[100%] Built target KExiv2
make[1]: Leaving directory '/usr/src/RPM/BUILD/libkexiv2-23.08.5/BUILD'
/usr/bin/cmake -E cmake_progress_start /usr/src/RPM/BUILD/libkexiv2-23.08.5/BUILD/CMakeFiles 0
make  -f CMakeFiles/Makefile2 preinstall
make[1]: Entering directory '/usr/src/RPM/BUILD/libkexiv2-23.08.5/BUILD'
make[1]: Nothing to be done for 'preinstall'.
make[1]: Leaving directory '/usr/src/RPM/BUILD/libkexiv2-23.08.5/BUILD'
Install the project...
/usr/bin/cmake -P cmake_install.cmake
-- Install configuration: "Release"
-- Installing: /usr/src/tmp/kde5-libkexiv2-buildroot/usr/lib/libKF5KExiv2.so.5.0.0
-- Installing: /usr/src/tmp/kde5-libkexiv2-buildroot/usr/lib/libKF5KExiv2.so.15.0.0
-- Installing: /usr/src/tmp/kde5-libkexiv2-buildroot/usr/lib/libKF5KExiv2.so
-- Installing: /usr/src/tmp/kde5-libkexiv2-buildroot/usr/include/KF5/KExiv2/KExiv2/KExiv2Data
-- Installing: /usr/src/tmp/kde5-libkexiv2-buildroot/usr/include/KF5/KExiv2/KExiv2/KExiv2
-- Installing: /usr/src/tmp/kde5-libkexiv2-buildroot/usr/include/KF5/KExiv2/KExiv2/KExiv2Previews
-- Installing: /usr/src/tmp/kde5-libkexiv2-buildroot/usr/include/KF5/KExiv2/KExiv2/RotationMatrix
-- Installing: /usr/src/tmp/kde5-libkexiv2-buildroot/usr/include/KF5/KExiv2/kexiv2/kexiv2data.h
-- Installing: /usr/src/tmp/kde5-libkexiv2-buildroot/usr/include/KF5/KExiv2/kexiv2/kexiv2.h
-- Installing: /usr/src/tmp/kde5-libkexiv2-buildroot/usr/include/KF5/KExiv2/kexiv2/kexiv2previews.h
-- Installing: /usr/src/tmp/kde5-libkexiv2-buildroot/usr/include/KF5/KExiv2/kexiv2/rotationmatrix.h
-- Installing: /usr/src/tmp/kde5-libkexiv2-buildroot/usr/include/KF5/KExiv2/kexiv2/libkexiv2_export.h
-- Installing: /usr/src/tmp/kde5-libkexiv2-buildroot/usr/include/KF5/KExiv2/libkexiv2_version.h
-- Installing: /usr/src/tmp/kde5-libkexiv2-buildroot/usr/share/qlogging-categories5/libkexiv2.categories
-- Installing: /usr/src/tmp/kde5-libkexiv2-buildroot/usr/lib/cmake/KF5KExiv2/KF5KExiv2Config.cmake
-- Installing: /usr/src/tmp/kde5-libkexiv2-buildroot/usr/lib/cmake/KF5KExiv2/KF5KExiv2ConfigVersion.cmake
-- Installing: /usr/src/tmp/kde5-libkexiv2-buildroot/usr/lib/cmake/KF5KExiv2/KF5KExiv2Targets.cmake
-- Installing: /usr/src/tmp/kde5-libkexiv2-buildroot/usr/lib/cmake/KF5KExiv2/KF5KExiv2Targets-release.cmake
make: Leaving directory '/usr/src/RPM/BUILD/libkexiv2-23.08.5/BUILD'
+ '[' -d /usr/src/tmp/kde5-libkexiv2-buildroot//usr/share ']'
+ ls -1d '/usr/src/tmp/kde5-libkexiv2-buildroot//usr/share/kf5/k*5'
+ read d
ls: cannot access '/usr/src/tmp/kde5-libkexiv2-buildroot//usr/share/kf5/k*5': No such file or directory
+ '[' -d /usr/src/tmp/kde5-libkexiv2-buildroot//usr/share/kf5/lib64 ']'
+ '[' -d /usr/src/tmp/kde5-libkexiv2-buildroot//usr/share/kf5/lib ']'
+ '[' /usr/lib/kf5/devel '!=' /usr/lib ']'
+ ls -1 /usr/src/tmp/kde5-libkexiv2-buildroot//usr/lib/libKF5KExiv2.so
+ read p
+ '[' -L /usr/src/tmp/kde5-libkexiv2-buildroot//usr/lib/libKF5KExiv2.so ']'
+ mkdir -p /usr/src/tmp/kde5-libkexiv2-buildroot//usr/lib/kf5/devel
++ readlink /usr/src/tmp/kde5-libkexiv2-buildroot//usr/lib/libKF5KExiv2.so
+ f=libKF5KExiv2.so.15.0.0
++ basename /usr/src/tmp/kde5-libkexiv2-buildroot//usr/lib/libKF5KExiv2.so
+ l=libKF5KExiv2.so
++ relative /usr/src/tmp/kde5-libkexiv2-buildroot//usr/lib/libKF5KExiv2.so.15.0.0 /usr/src/tmp/kde5-libkexiv2-buildroot//usr/lib/kf5/devel/libKF5KExiv2.so.15.0.0
+ ln -sf ../../libKF5KExiv2.so.15.0.0 /usr/src/tmp/kde5-libkexiv2-buildroot//usr/lib/kf5/devel/libKF5KExiv2.so
+ rm -f /usr/src/tmp/kde5-libkexiv2-buildroot//usr/lib/libKF5KExiv2.so
+ read p
+ '[' -d /usr/src/tmp/kde5-libkexiv2-buildroot//usr/share/kf5/bin ']'
+ '[' -d /usr/src/tmp/kde5-libkexiv2-buildroot//usr/share/kf5/include ']'
+ '[' -d /usr/src/tmp/kde5-libkexiv2-buildroot//usr/lib/kf5/bin -a true == true ']'
+ '[' -d /usr/src/tmp/kde5-libkexiv2-buildroot//usr/share/akonadi ']'
+ '[' -d /usr/src/tmp/kde5-libkexiv2-buildroot//usr/share/kf5/akonadi ']'
+ '[' -d /usr/src/tmp/kde5-libkexiv2-buildroot//usr/share/man -a remove == remove ']'
+ '[' -d /usr/src/tmp/kde5-libkexiv2-buildroot//usr/share/appdata -a keep == remove ']'
+ '[' -d /usr/src/tmp/kde5-libkexiv2-buildroot//usr/share/metainfo -a keep == remove ']'
+ '[' -d /usr/src/tmp/kde5-libkexiv2-buildroot//usr/lib/cmake/ ']'
+ find /usr/src/tmp/kde5-libkexiv2-buildroot//usr/lib/cmake/ -type f -name '*.cmake'
+ read f
+ sed -i -e 's|\(set(.*\)${PACKAGE_PREFIX_DIR}//usr/|\1${PACKAGE_PREFIX_DIR}/|' /usr/src/tmp/kde5-libkexiv2-buildroot//usr/lib/cmake/KF5KExiv2/KF5KExiv2Targets-release.cmake
+ sed -i -e 's|/usr//usr/|/usr/|' /usr/src/tmp/kde5-libkexiv2-buildroot//usr/lib/cmake/KF5KExiv2/KF5KExiv2Targets-release.cmake
+ read f
+ sed -i -e 's|\(set(.*\)${PACKAGE_PREFIX_DIR}//usr/|\1${PACKAGE_PREFIX_DIR}/|' /usr/src/tmp/kde5-libkexiv2-buildroot//usr/lib/cmake/KF5KExiv2/KF5KExiv2Targets.cmake
+ sed -i -e 's|/usr//usr/|/usr/|' /usr/src/tmp/kde5-libkexiv2-buildroot//usr/lib/cmake/KF5KExiv2/KF5KExiv2Targets.cmake
+ read f
+ sed -i -e 's|\(set(.*\)${PACKAGE_PREFIX_DIR}//usr/|\1${PACKAGE_PREFIX_DIR}/|' /usr/src/tmp/kde5-libkexiv2-buildroot//usr/lib/cmake/KF5KExiv2/KF5KExiv2ConfigVersion.cmake
+ sed -i -e 's|/usr//usr/|/usr/|' /usr/src/tmp/kde5-libkexiv2-buildroot//usr/lib/cmake/KF5KExiv2/KF5KExiv2ConfigVersion.cmake
+ read f
+ sed -i -e 's|\(set(.*\)${PACKAGE_PREFIX_DIR}//usr/|\1${PACKAGE_PREFIX_DIR}/|' /usr/src/tmp/kde5-libkexiv2-buildroot//usr/lib/cmake/KF5KExiv2/KF5KExiv2Config.cmake
+ sed -i -e 's|/usr//usr/|/usr/|' /usr/src/tmp/kde5-libkexiv2-buildroot//usr/lib/cmake/KF5KExiv2/KF5KExiv2Config.cmake
+ read f
+ /usr/lib/rpm/find-lang kde5-libkexiv2 --with-kde --all-name
+ /usr/lib/rpm/brp-alt
Cleaning files in /usr/src/tmp/kde5-libkexiv2-buildroot (auto)
mode of './usr/lib/libKF5KExiv2.so.5.0.0' changed from 0755 (rwxr-xr-x) to 0644 (rw-r--r--)
Verifying and fixing files in /usr/src/tmp/kde5-libkexiv2-buildroot (binconfig,pkgconfig,libtool,desktop,gnuconfig)
Checking contents of files in /usr/src/tmp/kde5-libkexiv2-buildroot/ (default)
Compressing files in /usr/src/tmp/kde5-libkexiv2-buildroot (auto)
Adjusting library links in /usr/src/tmp/kde5-libkexiv2-buildroot
./usr/lib: (from <cmdline>:0)
	libKF5KExiv2.so.15.0.0 -> libKF5KExiv2.so.5.0.0
Verifying ELF objects in /usr/src/tmp/kde5-libkexiv2-buildroot (arch=normal,fhs=normal,lfs=relaxed,lint=relaxed,rpath=normal,stack=normal,textrel=normal,unresolved=normal)
Processing files: kde5-libkexiv2-common-23.08.5-alt1
Executing(%doc): /bin/sh -e /usr/src/tmp/rpm-tmp.92319
+ umask 022
+ /bin/mkdir -p /usr/src/RPM/BUILD
+ cd /usr/src/RPM/BUILD
+ cd libkexiv2-23.08.5
+ DOCDIR=/usr/src/tmp/kde5-libkexiv2-buildroot/usr/share/doc/kde5-libkexiv2-common-23.08.5
+ export DOCDIR
+ rm -rf /usr/src/tmp/kde5-libkexiv2-buildroot/usr/share/doc/kde5-libkexiv2-common-23.08.5
+ /bin/mkdir -p /usr/src/tmp/kde5-libkexiv2-buildroot/usr/share/doc/kde5-libkexiv2-common-23.08.5
+ cp -prL LICENSES/BSD-3-Clause.txt LICENSES/GPL-2.0-or-later.txt /usr/src/tmp/kde5-libkexiv2-buildroot/usr/share/doc/kde5-libkexiv2-common-23.08.5
+ chmod -R go-w /usr/src/tmp/kde5-libkexiv2-buildroot/usr/share/doc/kde5-libkexiv2-common-23.08.5
+ chmod -R a+rX /usr/src/tmp/kde5-libkexiv2-buildroot/usr/share/doc/kde5-libkexiv2-common-23.08.5
+ exit 0
Finding Provides (using /usr/lib/rpm/find-provides)
Executing: /bin/sh -e /usr/src/tmp/rpm-tmp.BJsqH6
find-provides: running scripts (alternatives,debuginfo,lib,pam,perl,pkgconfig,python,python3,qml,shell)
Finding Requires (using /usr/lib/rpm/find-requires)
Executing: /bin/sh -e /usr/src/tmp/rpm-tmp.xKKn9m
find-requires: running scripts (cpp,debuginfo,files,lib,pam,perl,pkgconfig,pkgconfiglib,python,python3,qml,rpmlib,shebang,shell,static,symlinks,systemd-services)
Requires: kf5-filesystem
Processing files: kde5-libkexiv2-devel-23.08.5-alt1
Finding Provides (using /usr/lib/rpm/find-provides)
Executing: /bin/sh -e /usr/src/tmp/rpm-tmp.sgNPyd
find-provides: running scripts (alternatives,debuginfo,lib,pam,perl,pkgconfig,python,python3,qml,shell)
Finding Requires (using /usr/lib/rpm/find-requires)
Executing: /bin/sh -e /usr/src/tmp/rpm-tmp.5xwHXP
find-requires: running scripts (cpp,debuginfo,files,lib,pam,perl,pkgconfig,pkgconfiglib,python,python3,qml,rpmlib,shebang,shell,static,symlinks,systemd-services)
/usr/src/tmp/kde5-libkexiv2-buildroot/usr/include/KF5/KExiv2/kexiv2/kexiv2.h:13:10: fatal error: memory: No such file or directory
   13 | #include <memory>
      |          ^~~~~~~~
compilation terminated.
cpp.req: /usr/src/tmp/kde5-libkexiv2-buildroot/usr/include/KF5/KExiv2/kexiv2/kexiv2.h: cpp failed, trying c++ mode
/usr/src/tmp/kde5-libkexiv2-buildroot/usr/include/KF5/KExiv2/kexiv2/kexiv2.h:17:10: fatal error: QByteArray: No such file or directory
   17 | #include <QByteArray>
      |          ^~~~~~~~~~~~
compilation terminated.
cpp.req: WARNING: /usr/src/tmp/kde5-libkexiv2-buildroot/usr/include/KF5/KExiv2/kexiv2/kexiv2.h: cpp failed
/usr/src/tmp/kde5-libkexiv2-buildroot/usr/include/KF5/KExiv2/kexiv2/kexiv2data.h:13:10: fatal error: QSharedDataPointer: No such file or directory
   13 | #include <QSharedDataPointer>
      |          ^~~~~~~~~~~~~~~~~~~~
compilation terminated.
cpp.req: /usr/src/tmp/kde5-libkexiv2-buildroot/usr/include/KF5/KExiv2/kexiv2/kexiv2data.h: cpp failed, trying c++ mode
/usr/src/tmp/kde5-libkexiv2-buildroot/usr/include/KF5/KExiv2/kexiv2/kexiv2data.h:13:10: fatal error: QSharedDataPointer: No such file or directory
   13 | #include <QSharedDataPointer>
      |          ^~~~~~~~~~~~~~~~~~~~
compilation terminated.
cpp.req: WARNING: /usr/src/tmp/kde5-libkexiv2-buildroot/usr/include/KF5/KExiv2/kexiv2/kexiv2data.h: cpp failed
/usr/src/tmp/kde5-libkexiv2-buildroot/usr/include/KF5/KExiv2/kexiv2/kexiv2previews.h:13:10: fatal error: memory: No such file or directory
   13 | #include <memory>
      |          ^~~~~~~~
compilation terminated.
cpp.req: /usr/src/tmp/kde5-libkexiv2-buildroot/usr/include/KF5/KExiv2/kexiv2/kexiv2previews.h: cpp failed, trying c++ mode
/usr/src/tmp/kde5-libkexiv2-buildroot/usr/include/KF5/KExiv2/kexiv2/kexiv2previews.h:17:10: fatal error: QByteArray: No such file or directory
   17 | #include <QByteArray>
      |          ^~~~~~~~~~~~
compilation terminated.
cpp.req: WARNING: /usr/src/tmp/kde5-libkexiv2-buildroot/usr/include/KF5/KExiv2/kexiv2/kexiv2previews.h: cpp failed
In file included from /usr/src/tmp/kde5-libkexiv2-buildroot/usr/include/KF5/KExiv2/kexiv2/rotationmatrix.h:14:
/usr/src/tmp/kde5-libkexiv2-buildroot/usr/include/KF5/KExiv2/kexiv2/kexiv2.h:13:10: fatal error: memory: No such file or directory
   13 | #include <memory>
      |          ^~~~~~~~
compilation terminated.
cpp.req: /usr/src/tmp/kde5-libkexiv2-buildroot/usr/include/KF5/KExiv2/kexiv2/rotationmatrix.h: cpp failed, trying c++ mode
In file included from /usr/src/tmp/kde5-libkexiv2-buildroot/usr/include/KF5/KExiv2/kexiv2/rotationmatrix.h:14:
/usr/src/tmp/kde5-libkexiv2-buildroot/usr/include/KF5/KExiv2/kexiv2/kexiv2.h:17:10: fatal error: QByteArray: No such file or directory
   17 | #include <QByteArray>
      |          ^~~~~~~~~~~~
compilation terminated.
cpp.req: WARNING: /usr/src/tmp/kde5-libkexiv2-buildroot/usr/include/KF5/KExiv2/kexiv2/rotationmatrix.h: cpp failed
Requires: /usr/lib/libKF5KExiv2.so.15.0.0
Finding debuginfo files (using /usr/lib/rpm/find-debuginfo-files)
Executing: /bin/sh -e /usr/src/tmp/rpm-tmp.xThHsm
Processing files: libkf5exiv2-23.08.5-alt1
Finding Provides (using /usr/lib/rpm/find-provides)
Executing: /bin/sh -e /usr/src/tmp/rpm-tmp.KL8IMT
find-provides: running scripts (alternatives,debuginfo,lib,pam,perl,pkgconfig,python,python3,qml,shell)
lib.prov: /usr/src/tmp/kde5-libkexiv2-buildroot/usr/lib/libKF5KExiv2.so.15.0.0: 218 symbols, 18 bpp
Finding Requires (using /usr/lib/rpm/find-requires)
Executing: /bin/sh -e /usr/src/tmp/rpm-tmp.1wCpEJ
find-requires: running scripts (cpp,debuginfo,files,lib,pam,perl,pkgconfig,pkgconfiglib,python,python3,qml,rpmlib,shebang,shell,static,symlinks,systemd-services)
Provides: libKF5KExiv2.so.15.0.0 = set:ld6l18bCVSwFUFbnks2Z1zyTQK25QQbrbh22JTqVdrOGwpGMpHFXIi9xz5tZ9ZsBQ1KP0ljGhOl2TZ98cQmqDv1ZKYPn3yrL45frKqjwxF5DOmgt0KhAwOGh6CqMD6fi89PRcPcunRoPdQk3jdzMhoyFIpeAhXu60B3mSREMsu9pRa3Bavhysu2yy7DXoJSvcJCQbQLxazIGtnxSgQZaZw5qZ2Z0OFgQk07UPQVKylZEMZtsNDfJa1m4VLiZIXOrVG77FWYXie3OspQuSobHBA5twFSoEyxRIcPEa1AfoyYDAHCZBqRj6Pel57z1iBe742f6p1zQ7RL0VQdPikGw5xWldgrshEN0gIH2l3L4IjY1ZDIneq42GoPLp1bmZFK9KIlzkQejQRMEtIs4lTkSdOo5JBHHFMXuCxg88GlG70I5LKde3f
Requires: kde5-libkexiv2-common = 23.08.5-alt1, libQt5Core.so.5 >= set:qjyOrQrJeL3A78HihBgxchPZzdtp061abTWjlka8ZnxwkPX7P0I3ruo8fKTzl79LeUrfgtUZ60T7MqpqQnZtafEWbLNNZFNtadDhgZ7mm9V79ucZzixNtB3JZ4oUUnyvqC8l7FwYS8wWVbx0N0fJoTpJHq6CZ6G9guGDO5Q9wwiZiRFy8Lwp1PVEaFwsoXY9KMAYZ41is7JAbob9u9HcIL4xSWEuZxt6mwBxxPvV1oKIhYrvxBbkCrt3FGIKZr8G99KIJWzxx8dXGmcYHcZpPO9muCipWMCVWCng0jWB9UPP0ZFGTilF3BnpL2FCc6jdz6pnI8NZlM4ReJZBGXMeJnYrE5983dsMLaMB8ZdHnFdTjkJo71, libQt5Core.so.5(Qt_5), libQt5Core.so.5(Qt_5.15), libQt5Gui.so.5 >= set:rnsSjx9Ke4ggCSqQZ1XgqfdRTUkSYDtbGFp0E4ZsIEtZI9Ko43XrEjXGD0, libQt5Gui.so.5(Qt_5), libc.so.6(GLIBC_2.0), libc.so.6(GLIBC_2.1.3), libc.so.6(GLIBC_2.3.4), libc.so.6(GLIBC_2.33), libc.so.6(GLIBC_2.4), libexiv2.so.28 >= set:oh1OCvyiDaSLolkZ4dcUALZ4JDbLVklYCziekpzOCZIwWcGMJoZsoYcFkO3QgZylCMkqxHsQfO9DehENzlHaXPF2d1nErOXuJWEf6ZFE0FoakCOZuGyHHOuA5Hj8YM74899HHEEuMWPSHorCr0NUZcRXZtGlh81GABdr7MLzOLjfNq5WmkRzwOdwRfFHCQlr3GPt1GPFZ9mo1yukZ8ZhuKjyAZCZhSGTjzi8iBc2ecfuTN5ZtSZyd9xkHekvsp6VMP7yVyaoxdZDKT2bWq0CnX8Uh3U9OqmEUJxm3RgURKaTEZyO6eNlfNS7bqX8CwyR3, libgcc_s.so.1(GCC_3.0), libgcc_s.so.1(GCC_3.3.1), libm.so.6(GLIBC_2.0), libm.so.6(GLIBC_2.1), libm.so.6(GLIBC_2.29), libstdc++.so.6(CXXABI_1.3), libstdc++.so.6(CXXABI_1.3.9), libstdc++.so.6(GLIBCXX_3.4), libstdc++.so.6(GLIBCXX_3.4.15), libstdc++.so.6(GLIBCXX_3.4.20), libstdc++.so.6(GLIBCXX_3.4.21), libstdc++.so.6(GLIBCXX_3.4.26), libstdc++.so.6(GLIBCXX_3.4.29), libstdc++.so.6(GLIBCXX_3.4.32), libstdc++.so.6(GLIBCXX_3.4.9), rtld(GNU_HASH)
Requires(rpmlib): rpmlib(SetVersions)
Finding debuginfo files (using /usr/lib/rpm/find-debuginfo-files)
Executing: /bin/sh -e /usr/src/tmp/rpm-tmp.cz9SY1
Creating libkf5exiv2-debuginfo package
Processing files: libkf5exiv2-debuginfo-23.08.5-alt1
Finding Provides (using /usr/lib/rpm/find-provides)
Executing: /bin/sh -e /usr/src/tmp/rpm-tmp.hstbAU
find-provides: running scripts (debuginfo)
Finding Requires (using /usr/lib/rpm/find-requires)
Executing: /bin/sh -e /usr/src/tmp/rpm-tmp.tTDhDA
find-requires: running scripts (debuginfo)
Provides: debug(libKF5KExiv2.so.15.0.0)
Requires: libkf5exiv2 = 23.08.5-alt1, debug(libQt5Core.so.5), debug(libQt5Gui.so.5), debug(libc.so.6), debug(libexiv2.so.28), debug(libgcc_s.so.1), debug(libm.so.6), debug(libstdc++.so.6)
Adding to libkf5exiv2 a strict dependency on kde5-libkexiv2-common
Adding to libkf5exiv2-debuginfo a strict dependency on libkf5exiv2
Adding to kde5-libkexiv2-devel a strict dependency on libkf5exiv2
Removing 1 extra deps from kde5-libkexiv2-devel due to dependency on libkf5exiv2
Wrote: /usr/src/RPM/RPMS/noarch/kde5-libkexiv2-common-23.08.5-alt1.noarch.rpm (w2.lzdio)
Wrote: /usr/src/RPM/RPMS/i586/kde5-libkexiv2-devel-23.08.5-alt1.i586.rpm (w2.lzdio)
Wrote: /usr/src/RPM/RPMS/i586/libkf5exiv2-23.08.5-alt1.i586.rpm (w2.lzdio)
Wrote: /usr/src/RPM/RPMS/i586/libkf5exiv2-debuginfo-23.08.5-alt1.i586.rpm (w2.lzdio)
31.71user 6.23system 0:17.64elapsed 215%CPU (0avgtext+0avgdata 199040maxresident)k
0inputs+0outputs (0major+1501753minor)pagefaults 0swaps
/.out/kde5-libkexiv2-common-23.08.5-alt1.noarch.rpm: bad symbols in the license tag: /
/.out/kde5-libkexiv2-devel-23.08.5-alt1.i586.rpm: bad symbols in the license tag: /
/.out/libkf5exiv2-23.08.5-alt1.i586.rpm: bad symbols in the license tag: /
/.out/libkf5exiv2-debuginfo-23.08.5-alt1.i586.rpm: bad symbols in the license tag: /
3.98user 1.70system 0:35.51elapsed 16%CPU (0avgtext+0avgdata 125264maxresident)k
0inputs+0outputs (0major+354250minor)pagefaults 0swaps