86>Nov 25 06:19:50 userdel[3900718]: delete user 'rooter'
<86>Nov 25 06:19:50 userdel[3900718]: removed group 'rooter' owned by 'rooter'
<86>Nov 25 06:19:50 userdel[3900718]: removed shadow group 'rooter' owned by 'rooter'
<86>Nov 25 06:19:50 groupadd[3900769]: group added to /etc/group: name=rooter, GID=1850
<86>Nov 25 06:19:50 groupadd[3900769]: group added to /etc/gshadow: name=rooter
<86>Nov 25 06:19:50 groupadd[3900769]: new group: name=rooter, GID=1850
<86>Nov 25 06:19:50 useradd[3900830]: new user: name=rooter, UID=1850, GID=1850, home=/root, shell=/bin/bash, from=none
<86>Nov 25 06:19:50 userdel[3900900]: delete user 'builder'
<86>Nov 25 06:19:50 userdel[3900900]: removed group 'builder' owned by 'builder'
<86>Nov 25 06:19:50 userdel[3900900]: removed shadow group 'builder' owned by 'builder'
<86>Nov 25 06:19:50 groupadd[3900950]: group added to /etc/group: name=builder, GID=1851
<86>Nov 25 06:19:50 groupadd[3900950]: group added to /etc/gshadow: name=builder
<86>Nov 25 06:19:50 groupadd[3900950]: new group: name=builder, GID=1851
<86>Nov 25 06:19:50 useradd[3901016]: new user: name=builder, UID=1851, GID=1851, home=/usr/src, shell=/bin/bash, from=none
/usr/src/in/srpm/kf5-kidletime-5.112.0-alt1.src.rpm: bad symbols in the license tag: /
<13>Nov 25 06:19:53 rpmi: libxkbcommon-1.6.0-alt1 sisyphus+331300.100.1.1 1696855236 installed
<13>Nov 25 06:19:53 rpmi: libexpat-2.5.0-alt1 sisyphus+309227.100.1.1 1667075766 installed
<13>Nov 25 06:19:53 rpmi: libidn2-2.3.4-alt1 sisyphus+309023.100.1.1 1666791089 installed
<13>Nov 25 06:19:53 rpmi: libnettle8-3.9.1-alt1 sisyphus+322548.100.1.2 1686176897 installed
<13>Nov 25 06:19:53 rpmi: libts0-1.22-alt3 sisyphus+278442.100.1.2 1626216683 installed
<13>Nov 25 06:19:53 rpmi: qt5-base-common-5.15.10-alt2 sisyphus+334496.300.1.1 1700136672 installed
<13>Nov 25 06:19:53 rpmi: qt5-declarative-common-5.15.10-alt1 sisyphus+324640.200.3.2 1689201548 installed
<13>Nov 25 06:19:53 rpmi: libmtdev-1.1.6-alt1 sisyphus+278361.100.1.1 1626091636 installed
<13>Nov 25 06:19:53 rpmi: libpng16-1.6.40-alt1 sisyphus+323732.100.1.1 1687771859 installed
<13>Nov 25 06:19:53 rpmi: libICE-1.1.1-alt1 sisyphus+311428.500.1.1 1670577559 installed
<13>Nov 25 06:19:53 rpmi: libglvnd-7:1.7.0-alt1 sisyphus+330949.100.1.1 1696424894 installed
<13>Nov 25 06:19:53 rpmi: libwayland-server-1.22.0-alt1.1 sisyphus+318010.100.1.1 1680606300 installed
<13>Nov 25 06:19:53 rpmi: libp11-kit-1:0.25.3-alt1 sisyphus+334477.100.1.1 1700063204 installed
<13>Nov 25 06:19:53 rpmi: libtasn1-4.19.0-alt3 sisyphus+327816.100.1.1 1692802618 installed
<13>Nov 25 06:19:53 rpmi: libSM-1.2.4-alt1 sisyphus+312057.200.1.1 1671526918 installed
<13>Nov 25 06:19:53 rpmi: libhogweed6-3.9.1-alt1 sisyphus+322548.100.1.2 1686176897 installed
<13>Nov 25 06:19:53 rpmi: libgnutls30-3.8.2-alt1 sisyphus+334989.100.1.1 1700758156 installed
<13>Nov 25 06:19:53 rpmi: libngtcp2.16-1.0.1-alt1 sisyphus+332583.200.2.1 1698669156 installed
<13>Nov 25 06:19:53 rpmi: libngtcp2_crypto_gnutls8-1.0.1-alt1 sisyphus+332583.200.2.1 1698669156 installed
<13>Nov 25 06:19:53 rpmi: rpm-macros-qt5-5.15.10-alt2 sisyphus+334496.300.1.1 1700136375 installed
<13>Nov 25 06:19:53 rpmi: rpm-build-xdg-0.2-alt1 1250461503 installed
<13>Nov 25 06:19:53 rpmi: libsqlite3-3.42.0-alt1 sisyphus+321513.100.1.1 1684603061 installed
<13>Nov 25 06:19:53 rpmi: libjpeg-2:2.1.5.1-alt2 sisyphus+334304.100.1.1 1699893684 installed
<13>Nov 25 06:19:53 rpmi: libwacom-data-2.8.0-alt1 sisyphus+328366.100.1.1 1693467821 installed
<13>Nov 25 06:19:53 rpmi: libmpdec3-2.5.1-alt3 sisyphus+314490.500.5.1 1675432033 installed
<13>Nov 25 06:19:54 rpmi: libicu74-1:7.4.1-alt1 sisyphus+334471.100.2.1 1700075688 installed
<13>Nov 25 06:19:54 rpmi: libgudev-1:238-alt1 sisyphus+324364.100.1.1 1688646145 installed
<13>Nov 25 06:19:54 rpmi: desktop-file-utils-0.26-alt6 sisyphus+331944.100.1.3 1697550035 installed
<13>Nov 25 06:19:54 rpmi: shared-mime-info-2.4-alt1 sisyphus+334259.100.1.1 1699787317 installed
<13>Nov 25 06:19:54 rpmi: libgdbm-1.8.3-alt10 sisyphus+278100.1600.1.1 1626059138 installed
<13>Nov 25 06:19:54 rpmi: libgraphite2-1.3.14-alt2.1 sisyphus+279571.100.1.2 1626605157 installed
<13>Nov 25 06:19:54 rpmi: libevdev-1.13.1-alt1 sisyphus+319955.100.1.1 1683290015 installed
<13>Nov 25 06:19:54 rpmi: libduktape-2.6.0-alt2 sisyphus+322268.100.1.1 1685614483 installed
<13>Nov 25 06:19:54 rpmi: libdouble-conversion3-3.3.0-alt1 sisyphus+333410.100.1.1 1698928792 installed
<13>Nov 25 06:19:54 rpmi: libqt5-core-5.15.10-alt2 sisyphus+334496.300.1.1 1700136672 installed
<13>Nov 25 06:19:54 rpmi: libqt5-sql-5.15.10-alt2 sisyphus+334496.300.1.1 1700136672 installed
<13>Nov 25 06:19:54 rpmi: liblz4-1:1.9.4-alt1 sisyphus+309416.100.1.1 1667413000 installed
<13>Nov 25 06:19:54 rpmi: libsystemd-1:254.5-alt1.2 sisyphus+331053.100.1.1 1696514800 installed
<13>Nov 25 06:19:54 rpmi: libdbus-1.14.10-alt1 sisyphus+328676.100.1.1 1693833782 installed
<13>Nov 25 06:19:54 rpmi: libqt5-dbus-5.15.10-alt2 sisyphus+334496.300.1.1 1700136672 installed
<13>Nov 25 06:19:54 rpmi: publicsuffix-list-dafsa-20231026-alt1 sisyphus+332908.100.1.1 1698419299 installed
<13>Nov 25 06:19:54 rpmi: libpsl-0.21.2-alt1 sisyphus+312536.100.1.1 1672131180 installed
<13>Nov 25 06:19:54 rpmi: libnghttp3.9-1.0.0-alt1 sisyphus+332583.100.2.1 1698669105 installed
<13>Nov 25 06:19:54 rpmi: libnghttp2-1.57.0-alt1 sisyphus+331457.200.2.1 1697011708 installed
<13>Nov 25 06:19:54 rpmi: openldap-common-2.6.6-alt1 sisyphus+330946.100.2.1 1696432854 installed
<13>Nov 25 06:19:54 rpmi: libntlm-1.5-alt1 sisyphus+278100.3300.1.1 1626059663 installed
<13>Nov 25 06:19:54 rpmi: libidn-1.37-alt2 sisyphus+300849.100.1.1 1653769693 installed
<13>Nov 25 06:19:54 rpmi: libverto-0.3.2-alt1_1 sisyphus+321176.2200.10.2 1684806164 installed
<13>Nov 25 06:19:54 rpmi: liblmdb-0.9.31-alt1 sisyphus+330946.40.2.1 1696431544 installed
<13>Nov 25 06:19:54 rpmi: libkeyutils-1.6.3-alt1 sisyphus+266061.100.1.1 1612919567 installed
<13>Nov 25 06:19:54 rpmi: libcom_err-1.46.4.0.5.4cda-alt1 sisyphus+283826.100.1.1 1629975361 installed
<13>Nov 25 06:19:54 rpmi: libbrotlicommon-1.1.0-alt1 sisyphus+328501.100.1.1 1693598420 installed
<13>Nov 25 06:19:54 rpmi: libbrotlidec-1.1.0-alt1 sisyphus+328501.100.1.1 1693598420 installed
<13>Nov 25 06:19:54 rpmi: libharfbuzz-8.3.0-alt1 sisyphus+334471.200.2.1 1700075833 installed
<13>Nov 25 06:19:54 rpmi: libfreetype-2.13.2-alt1 sisyphus+328677.100.1.1 1693834346 installed
<13>Nov 25 06:19:54 rpmi: libfontconfig1-2.14.2-alt8 sisyphus+328444.100.1.1 1693553407 installed
<13>Nov 25 06:19:54 rpmi: libb2-0.98.1-alt1_1 sisyphus+291614.100.1.1 1638962878 installed
<13>Nov 25 06:19:54 rpmi: libSDL2-2.28.5-alt1 sisyphus+333852.100.1.1 1699387407 installed
<13>Nov 25 06:19:54 rpmi: tslib-1.22-alt3 sisyphus+278442.100.1.2 1626216683 installed
<13>Nov 25 06:19:54 rpmi: libxshmfence-1.3.2-alt1 sisyphus+311428.400.1.1 1670577529 installed
<13>Nov 25 06:19:54 rpmi: libX11-locales-3:1.8.7-alt1 sisyphus+330921.200.1.1 1696400315 installed
<13>Nov 25 06:19:54 rpmi: libXdmcp-1.1.4-alt1 sisyphus+311188.1000.1.1 1670233860 installed
<13>Nov 25 06:19:54 rpmi: libXau-1.0.11-alt1 sisyphus+311428.100.1.1 1670577440 installed
<13>Nov 25 06:19:54 rpmi: libxcb-1.16-alt1 sisyphus+327325.200.1.1 1692276267 installed
<13>Nov 25 06:19:54 rpmi: libX11-3:1.8.7-alt1 sisyphus+330921.200.1.1 1696400319 installed
<13>Nov 25 06:19:54 rpmi: libXext-1.3.5-alt1 sisyphus+309285.100.1.1 1667212413 installed
<13>Nov 25 06:19:54 rpmi: libXxf86vm-1.1.5-alt1 sisyphus+308663.1400.1.1 1666168534 installed
<13>Nov 25 06:19:54 rpmi: libXfixes-6.0.1-alt1 sisyphus+331490.300.1.1 1697023235 installed
<13>Nov 25 06:19:54 rpmi: libXrender-0.9.11-alt1 sisyphus+308841.100.1.1 1666436131 installed
<13>Nov 25 06:19:54 rpmi: libxcbutil-icccm-0.4.1-alt2 sisyphus+278275.100.1.2 1626148617 installed
<13>Nov 25 06:19:54 rpmi: libxcbutil-1:0.4.1-alt1 sisyphus+312057.100.1.1 1671526889 installed
<13>Nov 25 06:19:54 rpmi: libxcbutil-image-0.4.0-alt1 sisyphus+275413.100.1.3 1624505806 installed
<13>Nov 25 06:19:54 rpmi: libxcbutil-keysyms-0.4.0-alt1 sisyphus+278187.100.1.1 1626075950 installed
<13>Nov 25 06:19:54 rpmi: libxcb-render-util-0.3.9-alt3 sisyphus+276916.100.1.2 1625275237 installed
<13>Nov 25 06:19:54 rpmi: libxkbcommon-x11-1.6.0-alt1 sisyphus+331300.100.1.1 1696855236 installed
<13>Nov 25 06:19:54 rpmi: libwayland-client-1.22.0-alt1.1 sisyphus+318010.100.1.1 1680606300 installed
<13>Nov 25 06:19:54 rpmi: libpciaccess-1:0.17-alt1 sisyphus+308663.300.1.1 1666168262 installed
<13>Nov 25 06:19:54 rpmi: libdrm-1:2.4.117-alt1 sisyphus+332488.100.1.1 1698045111 installed
<13>Nov 25 06:19:54 rpmi: libGLX-mesa-4:23.2.1-alt1 sisyphus+333899.400.5.2 1699481833 installed
<13>Nov 25 06:19:54 rpmi: libgbm-4:23.2.1-alt1 sisyphus+333899.400.5.2 1699481833 installed
<13>Nov 25 06:19:54 rpmi: libEGL-mesa-4:23.2.1-alt1 sisyphus+333899.400.5.2 1699481833 installed
<13>Nov 25 06:19:54 rpmi: libEGL-7:1.7.0-alt1 sisyphus+330949.100.1.1 1696424894 installed
<13>Nov 25 06:19:54 rpmi: libGLX-7:1.7.0-alt1 sisyphus+330949.100.1.1 1696424894 installed
<13>Nov 25 06:19:54 rpmi: libGL-7:1.7.0-alt1 sisyphus+330949.100.1.1 1696424894 installed
<13>Nov 25 06:19:54 rpmi: gsettings-desktop-schemas-data-45.0-alt1 sisyphus+325066.400.6.2 1695203930 installed
<13>Nov 25 06:19:54 rpmi: libgio-2.78.1-alt1 sisyphus+332710.100.1.2 1698249935 installed
<13>Nov 25 06:19:54 rpmi: gsettings-desktop-schemas-45.0-alt1 sisyphus+325066.400.6.2 1695203930 installed
<13>Nov 25 06:19:54 rpmi: libdevmapper-1.02.196-alt1 sisyphus+328928.400.3.1 1694103939 installed
<13>Nov 25 06:19:54 rpmi: mount-2.39.2-alt1 sisyphus+329530.100.1.1 1694630203 installed
<13>Nov 25 06:19:54 rpmi: losetup-2.39.2-alt1 sisyphus+329530.100.1.1 1694630203 installed
<13>Nov 25 06:19:54 rpmi: lsblk-2.39.2-alt1 sisyphus+329530.100.1.1 1694630203 installed
<13>Nov 25 06:19:54 rpmi: rpm-macros-alternatives-0.5.2-alt2 sisyphus+315270.200.2.1 1676457367 installed
<13>Nov 25 06:19:54 rpmi: alternatives-0.5.2-alt2 sisyphus+315270.200.2.1 1676457367 installed
<13>Nov 25 06:19:54 rpmi: ca-certificates-2023.07.31-alt1 sisyphus+326137.200.1.1 1690809798 installed
<13>Nov 25 06:19:54 rpmi: ca-trust-0.1.4-alt1 sisyphus+308690.100.1.1 1666182992 installed
<13>Nov 25 06:19:54 rpmi: p11-kit-trust-1:0.25.3-alt1 sisyphus+334477.100.1.1 1700063204 installed
<13>Nov 25 06:19:55 rpmi: libcrypto3-3.1.4-alt1 sisyphus+332632.100.2.1 1698241305 installed
<13>Nov 25 06:19:55 rpmi: libssl3-3.1.4-alt1 sisyphus+332632.100.2.1 1698241305 installed
<86>Nov 25 06:19:55 groupadd[3920720]: group added to /etc/group: name=_keytab, GID=999
<86>Nov 25 06:19:55 groupadd[3920720]: group added to /etc/gshadow: name=_keytab
<86>Nov 25 06:19:55 groupadd[3920720]: new group: name=_keytab, GID=999
<13>Nov 25 06:19:55 rpmi: libkrb5-1.21.2-alt1 sisyphus+327265.100.1.1 1692185512 installed
<13>Nov 25 06:19:55 rpmi: python3-3.11.6-alt1 sisyphus+331220.100.1.1 1696668078 installed
<13>Nov 25 06:19:55 rpmi: python3-base-3.11.6-alt1 sisyphus+331220.100.1.1 1696668078 installed
<13>Nov 25 06:19:55 rpmi: libkmod-31-alt1 sisyphus+330699.100.1.1 1696072426 installed
<13>Nov 25 06:19:55 rpmi: kmod-31-alt1 sisyphus+330699.100.1.1 1696072426 installed
<13>Nov 25 06:19:55 rpmi: dmsetup-1.02.196-alt1 sisyphus+328928.400.3.1 1694103939 installed
<86>Nov 25 06:19:55 groupadd[3923050]: group added to /etc/group: name=tape, GID=998
<86>Nov 25 06:19:55 groupadd[3923050]: group added to /etc/gshadow: name=tape
<86>Nov 25 06:19:55 groupadd[3923050]: new group: name=tape, GID=998
<86>Nov 25 06:19:55 groupadd[3923058]: group added to /etc/group: name=dialout, GID=997
<86>Nov 25 06:19:55 groupadd[3923058]: group added to /etc/gshadow: name=dialout
<86>Nov 25 06:19:55 groupadd[3923058]: new group: name=dialout, GID=997
<86>Nov 25 06:19:55 groupadd[3923078]: group added to /etc/group: name=input, GID=996
<86>Nov 25 06:19:55 groupadd[3923078]: group added to /etc/gshadow: name=input
<86>Nov 25 06:19:55 groupadd[3923078]: new group: name=input, GID=996
<86>Nov 25 06:19:55 groupadd[3923093]: group added to /etc/group: name=video, GID=995
<86>Nov 25 06:19:55 groupadd[3923093]: group added to /etc/gshadow: name=video
<86>Nov 25 06:19:55 groupadd[3923093]: new group: name=video, GID=995
<86>Nov 25 06:19:55 groupadd[3923101]: group added to /etc/group: name=render, GID=994
<86>Nov 25 06:19:55 groupadd[3923101]: group added to /etc/gshadow: name=render
<86>Nov 25 06:19:55 groupadd[3923101]: new group: name=render, GID=994
<86>Nov 25 06:19:55 groupadd[3923110]: group added to /etc/group: name=sgx, GID=993
<86>Nov 25 06:19:55 groupadd[3923110]: group added to /etc/gshadow: name=sgx
<86>Nov 25 06:19:55 groupadd[3923110]: new group: name=sgx, GID=993
<13>Nov 25 06:19:56 rpmi: udev-1:254.5-alt1.2 sisyphus+331053.100.1.1 1696514800 installed
<13>Nov 25 06:19:56 rpmi: python3-module-pyudev-0.24.0-alt1 sisyphus+307006.100.1.1 1663406384 installed
<13>Nov 25 06:19:56 rpmi: python3-module-libevdev-0.11-alt1 sisyphus+300877.100.1.1 1653893962 installed
<13>Nov 25 06:19:56 rpmi: libwacom-2.8.0-alt1 sisyphus+328366.100.1.1 1693467822 installed
<13>Nov 25 06:19:56 rpmi: libinput-1.24.0-alt1.1 sisyphus+332463.100.1.1 1698001494 installed
<13>Nov 25 06:19:56 rpmi: libgsasl-2.2.0-alt1 sisyphus+333173.100.1.1 1698696961 installed
<86>Nov 25 06:19:56 groupadd[3924831]: group added to /etc/group: name=sasl, GID=992
<86>Nov 25 06:19:56 groupadd[3924831]: group added to /etc/gshadow: name=sasl
<86>Nov 25 06:19:56 groupadd[3924831]: new group: name=sasl, GID=992
<13>Nov 25 06:19:56 rpmi: libsasl2-3-2.1.27-alt2.2 sisyphus+324359.6000.12.1 1689392231 installed
<13>Nov 25 06:19:56 rpmi: libldap2-2.6.6-alt1 sisyphus+330946.100.2.1 1696432858 installed
<13>Nov 25 06:19:56 rpmi: libssh2-1.11.0-alt1 sisyphus+327652.100.1.1 1692636581 installed
<13>Nov 25 06:19:56 rpmi: libcurl-8.4.0-alt1 sisyphus+333173.300.3.1 1698701762 installed
<13>Nov 25 06:19:56 rpmi: libproxy-0.5.3-alt1 sisyphus+327644.100.1.1 1692627186 installed
<13>Nov 25 06:19:56 rpmi: libqt5-network-5.15.10-alt2 sisyphus+334496.300.1.1 1700136672 installed
<13>Nov 25 06:19:56 rpmi: libqt5-xcbqpa-5.15.10-alt2 sisyphus+334496.300.1.1 1700136672 installed
<13>Nov 25 06:19:56 rpmi: libqt5-eglfskmssupport-5.15.10-alt2 sisyphus+334496.300.1.1 1700136672 installed
<13>Nov 25 06:19:56 rpmi: libqt5-eglfsdeviceintegration-5.15.10-alt2 sisyphus+334496.300.1.1 1700136672 installed
<13>Nov 25 06:19:56 rpmi: libqt5-gui-5.15.10-alt2 sisyphus+334496.300.1.1 1700136672 installed
<13>Nov 25 06:19:56 rpmi: libqt5-qmlmodels-5.15.10-alt1 sisyphus+324640.200.3.2 1689201548 installed
<13>Nov 25 06:19:56 rpmi: libqt5-qmlworkerscript-5.15.10-alt1 sisyphus+324640.200.3.2 1689201548 installed
<13>Nov 25 06:19:56 rpmi: libqt5-quick-5.15.10-alt1 sisyphus+324640.200.3.2 1689201548 installed
<13>Nov 25 06:19:56 rpmi: libqt5-quickshapes-5.15.10-alt1 sisyphus+324640.200.3.2 1689201548 installed
<13>Nov 25 06:19:56 rpmi: libqt5-qml-5.15.10-alt1 sisyphus+324640.200.3.2 1689201548 installed
<13>Nov 25 06:19:56 rpmi: rpm-build-qml-5.15.10-alt1 sisyphus+324640.200.3.2 1689201548 installed
<13>Nov 25 06:19:56 rpmi: rpm-build-kf5-5.100.2-alt1 sisyphus+334524.100.1.1 1700130807 installed
<13>Nov 25 06:19:59 rpmi: xorg-proto-devel-2023.2-alt1.1 sisyphus+330960.100.2.1 1696609218 installed
<13>Nov 25 06:19:59 rpmi: libqt5-widgets-5.15.10-alt2 sisyphus+334496.300.1.1 1700136672 installed
<13>Nov 25 06:20:00 rpmi: libxcb-devel-1.16-alt1 sisyphus+327325.200.1.1 1692276267 installed
<13>Nov 25 06:20:00 rpmi: libX11-devel-3:1.8.7-alt1 sisyphus+330921.200.1.1 1696400319 installed
<13>Nov 25 06:20:00 rpmi: libXrender-devel-0.9.11-alt1 sisyphus+308841.100.1.1 1666436131 installed
<13>Nov 25 06:20:00 rpmi: libXfixes-devel-6.0.1-alt1 sisyphus+331490.300.1.1 1697023235 installed
<13>Nov 25 06:20:00 rpmi: wayland-devel-1.22.0-alt1.1 sisyphus+318010.100.1.1 1680606300 installed
<13>Nov 25 06:20:00 rpmi: libXt-1.3.0-alt1 sisyphus+331490.500.1.1 1697023316 installed
<13>Nov 25 06:20:00 rpmi: vulkan-filesystem-1.3.268-alt1 sisyphus+334119.500.4.3 1699893796 installed
<13>Nov 25 06:20:00 rpmi: qt5-wayland-common-5.15.10-alt1 sisyphus+324640.3000.3.2 1689203956 installed
<13>Nov 25 06:20:00 rpmi: libqt5-test-5.15.10-alt2 sisyphus+334496.300.1.1 1700136672 installed
<13>Nov 25 06:20:00 rpmi: zlib-devel-1.2.13-alt1 sisyphus+309409.200.2.1 1667402045 installed
<13>Nov 25 06:20:00 rpmi: xml-utils-1:2.10.4-alt1 sisyphus+311250.4140.175.1 1685629210 installed
<13>Nov 25 06:20:00 rpmi: rpm-build-gir-0.7.3-alt3.1 sisyphus+319393.100.1.1 1682538783 installed
<13>Nov 25 06:20:00 rpmi: fontconfig-2.14.2-alt8 sisyphus+328444.100.1.1 1693553407 installed
Updating fonts cache: <29>Nov 25 06:20:01 fontconfig: Updating fonts cache: succeeded
[ DONE ]
<13>Nov 25 06:20:01 rpmi: libpng-devel-1.6.40-alt1 sisyphus+323732.100.1.1 1687771859 installed
<13>Nov 25 06:20:01 rpmi: libqt5-quicktest-5.15.10-alt1 sisyphus+324640.200.3.2 1689201548 installed
<13>Nov 25 06:20:01 rpmi: libqt5-waylandcompositor-5.15.10-alt1 sisyphus+324640.3000.3.2 1689204287 installed
<13>Nov 25 06:20:01 rpmi: libvulkan1-1.3.268-alt1 sisyphus+334119.500.4.3 1699893786 installed
<13>Nov 25 06:20:01 rpmi: libXmu-1.1.4-alt1 sisyphus+308663.1000.1.1 1666168416 installed
<13>Nov 25 06:20:01 rpmi: libXpm-3.5.17-alt1 sisyphus+330921.100.1.1 1696400258 installed
<13>Nov 25 06:20:01 rpmi: libXpm-devel-3.5.17-alt1 sisyphus+330921.100.1.1 1696400258 installed
<13>Nov 25 06:20:01 rpmi: libwayland-client-devel-1.22.0-alt1.1 sisyphus+318010.100.1.1 1680606300 installed
<13>Nov 25 06:20:01 rpmi: libwayland-server-devel-1.22.0-alt1.1 sisyphus+318010.100.1.1 1680606300 installed
<13>Nov 25 06:20:01 rpmi: libxcbutil-keysyms-devel-0.4.0-alt1 sisyphus+278187.100.1.1 1626075950 installed
<13>Nov 25 06:20:01 rpmi: libqt5-opengl-5.15.10-alt2 sisyphus+334496.300.1.1 1700136672 installed
<13>Nov 25 06:20:01 rpmi: libqt5-quickwidgets-5.15.10-alt1 sisyphus+324640.200.3.2 1689201548 installed
<13>Nov 25 06:20:01 rpmi: libXau-devel-1.0.11-alt1 sisyphus+311428.100.1.1 1670577440 installed
<13>Nov 25 06:20:01 rpmi: libXext-devel-1.3.5-alt1 sisyphus+309285.100.1.1 1667212413 installed
<13>Nov 25 06:20:01 rpmi: libICE-devel-1.1.1-alt1 sisyphus+311428.500.1.1 1670577559 installed
<13>Nov 25 06:20:01 rpmi: libSM-devel-1.2.4-alt1 sisyphus+312057.200.1.1 1671526918 installed
<13>Nov 25 06:20:01 rpmi: libXt-devel-1.3.0-alt1 sisyphus+331490.500.1.1 1697023316 installed
<13>Nov 25 06:20:01 rpmi: libXmu-devel-1.1.4-alt1 sisyphus+308663.1000.1.1 1666168416 installed
<13>Nov 25 06:20:01 rpmi: libXdmcp-devel-1.1.4-alt1 sisyphus+311188.1000.1.1 1670233860 installed
<13>Nov 25 06:20:01 rpmi: libXxf86vm-devel-1.1.5-alt1 sisyphus+308663.1400.1.1 1666168534 installed
<13>Nov 25 06:20:01 rpmi: xxd-4:9.0.2081-alt1 sisyphus+333294.100.1.1 1698819669 installed
<13>Nov 25 06:20:01 rpmi: libxkbfile-1.1.2-alt1 sisyphus+311428.300.1.1 1670577500 installed
<13>Nov 25 06:20:01 rpmi: libxkbfile-devel-1.1.2-alt1 sisyphus+311428.300.1.1 1670577500 installed
<13>Nov 25 06:20:01 rpmi: libxkbcommon-devel-1.6.0-alt1 sisyphus+331300.100.1.1 1696855236 installed
<13>Nov 25 06:20:01 rpmi: python3-module-railroad-diagrams-1.1.1-alt1 sisyphus+294587.100.1.1 1643813088 installed
<13>Nov 25 06:20:01 rpmi: python3-module-markupsafe-1:2.1.3-alt1 sisyphus+323659.100.1.1 1687595160 installed
<13>Nov 25 06:20:01 rpmi: python3-module-jinja2-3.1.2-alt1 sisyphus+303664.100.1.1 1657809843 installed
<13>Nov 25 06:20:02 rpmi: python3-module-pyparsing-3.1.1-alt1 sisyphus+326203.100.2.1 1691138597 installed
<13>Nov 25 06:20:02 rpmi: vulkan-registry-1.3.268-alt1 sisyphus+334119.500.4.3 1699893796 installed
<13>Nov 25 06:20:02 rpmi: libvulkan-devel-1.3.268-alt1 sisyphus+334119.500.4.3 1699893786 installed
<13>Nov 25 06:20:02 rpmi: libudev-devel-1:254.5-alt1.2 sisyphus+331053.100.1.1 1696514800 installed
<13>Nov 25 06:20:02 rpmi: libssl-devel-3.1.4-alt1 sisyphus+332632.100.2.1 1698241305 installed
<13>Nov 25 06:20:02 rpmi: libqt5-xml-5.15.10-alt2 sisyphus+334496.300.1.1 1700136672 installed
<13>Nov 25 06:20:02 rpmi: qt5-x11extras-common-5.15.10-alt1 sisyphus+324640.1600.3.2 1689203052 installed
<13>Nov 25 06:20:02 rpmi: libqt5-x11extras-5.15.10-alt1 sisyphus+324640.1600.3.2 1689203283 installed
<13>Nov 25 06:20:02 rpmi: libwayland-cursor-1.22.0-alt1.1 sisyphus+318010.100.1.1 1680606300 installed
<13>Nov 25 06:20:02 rpmi: libqt5-waylandclient-5.15.10-alt1 sisyphus+324640.3000.3.2 1689204287 installed
<13>Nov 25 06:20:02 rpmi: libqt5-quickparticles-5.15.10-alt1 sisyphus+324640.200.3.2 1689201548 installed
<13>Nov 25 06:20:02 rpmi: libqt5-concurrent-5.15.10-alt2 sisyphus+334496.300.1.1 1700136672 installed
<13>Nov 25 06:20:02 rpmi: libdouble-conversion-devel-3.3.0-alt1 sisyphus+333410.100.1.1 1698928792 installed
<13>Nov 25 06:20:02 rpmi: libavahi-0.8-alt2 sisyphus+321176.300.10.2 1684803998 installed
<13>Nov 25 06:20:02 rpmi: libcups-2.4.7-alt2 sisyphus+333092.100.1.1 1698654164 installed
<13>Nov 25 06:20:02 rpmi: libqt5-printsupport-5.15.10-alt2 sisyphus+334496.300.1.1 1700136672 installed
<13>Nov 25 06:20:02 rpmi: xorg-xf86miscproto-devel-0.9.3-alt1 sisyphus+277136.100.1.1 1625405239 installed
<13>Nov 25 06:20:02 rpmi: libXxf86misc-1.0.4-alt1 sisyphus+275333.100.2.2 1624577011 installed
<13>Nov 25 06:20:02 rpmi: libXxf86misc-devel-1.0.4-alt1 sisyphus+275333.100.2.2 1624577011 installed
<13>Nov 25 06:20:02 rpmi: libXv-1.0.12-alt1 sisyphus+311188.600.1.1 1670233801 installed
<13>Nov 25 06:20:02 rpmi: libXv-devel-1.0.12-alt1 sisyphus+311188.600.1.1 1670233801 installed
<13>Nov 25 06:20:02 rpmi: libXtst-1.2.4-alt1 sisyphus+308663.1300.1.1 1666168504 installed
<13>Nov 25 06:20:02 rpmi: libXrandr-1.5.4-alt1 sisyphus+330992.100.1.1 1696485401 installed
<13>Nov 25 06:20:02 rpmi: libXrandr-devel-1.5.4-alt1 sisyphus+330992.100.1.1 1696485401 installed
<13>Nov 25 06:20:02 rpmi: libXinerama-1.1.5-alt1 sisyphus+309287.100.1.1 1667213209 installed
<13>Nov 25 06:20:02 rpmi: libXinerama-devel-1.1.5-alt1 sisyphus+309287.100.1.1 1667213209 installed
<13>Nov 25 06:20:02 rpmi: libXi-1.8-alt1 sisyphus+285490.200.1.1 1632124180 installed
<13>Nov 25 06:20:02 rpmi: libXi-devel-1.8-alt1 sisyphus+285490.200.1.1 1632124180 installed
<13>Nov 25 06:20:02 rpmi: libXtst-devel-1.2.4-alt1 sisyphus+308663.1300.1.1 1666168504 installed
<13>Nov 25 06:20:02 rpmi: libXft-2.3.8-alt1 sisyphus+331490.400.1.1 1697023273 installed
<13>Nov 25 06:20:02 rpmi: libXdamage-1.1.6-alt1 sisyphus+311188.300.1.1 1670233713 installed
<13>Nov 25 06:20:02 rpmi: libXdamage-devel-1.1.6-alt1 sisyphus+311188.300.1.1 1670233713 installed
<13>Nov 25 06:20:02 rpmi: libXcursor-1.2.1-alt1 sisyphus+297765.200.1.1 1649053934 installed
<13>Nov 25 06:20:02 rpmi: libXcursor-devel-1.2.1-alt1 sisyphus+297765.200.1.1 1649053934 installed
<13>Nov 25 06:20:02 rpmi: libXcomposite-0.4.6-alt1 sisyphus+311188.200.1.1 1670233684 installed
<13>Nov 25 06:20:02 rpmi: libXcomposite-devel-0.4.6-alt1 sisyphus+311188.200.1.1 1670233684 installed
<13>Nov 25 06:20:02 rpmi: libXScrnSaver-1.2.4-alt1 sisyphus+311188.500.1.1 1670233772 installed
<13>Nov 25 06:20:02 rpmi: libXScrnSaver-devel-1.2.4-alt1 sisyphus+311188.500.1.1 1670233772 installed
<13>Nov 25 06:20:02 rpmi: libOpenGL-7:1.7.0-alt1 sisyphus+330949.100.1.1 1696424894 installed
<13>Nov 25 06:20:02 rpmi: libGLES-7:1.7.0-alt1 sisyphus+330949.100.1.1 1696424894 installed
<13>Nov 25 06:20:02 rpmi: libglvnd-devel-7:1.7.0-alt1 sisyphus+330949.100.1.1 1696424894 installed
<13>Nov 25 06:20:02 rpmi: wayland-protocols-1.32-alt1 sisyphus+324150.100.1.1 1688391467 installed
<13>Nov 25 06:20:02 rpmi: gcc-c++-common-1.4.27-alt1 sisyphus+278099.1300.1.1 1626028636 installed
<13>Nov 25 06:20:02 rpmi: libstdc++13-devel-13.2.1-alt2 sisyphus+327572.100.1.1 1692472364 installed
<13>Nov 25 06:20:03 rpmi: gcc13-c++-13.2.1-alt2 sisyphus+327572.100.1.1 1692472364 installed
<13>Nov 25 06:20:03 rpmi: gcc-c++-13-alt1 sisyphus+323337.300.1.1 1687268227 installed
<13>Nov 25 06:20:03 rpmi: libharfbuzz-gobject-8.3.0-alt1 sisyphus+334471.200.2.1 1700075833 installed
<13>Nov 25 06:20:03 rpmi: libharfbuzz-icu-8.3.0-alt1 sisyphus+334471.200.2.1 1700075833 installed
<13>Nov 25 06:20:03 rpmi: icu-utils-1:7.4.1-alt1 sisyphus+334471.100.2.1 1700075688 installed
<13>Nov 25 06:20:03 rpmi: libicu-devel-1:7.4.1-alt1 sisyphus+334471.100.2.1 1700075688 installed
<13>Nov 25 06:20:04 rpmi: qt5-base-devel-5.15.10-alt2 sisyphus+334496.300.1.1 1700136672 installed
<13>Nov 25 06:20:04 rpmi: qt5-declarative-devel-5.15.10-alt1 sisyphus+324640.200.3.2 1689201548 installed
<13>Nov 25 06:20:04 rpmi: libgraphite2-devel-1.3.14-alt2.1 sisyphus+279571.100.1.2 1626605157 installed
<13>Nov 25 06:20:04 rpmi: libpixman-3:0.42.2-alt1 sisyphus+309549.100.1.1 1667649379 installed
<13>Nov 25 06:20:04 rpmi: libcairo-1:1.18.0-alt1 sisyphus+330227.100.1.1 1695539082 installed
<13>Nov 25 06:20:04 rpmi: libharfbuzz-cairo-8.3.0-alt1 sisyphus+334471.200.2.1 1700075833 installed
<13>Nov 25 06:20:04 rpmi: python3-module-pkg_resources-1:68.2.2-alt1 sisyphus+329927.100.2.1 1695208272 installed
<13>Nov 25 06:20:04 rpmi: libpython3-3.11.6-alt1 sisyphus+331220.100.1.1 1696668078 installed
<13>Nov 25 06:20:04 rpmi: libncurses6-6.3.20220618-alt4 sisyphus+328055.40.2.1 1693213017 installed
<13>Nov 25 06:20:04 rpmi: libtinfo-devel-6.3.20220618-alt4 sisyphus+328055.40.2.1 1693213017 installed
<13>Nov 25 06:20:04 rpmi: libncurses-devel-6.3.20220618-alt4 sisyphus+328055.40.2.1 1693213017 installed
<13>Nov 25 06:20:04 rpmi: tests-for-installed-python3-pkgs-0.1.24-alt2 sisyphus+331059.100.4.1 1696870033 installed
<13>Nov 25 06:20:04 rpmi: python3-module-py3dephell-0.1.0-alt2 sisyphus+328191.600.5.1 1693609196 installed
<13>Nov 25 06:20:04 rpmi: rpm-build-python3-0.1.24-alt2 sisyphus+331059.100.4.1 1696870033 installed
<13>Nov 25 06:20:05 rpmi: python3-dev-3.11.6-alt1 sisyphus+331220.100.1.1 1696668078 installed
<13>Nov 25 06:20:05 rpmi: python3-module-setuptools-1:68.2.2-alt1 sisyphus+329927.100.2.1 1695208272 installed
<13>Nov 25 06:20:05 rpmi: glib2-devel-2.78.1-alt1 sisyphus+332710.100.1.2 1698249935 installed
<13>Nov 25 06:20:06 rpmi: libfreetype-devel-2.13.2-alt1 sisyphus+328677.100.1.1 1693834346 installed
<13>Nov 25 06:20:06 rpmi: fontconfig-devel-2.14.2-alt8 sisyphus+328444.100.1.1 1693553407 installed
<13>Nov 25 06:20:06 rpmi: libcairo-devel-1:1.18.0-alt1 sisyphus+330227.100.1.1 1695539082 installed
<13>Nov 25 06:20:06 rpmi: libharfbuzz-devel-8.3.0-alt1 sisyphus+334471.200.2.1 1700075833 installed
<13>Nov 25 06:20:06 rpmi: libXft-devel-2.3.8-alt1 sisyphus+331490.400.1.1 1697023273 installed
<13>Nov 25 06:20:06 rpmi: libyaml2-0.2.5-alt1 sisyphus+278391.100.1.1 1626094932 installed
<13>Nov 25 06:20:06 rpmi: python3-module-yaml-6.0.1-alt1 sisyphus+329508.100.1.1 1694616139 installed
<13>Nov 25 06:20:06 rpmi: python3-module-pyxdg-0.28-alt1.1 sisyphus+319907.500.1.1 1683220498 installed
<13>Nov 25 06:20:06 rpmi: python3-module-pycparser-2.21-alt1.1 sisyphus+309935.7300.4.1 1668527005 installed
<13>Nov 25 06:20:06 rpmi: python3-module-cffi-1.16.0-alt1 sisyphus+330935.100.2.1 1696495706 installed
<13>Nov 25 06:20:06 rpmi: python3-module-cryptography-41.0.5-alt1 sisyphus+333239.200.1.1 1698754471 installed
<13>Nov 25 06:20:06 rpmi: python3-module-openssl-23.2.0-alt1 sisyphus+326014.100.1.1 1690659362 installed
<13>Nov 25 06:20:06 rpmi: python3-module-urllib3-2:2.1.0-alt1 sisyphus+334413.100.2.1 1700048728 installed
<13>Nov 25 06:20:06 rpmi: python3-module-idna-3.4-alt1 sisyphus+307942.100.1.1 1665051373 installed
<13>Nov 25 06:20:06 rpmi: python3-module-charset-normalizer-2.1.1-alt1 sisyphus+311047.100.1.1 1669992940 installed
<13>Nov 25 06:20:06 rpmi: python3-module-requests-2.31.0-alt1 sisyphus+321663.100.2.1 1684917021 installed
<13>Nov 25 06:20:06 rpmi: libxxhash-0.8.0-alt2 sisyphus+277476.100.2.1 1625621318 installed
<13>Nov 25 06:20:06 rpmi: rsync-3.2.7-alt1 sisyphus+325006.2000.1.1 1689498390 installed
<13>Nov 25 06:20:06 rpmi: openssh-common-9.5p1-alt1 sisyphus+330957.100.3.1 1696924057 installed
<13>Nov 25 06:20:06 rpmi: libedit3-3.1.20230828-alt1 sisyphus+330914.200.3.1 1696922745 installed
<86>Nov 25 06:20:06 groupadd[3963744]: group added to /etc/group: name=sshagent, GID=991
<86>Nov 25 06:20:06 groupadd[3963744]: group added to /etc/gshadow: name=sshagent
<86>Nov 25 06:20:06 groupadd[3963744]: new group: name=sshagent, GID=991
<13>Nov 25 06:20:06 rpmi: openssh-clients-9.5p1-alt1 sisyphus+330957.100.3.1 1696924057 installed
<13>Nov 25 06:20:06 rpmi: less-633-alt1 sisyphus+328181.300.2.1 1693321749 installed
<13>Nov 25 06:20:06 rpmi: diffstat-1.64-alt1 sisyphus+278100.700.1.1 1626056686 installed
<13>Nov 25 06:20:06 rpmi: git-core-2.42.1-alt1 sisyphus+333661.100.1.1 1699193194 installed
<13>Nov 25 06:20:06 rpmi: rpm-macros-cmake-3.27.7-alt1 sisyphus+331245.40.2.1 1697877632 installed
<13>Nov 25 06:20:06 rpmi: cmake-modules-3.27.7-alt1 sisyphus+331245.40.2.1 1697877617 installed
<13>Nov 25 06:20:06 rpmi: libuv-1.46.0-alt1 sisyphus+326001.100.1.1 1690655255 installed
<13>Nov 25 06:20:06 rpmi: librhash-1.3.5-alt3 sisyphus+286141.40.2.1 1632982456 installed
<13>Nov 25 06:20:06 rpmi: libjsoncpp24-1.9.4-alt2 sisyphus+286441.100.1.1 1633444234 installed
<13>Nov 25 06:20:06 rpmi: libarchive13-3.6.1-alt2 sisyphus+324359.1300.6.1 1689326414 installed
<13>Nov 25 06:20:07 rpmi: cmake-3.27.7-alt1 sisyphus+331245.40.2.1 1697877632 installed
<13>Nov 25 06:20:07 rpmi: extra-cmake-modules-5.112.0-alt1 sisyphus+334446.100.4.1 1700211850 installed
<13>Nov 25 06:20:07 rpmi: qt5-x11extras-devel-5.15.10-alt1 sisyphus+324640.1600.3.2 1689203283 installed
<13>Nov 25 06:20:07 rpmi: qt5-wayland-devel-5.15.10-alt1 sisyphus+324640.3000.3.2 1689204287 installed
<13>Nov 25 06:20:07 rpmi: kde5-plasma-wayland-protocols-1.10.0-alt2 sisyphus+316292.100.1.1 1678106670 installed
Building target platforms: i586
Building for target i586
Wrote: /usr/src/in/nosrpm/kf5-kidletime-5.112.0-alt1.nosrc.rpm (w1.gzdio)
Installing kf5-kidletime-5.112.0-alt1.src.rpm
Building target platforms: i586
Building for target i586
Executing(%prep): /bin/sh -e /usr/src/tmp/rpm-tmp.92966
+ umask 022
+ /bin/mkdir -p /usr/src/RPM/BUILD
+ cd /usr/src/RPM/BUILD
+ cd /usr/src/RPM/BUILD
+ rm -rf kidletime-5.112.0
+ echo 'Source #0 (kidletime-5.112.0.tar):'
Source #0 (kidletime-5.112.0.tar):
+ /bin/tar -xf /usr/src/RPM/SOURCES/kidletime-5.112.0.tar
+ cd kidletime-5.112.0
+ /bin/chmod -c -Rf u+rwX,go-w .
+ exit 0
Executing(%build): /bin/sh -e /usr/src/tmp/rpm-tmp.92966
+ umask 022
+ /bin/mkdir -p /usr/src/RPM/BUILD
+ cd /usr/src/RPM/BUILD
+ cd kidletime-5.112.0
+ __kf5_build
+ mkdir -p BUILD
+ __kf5_cmake
+ export PATH=/usr/lib/kf5/bin:/usr/src/bin:/bin:/usr/bin:/usr/X11R6/bin:/usr/games
+ PATH=/usr/lib/kf5/bin:/usr/src/bin:/bin:/usr/bin:/usr/X11R6/bin:/usr/games
+ export QTDIR=/usr/share/qt5
+ QTDIR=/usr/share/qt5
+ export 'CFLAGS=-pipe -frecord-gcc-switches -Wall -g -O2 -flto=auto -march=i586 -mtune=generic'
+ CFLAGS='-pipe -frecord-gcc-switches -Wall -g -O2 -flto=auto -march=i586 -mtune=generic'
+ export 'CXXFLAGS=-pipe -frecord-gcc-switches -Wall -g -O2 -flto=auto -march=i586 -mtune=generic'
+ CXXFLAGS='-pipe -frecord-gcc-switches -Wall -g -O2 -flto=auto -march=i586 -mtune=generic'
+ pushd BUILD
~/RPM/BUILD/kidletime-5.112.0/BUILD ~/RPM/BUILD/kidletime-5.112.0
+ cmake .. -DCMAKE_USE_RELATIVE_PATHS:BOOL=ON -DCMAKE_VERBOSE_MAKEFILE:BOOL=ON -DCMAKE_SKIP_RPATH:BOOL=ON -DBUILD_TESTING:BOOL=FALSE -DKDE_INSTALL_USE_QT_SYS_PATHS:BOOL=ON -DCMAKE_BUILD_TYPE=Release '-DCMAKE_EXE_LINKER_FLAGS:STRING=-L/usr/lib -L/usr/lib/kf5/devel' '-DCMAKE_MODULE_LINKER_FLAGS:STRING=-L/usr/lib -L/usr/lib/kf5/devel' '-DCMAKE_SHARED_LINKER_FLAGS:STRING=-L/usr/lib -L/usr/lib/kf5/devel' '-DCMAKE_LIBRARY_PATH=/usr/lib/kf5/devel;/usr/lib;/lib' '-DCMAKE_INCLUDE_PATH=/usr/include/KF5;/usr/include' -DCMAKE_INSTALL_PREFIX=/usr -DCMAKE_PREFIX_PATH=/usr -DCMAKE_INSTALL_BINDIR=/usr/lib/kf5/bin -DCMAKE_INSTALL_FULL_BINDIR=/usr/lib/kf5/bin -DBIN_INSTALL_DIR:PATH=/usr/lib/kf5/bin -DCMAKE_INSTALL_SBINDIR=/usr/lib/kf5/sbin -DCMAKE_INSTALL_FULL_SBINDIR=/usr/lib/kf5/sbin -DSBIN_INSTALL_DIR:PATH=/usr/lib/kf5/sbin -DLIBEXEC_INSTALL_DIR:PATH=/usr/libexec -DINCLUDE_INSTALL_DIR:PATH=/usr/include -DCMAKE_INSTALL_INCLUDEDIR_KF5=/usr/include/KF5 -DDATA_INSTALL_DIR:PATH=/usr/share -DCONFIG_INSTALL_DIR:PATH=/etc/kf5/xdg -DSERVICES_INSTALL_DIR:PATH=/usr/share/kservices5 -DSERVICETYPES_INSTALL_DIR:PATH=/usr/share/kservicetypes5 -DKNOTIFYRC_INSTALL_DIR:PATH=/usr/share/knotifications5 -DKXMLGUI_INSTALL_DIR:PATH=/usr/share/kxmlgui5 -DLIB_INSTALL_DIR:PATH=/usr/lib -DLIB_DESTINATION=lib -DLIB_SUFFIX= -DSYSCONF_INSTALL_DIR:PATH=/etc -DAUTOSTART_INSTALL_DIR=/etc/kf5/xdg/autostart -DHTML_INSTALL_DIR=/usr/share/kf5/doc/HTML -DICON_INSTALL_DIR=/usr/share/kf5/icons -DXDG_MIME_INSTALL_DIR=/usr/share/mime/packages -DXDG_APPS_INSTALL_DIR=/usr/share/kf5/applications -DECM_MKSPECS_INSTALL_DIR:PATH=/usr/lib/qt5/mkspecs/modules -DKCFG_INSTALL_DIR:PATH=/usr/share/kf5/config.kcfg -DPLUGIN_INSTALL_DIR:PATH=/usr/lib/qt5/plugins -DQT_PLUGIN_INSTALL_DIR:PATH=/usr/lib/qt5/plugins -DQML_INSTALL_DIR:PATH=/usr/lib/qt5/qml -DIMPORTS_INSTALL_DIR:PATH=/usr/lib/qt5/imports -DDBUS_INTERFACES_INSTALL_DIR=/usr/share/kf5/dbus-1/interfaces -DDBUS_SERVICES_INSTALL_DIR=/usr/share/kf5/dbus-1/services -DDBUS_SYSTEM_SERVICES_INSTALL_DIR=/lib/dbus-1/system-services
-- The C compiler identification is GNU 13.2.1
-- The CXX compiler identification is GNU 13.2.1
-- Detecting C compiler ABI info
-- Detecting C compiler ABI info - done
-- Check for working C compiler: /usr/bin/cc - skipped
-- Detecting C compile features
-- Detecting C compile features - done
-- Detecting CXX compiler ABI info
-- Detecting CXX compiler ABI info - done
-- Check for working CXX compiler: /usr/bin/c++ - skipped
-- Detecting CXX compile features
-- Detecting CXX compile features - done
--
CMake Deprecation Warning at /usr/share/ECM/kde-modules/KDEInstallDirsCommon.cmake:135 (message):
BIN_INSTALL_DIR is deprecated, use KDE_INSTALL_BINDIR instead.
Call Stack (most recent call first):
/usr/share/ECM/kde-modules/KDEInstallDirsCommon.cmake:236 (_define_relative)
/usr/share/ECM/kde-modules/KDEInstallDirs5.cmake:229 (include)
/usr/share/ECM/kde-modules/KDEInstallDirs.cmake:15 (include)
CMakeLists.txt:14 (include)
CMake Deprecation Warning at /usr/share/ECM/kde-modules/KDEInstallDirsCommon.cmake:135 (message):
SBIN_INSTALL_DIR is deprecated, use KDE_INSTALL_SBINDIR instead.
Call Stack (most recent call first):
/usr/share/ECM/kde-modules/KDEInstallDirsCommon.cmake:239 (_define_relative)
/usr/share/ECM/kde-modules/KDEInstallDirs5.cmake:229 (include)
/usr/share/ECM/kde-modules/KDEInstallDirs.cmake:15 (include)
CMakeLists.txt:14 (include)
CMake Deprecation Warning at /usr/share/ECM/kde-modules/KDEInstallDirsCommon.cmake:135 (message):
LIB_INSTALL_DIR is deprecated, use KDE_INSTALL_LIBDIR instead.
Call Stack (most recent call first):
/usr/share/ECM/kde-modules/KDEInstallDirsCommon.cmake:242 (_define_relative)
/usr/share/ECM/kde-modules/KDEInstallDirs5.cmake:229 (include)
/usr/share/ECM/kde-modules/KDEInstallDirs.cmake:15 (include)
CMakeLists.txt:14 (include)
CMake Deprecation Warning at /usr/share/ECM/kde-modules/KDEInstallDirsCommon.cmake:135 (message):
LIBEXEC_INSTALL_DIR is deprecated, use KDE_INSTALL_LIBEXECDIR instead.
Call Stack (most recent call first):
/usr/share/ECM/kde-modules/KDEInstallDirsCommon.cmake:251 (_define_relative)
/usr/share/ECM/kde-modules/KDEInstallDirs5.cmake:229 (include)
/usr/share/ECM/kde-modules/KDEInstallDirs.cmake:15 (include)
CMakeLists.txt:14 (include)
CMake Deprecation Warning at /usr/share/ECM/kde-modules/KDEInstallDirsCommon.cmake:135 (message):
INCLUDE_INSTALL_DIR is deprecated, use KDE_INSTALL_INCLUDEDIR instead.
Call Stack (most recent call first):
/usr/share/ECM/kde-modules/KDEInstallDirsCommon.cmake:200 (_define_relative)
/usr/share/ECM/kde-modules/KDEInstallDirsCommon.cmake:260 (_define_absolute)
/usr/share/ECM/kde-modules/KDEInstallDirs5.cmake:229 (include)
/usr/share/ECM/kde-modules/KDEInstallDirs.cmake:15 (include)
CMakeLists.txt:14 (include)
CMake Deprecation Warning at /usr/share/ECM/kde-modules/KDEInstallDirsCommon.cmake:135 (message):
DATA_INSTALL_DIR is deprecated, use KDE_INSTALL_DATADIR instead.
Call Stack (most recent call first):
/usr/share/ECM/kde-modules/KDEInstallDirsCommon.cmake:280 (_define_relative)
/usr/share/ECM/kde-modules/KDEInstallDirs5.cmake:229 (include)
/usr/share/ECM/kde-modules/KDEInstallDirs.cmake:15 (include)
CMakeLists.txt:14 (include)
CMake Deprecation Warning at /usr/share/ECM/kde-modules/KDEInstallDirsCommon.cmake:135 (message):
HTML_INSTALL_DIR is deprecated, use KDE_INSTALL_DOCBUNDLEDIR instead.
Call Stack (most recent call first):
/usr/share/ECM/kde-modules/KDEInstallDirsCommon.cmake:285 (_define_relative)
/usr/share/ECM/kde-modules/KDEInstallDirs5.cmake:229 (include)
/usr/share/ECM/kde-modules/KDEInstallDirs.cmake:15 (include)
CMakeLists.txt:14 (include)
CMake Deprecation Warning at /usr/share/ECM/kde-modules/KDEInstallDirsCommon.cmake:135 (message):
KCFG_INSTALL_DIR is deprecated, use KDE_INSTALL_KCFGDIR instead.
Call Stack (most recent call first):
/usr/share/ECM/kde-modules/KDEInstallDirsCommon.cmake:288 (_define_relative)
/usr/share/ECM/kde-modules/KDEInstallDirs5.cmake:229 (include)
/usr/share/ECM/kde-modules/KDEInstallDirs.cmake:15 (include)
CMakeLists.txt:14 (include)
CMake Deprecation Warning at /usr/share/ECM/kde-modules/KDEInstallDirsCommon.cmake:135 (message):
ICON_INSTALL_DIR is deprecated, use KDE_INSTALL_ICONDIR instead.
Call Stack (most recent call first):
/usr/share/ECM/kde-modules/KDEInstallDirsCommon.cmake:305 (_define_relative)
/usr/share/ECM/kde-modules/KDEInstallDirs5.cmake:229 (include)
/usr/share/ECM/kde-modules/KDEInstallDirs.cmake:15 (include)
CMakeLists.txt:14 (include)
CMake Deprecation Warning at /usr/share/ECM/kde-modules/KDEInstallDirsCommon.cmake:135 (message):
XDG_APPS_INSTALL_DIR is deprecated, use KDE_INSTALL_APPDIR instead.
Call Stack (most recent call first):
/usr/share/ECM/kde-modules/KDEInstallDirsCommon.cmake:320 (_define_relative)
/usr/share/ECM/kde-modules/KDEInstallDirs5.cmake:229 (include)
/usr/share/ECM/kde-modules/KDEInstallDirs.cmake:15 (include)
CMakeLists.txt:14 (include)
CMake Deprecation Warning at /usr/share/ECM/kde-modules/KDEInstallDirsCommon.cmake:135 (message):
XDG_MIME_INSTALL_DIR is deprecated, use KDE_INSTALL_MIMEDIR instead.
Call Stack (most recent call first):
/usr/share/ECM/kde-modules/KDEInstallDirsCommon.cmake:326 (_define_relative)
/usr/share/ECM/kde-modules/KDEInstallDirs5.cmake:229 (include)
/usr/share/ECM/kde-modules/KDEInstallDirs.cmake:15 (include)
CMakeLists.txt:14 (include)
CMake Deprecation Warning at /usr/share/ECM/kde-modules/KDEInstallDirsCommon.cmake:135 (message):
DBUS_INTERFACES_INSTALL_DIR is deprecated, use KDE_INSTALL_DBUSINTERFACEDIR
instead.
Call Stack (most recent call first):
/usr/share/ECM/kde-modules/KDEInstallDirsCommon.cmake:340 (_define_relative)
/usr/share/ECM/kde-modules/KDEInstallDirs5.cmake:229 (include)
/usr/share/ECM/kde-modules/KDEInstallDirs.cmake:15 (include)
CMakeLists.txt:14 (include)
CMake Deprecation Warning at /usr/share/ECM/kde-modules/KDEInstallDirsCommon.cmake:135 (message):
DBUS_SERVICES_INSTALL_DIR is deprecated, use KDE_INSTALL_DBUSSERVICEDIR
instead.
Call Stack (most recent call first):
/usr/share/ECM/kde-modules/KDEInstallDirsCommon.cmake:343 (_define_relative)
/usr/share/ECM/kde-modules/KDEInstallDirs5.cmake:229 (include)
/usr/share/ECM/kde-modules/KDEInstallDirs.cmake:15 (include)
CMakeLists.txt:14 (include)
CMake Deprecation Warning at /usr/share/ECM/kde-modules/KDEInstallDirsCommon.cmake:135 (message):
DBUS_SYSTEM_SERVICES_INSTALL_DIR is deprecated, use
KDE_INSTALL_DBUSSYSTEMSERVICEDIR instead.
Call Stack (most recent call first):
/usr/share/ECM/kde-modules/KDEInstallDirsCommon.cmake:346 (_define_relative)
/usr/share/ECM/kde-modules/KDEInstallDirs5.cmake:229 (include)
/usr/share/ECM/kde-modules/KDEInstallDirs.cmake:15 (include)
CMakeLists.txt:14 (include)
CMake Deprecation Warning at /usr/share/ECM/kde-modules/KDEInstallDirsCommon.cmake:135 (message):
SYSCONF_INSTALL_DIR is deprecated, use KDE_INSTALL_SYSCONFDIR instead.
Call Stack (most recent call first):
/usr/share/ECM/kde-modules/KDEInstallDirsCommon.cmake:200 (_define_relative)
/usr/share/ECM/kde-modules/KDEInstallDirsCommon.cmake:363 (_define_absolute)
/usr/share/ECM/kde-modules/KDEInstallDirs5.cmake:229 (include)
/usr/share/ECM/kde-modules/KDEInstallDirs.cmake:15 (include)
CMakeLists.txt:14 (include)
CMake Deprecation Warning at /usr/share/ECM/kde-modules/KDEInstallDirsCommon.cmake:135 (message):
CONFIG_INSTALL_DIR is deprecated, use KDE_INSTALL_CONFDIR instead.
Call Stack (most recent call first):
/usr/share/ECM/kde-modules/KDEInstallDirsCommon.cmake:366 (_define_relative)
/usr/share/ECM/kde-modules/KDEInstallDirs5.cmake:229 (include)
/usr/share/ECM/kde-modules/KDEInstallDirs.cmake:15 (include)
CMakeLists.txt:14 (include)
CMake Deprecation Warning at /usr/share/ECM/kde-modules/KDEInstallDirsCommon.cmake:135 (message):
AUTOSTART_INSTALL_DIR is deprecated, use KDE_INSTALL_AUTOSTARTDIR instead.
Call Stack (most recent call first):
/usr/share/ECM/kde-modules/KDEInstallDirsCommon.cmake:369 (_define_relative)
/usr/share/ECM/kde-modules/KDEInstallDirs5.cmake:229 (include)
/usr/share/ECM/kde-modules/KDEInstallDirs.cmake:15 (include)
CMakeLists.txt:14 (include)
CMake Deprecation Warning at /usr/share/ECM/kde-modules/KDEInstallDirsCommon.cmake:135 (message):
QT_PLUGIN_INSTALL_DIR is deprecated, use KDE_INSTALL_QTPLUGINDIR instead.
Call Stack (most recent call first):
/usr/share/ECM/kde-modules/KDEInstallDirsCommon.cmake:200 (_define_relative)
/usr/share/ECM/kde-modules/KDEInstallDirs5.cmake:260 (_define_absolute)
/usr/share/ECM/kde-modules/KDEInstallDirs.cmake:15 (include)
CMakeLists.txt:14 (include)
CMake Deprecation Warning at /usr/share/ECM/kde-modules/KDEInstallDirsCommon.cmake:135 (message):
IMPORTS_INSTALL_DIR is deprecated, use KDE_INSTALL_QTQUICKIMPORTSDIR
instead.
Call Stack (most recent call first):
/usr/share/ECM/kde-modules/KDEInstallDirsCommon.cmake:200 (_define_relative)
/usr/share/ECM/kde-modules/KDEInstallDirs5.cmake:269 (_define_absolute)
/usr/share/ECM/kde-modules/KDEInstallDirs.cmake:15 (include)
CMakeLists.txt:14 (include)
CMake Deprecation Warning at /usr/share/ECM/kde-modules/KDEInstallDirsCommon.cmake:135 (message):
QML_INSTALL_DIR is deprecated, use KDE_INSTALL_QMLDIR instead.
Call Stack (most recent call first):
/usr/share/ECM/kde-modules/KDEInstallDirsCommon.cmake:200 (_define_relative)
/usr/share/ECM/kde-modules/KDEInstallDirs5.cmake:278 (_define_absolute)
/usr/share/ECM/kde-modules/KDEInstallDirs.cmake:15 (include)
CMakeLists.txt:14 (include)
CMake Deprecation Warning at /usr/share/ECM/kde-modules/KDEInstallDirsCommon.cmake:135 (message):
PLUGIN_INSTALL_DIR is deprecated, use KDE_INSTALL_PLUGINDIR instead.
Call Stack (most recent call first):
/usr/share/ECM/kde-modules/KDEInstallDirs5.cmake:300 (_define_relative)
/usr/share/ECM/kde-modules/KDEInstallDirs.cmake:15 (include)
CMakeLists.txt:14 (include)
CMake Deprecation Warning at /usr/share/ECM/kde-modules/KDEInstallDirsCommon.cmake:135 (message):
SERVICES_INSTALL_DIR is deprecated, use KDE_INSTALL_KSERVICES5DIR instead.
Call Stack (most recent call first):
/usr/share/ECM/kde-modules/KDEInstallDirs5.cmake:328 (_define_relative)
/usr/share/ECM/kde-modules/KDEInstallDirs.cmake:15 (include)
CMakeLists.txt:14 (include)
CMake Deprecation Warning at /usr/share/ECM/kde-modules/KDEInstallDirsCommon.cmake:135 (message):
SERVICETYPES_INSTALL_DIR is deprecated, use KDE_INSTALL_KSERVICETYPES5DIR
instead.
Call Stack (most recent call first):
/usr/share/ECM/kde-modules/KDEInstallDirs5.cmake:331 (_define_relative)
/usr/share/ECM/kde-modules/KDEInstallDirs.cmake:15 (include)
CMakeLists.txt:14 (include)
CMake Deprecation Warning at /usr/share/ECM/kde-modules/KDEInstallDirsCommon.cmake:135 (message):
KNOTIFYRC_INSTALL_DIR is deprecated, use KDE_INSTALL_KNOTIFY5RCDIR instead.
Call Stack (most recent call first):
/usr/share/ECM/kde-modules/KDEInstallDirs5.cmake:334 (_define_relative)
/usr/share/ECM/kde-modules/KDEInstallDirs.cmake:15 (include)
CMakeLists.txt:14 (include)
CMake Deprecation Warning at /usr/share/ECM/kde-modules/KDEInstallDirsCommon.cmake:135 (message):
KXMLGUI_INSTALL_DIR is deprecated, use KDE_INSTALL_KXMLGUI5DIR instead.
Call Stack (most recent call first):
/usr/share/ECM/kde-modules/KDEInstallDirs5.cmake:337 (_define_relative)
/usr/share/ECM/kde-modules/KDEInstallDirs.cmake:15 (include)
CMakeLists.txt:14 (include)
fatal: not a git repository (or any of the parent directories): .git
fatal: not a git repository (or any of the parent directories): .git
-- Looking for __GLIBC__
-- Looking for __GLIBC__ - found
-- Performing Test _OFFT_IS_64BIT
-- Performing Test _OFFT_IS_64BIT - Failed
-- Performing Test HAVE_DATE_TIME
-- Performing Test HAVE_DATE_TIME - Success
-- Performing Test BSYMBOLICFUNCTIONS_AVAILABLE
-- Performing Test BSYMBOLICFUNCTIONS_AVAILABLE - Success
Package bzip2 was not found in the pkg-config search path.
Perhaps you should add the directory containing `bzip2.pc'
to the PKG_CONFIG_PATH environment variable
Package 'bzip2', required by 'freetype2', not found
Package bzip2 was not found in the pkg-config search path.
Perhaps you should add the directory containing `bzip2.pc'
to the PKG_CONFIG_PATH environment variable
Package 'bzip2', required by 'freetype2', not found
Package bzip2 was not found in the pkg-config search path.
Perhaps you should add the directory containing `bzip2.pc'
to the PKG_CONFIG_PATH environment variable
Package 'bzip2', required by 'freetype2', not found
Package bzip2 was not found in the pkg-config search path.
Perhaps you should add the directory containing `bzip2.pc'
to the PKG_CONFIG_PATH environment variable
Package 'bzip2', required by 'freetype2', not found
-- Found X11: /usr/include
-- Looking for XOpenDisplay in /usr/lib/libX11.so;/usr/lib/libXext.so
-- Looking for XOpenDisplay in /usr/lib/libX11.so;/usr/lib/libXext.so - found
-- Looking for gethostbyname
-- Looking for gethostbyname - found
-- Looking for connect
-- Looking for connect - found
-- Looking for remove
-- Looking for remove - found
-- Looking for shmat
-- Looking for shmat - found
-- Looking for IceConnectionNumber in ICE
-- Looking for IceConnectionNumber in ICE - found
-- Found XCB_XCB: /usr/lib/libxcb.so (found version "1.16")
-- Found XCB: /usr/lib/libxcb.so (found version "1.16") found components: XCB
-- Found XCB_SYNC: /usr/lib/libxcb-sync.so (found version "1.16")
-- Found XCB: /usr/lib/libxcb.so;/usr/lib/libxcb-sync.so (found version "1.16") found components: XCB SYNC
-- Found X11_XCB: /usr/lib/libX11-xcb.so (found version "1.8.7")
-- Found QtWaylandScanner: /usr/share/qt5/bin/qtwaylandscanner
Package libffi was not found in the pkg-config search path.
Perhaps you should add the directory containing `libffi.pc'
to the PKG_CONFIG_PATH environment variable
Package 'libffi', required by 'wayland-client', not found
Package libffi was not found in the pkg-config search path.
Perhaps you should add the directory containing `libffi.pc'
to the PKG_CONFIG_PATH environment variable
Package 'libffi', required by 'wayland-client', not found
Package libffi was not found in the pkg-config search path.
Perhaps you should add the directory containing `libffi.pc'
to the PKG_CONFIG_PATH environment variable
Package 'libffi', required by 'wayland-client', not found
Package libffi was not found in the pkg-config search path.
Perhaps you should add the directory containing `libffi.pc'
to the PKG_CONFIG_PATH environment variable
Package 'libffi', required by 'wayland-client', not found
-- Found Wayland_Client: /usr/lib/libwayland-client.so (found version "1.22.0")
-- Found Wayland: /usr/lib/libwayland-client.so (found suitable version "1.22.0", minimum required is "1.9") found components: Client
-- Found WaylandProtocols: //usr/share/wayland-protocols (found suitable version "1.32", minimum required is "1.27")
-- Warning: Property URL already set to "https://wayland.freedesktop.org/", overriding it with "https://gitlab.freedesktop.org/wayland/wayland-protocols/"
-- Performing Test COMPILER_HAS_HIDDEN_VISIBILITY
-- Performing Test COMPILER_HAS_HIDDEN_VISIBILITY - Success
-- Performing Test COMPILER_HAS_HIDDEN_INLINE_VISIBILITY
-- Performing Test COMPILER_HAS_HIDDEN_INLINE_VISIBILITY - Success
-- Performing Test COMPILER_HAS_DEPRECATED_ATTR
-- Performing Test COMPILER_HAS_DEPRECATED_ATTR - Success
-- The following features have been enabled:
* libXext, required for X-Sync based poller
* libX11-xcb, required for X-Sync based poller
* libxcb, required for X-Sync based poller
* libxcb-sync, required for X-Sync based poller
* X-Sync based poller, efficient operation of KIdleTime. STRONGLY RECOMMENDED (requires libXext, libX11-xcb, libxcb and libxcb-sync)
* X-Screensaver based poller, KIdleTime fallback mode (libXss)
-- The following OPTIONAL packages have been found:
* X11
* Qt5WaylandClient (required version >= 5.15.2)
* XCB, X protocol C-language Binding,
* X11_XCB, A compatibility library for code that translates Xlib API calls into XCB calls,
-- The following REQUIRED packages have been found:
* ECM (required version >= 5.112.0), Extra CMake Modules.,
* Qt5Gui
* Qt5X11Extras
* Qt5DBus
* Qt5 (required version >= 5.15.2)
* QtWaylandScanner, Executable that converts XML protocol files to C++ code,
* Wayland (required version >= 1.9), C library implementation of the Wayland protocol: a protocol for a compositor to talk to its clients,
* PlasmaWaylandProtocols (required version >= 1.6.0)
* WaylandProtocols (required version >= 1.27), Specifications of extended Wayland protocols,
Collection of Wayland protocols that add functionality not available in the Wayland core protocol
* WaylandScanner, Executable that converts XML protocol files to C code,
-- The following features have been disabled:
* QCH, API documentation in QCH format (for e.g. Qt Assistant, Qt Creator & KDevelop)
-- Configuring done (1.9s)
-- Generating done (0.0s)
CMake Warning:
Manually-specified variables were not used by the project:
CMAKE_USE_RELATIVE_PATHS
LIB_DESTINATION
LIB_SUFFIX
-- Build files have been written to: /usr/src/RPM/BUILD/kidletime-5.112.0/BUILD
+ popd
~/RPM/BUILD/kidletime-5.112.0
+ __kf5_make
+ pushd BUILD
~/RPM/BUILD/kidletime-5.112.0/BUILD ~/RPM/BUILD/kidletime-5.112.0
+ make -j16
make: Entering directory '/usr/src/RPM/BUILD/kidletime-5.112.0/BUILD'
/usr/bin/cmake -S/usr/src/RPM/BUILD/kidletime-5.112.0 -B/usr/src/RPM/BUILD/kidletime-5.112.0/BUILD --check-build-system CMakeFiles/Makefile.cmake 0
make: Leaving directory '/usr/src/RPM/BUILD/kidletime-5.112.0/BUILD'
make: Entering directory '/usr/src/RPM/BUILD/kidletime-5.112.0/BUILD'
/usr/bin/cmake -E cmake_progress_start /usr/src/RPM/BUILD/kidletime-5.112.0/BUILD/CMakeFiles /usr/src/RPM/BUILD/kidletime-5.112.0/BUILD//CMakeFiles/progress.marks
make: Leaving directory '/usr/src/RPM/BUILD/kidletime-5.112.0/BUILD'
make -f CMakeFiles/Makefile2 all
make -f src/CMakeFiles/KF5IdleTime_autogen.dir/build.make src/CMakeFiles/KF5IdleTime_autogen.dir/depend
make[2]: Entering directory '/usr/src/RPM/BUILD/kidletime-5.112.0/BUILD'
cd /usr/src/RPM/BUILD/kidletime-5.112.0/BUILD && /usr/bin/cmake -E cmake_depends "Unix Makefiles" /usr/src/RPM/BUILD/kidletime-5.112.0 /usr/src/RPM/BUILD/kidletime-5.112.0/src /usr/src/RPM/BUILD/kidletime-5.112.0/BUILD /usr/src/RPM/BUILD/kidletime-5.112.0/BUILD/src /usr/src/RPM/BUILD/kidletime-5.112.0/BUILD/src/CMakeFiles/KF5IdleTime_autogen.dir/DependInfo.cmake "--color="
make[2]: Leaving directory '/usr/src/RPM/BUILD/kidletime-5.112.0/BUILD'
make -f src/CMakeFiles/KF5IdleTime_autogen.dir/build.make src/CMakeFiles/KF5IdleTime_autogen.dir/build
make[2]: Entering directory '/usr/src/RPM/BUILD/kidletime-5.112.0/BUILD'
[ 2%] Automatic MOC for target KF5IdleTime
cd /usr/src/RPM/BUILD/kidletime-5.112.0/BUILD/src && /usr/bin/cmake -E cmake_autogen /usr/src/RPM/BUILD/kidletime-5.112.0/BUILD/src/CMakeFiles/KF5IdleTime_autogen.dir/AutogenInfo.json Release
make[2]: Leaving directory '/usr/src/RPM/BUILD/kidletime-5.112.0/BUILD'
make[1]: Entering directory '/usr/src/RPM/BUILD/kidletime-5.112.0/BUILD'
[ 2%] Built target KF5IdleTime_autogen
make[1]: Leaving directory '/usr/src/RPM/BUILD/kidletime-5.112.0/BUILD'
make -f src/CMakeFiles/KF5IdleTime.dir/build.make src/CMakeFiles/KF5IdleTime.dir/depend
make[2]: Entering directory '/usr/src/RPM/BUILD/kidletime-5.112.0/BUILD'
cd /usr/src/RPM/BUILD/kidletime-5.112.0/BUILD && /usr/bin/cmake -E cmake_depends "Unix Makefiles" /usr/src/RPM/BUILD/kidletime-5.112.0 /usr/src/RPM/BUILD/kidletime-5.112.0/src /usr/src/RPM/BUILD/kidletime-5.112.0/BUILD /usr/src/RPM/BUILD/kidletime-5.112.0/BUILD/src /usr/src/RPM/BUILD/kidletime-5.112.0/BUILD/src/CMakeFiles/KF5IdleTime.dir/DependInfo.cmake "--color="
make[2]: Leaving directory '/usr/src/RPM/BUILD/kidletime-5.112.0/BUILD'
make -f src/CMakeFiles/KF5IdleTime.dir/build.make src/CMakeFiles/KF5IdleTime.dir/build
make[2]: Entering directory '/usr/src/RPM/BUILD/kidletime-5.112.0/BUILD'
[ 4%] Building CXX object src/CMakeFiles/KF5IdleTime.dir/KF5IdleTime_autogen/mocs_compilation.cpp.o
cd /usr/src/RPM/BUILD/kidletime-5.112.0/BUILD/src && /usr/bin/c++ -DKF5IdleTime_EXPORTS -DKF_DEPRECATED_WARNINGS_SINCE=0x60000 -DKF_DISABLE_DEPRECATED_BEFORE_AND_AT=0x56100 -DKIDLETIME_DEPRECATED_WARNINGS_SINCE=0x0 -DKIDLETIME_DISABLE_DEPRECATED_BEFORE_AND_AT=0x0 -DQT_CORE_LIB -DQT_DEPRECATED_WARNINGS_SINCE=0x60000 -DQT_DISABLE_DEPRECATED_BEFORE=0x50f02 -DQT_GUI_LIB -DQT_NO_CAST_FROM_ASCII -DQT_NO_CAST_FROM_BYTEARRAY -DQT_NO_CAST_TO_ASCII -DQT_NO_DEBUG -DQT_NO_FOREACH -DQT_NO_KEYWORDS -DQT_NO_NARROWING_CONVERSIONS_IN_CONNECT -DQT_NO_URL_CAST_FROM_STRING -DQT_STRICT_ITERATORS -DQT_USE_QSTRINGBUILDER -D_FILE_OFFSET_BITS=64 -D_GNU_SOURCE -D_LARGEFILE64_SOURCE -I/usr/src/RPM/BUILD/kidletime-5.112.0/BUILD/src -I/usr/src/RPM/BUILD/kidletime-5.112.0/src -I/usr/src/RPM/BUILD/kidletime-5.112.0/BUILD/src/KF5IdleTime_autogen/include -isystem /usr/include/qt5 -isystem /usr/include/qt5/QtCore -isystem /usr/share/qt5/../../lib/qt5/mkspecs/linux-g++ -isystem /usr/include/qt5/QtGui -pipe -frecord-gcc-switches -Wall -g -O2 -flto=auto -march=i586 -mtune=generic -fno-operator-names -fno-exceptions -Wall -Wextra -Wcast-align -Wchar-subscripts -Wformat-security -Wno-long-long -Wpointer-arith -Wundef -Wnon-virtual-dtor -Woverloaded-virtual -Werror=return-type -Werror=init-self -Werror=undef -Wvla -Wdate-time -Wsuggest-override -Wlogical-op -pedantic -Wzero-as-null-pointer-constant -Wmissing-include-dirs -O2 -DNDEBUG -std=c++17 -fPIC -fvisibility=hidden -fvisibility-inlines-hidden -fPIC -MD -MT src/CMakeFiles/KF5IdleTime.dir/KF5IdleTime_autogen/mocs_compilation.cpp.o -MF CMakeFiles/KF5IdleTime.dir/KF5IdleTime_autogen/mocs_compilation.cpp.o.d -o CMakeFiles/KF5IdleTime.dir/KF5IdleTime_autogen/mocs_compilation.cpp.o -c /usr/src/RPM/BUILD/kidletime-5.112.0/BUILD/src/KF5IdleTime_autogen/mocs_compilation.cpp
make[2]: Leaving directory '/usr/src/RPM/BUILD/kidletime-5.112.0/BUILD'
make[2]: Entering directory '/usr/src/RPM/BUILD/kidletime-5.112.0/BUILD'
[ 14%] Building CXX object src/CMakeFiles/KF5IdleTime.dir/abstractsystempoller.cpp.o
cd /usr/src/RPM/BUILD/kidletime-5.112.0/BUILD/src && /usr/bin/c++ -DKF5IdleTime_EXPORTS -DKF_DEPRECATED_WARNINGS_SINCE=0x60000 -DKF_DISABLE_DEPRECATED_BEFORE_AND_AT=0x56100 -DKIDLETIME_DEPRECATED_WARNINGS_SINCE=0x0 -DKIDLETIME_DISABLE_DEPRECATED_BEFORE_AND_AT=0x0 -DQT_CORE_LIB -DQT_DEPRECATED_WARNINGS_SINCE=0x60000 -DQT_DISABLE_DEPRECATED_BEFORE=0x50f02 -DQT_GUI_LIB -DQT_NO_CAST_FROM_ASCII -DQT_NO_CAST_FROM_BYTEARRAY -DQT_NO_CAST_TO_ASCII -DQT_NO_DEBUG -DQT_NO_FOREACH -DQT_NO_KEYWORDS -DQT_NO_NARROWING_CONVERSIONS_IN_CONNECT -DQT_NO_URL_CAST_FROM_STRING -DQT_STRICT_ITERATORS -DQT_USE_QSTRINGBUILDER -D_FILE_OFFSET_BITS=64 -D_GNU_SOURCE -D_LARGEFILE64_SOURCE -I/usr/src/RPM/BUILD/kidletime-5.112.0/BUILD/src -I/usr/src/RPM/BUILD/kidletime-5.112.0/src -I/usr/src/RPM/BUILD/kidletime-5.112.0/BUILD/src/KF5IdleTime_autogen/include -isystem /usr/include/qt5 -isystem /usr/include/qt5/QtCore -isystem /usr/share/qt5/../../lib/qt5/mkspecs/linux-g++ -isystem /usr/include/qt5/QtGui -pipe -frecord-gcc-switches -Wall -g -O2 -flto=auto -march=i586 -mtune=generic -fno-operator-names -fno-exceptions -Wall -Wextra -Wcast-align -Wchar-subscripts -Wformat-security -Wno-long-long -Wpointer-arith -Wundef -Wnon-virtual-dtor -Woverloaded-virtual -Werror=return-type -Werror=init-self -Werror=undef -Wvla -Wdate-time -Wsuggest-override -Wlogical-op -pedantic -Wzero-as-null-pointer-constant -Wmissing-include-dirs -O2 -DNDEBUG -std=c++17 -fPIC -fvisibility=hidden -fvisibility-inlines-hidden -fPIC -MD -MT src/CMakeFiles/KF5IdleTime.dir/abstractsystempoller.cpp.o -MF CMakeFiles/KF5IdleTime.dir/abstractsystempoller.cpp.o.d -o CMakeFiles/KF5IdleTime.dir/abstractsystempoller.cpp.o -c /usr/src/RPM/BUILD/kidletime-5.112.0/src/abstractsystempoller.cpp
make[2]: Leaving directory '/usr/src/RPM/BUILD/kidletime-5.112.0/BUILD'
make[2]: Entering directory '/usr/src/RPM/BUILD/kidletime-5.112.0/BUILD'
[ 14%] Building CXX object src/CMakeFiles/KF5IdleTime.dir/logging.cpp.o
cd /usr/src/RPM/BUILD/kidletime-5.112.0/BUILD/src && /usr/bin/c++ -DKF5IdleTime_EXPORTS -DKF_DEPRECATED_WARNINGS_SINCE=0x60000 -DKF_DISABLE_DEPRECATED_BEFORE_AND_AT=0x56100 -DKIDLETIME_DEPRECATED_WARNINGS_SINCE=0x0 -DKIDLETIME_DISABLE_DEPRECATED_BEFORE_AND_AT=0x0 -DQT_CORE_LIB -DQT_DEPRECATED_WARNINGS_SINCE=0x60000 -DQT_DISABLE_DEPRECATED_BEFORE=0x50f02 -DQT_GUI_LIB -DQT_NO_CAST_FROM_ASCII -DQT_NO_CAST_FROM_BYTEARRAY -DQT_NO_CAST_TO_ASCII -DQT_NO_DEBUG -DQT_NO_FOREACH -DQT_NO_KEYWORDS -DQT_NO_NARROWING_CONVERSIONS_IN_CONNECT -DQT_NO_URL_CAST_FROM_STRING -DQT_STRICT_ITERATORS -DQT_USE_QSTRINGBUILDER -D_FILE_OFFSET_BITS=64 -D_GNU_SOURCE -D_LARGEFILE64_SOURCE -I/usr/src/RPM/BUILD/kidletime-5.112.0/BUILD/src -I/usr/src/RPM/BUILD/kidletime-5.112.0/src -I/usr/src/RPM/BUILD/kidletime-5.112.0/BUILD/src/KF5IdleTime_autogen/include -isystem /usr/include/qt5 -isystem /usr/include/qt5/QtCore -isystem /usr/share/qt5/../../lib/qt5/mkspecs/linux-g++ -isystem /usr/include/qt5/QtGui -pipe -frecord-gcc-switches -Wall -g -O2 -flto=auto -march=i586 -mtune=generic -fno-operator-names -fno-exceptions -Wall -Wextra -Wcast-align -Wchar-subscripts -Wformat-security -Wno-long-long -Wpointer-arith -Wundef -Wnon-virtual-dtor -Woverloaded-virtual -Werror=return-type -Werror=init-self -Werror=undef -Wvla -Wdate-time -Wsuggest-override -Wlogical-op -pedantic -Wzero-as-null-pointer-constant -Wmissing-include-dirs -O2 -DNDEBUG -std=c++17 -fPIC -fvisibility=hidden -fvisibility-inlines-hidden -fPIC -MD -MT src/CMakeFiles/KF5IdleTime.dir/logging.cpp.o -MF CMakeFiles/KF5IdleTime.dir/logging.cpp.o.d -o CMakeFiles/KF5IdleTime.dir/logging.cpp.o -c /usr/src/RPM/BUILD/kidletime-5.112.0/BUILD/src/logging.cpp
make[2]: Leaving directory '/usr/src/RPM/BUILD/kidletime-5.112.0/BUILD'
make[2]: Entering directory '/usr/src/RPM/BUILD/kidletime-5.112.0/BUILD'
[ 9%] Building CXX object src/CMakeFiles/KF5IdleTime.dir/widgetbasedpoller.cpp.o
cd /usr/src/RPM/BUILD/kidletime-5.112.0/BUILD/src && /usr/bin/c++ -DKF5IdleTime_EXPORTS -DKF_DEPRECATED_WARNINGS_SINCE=0x60000 -DKF_DISABLE_DEPRECATED_BEFORE_AND_AT=0x56100 -DKIDLETIME_DEPRECATED_WARNINGS_SINCE=0x0 -DKIDLETIME_DISABLE_DEPRECATED_BEFORE_AND_AT=0x0 -DQT_CORE_LIB -DQT_DEPRECATED_WARNINGS_SINCE=0x60000 -DQT_DISABLE_DEPRECATED_BEFORE=0x50f02 -DQT_GUI_LIB -DQT_NO_CAST_FROM_ASCII -DQT_NO_CAST_FROM_BYTEARRAY -DQT_NO_CAST_TO_ASCII -DQT_NO_DEBUG -DQT_NO_FOREACH -DQT_NO_KEYWORDS -DQT_NO_NARROWING_CONVERSIONS_IN_CONNECT -DQT_NO_URL_CAST_FROM_STRING -DQT_STRICT_ITERATORS -DQT_USE_QSTRINGBUILDER -D_FILE_OFFSET_BITS=64 -D_GNU_SOURCE -D_LARGEFILE64_SOURCE -I/usr/src/RPM/BUILD/kidletime-5.112.0/BUILD/src -I/usr/src/RPM/BUILD/kidletime-5.112.0/src -I/usr/src/RPM/BUILD/kidletime-5.112.0/BUILD/src/KF5IdleTime_autogen/include -isystem /usr/include/qt5 -isystem /usr/include/qt5/QtCore -isystem /usr/share/qt5/../../lib/qt5/mkspecs/linux-g++ -isystem /usr/include/qt5/QtGui -pipe -frecord-gcc-switches -Wall -g -O2 -flto=auto -march=i586 -mtune=generic -fno-operator-names -fno-exceptions -Wall -Wextra -Wcast-align -Wchar-subscripts -Wformat-security -Wno-long-long -Wpointer-arith -Wundef -Wnon-virtual-dtor -Woverloaded-virtual -Werror=return-type -Werror=init-self -Werror=undef -Wvla -Wdate-time -Wsuggest-override -Wlogical-op -pedantic -Wzero-as-null-pointer-constant -Wmissing-include-dirs -O2 -DNDEBUG -std=c++17 -fPIC -fvisibility=hidden -fvisibility-inlines-hidden -fPIC -MD -MT src/CMakeFiles/KF5IdleTime.dir/widgetbasedpoller.cpp.o -MF CMakeFiles/KF5IdleTime.dir/widgetbasedpoller.cpp.o.d -o CMakeFiles/KF5IdleTime.dir/widgetbasedpoller.cpp.o -c /usr/src/RPM/BUILD/kidletime-5.112.0/src/widgetbasedpoller.cpp
make[2]: Leaving directory '/usr/src/RPM/BUILD/kidletime-5.112.0/BUILD'
make[2]: Entering directory '/usr/src/RPM/BUILD/kidletime-5.112.0/BUILD'
[ 7%] Building CXX object src/CMakeFiles/KF5IdleTime.dir/kidletime.cpp.o
cd /usr/src/RPM/BUILD/kidletime-5.112.0/BUILD/src && /usr/bin/c++ -DKF5IdleTime_EXPORTS -DKF_DEPRECATED_WARNINGS_SINCE=0x60000 -DKF_DISABLE_DEPRECATED_BEFORE_AND_AT=0x56100 -DKIDLETIME_DEPRECATED_WARNINGS_SINCE=0x0 -DKIDLETIME_DISABLE_DEPRECATED_BEFORE_AND_AT=0x0 -DQT_CORE_LIB -DQT_DEPRECATED_WARNINGS_SINCE=0x60000 -DQT_DISABLE_DEPRECATED_BEFORE=0x50f02 -DQT_GUI_LIB -DQT_NO_CAST_FROM_ASCII -DQT_NO_CAST_FROM_BYTEARRAY -DQT_NO_CAST_TO_ASCII -DQT_NO_DEBUG -DQT_NO_FOREACH -DQT_NO_KEYWORDS -DQT_NO_NARROWING_CONVERSIONS_IN_CONNECT -DQT_NO_URL_CAST_FROM_STRING -DQT_STRICT_ITERATORS -DQT_USE_QSTRINGBUILDER -D_FILE_OFFSET_BITS=64 -D_GNU_SOURCE -D_LARGEFILE64_SOURCE -I/usr/src/RPM/BUILD/kidletime-5.112.0/BUILD/src -I/usr/src/RPM/BUILD/kidletime-5.112.0/src -I/usr/src/RPM/BUILD/kidletime-5.112.0/BUILD/src/KF5IdleTime_autogen/include -isystem /usr/include/qt5 -isystem /usr/include/qt5/QtCore -isystem /usr/share/qt5/../../lib/qt5/mkspecs/linux-g++ -isystem /usr/include/qt5/QtGui -pipe -frecord-gcc-switches -Wall -g -O2 -flto=auto -march=i586 -mtune=generic -fno-operator-names -fno-exceptions -Wall -Wextra -Wcast-align -Wchar-subscripts -Wformat-security -Wno-long-long -Wpointer-arith -Wundef -Wnon-virtual-dtor -Woverloaded-virtual -Werror=return-type -Werror=init-self -Werror=undef -Wvla -Wdate-time -Wsuggest-override -Wlogical-op -pedantic -Wzero-as-null-pointer-constant -Wmissing-include-dirs -O2 -DNDEBUG -std=c++17 -fPIC -fvisibility=hidden -fvisibility-inlines-hidden -fPIC -MD -MT src/CMakeFiles/KF5IdleTime.dir/kidletime.cpp.o -MF CMakeFiles/KF5IdleTime.dir/kidletime.cpp.o.d -o CMakeFiles/KF5IdleTime.dir/kidletime.cpp.o -c /usr/src/RPM/BUILD/kidletime-5.112.0/src/kidletime.cpp
make[2]: Leaving directory '/usr/src/RPM/BUILD/kidletime-5.112.0/BUILD'
make[2]: Entering directory '/usr/src/RPM/BUILD/kidletime-5.112.0/BUILD'
[ 17%] Linking CXX shared library ../bin/libKF5IdleTime.so
cd /usr/src/RPM/BUILD/kidletime-5.112.0/BUILD/src && /usr/bin/cmake -E cmake_link_script CMakeFiles/KF5IdleTime.dir/link.txt --verbose=1
/usr/bin/c++ -fPIC -pipe -frecord-gcc-switches -Wall -g -O2 -flto=auto -march=i586 -mtune=generic -fno-operator-names -fno-exceptions -Wall -Wextra -Wcast-align -Wchar-subscripts -Wformat-security -Wno-long-long -Wpointer-arith -Wundef -Wnon-virtual-dtor -Woverloaded-virtual -Werror=return-type -Werror=init-self -Werror=undef -Wvla -Wdate-time -Wsuggest-override -Wlogical-op -pedantic -Wzero-as-null-pointer-constant -Wmissing-include-dirs -O2 -DNDEBUG -Wl,--no-undefined -Wl,--fatal-warnings -Wl,--enable-new-dtags -L/usr/lib -L/usr/lib/kf5/devel -Wl,-Bsymbolic-functions -shared -Wl,-soname,libKF5IdleTime.so.5 -o ../bin/libKF5IdleTime.so.5.112.0 CMakeFiles/KF5IdleTime.dir/KF5IdleTime_autogen/mocs_compilation.cpp.o CMakeFiles/KF5IdleTime.dir/kidletime.cpp.o CMakeFiles/KF5IdleTime.dir/abstractsystempoller.cpp.o CMakeFiles/KF5IdleTime.dir/widgetbasedpoller.cpp.o CMakeFiles/KF5IdleTime.dir/logging.cpp.o /usr/lib/libQt5Gui.so.5.15.10 /usr/lib/libQt5Core.so.5.15.10
cd /usr/src/RPM/BUILD/kidletime-5.112.0/BUILD/src && /usr/bin/cmake -E cmake_symlink_library ../bin/libKF5IdleTime.so.5.112.0 ../bin/libKF5IdleTime.so.5 ../bin/libKF5IdleTime.so
make[2]: Leaving directory '/usr/src/RPM/BUILD/kidletime-5.112.0/BUILD'
make[1]: Entering directory '/usr/src/RPM/BUILD/kidletime-5.112.0/BUILD'
[ 17%] Built target KF5IdleTime
make[1]: Leaving directory '/usr/src/RPM/BUILD/kidletime-5.112.0/BUILD'
make -f src/plugins/xscreensaver/CMakeFiles/KF5IdleTimeXcbPlugin1_autogen.dir/build.make src/plugins/xscreensaver/CMakeFiles/KF5IdleTimeXcbPlugin1_autogen.dir/depend
make -f src/plugins/xsync/CMakeFiles/KF5IdleTimeXcbPlugin0_autogen.dir/build.make src/plugins/xsync/CMakeFiles/KF5IdleTimeXcbPlugin0_autogen.dir/depend
make -f src/plugins/wayland/CMakeFiles/KF5IdleTimeWaylandPlugin_autogen.dir/build.make src/plugins/wayland/CMakeFiles/KF5IdleTimeWaylandPlugin_autogen.dir/depend
make -f examples/CMakeFiles/kidletime_example_autogen.dir/build.make examples/CMakeFiles/kidletime_example_autogen.dir/depend
make[2]: Entering directory '/usr/src/RPM/BUILD/kidletime-5.112.0/BUILD'
cd /usr/src/RPM/BUILD/kidletime-5.112.0/BUILD && /usr/bin/cmake -E cmake_depends "Unix Makefiles" /usr/src/RPM/BUILD/kidletime-5.112.0 /usr/src/RPM/BUILD/kidletime-5.112.0/src/plugins/xscreensaver /usr/src/RPM/BUILD/kidletime-5.112.0/BUILD /usr/src/RPM/BUILD/kidletime-5.112.0/BUILD/src/plugins/xscreensaver /usr/src/RPM/BUILD/kidletime-5.112.0/BUILD/src/plugins/xscreensaver/CMakeFiles/KF5IdleTimeXcbPlugin1_autogen.dir/DependInfo.cmake "--color="
make[2]: Leaving directory '/usr/src/RPM/BUILD/kidletime-5.112.0/BUILD'
make -f src/plugins/xscreensaver/CMakeFiles/KF5IdleTimeXcbPlugin1_autogen.dir/build.make src/plugins/xscreensaver/CMakeFiles/KF5IdleTimeXcbPlugin1_autogen.dir/build
make[2]: Entering directory '/usr/src/RPM/BUILD/kidletime-5.112.0/BUILD'
cd /usr/src/RPM/BUILD/kidletime-5.112.0/BUILD && /usr/bin/cmake -E cmake_depends "Unix Makefiles" /usr/src/RPM/BUILD/kidletime-5.112.0 /usr/src/RPM/BUILD/kidletime-5.112.0/src/plugins/xsync /usr/src/RPM/BUILD/kidletime-5.112.0/BUILD /usr/src/RPM/BUILD/kidletime-5.112.0/BUILD/src/plugins/xsync /usr/src/RPM/BUILD/kidletime-5.112.0/BUILD/src/plugins/xsync/CMakeFiles/KF5IdleTimeXcbPlugin0_autogen.dir/DependInfo.cmake "--color="
make[2]: Leaving directory '/usr/src/RPM/BUILD/kidletime-5.112.0/BUILD'
make -f src/plugins/xsync/CMakeFiles/KF5IdleTimeXcbPlugin0_autogen.dir/build.make src/plugins/xsync/CMakeFiles/KF5IdleTimeXcbPlugin0_autogen.dir/build
make[2]: Entering directory '/usr/src/RPM/BUILD/kidletime-5.112.0/BUILD'
cd /usr/src/RPM/BUILD/kidletime-5.112.0/BUILD && /usr/bin/cmake -E cmake_depends "Unix Makefiles" /usr/src/RPM/BUILD/kidletime-5.112.0 /usr/src/RPM/BUILD/kidletime-5.112.0/examples /usr/src/RPM/BUILD/kidletime-5.112.0/BUILD /usr/src/RPM/BUILD/kidletime-5.112.0/BUILD/examples /usr/src/RPM/BUILD/kidletime-5.112.0/BUILD/examples/CMakeFiles/kidletime_example_autogen.dir/DependInfo.cmake "--color="
make[2]: Leaving directory '/usr/src/RPM/BUILD/kidletime-5.112.0/BUILD'
make -f examples/CMakeFiles/kidletime_example_autogen.dir/build.make examples/CMakeFiles/kidletime_example_autogen.dir/build
make[2]: Entering directory '/usr/src/RPM/BUILD/kidletime-5.112.0/BUILD'
cd /usr/src/RPM/BUILD/kidletime-5.112.0/BUILD && /usr/bin/cmake -E cmake_depends "Unix Makefiles" /usr/src/RPM/BUILD/kidletime-5.112.0 /usr/src/RPM/BUILD/kidletime-5.112.0/src/plugins/wayland /usr/src/RPM/BUILD/kidletime-5.112.0/BUILD /usr/src/RPM/BUILD/kidletime-5.112.0/BUILD/src/plugins/wayland /usr/src/RPM/BUILD/kidletime-5.112.0/BUILD/src/plugins/wayland/CMakeFiles/KF5IdleTimeWaylandPlugin_autogen.dir/DependInfo.cmake "--color="
make[2]: Leaving directory '/usr/src/RPM/BUILD/kidletime-5.112.0/BUILD'
make -f src/plugins/wayland/CMakeFiles/KF5IdleTimeWaylandPlugin_autogen.dir/build.make src/plugins/wayland/CMakeFiles/KF5IdleTimeWaylandPlugin_autogen.dir/build
make[2]: Entering directory '/usr/src/RPM/BUILD/kidletime-5.112.0/BUILD'
[ 24%] Automatic MOC for target kidletime_example
cd /usr/src/RPM/BUILD/kidletime-5.112.0/BUILD/examples && /usr/bin/cmake -E cmake_autogen /usr/src/RPM/BUILD/kidletime-5.112.0/BUILD/examples/CMakeFiles/kidletime_example_autogen.dir/AutogenInfo.json Release
make[2]: Leaving directory '/usr/src/RPM/BUILD/kidletime-5.112.0/BUILD'
make[2]: Entering directory '/usr/src/RPM/BUILD/kidletime-5.112.0/BUILD'
[ 21%] Automatic MOC for target KF5IdleTimeXcbPlugin1
cd /usr/src/RPM/BUILD/kidletime-5.112.0/BUILD/src/plugins/xscreensaver && /usr/bin/cmake -E cmake_autogen /usr/src/RPM/BUILD/kidletime-5.112.0/BUILD/src/plugins/xscreensaver/CMakeFiles/KF5IdleTimeXcbPlugin1_autogen.dir/AutogenInfo.json Release
make[2]: Leaving directory '/usr/src/RPM/BUILD/kidletime-5.112.0/BUILD'
make[1]: Entering directory '/usr/src/RPM/BUILD/kidletime-5.112.0/BUILD'
[ 26%] Built target KF5IdleTimeXcbPlugin1_autogen
make[1]: Leaving directory '/usr/src/RPM/BUILD/kidletime-5.112.0/BUILD'
make -f src/plugins/xscreensaver/CMakeFiles/KF5IdleTimeXcbPlugin1.dir/build.make src/plugins/xscreensaver/CMakeFiles/KF5IdleTimeXcbPlugin1.dir/depend
make[1]: Entering directory '/usr/src/RPM/BUILD/kidletime-5.112.0/BUILD'
[ 26%] Built target kidletime_example_autogen
make[1]: Leaving directory '/usr/src/RPM/BUILD/kidletime-5.112.0/BUILD'
make -f examples/CMakeFiles/kidletime_example.dir/build.make examples/CMakeFiles/kidletime_example.dir/depend
make[2]: Entering directory '/usr/src/RPM/BUILD/kidletime-5.112.0/BUILD'
cd /usr/src/RPM/BUILD/kidletime-5.112.0/BUILD && /usr/bin/cmake -E cmake_depends "Unix Makefiles" /usr/src/RPM/BUILD/kidletime-5.112.0 /usr/src/RPM/BUILD/kidletime-5.112.0/examples /usr/src/RPM/BUILD/kidletime-5.112.0/BUILD /usr/src/RPM/BUILD/kidletime-5.112.0/BUILD/examples /usr/src/RPM/BUILD/kidletime-5.112.0/BUILD/examples/CMakeFiles/kidletime_example.dir/DependInfo.cmake "--color="
make[2]: Leaving directory '/usr/src/RPM/BUILD/kidletime-5.112.0/BUILD'
make -f examples/CMakeFiles/kidletime_example.dir/build.make examples/CMakeFiles/kidletime_example.dir/build
make[2]: Entering directory '/usr/src/RPM/BUILD/kidletime-5.112.0/BUILD'
[ 29%] Generating screensaver_interface.cpp, screensaver_interface.h
cd /usr/src/RPM/BUILD/kidletime-5.112.0/BUILD/src/plugins/xscreensaver && /usr/share/qt5/bin/qdbusxml2cpp -m -p screensaver_interface /usr/src/RPM/BUILD/kidletime-5.112.0/src/plugins/xscreensaver/org.freedesktop.ScreenSaver.xml
make[2]: Leaving directory '/usr/src/RPM/BUILD/kidletime-5.112.0/BUILD'
make[2]: Entering directory '/usr/src/RPM/BUILD/kidletime-5.112.0/BUILD'
[ 31%] Building CXX object examples/CMakeFiles/kidletime_example.dir/kidletime_example_autogen/mocs_compilation.cpp.o
cd /usr/src/RPM/BUILD/kidletime-5.112.0/BUILD/examples && /usr/bin/c++ -DKF_DEPRECATED_WARNINGS_SINCE=0x60000 -DKF_DISABLE_DEPRECATED_BEFORE_AND_AT=0x56100 -DKIDLETIME_DEPRECATED_WARNINGS_SINCE=0x0 -DKIDLETIME_DISABLE_DEPRECATED_BEFORE_AND_AT=0x0 -DQT_CORE_LIB -DQT_DEPRECATED_WARNINGS_SINCE=0x60000 -DQT_DISABLE_DEPRECATED_BEFORE=0x50f02 -DQT_GUI_LIB -DQT_NO_CAST_FROM_ASCII -DQT_NO_CAST_FROM_BYTEARRAY -DQT_NO_CAST_TO_ASCII -DQT_NO_DEBUG -DQT_NO_FOREACH -DQT_NO_KEYWORDS -DQT_NO_NARROWING_CONVERSIONS_IN_CONNECT -DQT_NO_URL_CAST_FROM_STRING -DQT_STRICT_ITERATORS -DQT_USE_QSTRINGBUILDER -D_FILE_OFFSET_BITS=64 -D_GNU_SOURCE -D_LARGEFILE64_SOURCE -I/usr/src/RPM/BUILD/kidletime-5.112.0/BUILD/examples -I/usr/src/RPM/BUILD/kidletime-5.112.0/examples -I/usr/src/RPM/BUILD/kidletime-5.112.0/BUILD/examples/kidletime_example_autogen/include -I/usr/src/RPM/BUILD/kidletime-5.112.0/BUILD/src -I/usr/src/RPM/BUILD/kidletime-5.112.0/src -isystem /usr/include/qt5 -isystem /usr/include/qt5/QtCore -isystem /usr/share/qt5/../../lib/qt5/mkspecs/linux-g++ -isystem /usr/include/qt5/QtGui -pipe -frecord-gcc-switches -Wall -g -O2 -flto=auto -march=i586 -mtune=generic -fno-operator-names -fno-exceptions -Wall -Wextra -Wcast-align -Wchar-subscripts -Wformat-security -Wno-long-long -Wpointer-arith -Wundef -Wnon-virtual-dtor -Woverloaded-virtual -Werror=return-type -Werror=init-self -Werror=undef -Wvla -Wdate-time -Wsuggest-override -Wlogical-op -pedantic -Wzero-as-null-pointer-constant -Wmissing-include-dirs -O2 -DNDEBUG -std=c++17 -fvisibility=hidden -fvisibility-inlines-hidden -fPIC -MD -MT examples/CMakeFiles/kidletime_example.dir/kidletime_example_autogen/mocs_compilation.cpp.o -MF CMakeFiles/kidletime_example.dir/kidletime_example_autogen/mocs_compilation.cpp.o.d -o CMakeFiles/kidletime_example.dir/kidletime_example_autogen/mocs_compilation.cpp.o -c /usr/src/RPM/BUILD/kidletime-5.112.0/BUILD/examples/kidletime_example_autogen/mocs_compilation.cpp
make[2]: Leaving directory '/usr/src/RPM/BUILD/kidletime-5.112.0/BUILD'
make[2]: Entering directory '/usr/src/RPM/BUILD/kidletime-5.112.0/BUILD'
[ 21%] Automatic MOC for target KF5IdleTimeXcbPlugin0
cd /usr/src/RPM/BUILD/kidletime-5.112.0/BUILD/src/plugins/xsync && /usr/bin/cmake -E cmake_autogen /usr/src/RPM/BUILD/kidletime-5.112.0/BUILD/src/plugins/xsync/CMakeFiles/KF5IdleTimeXcbPlugin0_autogen.dir/AutogenInfo.json Release
make[2]: Leaving directory '/usr/src/RPM/BUILD/kidletime-5.112.0/BUILD'
make[2]: Entering directory '/usr/src/RPM/BUILD/kidletime-5.112.0/BUILD'
[ 39%] Generating screensaver_interface.moc
cd /usr/src/RPM/BUILD/kidletime-5.112.0/BUILD/src/plugins/xscreensaver && /usr/share/qt5/bin/moc @/usr/src/RPM/BUILD/kidletime-5.112.0/BUILD/src/plugins/xscreensaver/screensaver_interface.moc_parameters
make[2]: Leaving directory '/usr/src/RPM/BUILD/kidletime-5.112.0/BUILD'
make[1]: Entering directory '/usr/src/RPM/BUILD/kidletime-5.112.0/BUILD'
[ 39%] Built target KF5IdleTimeXcbPlugin0_autogen
make[1]: Leaving directory '/usr/src/RPM/BUILD/kidletime-5.112.0/BUILD'
make -f src/plugins/xsync/CMakeFiles/KF5IdleTimeXcbPlugin0.dir/build.make src/plugins/xsync/CMakeFiles/KF5IdleTimeXcbPlugin0.dir/depend
make[2]: Entering directory '/usr/src/RPM/BUILD/kidletime-5.112.0/BUILD'
cd /usr/src/RPM/BUILD/kidletime-5.112.0/BUILD && /usr/bin/cmake -E cmake_depends "Unix Makefiles" /usr/src/RPM/BUILD/kidletime-5.112.0 /usr/src/RPM/BUILD/kidletime-5.112.0/src/plugins/xscreensaver /usr/src/RPM/BUILD/kidletime-5.112.0/BUILD /usr/src/RPM/BUILD/kidletime-5.112.0/BUILD/src/plugins/xscreensaver /usr/src/RPM/BUILD/kidletime-5.112.0/BUILD/src/plugins/xscreensaver/CMakeFiles/KF5IdleTimeXcbPlugin1.dir/DependInfo.cmake "--color="
make[2]: Leaving directory '/usr/src/RPM/BUILD/kidletime-5.112.0/BUILD'
make -f src/plugins/xscreensaver/CMakeFiles/KF5IdleTimeXcbPlugin1.dir/build.make src/plugins/xscreensaver/CMakeFiles/KF5IdleTimeXcbPlugin1.dir/build
make[2]: Entering directory '/usr/src/RPM/BUILD/kidletime-5.112.0/BUILD'
cd /usr/src/RPM/BUILD/kidletime-5.112.0/BUILD && /usr/bin/cmake -E cmake_depends "Unix Makefiles" /usr/src/RPM/BUILD/kidletime-5.112.0 /usr/src/RPM/BUILD/kidletime-5.112.0/src/plugins/xsync /usr/src/RPM/BUILD/kidletime-5.112.0/BUILD /usr/src/RPM/BUILD/kidletime-5.112.0/BUILD/src/plugins/xsync /usr/src/RPM/BUILD/kidletime-5.112.0/BUILD/src/plugins/xsync/CMakeFiles/KF5IdleTimeXcbPlugin0.dir/DependInfo.cmake "--color="
make[2]: Leaving directory '/usr/src/RPM/BUILD/kidletime-5.112.0/BUILD'
make -f src/plugins/xsync/CMakeFiles/KF5IdleTimeXcbPlugin0.dir/build.make src/plugins/xsync/CMakeFiles/KF5IdleTimeXcbPlugin0.dir/build
make[2]: Entering directory '/usr/src/RPM/BUILD/kidletime-5.112.0/BUILD'
[ 26%] Automatic MOC for target KF5IdleTimeWaylandPlugin
cd /usr/src/RPM/BUILD/kidletime-5.112.0/BUILD/src/plugins/wayland && /usr/bin/cmake -E cmake_autogen /usr/src/RPM/BUILD/kidletime-5.112.0/BUILD/src/plugins/wayland/CMakeFiles/KF5IdleTimeWaylandPlugin_autogen.dir/AutogenInfo.json Release
make[2]: Leaving directory '/usr/src/RPM/BUILD/kidletime-5.112.0/BUILD'
make[2]: Entering directory '/usr/src/RPM/BUILD/kidletime-5.112.0/BUILD'
[ 43%] Building CXX object src/plugins/xscreensaver/CMakeFiles/KF5IdleTimeXcbPlugin1.dir/KF5IdleTimeXcbPlugin1_autogen/mocs_compilation.cpp.o
cd /usr/src/RPM/BUILD/kidletime-5.112.0/BUILD/src/plugins/xscreensaver && /usr/bin/c++ -DKF5IdleTimeXcbPlugin1_EXPORTS -DKF_DEPRECATED_WARNINGS_SINCE=0x60000 -DKF_DISABLE_DEPRECATED_BEFORE_AND_AT=0x56100 -DKIDLETIME_DEPRECATED_WARNINGS_SINCE=0x0 -DKIDLETIME_DISABLE_DEPRECATED_BEFORE_AND_AT=0x0 -DQT_CORE_LIB -DQT_DBUS_LIB -DQT_DEPRECATED_WARNINGS_SINCE=0x60000 -DQT_DISABLE_DEPRECATED_BEFORE=0x50f02 -DQT_GUI_LIB -DQT_NO_CAST_FROM_ASCII -DQT_NO_CAST_FROM_BYTEARRAY -DQT_NO_CAST_TO_ASCII -DQT_NO_DEBUG -DQT_NO_FOREACH -DQT_NO_KEYWORDS -DQT_NO_NARROWING_CONVERSIONS_IN_CONNECT -DQT_NO_URL_CAST_FROM_STRING -DQT_STRICT_ITERATORS -DQT_USE_QSTRINGBUILDER -DQT_X11EXTRAS_LIB -D_FILE_OFFSET_BITS=64 -D_GNU_SOURCE -D_LARGEFILE64_SOURCE -I/usr/src/RPM/BUILD/kidletime-5.112.0/BUILD/src/plugins/xscreensaver -I/usr/src/RPM/BUILD/kidletime-5.112.0/src/plugins/xscreensaver -I/usr/src/RPM/BUILD/kidletime-5.112.0/BUILD/src/plugins/xscreensaver/KF5IdleTimeXcbPlugin1_autogen/include -I/usr/src/RPM/BUILD/kidletime-5.112.0/BUILD/src -I/usr/src/RPM/BUILD/kidletime-5.112.0/src -isystem /usr/include/qt5 -isystem /usr/include/qt5/QtCore -isystem /usr/share/qt5/../../lib/qt5/mkspecs/linux-g++ -isystem /usr/include/qt5/QtDBus -isystem /usr/include/qt5/QtX11Extras -isystem /usr/include/qt5/QtGui -pipe -frecord-gcc-switches -Wall -g -O2 -flto=auto -march=i586 -mtune=generic -fno-operator-names -fno-exceptions -Wall -Wextra -Wcast-align -Wchar-subscripts -Wformat-security -Wno-long-long -Wpointer-arith -Wundef -Wnon-virtual-dtor -Woverloaded-virtual -Werror=return-type -Werror=init-self -Werror=undef -Wvla -Wdate-time -Wsuggest-override -Wlogical-op -pedantic -Wzero-as-null-pointer-constant -Wmissing-include-dirs -O2 -DNDEBUG -std=c++17 -fPIC -fvisibility=hidden -fvisibility-inlines-hidden -fPIC -MD -MT src/plugins/xscreensaver/CMakeFiles/KF5IdleTimeXcbPlugin1.dir/KF5IdleTimeXcbPlugin1_autogen/mocs_compilation.cpp.o -MF CMakeFiles/KF5IdleTimeXcbPlugin1.dir/KF5IdleTimeXcbPlugin1_autogen/mocs_compilation.cpp.o.d -o CMakeFiles/KF5IdleTimeXcbPlugin1.dir/KF5IdleTimeXcbPlugin1_autogen/mocs_compilation.cpp.o -c /usr/src/RPM/BUILD/kidletime-5.112.0/BUILD/src/plugins/xscreensaver/KF5IdleTimeXcbPlugin1_autogen/mocs_compilation.cpp
make[2]: Leaving directory '/usr/src/RPM/BUILD/kidletime-5.112.0/BUILD'
make[1]: Entering directory '/usr/src/RPM/BUILD/kidletime-5.112.0/BUILD'
[ 56%] Built target KF5IdleTimeWaylandPlugin_autogen
make[1]: Leaving directory '/usr/src/RPM/BUILD/kidletime-5.112.0/BUILD'
make -f src/plugins/wayland/CMakeFiles/KF5IdleTimeWaylandPlugin.dir/build.make src/plugins/wayland/CMakeFiles/KF5IdleTimeWaylandPlugin.dir/depend
make[2]: Entering directory '/usr/src/RPM/BUILD/kidletime-5.112.0/BUILD'
[ 53%] Building CXX object src/plugins/xsync/CMakeFiles/KF5IdleTimeXcbPlugin0.dir/KF5IdleTimeXcbPlugin0_autogen/mocs_compilation.cpp.o
cd /usr/src/RPM/BUILD/kidletime-5.112.0/BUILD/src/plugins/xsync && /usr/bin/c++ -DKF5IdleTimeXcbPlugin0_EXPORTS -DKF_DEPRECATED_WARNINGS_SINCE=0x60000 -DKF_DISABLE_DEPRECATED_BEFORE_AND_AT=0x56100 -DKIDLETIME_DEPRECATED_WARNINGS_SINCE=0x0 -DKIDLETIME_DISABLE_DEPRECATED_BEFORE_AND_AT=0x0 -DQT_CORE_LIB -DQT_DEPRECATED_WARNINGS_SINCE=0x60000 -DQT_DISABLE_DEPRECATED_BEFORE=0x50f02 -DQT_GUI_LIB -DQT_NO_CAST_FROM_ASCII -DQT_NO_CAST_FROM_BYTEARRAY -DQT_NO_CAST_TO_ASCII -DQT_NO_DEBUG -DQT_NO_FOREACH -DQT_NO_KEYWORDS -DQT_NO_NARROWING_CONVERSIONS_IN_CONNECT -DQT_NO_URL_CAST_FROM_STRING -DQT_STRICT_ITERATORS -DQT_USE_QSTRINGBUILDER -DQT_X11EXTRAS_LIB -D_FILE_OFFSET_BITS=64 -D_GNU_SOURCE -D_LARGEFILE64_SOURCE -I/usr/src/RPM/BUILD/kidletime-5.112.0/BUILD/src/plugins/xsync -I/usr/src/RPM/BUILD/kidletime-5.112.0/src/plugins/xsync -I/usr/src/RPM/BUILD/kidletime-5.112.0/BUILD/src/plugins/xsync/KF5IdleTimeXcbPlugin0_autogen/include -I/usr/src/RPM/BUILD/kidletime-5.112.0/BUILD/src -I/usr/src/RPM/BUILD/kidletime-5.112.0/src -isystem /usr/include/qt5 -isystem /usr/include/qt5/QtCore -isystem /usr/share/qt5/../../lib/qt5/mkspecs/linux-g++ -isystem /usr/include/qt5/QtX11Extras -isystem /usr/include/qt5/QtGui -pipe -frecord-gcc-switches -Wall -g -O2 -flto=auto -march=i586 -mtune=generic -fno-operator-names -fno-exceptions -Wall -Wextra -Wcast-align -Wchar-subscripts -Wformat-security -Wno-long-long -Wpointer-arith -Wundef -Wnon-virtual-dtor -Woverloaded-virtual -Werror=return-type -Werror=init-self -Werror=undef -Wvla -Wdate-time -Wsuggest-override -Wlogical-op -pedantic -Wzero-as-null-pointer-constant -Wmissing-include-dirs -O2 -DNDEBUG -std=c++17 -fPIC -fvisibility=hidden -fvisibility-inlines-hidden -fPIC -MD -MT src/plugins/xsync/CMakeFiles/KF5IdleTimeXcbPlugin0.dir/KF5IdleTimeXcbPlugin0_autogen/mocs_compilation.cpp.o -MF CMakeFiles/KF5IdleTimeXcbPlugin0.dir/KF5IdleTimeXcbPlugin0_autogen/mocs_compilation.cpp.o.d -o CMakeFiles/KF5IdleTimeXcbPlugin0.dir/KF5IdleTimeXcbPlugin0_autogen/mocs_compilation.cpp.o -c /usr/src/RPM/BUILD/kidletime-5.112.0/BUILD/src/plugins/xsync/KF5IdleTimeXcbPlugin0_autogen/mocs_compilation.cpp
make[2]: Leaving directory '/usr/src/RPM/BUILD/kidletime-5.112.0/BUILD'
make[2]: Entering directory '/usr/src/RPM/BUILD/kidletime-5.112.0/BUILD'
[ 58%] Generating wayland-ext-idle-notify-v1-client-protocol.h
cd /usr/src/RPM/BUILD/kidletime-5.112.0/BUILD/src/plugins/wayland && /usr/bin/wayland-scanner client-header //usr/share/wayland-protocols/staging/ext-idle-notify/ext-idle-notify-v1.xml /usr/src/RPM/BUILD/kidletime-5.112.0/BUILD/src/plugins/wayland/wayland-ext-idle-notify-v1-client-protocol.h
make[2]: Leaving directory '/usr/src/RPM/BUILD/kidletime-5.112.0/BUILD'
make[2]: Entering directory '/usr/src/RPM/BUILD/kidletime-5.112.0/BUILD'
[ 63%] Generating wayland-idle-client-protocol.h
cd /usr/src/RPM/BUILD/kidletime-5.112.0/BUILD/src/plugins/wayland && /usr/bin/wayland-scanner client-header /usr/share/plasma-wayland-protocols/idle.xml /usr/src/RPM/BUILD/kidletime-5.112.0/BUILD/src/plugins/wayland/wayland-idle-client-protocol.h
make[2]: Leaving directory '/usr/src/RPM/BUILD/kidletime-5.112.0/BUILD'
make[2]: Entering directory '/usr/src/RPM/BUILD/kidletime-5.112.0/BUILD'
[ 63%] Generating qwayland-ext-idle-notify-v1.h
cd /usr/src/RPM/BUILD/kidletime-5.112.0/BUILD/src/plugins/wayland && /usr/share/qt5/bin/qtwaylandscanner client-header //usr/share/wayland-protocols/staging/ext-idle-notify/ext-idle-notify-v1.xml "" > /usr/src/RPM/BUILD/kidletime-5.112.0/BUILD/src/plugins/wayland/qwayland-ext-idle-notify-v1.h
make[2]: Leaving directory '/usr/src/RPM/BUILD/kidletime-5.112.0/BUILD'
make[2]: Entering directory '/usr/src/RPM/BUILD/kidletime-5.112.0/BUILD'
[ 65%] Generating qwayland-idle.h
cd /usr/src/RPM/BUILD/kidletime-5.112.0/BUILD/src/plugins/wayland && /usr/share/qt5/bin/qtwaylandscanner client-header /usr/share/plasma-wayland-protocols/idle.xml "" > /usr/src/RPM/BUILD/kidletime-5.112.0/BUILD/src/plugins/wayland/qwayland-idle.h
make[2]: Leaving directory '/usr/src/RPM/BUILD/kidletime-5.112.0/BUILD'
make[2]: Entering directory '/usr/src/RPM/BUILD/kidletime-5.112.0/BUILD'
[ 68%] Generating wayland-idle-protocol.c
cd /usr/src/RPM/BUILD/kidletime-5.112.0/BUILD/src/plugins/wayland && /usr/bin/wayland-scanner public-code /usr/share/plasma-wayland-protocols/idle.xml /usr/src/RPM/BUILD/kidletime-5.112.0/BUILD/src/plugins/wayland/wayland-idle-protocol.c
make[2]: Leaving directory '/usr/src/RPM/BUILD/kidletime-5.112.0/BUILD'
make[2]: Entering directory '/usr/src/RPM/BUILD/kidletime-5.112.0/BUILD'
[ 70%] Generating wayland-ext-idle-notify-v1-protocol.c
cd /usr/src/RPM/BUILD/kidletime-5.112.0/BUILD/src/plugins/wayland && /usr/bin/wayland-scanner public-code //usr/share/wayland-protocols/staging/ext-idle-notify/ext-idle-notify-v1.xml /usr/src/RPM/BUILD/kidletime-5.112.0/BUILD/src/plugins/wayland/wayland-ext-idle-notify-v1-protocol.c
make[2]: Leaving directory '/usr/src/RPM/BUILD/kidletime-5.112.0/BUILD'
make[2]: Entering directory '/usr/src/RPM/BUILD/kidletime-5.112.0/BUILD'
[ 73%] Generating qwayland-ext-idle-notify-v1.cpp
cd /usr/src/RPM/BUILD/kidletime-5.112.0/BUILD/src/plugins/wayland && /usr/share/qt5/bin/qtwaylandscanner client-code //usr/share/wayland-protocols/staging/ext-idle-notify/ext-idle-notify-v1.xml "" > /usr/src/RPM/BUILD/kidletime-5.112.0/BUILD/src/plugins/wayland/qwayland-ext-idle-notify-v1.cpp
make[2]: Leaving directory '/usr/src/RPM/BUILD/kidletime-5.112.0/BUILD'
make[2]: Entering directory '/usr/src/RPM/BUILD/kidletime-5.112.0/BUILD'
[ 75%] Generating qwayland-idle.cpp
cd /usr/src/RPM/BUILD/kidletime-5.112.0/BUILD/src/plugins/wayland && /usr/share/qt5/bin/qtwaylandscanner client-code /usr/share/plasma-wayland-protocols/idle.xml "" > /usr/src/RPM/BUILD/kidletime-5.112.0/BUILD/src/plugins/wayland/qwayland-idle.cpp
make[2]: Leaving directory '/usr/src/RPM/BUILD/kidletime-5.112.0/BUILD'
make[2]: Entering directory '/usr/src/RPM/BUILD/kidletime-5.112.0/BUILD'
cd /usr/src/RPM/BUILD/kidletime-5.112.0/BUILD && /usr/bin/cmake -E cmake_depends "Unix Makefiles" /usr/src/RPM/BUILD/kidletime-5.112.0 /usr/src/RPM/BUILD/kidletime-5.112.0/src/plugins/wayland /usr/src/RPM/BUILD/kidletime-5.112.0/BUILD /usr/src/RPM/BUILD/kidletime-5.112.0/BUILD/src/plugins/wayland /usr/src/RPM/BUILD/kidletime-5.112.0/BUILD/src/plugins/wayland/CMakeFiles/KF5IdleTimeWaylandPlugin.dir/DependInfo.cmake "--color="
make[2]: Leaving directory '/usr/src/RPM/BUILD/kidletime-5.112.0/BUILD'
make -f src/plugins/wayland/CMakeFiles/KF5IdleTimeWaylandPlugin.dir/build.make src/plugins/wayland/CMakeFiles/KF5IdleTimeWaylandPlugin.dir/build
make[2]: Entering directory '/usr/src/RPM/BUILD/kidletime-5.112.0/BUILD'
[ 85%] Building CXX object src/plugins/wayland/CMakeFiles/KF5IdleTimeWaylandPlugin.dir/KF5IdleTimeWaylandPlugin_autogen/mocs_compilation.cpp.o
cd /usr/src/RPM/BUILD/kidletime-5.112.0/BUILD/src/plugins/wayland && /usr/bin/c++ -DKF5IdleTimeWaylandPlugin_EXPORTS -DKF_DEPRECATED_WARNINGS_SINCE=0x60000 -DKF_DISABLE_DEPRECATED_BEFORE_AND_AT=0x56100 -DKIDLETIME_DEPRECATED_WARNINGS_SINCE=0x0 -DKIDLETIME_DISABLE_DEPRECATED_BEFORE_AND_AT=0x0 -DQT_CORE_LIB -DQT_DEPRECATED_WARNINGS_SINCE=0x60000 -DQT_DISABLE_DEPRECATED_BEFORE=0x50f02 -DQT_GUI_LIB -DQT_NO_CAST_FROM_ASCII -DQT_NO_CAST_FROM_BYTEARRAY -DQT_NO_CAST_TO_ASCII -DQT_NO_DEBUG -DQT_NO_FOREACH -DQT_NO_KEYWORDS -DQT_NO_NARROWING_CONVERSIONS_IN_CONNECT -DQT_NO_URL_CAST_FROM_STRING -DQT_STRICT_ITERATORS -DQT_USE_QSTRINGBUILDER -DQT_WAYLANDCLIENT_LIB -D_FILE_OFFSET_BITS=64 -D_GNU_SOURCE -D_LARGEFILE64_SOURCE -I/usr/src/RPM/BUILD/kidletime-5.112.0/BUILD/src/plugins/wayland -I/usr/src/RPM/BUILD/kidletime-5.112.0/src/plugins/wayland -I/usr/src/RPM/BUILD/kidletime-5.112.0/BUILD/src/plugins/wayland/KF5IdleTimeWaylandPlugin_autogen/include -I/usr/src/RPM/BUILD/kidletime-5.112.0/BUILD/src -I/usr/src/RPM/BUILD/kidletime-5.112.0/src -isystem /usr/include/qt5 -isystem /usr/include/qt5/QtCore -isystem /usr/share/qt5/../../lib/qt5/mkspecs/linux-g++ -isystem /usr/include/qt5/QtWaylandClient -isystem /usr/include/qt5/QtGui -isystem /usr/include/qt5/QtGui/5.15.10 -isystem /usr/include/qt5/QtGui/5.15.10/QtGui -isystem /usr/include/qt5/QtCore/5.15.10 -isystem /usr/include/qt5/QtCore/5.15.10/QtCore -pipe -frecord-gcc-switches -Wall -g -O2 -flto=auto -march=i586 -mtune=generic -fno-operator-names -fno-exceptions -Wall -Wextra -Wcast-align -Wchar-subscripts -Wformat-security -Wno-long-long -Wpointer-arith -Wundef -Wnon-virtual-dtor -Woverloaded-virtual -Werror=return-type -Werror=init-self -Werror=undef -Wvla -Wdate-time -Wsuggest-override -Wlogical-op -pedantic -Wzero-as-null-pointer-constant -Wmissing-include-dirs -O2 -DNDEBUG -std=c++17 -fPIC -fvisibility=hidden -fvisibility-inlines-hidden -fPIC -MD -MT src/plugins/wayland/CMakeFiles/KF5IdleTimeWaylandPlugin.dir/KF5IdleTimeWaylandPlugin_autogen/mocs_compilation.cpp.o -MF CMakeFiles/KF5IdleTimeWaylandPlugin.dir/KF5IdleTimeWaylandPlugin_autogen/mocs_compilation.cpp.o.d -o CMakeFiles/KF5IdleTimeWaylandPlugin.dir/KF5IdleTimeWaylandPlugin_autogen/mocs_compilation.cpp.o -c /usr/src/RPM/BUILD/kidletime-5.112.0/BUILD/src/plugins/wayland/KF5IdleTimeWaylandPlugin_autogen/mocs_compilation.cpp
make[2]: Leaving directory '/usr/src/RPM/BUILD/kidletime-5.112.0/BUILD'
make[2]: Entering directory '/usr/src/RPM/BUILD/kidletime-5.112.0/BUILD'
[ 90%] Building C object src/plugins/wayland/CMakeFiles/KF5IdleTimeWaylandPlugin.dir/wayland-ext-idle-notify-v1-protocol.c.o
cd /usr/src/RPM/BUILD/kidletime-5.112.0/BUILD/src/plugins/wayland && /usr/bin/cc -DKF5IdleTimeWaylandPlugin_EXPORTS -DKF_DEPRECATED_WARNINGS_SINCE=0x60000 -DKF_DISABLE_DEPRECATED_BEFORE_AND_AT=0x56100 -DKIDLETIME_DEPRECATED_WARNINGS_SINCE=0x0 -DKIDLETIME_DISABLE_DEPRECATED_BEFORE_AND_AT=0x0 -DQT_CORE_LIB -DQT_DEPRECATED_WARNINGS_SINCE=0x60000 -DQT_DISABLE_DEPRECATED_BEFORE=0x50f02 -DQT_GUI_LIB -DQT_NO_CAST_FROM_ASCII -DQT_NO_CAST_FROM_BYTEARRAY -DQT_NO_CAST_TO_ASCII -DQT_NO_DEBUG -DQT_NO_FOREACH -DQT_NO_KEYWORDS -DQT_NO_NARROWING_CONVERSIONS_IN_CONNECT -DQT_NO_URL_CAST_FROM_STRING -DQT_STRICT_ITERATORS -DQT_USE_QSTRINGBUILDER -DQT_WAYLANDCLIENT_LIB -D_FILE_OFFSET_BITS=64 -D_GNU_SOURCE -D_LARGEFILE64_SOURCE -I/usr/src/RPM/BUILD/kidletime-5.112.0/BUILD/src/plugins/wayland -I/usr/src/RPM/BUILD/kidletime-5.112.0/src/plugins/wayland -I/usr/src/RPM/BUILD/kidletime-5.112.0/BUILD/src/plugins/wayland/KF5IdleTimeWaylandPlugin_autogen/include -I/usr/src/RPM/BUILD/kidletime-5.112.0/BUILD/src -I/usr/src/RPM/BUILD/kidletime-5.112.0/src -isystem /usr/include/qt5 -isystem /usr/include/qt5/QtCore -isystem /usr/share/qt5/../../lib/qt5/mkspecs/linux-g++ -isystem /usr/include/qt5/QtWaylandClient -isystem /usr/include/qt5/QtGui -isystem /usr/include/qt5/QtGui/5.15.10 -isystem /usr/include/qt5/QtGui/5.15.10/QtGui -isystem /usr/include/qt5/QtCore/5.15.10 -isystem /usr/include/qt5/QtCore/5.15.10/QtCore -pipe -frecord-gcc-switches -Wall -g -O2 -flto=auto -march=i586 -mtune=generic -fno-common -Wall -Wextra -Wcast-align -Wchar-subscripts -Wformat-security -Wno-long-long -Wpointer-arith -Wundef -Wmissing-format-attribute -Wwrite-strings -Werror=implicit-function-declaration -O2 -DNDEBUG -std=c99 -fPIC -fvisibility=hidden -fPIC -MD -MT src/plugins/wayland/CMakeFiles/KF5IdleTimeWaylandPlugin.dir/wayland-ext-idle-notify-v1-protocol.c.o -MF CMakeFiles/KF5IdleTimeWaylandPlugin.dir/wayland-ext-idle-notify-v1-protocol.c.o.d -o CMakeFiles/KF5IdleTimeWaylandPlugin.dir/wayland-ext-idle-notify-v1-protocol.c.o -c /usr/src/RPM/BUILD/kidletime-5.112.0/BUILD/src/plugins/wayland/wayland-ext-idle-notify-v1-protocol.c
make[2]: Leaving directory '/usr/src/RPM/BUILD/kidletime-5.112.0/BUILD'
make[2]: Entering directory '/usr/src/RPM/BUILD/kidletime-5.112.0/BUILD'
[ 85%] Building C object src/plugins/wayland/CMakeFiles/KF5IdleTimeWaylandPlugin.dir/wayland-idle-protocol.c.o
cd /usr/src/RPM/BUILD/kidletime-5.112.0/BUILD/src/plugins/wayland && /usr/bin/cc -DKF5IdleTimeWaylandPlugin_EXPORTS -DKF_DEPRECATED_WARNINGS_SINCE=0x60000 -DKF_DISABLE_DEPRECATED_BEFORE_AND_AT=0x56100 -DKIDLETIME_DEPRECATED_WARNINGS_SINCE=0x0 -DKIDLETIME_DISABLE_DEPRECATED_BEFORE_AND_AT=0x0 -DQT_CORE_LIB -DQT_DEPRECATED_WARNINGS_SINCE=0x60000 -DQT_DISABLE_DEPRECATED_BEFORE=0x50f02 -DQT_GUI_LIB -DQT_NO_CAST_FROM_ASCII -DQT_NO_CAST_FROM_BYTEARRAY -DQT_NO_CAST_TO_ASCII -DQT_NO_DEBUG -DQT_NO_FOREACH -DQT_NO_KEYWORDS -DQT_NO_NARROWING_CONVERSIONS_IN_CONNECT -DQT_NO_URL_CAST_FROM_STRING -DQT_STRICT_ITERATORS -DQT_USE_QSTRINGBUILDER -DQT_WAYLANDCLIENT_LIB -D_FILE_OFFSET_BITS=64 -D_GNU_SOURCE -D_LARGEFILE64_SOURCE -I/usr/src/RPM/BUILD/kidletime-5.112.0/BUILD/src/plugins/wayland -I/usr/src/RPM/BUILD/kidletime-5.112.0/src/plugins/wayland -I/usr/src/RPM/BUILD/kidletime-5.112.0/BUILD/src/plugins/wayland/KF5IdleTimeWaylandPlugin_autogen/include -I/usr/src/RPM/BUILD/kidletime-5.112.0/BUILD/src -I/usr/src/RPM/BUILD/kidletime-5.112.0/src -isystem /usr/include/qt5 -isystem /usr/include/qt5/QtCore -isystem /usr/share/qt5/../../lib/qt5/mkspecs/linux-g++ -isystem /usr/include/qt5/QtWaylandClient -isystem /usr/include/qt5/QtGui -isystem /usr/include/qt5/QtGui/5.15.10 -isystem /usr/include/qt5/QtGui/5.15.10/QtGui -isystem /usr/include/qt5/QtCore/5.15.10 -isystem /usr/include/qt5/QtCore/5.15.10/QtCore -pipe -frecord-gcc-switches -Wall -g -O2 -flto=auto -march=i586 -mtune=generic -fno-common -Wall -Wextra -Wcast-align -Wchar-subscripts -Wformat-security -Wno-long-long -Wpointer-arith -Wundef -Wmissing-format-attribute -Wwrite-strings -Werror=implicit-function-declaration -O2 -DNDEBUG -std=c99 -fPIC -fvisibility=hidden -fPIC -MD -MT src/plugins/wayland/CMakeFiles/KF5IdleTimeWaylandPlugin.dir/wayland-idle-protocol.c.o -MF CMakeFiles/KF5IdleTimeWaylandPlugin.dir/wayland-idle-protocol.c.o.d -o CMakeFiles/KF5IdleTimeWaylandPlugin.dir/wayland-idle-protocol.c.o -c /usr/src/RPM/BUILD/kidletime-5.112.0/BUILD/src/plugins/wayland/wayland-idle-protocol.c
make[2]: Leaving directory '/usr/src/RPM/BUILD/kidletime-5.112.0/BUILD'
make[2]: Entering directory '/usr/src/RPM/BUILD/kidletime-5.112.0/BUILD'
[ 78%] Building CXX object src/plugins/wayland/CMakeFiles/KF5IdleTimeWaylandPlugin.dir/qwayland-idle.cpp.o
cd /usr/src/RPM/BUILD/kidletime-5.112.0/BUILD/src/plugins/wayland && /usr/bin/c++ -DKF5IdleTimeWaylandPlugin_EXPORTS -DKF_DEPRECATED_WARNINGS_SINCE=0x60000 -DKF_DISABLE_DEPRECATED_BEFORE_AND_AT=0x56100 -DKIDLETIME_DEPRECATED_WARNINGS_SINCE=0x0 -DKIDLETIME_DISABLE_DEPRECATED_BEFORE_AND_AT=0x0 -DQT_CORE_LIB -DQT_DEPRECATED_WARNINGS_SINCE=0x60000 -DQT_DISABLE_DEPRECATED_BEFORE=0x50f02 -DQT_GUI_LIB -DQT_NO_CAST_FROM_ASCII -DQT_NO_CAST_FROM_BYTEARRAY -DQT_NO_CAST_TO_ASCII -DQT_NO_DEBUG -DQT_NO_FOREACH -DQT_NO_KEYWORDS -DQT_NO_NARROWING_CONVERSIONS_IN_CONNECT -DQT_NO_URL_CAST_FROM_STRING -DQT_STRICT_ITERATORS -DQT_USE_QSTRINGBUILDER -DQT_WAYLANDCLIENT_LIB -D_FILE_OFFSET_BITS=64 -D_GNU_SOURCE -D_LARGEFILE64_SOURCE -I/usr/src/RPM/BUILD/kidletime-5.112.0/BUILD/src/plugins/wayland -I/usr/src/RPM/BUILD/kidletime-5.112.0/src/plugins/wayland -I/usr/src/RPM/BUILD/kidletime-5.112.0/BUILD/src/plugins/wayland/KF5IdleTimeWaylandPlugin_autogen/include -I/usr/src/RPM/BUILD/kidletime-5.112.0/BUILD/src -I/usr/src/RPM/BUILD/kidletime-5.112.0/src -isystem /usr/include/qt5 -isystem /usr/include/qt5/QtCore -isystem /usr/share/qt5/../../lib/qt5/mkspecs/linux-g++ -isystem /usr/include/qt5/QtWaylandClient -isystem /usr/include/qt5/QtGui -isystem /usr/include/qt5/QtGui/5.15.10 -isystem /usr/include/qt5/QtGui/5.15.10/QtGui -isystem /usr/include/qt5/QtCore/5.15.10 -isystem /usr/include/qt5/QtCore/5.15.10/QtCore -pipe -frecord-gcc-switches -Wall -g -O2 -flto=auto -march=i586 -mtune=generic -fno-operator-names -fno-exceptions -Wall -Wextra -Wcast-align -Wchar-subscripts -Wformat-security -Wno-long-long -Wpointer-arith -Wundef -Wnon-virtual-dtor -Woverloaded-virtual -Werror=return-type -Werror=init-self -Werror=undef -Wvla -Wdate-time -Wsuggest-override -Wlogical-op -pedantic -Wzero-as-null-pointer-constant -Wmissing-include-dirs -O2 -DNDEBUG -std=c++17 -fPIC -fvisibility=hidden -fvisibility-inlines-hidden -fPIC -MD -MT src/plugins/wayland/CMakeFiles/KF5IdleTimeWaylandPlugin.dir/qwayland-idle.cpp.o -MF CMakeFiles/KF5IdleTimeWaylandPlugin.dir/qwayland-idle.cpp.o.d -o CMakeFiles/KF5IdleTimeWaylandPlugin.dir/qwayland-idle.cpp.o -c /usr/src/RPM/BUILD/kidletime-5.112.0/BUILD/src/plugins/wayland/qwayland-idle.cpp
make[2]: Leaving directory '/usr/src/RPM/BUILD/kidletime-5.112.0/BUILD'
make[2]: Entering directory '/usr/src/RPM/BUILD/kidletime-5.112.0/BUILD'
[ 90%] Building CXX object src/plugins/wayland/CMakeFiles/KF5IdleTimeWaylandPlugin.dir/qwayland-ext-idle-notify-v1.cpp.o
cd /usr/src/RPM/BUILD/kidletime-5.112.0/BUILD/src/plugins/wayland && /usr/bin/c++ -DKF5IdleTimeWaylandPlugin_EXPORTS -DKF_DEPRECATED_WARNINGS_SINCE=0x60000 -DKF_DISABLE_DEPRECATED_BEFORE_AND_AT=0x56100 -DKIDLETIME_DEPRECATED_WARNINGS_SINCE=0x0 -DKIDLETIME_DISABLE_DEPRECATED_BEFORE_AND_AT=0x0 -DQT_CORE_LIB -DQT_DEPRECATED_WARNINGS_SINCE=0x60000 -DQT_DISABLE_DEPRECATED_BEFORE=0x50f02 -DQT_GUI_LIB -DQT_NO_CAST_FROM_ASCII -DQT_NO_CAST_FROM_BYTEARRAY -DQT_NO_CAST_TO_ASCII -DQT_NO_DEBUG -DQT_NO_FOREACH -DQT_NO_KEYWORDS -DQT_NO_NARROWING_CONVERSIONS_IN_CONNECT -DQT_NO_URL_CAST_FROM_STRING -DQT_STRICT_ITERATORS -DQT_USE_QSTRINGBUILDER -DQT_WAYLANDCLIENT_LIB -D_FILE_OFFSET_BITS=64 -D_GNU_SOURCE -D_LARGEFILE64_SOURCE -I/usr/src/RPM/BUILD/kidletime-5.112.0/BUILD/src/plugins/wayland -I/usr/src/RPM/BUILD/kidletime-5.112.0/src/plugins/wayland -I/usr/src/RPM/BUILD/kidletime-5.112.0/BUILD/src/plugins/wayland/KF5IdleTimeWaylandPlugin_autogen/include -I/usr/src/RPM/BUILD/kidletime-5.112.0/BUILD/src -I/usr/src/RPM/BUILD/kidletime-5.112.0/src -isystem /usr/include/qt5 -isystem /usr/include/qt5/QtCore -isystem /usr/share/qt5/../../lib/qt5/mkspecs/linux-g++ -isystem /usr/include/qt5/QtWaylandClient -isystem /usr/include/qt5/QtGui -isystem /usr/include/qt5/QtGui/5.15.10 -isystem /usr/include/qt5/QtGui/5.15.10/QtGui -isystem /usr/include/qt5/QtCore/5.15.10 -isystem /usr/include/qt5/QtCore/5.15.10/QtCore -pipe -frecord-gcc-switches -Wall -g -O2 -flto=auto -march=i586 -mtune=generic -fno-operator-names -fno-exceptions -Wall -Wextra -Wcast-align -Wchar-subscripts -Wformat-security -Wno-long-long -Wpointer-arith -Wundef -Wnon-virtual-dtor -Woverloaded-virtual -Werror=return-type -Werror=init-self -Werror=undef -Wvla -Wdate-time -Wsuggest-override -Wlogical-op -pedantic -Wzero-as-null-pointer-constant -Wmissing-include-dirs -O2 -DNDEBUG -std=c++17 -fPIC -fvisibility=hidden -fvisibility-inlines-hidden -fPIC -MD -MT src/plugins/wayland/CMakeFiles/KF5IdleTimeWaylandPlugin.dir/qwayland-ext-idle-notify-v1.cpp.o -MF CMakeFiles/KF5IdleTimeWaylandPlugin.dir/qwayland-ext-idle-notify-v1.cpp.o.d -o CMakeFiles/KF5IdleTimeWaylandPlugin.dir/qwayland-ext-idle-notify-v1.cpp.o -c /usr/src/RPM/BUILD/kidletime-5.112.0/BUILD/src/plugins/wayland/qwayland-ext-idle-notify-v1.cpp
make[2]: Leaving directory '/usr/src/RPM/BUILD/kidletime-5.112.0/BUILD'
make[2]: Entering directory '/usr/src/RPM/BUILD/kidletime-5.112.0/BUILD'
[ 48%] Building CXX object src/plugins/xsync/CMakeFiles/KF5IdleTimeXcbPlugin0.dir/__/__/logging.cpp.o
cd /usr/src/RPM/BUILD/kidletime-5.112.0/BUILD/src/plugins/xsync && /usr/bin/c++ -DKF5IdleTimeXcbPlugin0_EXPORTS -DKF_DEPRECATED_WARNINGS_SINCE=0x60000 -DKF_DISABLE_DEPRECATED_BEFORE_AND_AT=0x56100 -DKIDLETIME_DEPRECATED_WARNINGS_SINCE=0x0 -DKIDLETIME_DISABLE_DEPRECATED_BEFORE_AND_AT=0x0 -DQT_CORE_LIB -DQT_DEPRECATED_WARNINGS_SINCE=0x60000 -DQT_DISABLE_DEPRECATED_BEFORE=0x50f02 -DQT_GUI_LIB -DQT_NO_CAST_FROM_ASCII -DQT_NO_CAST_FROM_BYTEARRAY -DQT_NO_CAST_TO_ASCII -DQT_NO_DEBUG -DQT_NO_FOREACH -DQT_NO_KEYWORDS -DQT_NO_NARROWING_CONVERSIONS_IN_CONNECT -DQT_NO_URL_CAST_FROM_STRING -DQT_STRICT_ITERATORS -DQT_USE_QSTRINGBUILDER -DQT_X11EXTRAS_LIB -D_FILE_OFFSET_BITS=64 -D_GNU_SOURCE -D_LARGEFILE64_SOURCE -I/usr/src/RPM/BUILD/kidletime-5.112.0/BUILD/src/plugins/xsync -I/usr/src/RPM/BUILD/kidletime-5.112.0/src/plugins/xsync -I/usr/src/RPM/BUILD/kidletime-5.112.0/BUILD/src/plugins/xsync/KF5IdleTimeXcbPlugin0_autogen/include -I/usr/src/RPM/BUILD/kidletime-5.112.0/BUILD/src -I/usr/src/RPM/BUILD/kidletime-5.112.0/src -isystem /usr/include/qt5 -isystem /usr/include/qt5/QtCore -isystem /usr/share/qt5/../../lib/qt5/mkspecs/linux-g++ -isystem /usr/include/qt5/QtX11Extras -isystem /usr/include/qt5/QtGui -pipe -frecord-gcc-switches -Wall -g -O2 -flto=auto -march=i586 -mtune=generic -fno-operator-names -fno-exceptions -Wall -Wextra -Wcast-align -Wchar-subscripts -Wformat-security -Wno-long-long -Wpointer-arith -Wundef -Wnon-virtual-dtor -Woverloaded-virtual -Werror=return-type -Werror=init-self -Werror=undef -Wvla -Wdate-time -Wsuggest-override -Wlogical-op -pedantic -Wzero-as-null-pointer-constant -Wmissing-include-dirs -O2 -DNDEBUG -std=c++17 -fPIC -fvisibility=hidden -fvisibility-inlines-hidden -fPIC -MD -MT src/plugins/xsync/CMakeFiles/KF5IdleTimeXcbPlugin0.dir/__/__/logging.cpp.o -MF CMakeFiles/KF5IdleTimeXcbPlugin0.dir/__/__/logging.cpp.o.d -o CMakeFiles/KF5IdleTimeXcbPlugin0.dir/__/__/logging.cpp.o -c /usr/src/RPM/BUILD/kidletime-5.112.0/BUILD/src/logging.cpp
make[2]: Leaving directory '/usr/src/RPM/BUILD/kidletime-5.112.0/BUILD'
make[2]: Entering directory '/usr/src/RPM/BUILD/kidletime-5.112.0/BUILD'
[ 36%] Building CXX object examples/CMakeFiles/kidletime_example.dir/KIdleTest.cpp.o
cd /usr/src/RPM/BUILD/kidletime-5.112.0/BUILD/examples && /usr/bin/c++ -DKF_DEPRECATED_WARNINGS_SINCE=0x60000 -DKF_DISABLE_DEPRECATED_BEFORE_AND_AT=0x56100 -DKIDLETIME_DEPRECATED_WARNINGS_SINCE=0x0 -DKIDLETIME_DISABLE_DEPRECATED_BEFORE_AND_AT=0x0 -DQT_CORE_LIB -DQT_DEPRECATED_WARNINGS_SINCE=0x60000 -DQT_DISABLE_DEPRECATED_BEFORE=0x50f02 -DQT_GUI_LIB -DQT_NO_CAST_FROM_ASCII -DQT_NO_CAST_FROM_BYTEARRAY -DQT_NO_CAST_TO_ASCII -DQT_NO_DEBUG -DQT_NO_FOREACH -DQT_NO_KEYWORDS -DQT_NO_NARROWING_CONVERSIONS_IN_CONNECT -DQT_NO_URL_CAST_FROM_STRING -DQT_STRICT_ITERATORS -DQT_USE_QSTRINGBUILDER -D_FILE_OFFSET_BITS=64 -D_GNU_SOURCE -D_LARGEFILE64_SOURCE -I/usr/src/RPM/BUILD/kidletime-5.112.0/BUILD/examples -I/usr/src/RPM/BUILD/kidletime-5.112.0/examples -I/usr/src/RPM/BUILD/kidletime-5.112.0/BUILD/examples/kidletime_example_autogen/include -I/usr/src/RPM/BUILD/kidletime-5.112.0/BUILD/src -I/usr/src/RPM/BUILD/kidletime-5.112.0/src -isystem /usr/include/qt5 -isystem /usr/include/qt5/QtCore -isystem /usr/share/qt5/../../lib/qt5/mkspecs/linux-g++ -isystem /usr/include/qt5/QtGui -pipe -frecord-gcc-switches -Wall -g -O2 -flto=auto -march=i586 -mtune=generic -fno-operator-names -fno-exceptions -Wall -Wextra -Wcast-align -Wchar-subscripts -Wformat-security -Wno-long-long -Wpointer-arith -Wundef -Wnon-virtual-dtor -Woverloaded-virtual -Werror=return-type -Werror=init-self -Werror=undef -Wvla -Wdate-time -Wsuggest-override -Wlogical-op -pedantic -Wzero-as-null-pointer-constant -Wmissing-include-dirs -O2 -DNDEBUG -std=c++17 -fvisibility=hidden -fvisibility-inlines-hidden -fPIC -MD -MT examples/CMakeFiles/kidletime_example.dir/KIdleTest.cpp.o -MF CMakeFiles/kidletime_example.dir/KIdleTest.cpp.o.d -o CMakeFiles/kidletime_example.dir/KIdleTest.cpp.o -c /usr/src/RPM/BUILD/kidletime-5.112.0/examples/KIdleTest.cpp
make[2]: Leaving directory '/usr/src/RPM/BUILD/kidletime-5.112.0/BUILD'
make[2]: Entering directory '/usr/src/RPM/BUILD/kidletime-5.112.0/BUILD'
[ 56%] Building CXX object src/plugins/xsync/CMakeFiles/KF5IdleTimeXcbPlugin0.dir/xsync_logging.cpp.o
cd /usr/src/RPM/BUILD/kidletime-5.112.0/BUILD/src/plugins/xsync && /usr/bin/c++ -DKF5IdleTimeXcbPlugin0_EXPORTS -DKF_DEPRECATED_WARNINGS_SINCE=0x60000 -DKF_DISABLE_DEPRECATED_BEFORE_AND_AT=0x56100 -DKIDLETIME_DEPRECATED_WARNINGS_SINCE=0x0 -DKIDLETIME_DISABLE_DEPRECATED_BEFORE_AND_AT=0x0 -DQT_CORE_LIB -DQT_DEPRECATED_WARNINGS_SINCE=0x60000 -DQT_DISABLE_DEPRECATED_BEFORE=0x50f02 -DQT_GUI_LIB -DQT_NO_CAST_FROM_ASCII -DQT_NO_CAST_FROM_BYTEARRAY -DQT_NO_CAST_TO_ASCII -DQT_NO_DEBUG -DQT_NO_FOREACH -DQT_NO_KEYWORDS -DQT_NO_NARROWING_CONVERSIONS_IN_CONNECT -DQT_NO_URL_CAST_FROM_STRING -DQT_STRICT_ITERATORS -DQT_USE_QSTRINGBUILDER -DQT_X11EXTRAS_LIB -D_FILE_OFFSET_BITS=64 -D_GNU_SOURCE -D_LARGEFILE64_SOURCE -I/usr/src/RPM/BUILD/kidletime-5.112.0/BUILD/src/plugins/xsync -I/usr/src/RPM/BUILD/kidletime-5.112.0/src/plugins/xsync -I/usr/src/RPM/BUILD/kidletime-5.112.0/BUILD/src/plugins/xsync/KF5IdleTimeXcbPlugin0_autogen/include -I/usr/src/RPM/BUILD/kidletime-5.112.0/BUILD/src -I/usr/src/RPM/BUILD/kidletime-5.112.0/src -isystem /usr/include/qt5 -isystem /usr/include/qt5/QtCore -isystem /usr/share/qt5/../../lib/qt5/mkspecs/linux-g++ -isystem /usr/include/qt5/QtX11Extras -isystem /usr/include/qt5/QtGui -pipe -frecord-gcc-switches -Wall -g -O2 -flto=auto -march=i586 -mtune=generic -fno-operator-names -fno-exceptions -Wall -Wextra -Wcast-align -Wchar-subscripts -Wformat-security -Wno-long-long -Wpointer-arith -Wundef -Wnon-virtual-dtor -Woverloaded-virtual -Werror=return-type -Werror=init-self -Werror=undef -Wvla -Wdate-time -Wsuggest-override -Wlogical-op -pedantic -Wzero-as-null-pointer-constant -Wmissing-include-dirs -O2 -DNDEBUG -std=c++17 -fPIC -fvisibility=hidden -fvisibility-inlines-hidden -fPIC -MD -MT src/plugins/xsync/CMakeFiles/KF5IdleTimeXcbPlugin0.dir/xsync_logging.cpp.o -MF CMakeFiles/KF5IdleTimeXcbPlugin0.dir/xsync_logging.cpp.o.d -o CMakeFiles/KF5IdleTimeXcbPlugin0.dir/xsync_logging.cpp.o -c /usr/src/RPM/BUILD/kidletime-5.112.0/BUILD/src/plugins/xsync/xsync_logging.cpp
make[2]: Leaving directory '/usr/src/RPM/BUILD/kidletime-5.112.0/BUILD'
make[2]: Entering directory '/usr/src/RPM/BUILD/kidletime-5.112.0/BUILD'
[ 34%] Building CXX object examples/CMakeFiles/kidletime_example.dir/main.cpp.o
cd /usr/src/RPM/BUILD/kidletime-5.112.0/BUILD/examples && /usr/bin/c++ -DKF_DEPRECATED_WARNINGS_SINCE=0x60000 -DKF_DISABLE_DEPRECATED_BEFORE_AND_AT=0x56100 -DKIDLETIME_DEPRECATED_WARNINGS_SINCE=0x0 -DKIDLETIME_DISABLE_DEPRECATED_BEFORE_AND_AT=0x0 -DQT_CORE_LIB -DQT_DEPRECATED_WARNINGS_SINCE=0x60000 -DQT_DISABLE_DEPRECATED_BEFORE=0x50f02 -DQT_GUI_LIB -DQT_NO_CAST_FROM_ASCII -DQT_NO_CAST_FROM_BYTEARRAY -DQT_NO_CAST_TO_ASCII -DQT_NO_DEBUG -DQT_NO_FOREACH -DQT_NO_KEYWORDS -DQT_NO_NARROWING_CONVERSIONS_IN_CONNECT -DQT_NO_URL_CAST_FROM_STRING -DQT_STRICT_ITERATORS -DQT_USE_QSTRINGBUILDER -D_FILE_OFFSET_BITS=64 -D_GNU_SOURCE -D_LARGEFILE64_SOURCE -I/usr/src/RPM/BUILD/kidletime-5.112.0/BUILD/examples -I/usr/src/RPM/BUILD/kidletime-5.112.0/examples -I/usr/src/RPM/BUILD/kidletime-5.112.0/BUILD/examples/kidletime_example_autogen/include -I/usr/src/RPM/BUILD/kidletime-5.112.0/BUILD/src -I/usr/src/RPM/BUILD/kidletime-5.112.0/src -isystem /usr/include/qt5 -isystem /usr/include/qt5/QtCore -isystem /usr/share/qt5/../../lib/qt5/mkspecs/linux-g++ -isystem /usr/include/qt5/QtGui -pipe -frecord-gcc-switches -Wall -g -O2 -flto=auto -march=i586 -mtune=generic -fno-operator-names -fno-exceptions -Wall -Wextra -Wcast-align -Wchar-subscripts -Wformat-security -Wno-long-long -Wpointer-arith -Wundef -Wnon-virtual-dtor -Woverloaded-virtual -Werror=return-type -Werror=init-self -Werror=undef -Wvla -Wdate-time -Wsuggest-override -Wlogical-op -pedantic -Wzero-as-null-pointer-constant -Wmissing-include-dirs -O2 -DNDEBUG -std=c++17 -fvisibility=hidden -fvisibility-inlines-hidden -fPIC -MD -MT examples/CMakeFiles/kidletime_example.dir/main.cpp.o -MF CMakeFiles/kidletime_example.dir/main.cpp.o.d -o CMakeFiles/kidletime_example.dir/main.cpp.o -c /usr/src/RPM/BUILD/kidletime-5.112.0/examples/main.cpp
make[2]: Leaving directory '/usr/src/RPM/BUILD/kidletime-5.112.0/BUILD'
make[2]: Entering directory '/usr/src/RPM/BUILD/kidletime-5.112.0/BUILD'
[ 53%] Building CXX object src/plugins/xsync/CMakeFiles/KF5IdleTimeXcbPlugin0.dir/xsyncbasedpoller.cpp.o
cd /usr/src/RPM/BUILD/kidletime-5.112.0/BUILD/src/plugins/xsync && /usr/bin/c++ -DKF5IdleTimeXcbPlugin0_EXPORTS -DKF_DEPRECATED_WARNINGS_SINCE=0x60000 -DKF_DISABLE_DEPRECATED_BEFORE_AND_AT=0x56100 -DKIDLETIME_DEPRECATED_WARNINGS_SINCE=0x0 -DKIDLETIME_DISABLE_DEPRECATED_BEFORE_AND_AT=0x0 -DQT_CORE_LIB -DQT_DEPRECATED_WARNINGS_SINCE=0x60000 -DQT_DISABLE_DEPRECATED_BEFORE=0x50f02 -DQT_GUI_LIB -DQT_NO_CAST_FROM_ASCII -DQT_NO_CAST_FROM_BYTEARRAY -DQT_NO_CAST_TO_ASCII -DQT_NO_DEBUG -DQT_NO_FOREACH -DQT_NO_KEYWORDS -DQT_NO_NARROWING_CONVERSIONS_IN_CONNECT -DQT_NO_URL_CAST_FROM_STRING -DQT_STRICT_ITERATORS -DQT_USE_QSTRINGBUILDER -DQT_X11EXTRAS_LIB -D_FILE_OFFSET_BITS=64 -D_GNU_SOURCE -D_LARGEFILE64_SOURCE -I/usr/src/RPM/BUILD/kidletime-5.112.0/BUILD/src/plugins/xsync -I/usr/src/RPM/BUILD/kidletime-5.112.0/src/plugins/xsync -I/usr/src/RPM/BUILD/kidletime-5.112.0/BUILD/src/plugins/xsync/KF5IdleTimeXcbPlugin0_autogen/include -I/usr/src/RPM/BUILD/kidletime-5.112.0/BUILD/src -I/usr/src/RPM/BUILD/kidletime-5.112.0/src -isystem /usr/include/qt5 -isystem /usr/include/qt5/QtCore -isystem /usr/share/qt5/../../lib/qt5/mkspecs/linux-g++ -isystem /usr/include/qt5/QtX11Extras -isystem /usr/include/qt5/QtGui -pipe -frecord-gcc-switches -Wall -g -O2 -flto=auto -march=i586 -mtune=generic -fno-operator-names -fno-exceptions -Wall -Wextra -Wcast-align -Wchar-subscripts -Wformat-security -Wno-long-long -Wpointer-arith -Wundef -Wnon-virtual-dtor -Woverloaded-virtual -Werror=return-type -Werror=init-self -Werror=undef -Wvla -Wdate-time -Wsuggest-override -Wlogical-op -pedantic -Wzero-as-null-pointer-constant -Wmissing-include-dirs -O2 -DNDEBUG -std=c++17 -fPIC -fvisibility=hidden -fvisibility-inlines-hidden -fPIC -MD -MT src/plugins/xsync/CMakeFiles/KF5IdleTimeXcbPlugin0.dir/xsyncbasedpoller.cpp.o -MF CMakeFiles/KF5IdleTimeXcbPlugin0.dir/xsyncbasedpoller.cpp.o.d -o CMakeFiles/KF5IdleTimeXcbPlugin0.dir/xsyncbasedpoller.cpp.o -c /usr/src/RPM/BUILD/kidletime-5.112.0/src/plugins/xsync/xsyncbasedpoller.cpp
make[2]: Leaving directory '/usr/src/RPM/BUILD/kidletime-5.112.0/BUILD'
make[2]: Entering directory '/usr/src/RPM/BUILD/kidletime-5.112.0/BUILD'
[ 92%] Linking CXX executable ../bin/kidletime_example
cd /usr/src/RPM/BUILD/kidletime-5.112.0/BUILD/examples && /usr/bin/cmake -E cmake_link_script CMakeFiles/kidletime_example.dir/link.txt --verbose=1
/usr/bin/c++ -pipe -frecord-gcc-switches -Wall -g -O2 -flto=auto -march=i586 -mtune=generic -fno-operator-names -fno-exceptions -Wall -Wextra -Wcast-align -Wchar-subscripts -Wformat-security -Wno-long-long -Wpointer-arith -Wundef -Wnon-virtual-dtor -Woverloaded-virtual -Werror=return-type -Werror=init-self -Werror=undef -Wvla -Wdate-time -Wsuggest-override -Wlogical-op -pedantic -Wzero-as-null-pointer-constant -Wmissing-include-dirs -O2 -DNDEBUG -Wl,--enable-new-dtags -L/usr/lib -L/usr/lib/kf5/devel CMakeFiles/kidletime_example.dir/kidletime_example_autogen/mocs_compilation.cpp.o CMakeFiles/kidletime_example.dir/main.cpp.o CMakeFiles/kidletime_example.dir/KIdleTest.cpp.o -o ../bin/kidletime_example ../bin/libKF5IdleTime.so.5.112.0 /usr/lib/libQt5Gui.so.5.15.10 /usr/lib/libQt5Core.so.5.15.10
make[2]: Leaving directory '/usr/src/RPM/BUILD/kidletime-5.112.0/BUILD'
make[1]: Entering directory '/usr/src/RPM/BUILD/kidletime-5.112.0/BUILD'
[ 95%] Built target kidletime_example
make[1]: Leaving directory '/usr/src/RPM/BUILD/kidletime-5.112.0/BUILD'
make[2]: Entering directory '/usr/src/RPM/BUILD/kidletime-5.112.0/BUILD'
[ 80%] Building CXX object src/plugins/wayland/CMakeFiles/KF5IdleTimeWaylandPlugin.dir/poller.cpp.o
cd /usr/src/RPM/BUILD/kidletime-5.112.0/BUILD/src/plugins/wayland && /usr/bin/c++ -DKF5IdleTimeWaylandPlugin_EXPORTS -DKF_DEPRECATED_WARNINGS_SINCE=0x60000 -DKF_DISABLE_DEPRECATED_BEFORE_AND_AT=0x56100 -DKIDLETIME_DEPRECATED_WARNINGS_SINCE=0x0 -DKIDLETIME_DISABLE_DEPRECATED_BEFORE_AND_AT=0x0 -DQT_CORE_LIB -DQT_DEPRECATED_WARNINGS_SINCE=0x60000 -DQT_DISABLE_DEPRECATED_BEFORE=0x50f02 -DQT_GUI_LIB -DQT_NO_CAST_FROM_ASCII -DQT_NO_CAST_FROM_BYTEARRAY -DQT_NO_CAST_TO_ASCII -DQT_NO_DEBUG -DQT_NO_FOREACH -DQT_NO_KEYWORDS -DQT_NO_NARROWING_CONVERSIONS_IN_CONNECT -DQT_NO_URL_CAST_FROM_STRING -DQT_STRICT_ITERATORS -DQT_USE_QSTRINGBUILDER -DQT_WAYLANDCLIENT_LIB -D_FILE_OFFSET_BITS=64 -D_GNU_SOURCE -D_LARGEFILE64_SOURCE -I/usr/src/RPM/BUILD/kidletime-5.112.0/BUILD/src/plugins/wayland -I/usr/src/RPM/BUILD/kidletime-5.112.0/src/plugins/wayland -I/usr/src/RPM/BUILD/kidletime-5.112.0/BUILD/src/plugins/wayland/KF5IdleTimeWaylandPlugin_autogen/include -I/usr/src/RPM/BUILD/kidletime-5.112.0/BUILD/src -I/usr/src/RPM/BUILD/kidletime-5.112.0/src -isystem /usr/include/qt5 -isystem /usr/include/qt5/QtCore -isystem /usr/share/qt5/../../lib/qt5/mkspecs/linux-g++ -isystem /usr/include/qt5/QtWaylandClient -isystem /usr/include/qt5/QtGui -isystem /usr/include/qt5/QtGui/5.15.10 -isystem /usr/include/qt5/QtGui/5.15.10/QtGui -isystem /usr/include/qt5/QtCore/5.15.10 -isystem /usr/include/qt5/QtCore/5.15.10/QtCore -pipe -frecord-gcc-switches -Wall -g -O2 -flto=auto -march=i586 -mtune=generic -fno-operator-names -fno-exceptions -Wall -Wextra -Wcast-align -Wchar-subscripts -Wformat-security -Wno-long-long -Wpointer-arith -Wundef -Wnon-virtual-dtor -Woverloaded-virtual -Werror=return-type -Werror=init-self -Werror=undef -Wvla -Wdate-time -Wsuggest-override -Wlogical-op -pedantic -Wzero-as-null-pointer-constant -Wmissing-include-dirs -O2 -DNDEBUG -std=c++17 -fPIC -fvisibility=hidden -fvisibility-inlines-hidden -fPIC -MD -MT src/plugins/wayland/CMakeFiles/KF5IdleTimeWaylandPlugin.dir/poller.cpp.o -MF CMakeFiles/KF5IdleTimeWaylandPlugin.dir/poller.cpp.o.d -o CMakeFiles/KF5IdleTimeWaylandPlugin.dir/poller.cpp.o -c /usr/src/RPM/BUILD/kidletime-5.112.0/src/plugins/wayland/poller.cpp
make[2]: Leaving directory '/usr/src/RPM/BUILD/kidletime-5.112.0/BUILD'
make[2]: Entering directory '/usr/src/RPM/BUILD/kidletime-5.112.0/BUILD'
[ 95%] Linking CXX shared module ../../../bin/KF5IdleTimeXcbPlugin0.so
cd /usr/src/RPM/BUILD/kidletime-5.112.0/BUILD/src/plugins/xsync && /usr/bin/cmake -E cmake_link_script CMakeFiles/KF5IdleTimeXcbPlugin0.dir/link.txt --verbose=1
/usr/bin/c++ -fPIC -pipe -frecord-gcc-switches -Wall -g -O2 -flto=auto -march=i586 -mtune=generic -fno-operator-names -fno-exceptions -Wall -Wextra -Wcast-align -Wchar-subscripts -Wformat-security -Wno-long-long -Wpointer-arith -Wundef -Wnon-virtual-dtor -Woverloaded-virtual -Werror=return-type -Werror=init-self -Werror=undef -Wvla -Wdate-time -Wsuggest-override -Wlogical-op -pedantic -Wzero-as-null-pointer-constant -Wmissing-include-dirs -O2 -DNDEBUG -Wl,--no-undefined -Wl,--fatal-warnings -Wl,--enable-new-dtags -L/usr/lib -L/usr/lib/kf5/devel -Wl,-Bsymbolic-functions -shared -o ../../../bin/KF5IdleTimeXcbPlugin0.so CMakeFiles/KF5IdleTimeXcbPlugin0.dir/KF5IdleTimeXcbPlugin0_autogen/mocs_compilation.cpp.o CMakeFiles/KF5IdleTimeXcbPlugin0.dir/xsyncbasedpoller.cpp.o CMakeFiles/KF5IdleTimeXcbPlugin0.dir/__/__/logging.cpp.o CMakeFiles/KF5IdleTimeXcbPlugin0.dir/xsync_logging.cpp.o ../../../bin/libKF5IdleTime.so.5.112.0 /usr/lib/libxcb.so /usr/lib/libxcb-sync.so /usr/lib/libX11-xcb.so /usr/lib/libSM.so /usr/lib/libICE.so /usr/lib/libX11.so /usr/lib/libXext.so /usr/lib/libXext.so /usr/lib/libQt5X11Extras.so.5.15.10 /usr/lib/libxcb.so /usr/lib/libQt5Gui.so.5.15.10 /usr/lib/libQt5Core.so.5.15.10
make[2]: Leaving directory '/usr/src/RPM/BUILD/kidletime-5.112.0/BUILD'
make[1]: Entering directory '/usr/src/RPM/BUILD/kidletime-5.112.0/BUILD'
[ 97%] Built target KF5IdleTimeXcbPlugin0
make[1]: Leaving directory '/usr/src/RPM/BUILD/kidletime-5.112.0/BUILD'
make[2]: Entering directory '/usr/src/RPM/BUILD/kidletime-5.112.0/BUILD'
[ 41%] Building CXX object src/plugins/xscreensaver/CMakeFiles/KF5IdleTimeXcbPlugin1.dir/xscreensaverbasedpoller.cpp.o
cd /usr/src/RPM/BUILD/kidletime-5.112.0/BUILD/src/plugins/xscreensaver && /usr/bin/c++ -DKF5IdleTimeXcbPlugin1_EXPORTS -DKF_DEPRECATED_WARNINGS_SINCE=0x60000 -DKF_DISABLE_DEPRECATED_BEFORE_AND_AT=0x56100 -DKIDLETIME_DEPRECATED_WARNINGS_SINCE=0x0 -DKIDLETIME_DISABLE_DEPRECATED_BEFORE_AND_AT=0x0 -DQT_CORE_LIB -DQT_DBUS_LIB -DQT_DEPRECATED_WARNINGS_SINCE=0x60000 -DQT_DISABLE_DEPRECATED_BEFORE=0x50f02 -DQT_GUI_LIB -DQT_NO_CAST_FROM_ASCII -DQT_NO_CAST_FROM_BYTEARRAY -DQT_NO_CAST_TO_ASCII -DQT_NO_DEBUG -DQT_NO_FOREACH -DQT_NO_KEYWORDS -DQT_NO_NARROWING_CONVERSIONS_IN_CONNECT -DQT_NO_URL_CAST_FROM_STRING -DQT_STRICT_ITERATORS -DQT_USE_QSTRINGBUILDER -DQT_X11EXTRAS_LIB -D_FILE_OFFSET_BITS=64 -D_GNU_SOURCE -D_LARGEFILE64_SOURCE -I/usr/src/RPM/BUILD/kidletime-5.112.0/BUILD/src/plugins/xscreensaver -I/usr/src/RPM/BUILD/kidletime-5.112.0/src/plugins/xscreensaver -I/usr/src/RPM/BUILD/kidletime-5.112.0/BUILD/src/plugins/xscreensaver/KF5IdleTimeXcbPlugin1_autogen/include -I/usr/src/RPM/BUILD/kidletime-5.112.0/BUILD/src -I/usr/src/RPM/BUILD/kidletime-5.112.0/src -isystem /usr/include/qt5 -isystem /usr/include/qt5/QtCore -isystem /usr/share/qt5/../../lib/qt5/mkspecs/linux-g++ -isystem /usr/include/qt5/QtDBus -isystem /usr/include/qt5/QtX11Extras -isystem /usr/include/qt5/QtGui -pipe -frecord-gcc-switches -Wall -g -O2 -flto=auto -march=i586 -mtune=generic -fno-operator-names -fno-exceptions -Wall -Wextra -Wcast-align -Wchar-subscripts -Wformat-security -Wno-long-long -Wpointer-arith -Wundef -Wnon-virtual-dtor -Woverloaded-virtual -Werror=return-type -Werror=init-self -Werror=undef -Wvla -Wdate-time -Wsuggest-override -Wlogical-op -pedantic -Wzero-as-null-pointer-constant -Wmissing-include-dirs -O2 -DNDEBUG -std=c++17 -fPIC -fvisibility=hidden -fvisibility-inlines-hidden -fPIC -MD -MT src/plugins/xscreensaver/CMakeFiles/KF5IdleTimeXcbPlugin1.dir/xscreensaverbasedpoller.cpp.o -MF CMakeFiles/KF5IdleTimeXcbPlugin1.dir/xscreensaverbasedpoller.cpp.o.d -o CMakeFiles/KF5IdleTimeXcbPlugin1.dir/xscreensaverbasedpoller.cpp.o -c /usr/src/RPM/BUILD/kidletime-5.112.0/src/plugins/xscreensaver/xscreensaverbasedpoller.cpp
make[2]: Leaving directory '/usr/src/RPM/BUILD/kidletime-5.112.0/BUILD'
make[2]: Entering directory '/usr/src/RPM/BUILD/kidletime-5.112.0/BUILD'
[ 46%] Building CXX object src/plugins/xscreensaver/CMakeFiles/KF5IdleTimeXcbPlugin1.dir/screensaver_interface.cpp.o
cd /usr/src/RPM/BUILD/kidletime-5.112.0/BUILD/src/plugins/xscreensaver && /usr/bin/c++ -DKF5IdleTimeXcbPlugin1_EXPORTS -DKF_DEPRECATED_WARNINGS_SINCE=0x60000 -DKF_DISABLE_DEPRECATED_BEFORE_AND_AT=0x56100 -DKIDLETIME_DEPRECATED_WARNINGS_SINCE=0x0 -DKIDLETIME_DISABLE_DEPRECATED_BEFORE_AND_AT=0x0 -DQT_CORE_LIB -DQT_DBUS_LIB -DQT_DEPRECATED_WARNINGS_SINCE=0x60000 -DQT_DISABLE_DEPRECATED_BEFORE=0x50f02 -DQT_GUI_LIB -DQT_NO_CAST_FROM_ASCII -DQT_NO_CAST_FROM_BYTEARRAY -DQT_NO_CAST_TO_ASCII -DQT_NO_DEBUG -DQT_NO_FOREACH -DQT_NO_KEYWORDS -DQT_NO_NARROWING_CONVERSIONS_IN_CONNECT -DQT_NO_URL_CAST_FROM_STRING -DQT_STRICT_ITERATORS -DQT_USE_QSTRINGBUILDER -DQT_X11EXTRAS_LIB -D_FILE_OFFSET_BITS=64 -D_GNU_SOURCE -D_LARGEFILE64_SOURCE -I/usr/src/RPM/BUILD/kidletime-5.112.0/BUILD/src/plugins/xscreensaver -I/usr/src/RPM/BUILD/kidletime-5.112.0/src/plugins/xscreensaver -I/usr/src/RPM/BUILD/kidletime-5.112.0/BUILD/src/plugins/xscreensaver/KF5IdleTimeXcbPlugin1_autogen/include -I/usr/src/RPM/BUILD/kidletime-5.112.0/BUILD/src -I/usr/src/RPM/BUILD/kidletime-5.112.0/src -isystem /usr/include/qt5 -isystem /usr/include/qt5/QtCore -isystem /usr/share/qt5/../../lib/qt5/mkspecs/linux-g++ -isystem /usr/include/qt5/QtDBus -isystem /usr/include/qt5/QtX11Extras -isystem /usr/include/qt5/QtGui -pipe -frecord-gcc-switches -Wall -g -O2 -flto=auto -march=i586 -mtune=generic -fno-operator-names -fno-exceptions -Wall -Wextra -Wcast-align -Wchar-subscripts -Wformat-security -Wno-long-long -Wpointer-arith -Wundef -Wnon-virtual-dtor -Woverloaded-virtual -Werror=return-type -Werror=init-self -Werror=undef -Wvla -Wdate-time -Wsuggest-override -Wlogical-op -pedantic -Wzero-as-null-pointer-constant -Wmissing-include-dirs -O2 -DNDEBUG -std=c++17 -fPIC -fvisibility=hidden -fvisibility-inlines-hidden -fPIC -MD -MT src/plugins/xscreensaver/CMakeFiles/KF5IdleTimeXcbPlugin1.dir/screensaver_interface.cpp.o -MF CMakeFiles/KF5IdleTimeXcbPlugin1.dir/screensaver_interface.cpp.o.d -o CMakeFiles/KF5IdleTimeXcbPlugin1.dir/screensaver_interface.cpp.o -c /usr/src/RPM/BUILD/kidletime-5.112.0/BUILD/src/plugins/xscreensaver/screensaver_interface.cpp
make[2]: Leaving directory '/usr/src/RPM/BUILD/kidletime-5.112.0/BUILD'
make[2]: Entering directory '/usr/src/RPM/BUILD/kidletime-5.112.0/BUILD'
[ 97%] Linking CXX shared module ../../../bin/KF5IdleTimeWaylandPlugin.so
cd /usr/src/RPM/BUILD/kidletime-5.112.0/BUILD/src/plugins/wayland && /usr/bin/cmake -E cmake_link_script CMakeFiles/KF5IdleTimeWaylandPlugin.dir/link.txt --verbose=1
/usr/bin/c++ -fPIC -pipe -frecord-gcc-switches -Wall -g -O2 -flto=auto -march=i586 -mtune=generic -fno-operator-names -fno-exceptions -Wall -Wextra -Wcast-align -Wchar-subscripts -Wformat-security -Wno-long-long -Wpointer-arith -Wundef -Wnon-virtual-dtor -Woverloaded-virtual -Werror=return-type -Werror=init-self -Werror=undef -Wvla -Wdate-time -Wsuggest-override -Wlogical-op -pedantic -Wzero-as-null-pointer-constant -Wmissing-include-dirs -O2 -DNDEBUG -Wl,--no-undefined -Wl,--fatal-warnings -Wl,--enable-new-dtags -L/usr/lib -L/usr/lib/kf5/devel -Wl,-Bsymbolic-functions -shared -o ../../../bin/KF5IdleTimeWaylandPlugin.so CMakeFiles/KF5IdleTimeWaylandPlugin.dir/KF5IdleTimeWaylandPlugin_autogen/mocs_compilation.cpp.o CMakeFiles/KF5IdleTimeWaylandPlugin.dir/poller.cpp.o "CMakeFiles/KF5IdleTimeWaylandPlugin.dir/wayland-idle-protocol.c.o" "CMakeFiles/KF5IdleTimeWaylandPlugin.dir/qwayland-idle.cpp.o" "CMakeFiles/KF5IdleTimeWaylandPlugin.dir/wayland-ext-idle-notify-v1-protocol.c.o" "CMakeFiles/KF5IdleTimeWaylandPlugin.dir/qwayland-ext-idle-notify-v1.cpp.o" ../../../bin/libKF5IdleTime.so.5.112.0 /usr/lib/libQt5WaylandClient.so.5.15.10 /usr/lib/libwayland-client.so /usr/lib/libQt5Gui.so.5.15.10 /usr/lib/libQt5Core.so.5.15.10
make[2]: Leaving directory '/usr/src/RPM/BUILD/kidletime-5.112.0/BUILD'
make[1]: Entering directory '/usr/src/RPM/BUILD/kidletime-5.112.0/BUILD'
[100%] Built target KF5IdleTimeWaylandPlugin
make[1]: Leaving directory '/usr/src/RPM/BUILD/kidletime-5.112.0/BUILD'
make[2]: Entering directory '/usr/src/RPM/BUILD/kidletime-5.112.0/BUILD'
[100%] Linking CXX shared module ../../../bin/KF5IdleTimeXcbPlugin1.so
cd /usr/src/RPM/BUILD/kidletime-5.112.0/BUILD/src/plugins/xscreensaver && /usr/bin/cmake -E cmake_link_script CMakeFiles/KF5IdleTimeXcbPlugin1.dir/link.txt --verbose=1
/usr/bin/c++ -fPIC -pipe -frecord-gcc-switches -Wall -g -O2 -flto=auto -march=i586 -mtune=generic -fno-operator-names -fno-exceptions -Wall -Wextra -Wcast-align -Wchar-subscripts -Wformat-security -Wno-long-long -Wpointer-arith -Wundef -Wnon-virtual-dtor -Woverloaded-virtual -Werror=return-type -Werror=init-self -Werror=undef -Wvla -Wdate-time -Wsuggest-override -Wlogical-op -pedantic -Wzero-as-null-pointer-constant -Wmissing-include-dirs -O2 -DNDEBUG -Wl,--no-undefined -Wl,--fatal-warnings -Wl,--enable-new-dtags -L/usr/lib -L/usr/lib/kf5/devel -Wl,-Bsymbolic-functions -shared -o ../../../bin/KF5IdleTimeXcbPlugin1.so CMakeFiles/KF5IdleTimeXcbPlugin1.dir/KF5IdleTimeXcbPlugin1_autogen/mocs_compilation.cpp.o CMakeFiles/KF5IdleTimeXcbPlugin1.dir/xscreensaverbasedpoller.cpp.o CMakeFiles/KF5IdleTimeXcbPlugin1.dir/screensaver_interface.cpp.o ../../../bin/libKF5IdleTime.so.5.112.0 /usr/lib/libQt5DBus.so.5.15.10 /usr/lib/libSM.so /usr/lib/libICE.so /usr/lib/libX11.so /usr/lib/libXext.so /usr/lib/libXss.so /usr/lib/libQt5X11Extras.so.5.15.10 /usr/lib/libQt5Gui.so.5.15.10 /usr/lib/libQt5Core.so.5.15.10
make[2]: Leaving directory '/usr/src/RPM/BUILD/kidletime-5.112.0/BUILD'
make[1]: Entering directory '/usr/src/RPM/BUILD/kidletime-5.112.0/BUILD'
[100%] Built target KF5IdleTimeXcbPlugin1
make[1]: Leaving directory '/usr/src/RPM/BUILD/kidletime-5.112.0/BUILD'
make: Entering directory '/usr/src/RPM/BUILD/kidletime-5.112.0/BUILD'
/usr/bin/cmake -E cmake_progress_start /usr/src/RPM/BUILD/kidletime-5.112.0/BUILD/CMakeFiles 0
make: Leaving directory '/usr/src/RPM/BUILD/kidletime-5.112.0/BUILD'
+ popd
~/RPM/BUILD/kidletime-5.112.0
+ exit 0
Executing(%install): /bin/sh -e /usr/src/tmp/rpm-tmp.44072
+ umask 022
+ /bin/mkdir -p /usr/src/RPM/BUILD
+ cd /usr/src/RPM/BUILD
+ /bin/chmod -Rf u+rwX -- /usr/src/tmp/kf5-kidletime-buildroot
+ :
+ /bin/rm -rf -- /usr/src/tmp/kf5-kidletime-buildroot
+ PATH=/usr/libexec/rpm-build:/usr/src/bin:/bin:/usr/bin:/usr/X11R6/bin:/usr/games
+ cd kidletime-5.112.0
+ __kf5_install
+ make -C BUILD DESTDIR=/usr/src/tmp/kf5-kidletime-buildroot install
make: Entering directory '/usr/src/RPM/BUILD/kidletime-5.112.0/BUILD'
/usr/bin/cmake -S/usr/src/RPM/BUILD/kidletime-5.112.0 -B/usr/src/RPM/BUILD/kidletime-5.112.0/BUILD --check-build-system CMakeFiles/Makefile.cmake 0
/usr/bin/cmake -E cmake_progress_start /usr/src/RPM/BUILD/kidletime-5.112.0/BUILD/CMakeFiles /usr/src/RPM/BUILD/kidletime-5.112.0/BUILD//CMakeFiles/progress.marks
make -f CMakeFiles/Makefile2 all
make[1]: Entering directory '/usr/src/RPM/BUILD/kidletime-5.112.0/BUILD'
make -f src/CMakeFiles/KF5IdleTime_autogen.dir/build.make src/CMakeFiles/KF5IdleTime_autogen.dir/depend
make[2]: Entering directory '/usr/src/RPM/BUILD/kidletime-5.112.0/BUILD'
cd /usr/src/RPM/BUILD/kidletime-5.112.0/BUILD && /usr/bin/cmake -E cmake_depends "Unix Makefiles" /usr/src/RPM/BUILD/kidletime-5.112.0 /usr/src/RPM/BUILD/kidletime-5.112.0/src /usr/src/RPM/BUILD/kidletime-5.112.0/BUILD /usr/src/RPM/BUILD/kidletime-5.112.0/BUILD/src /usr/src/RPM/BUILD/kidletime-5.112.0/BUILD/src/CMakeFiles/KF5IdleTime_autogen.dir/DependInfo.cmake "--color="
make[2]: Leaving directory '/usr/src/RPM/BUILD/kidletime-5.112.0/BUILD'
make -f src/CMakeFiles/KF5IdleTime_autogen.dir/build.make src/CMakeFiles/KF5IdleTime_autogen.dir/build
make[2]: Entering directory '/usr/src/RPM/BUILD/kidletime-5.112.0/BUILD'
[ 2%] Automatic MOC for target KF5IdleTime
cd /usr/src/RPM/BUILD/kidletime-5.112.0/BUILD/src && /usr/bin/cmake -E cmake_autogen /usr/src/RPM/BUILD/kidletime-5.112.0/BUILD/src/CMakeFiles/KF5IdleTime_autogen.dir/AutogenInfo.json Release
make[2]: Leaving directory '/usr/src/RPM/BUILD/kidletime-5.112.0/BUILD'
[ 2%] Built target KF5IdleTime_autogen
make -f src/CMakeFiles/KF5IdleTime.dir/build.make src/CMakeFiles/KF5IdleTime.dir/depend
make[2]: Entering directory '/usr/src/RPM/BUILD/kidletime-5.112.0/BUILD'
cd /usr/src/RPM/BUILD/kidletime-5.112.0/BUILD && /usr/bin/cmake -E cmake_depends "Unix Makefiles" /usr/src/RPM/BUILD/kidletime-5.112.0 /usr/src/RPM/BUILD/kidletime-5.112.0/src /usr/src/RPM/BUILD/kidletime-5.112.0/BUILD /usr/src/RPM/BUILD/kidletime-5.112.0/BUILD/src /usr/src/RPM/BUILD/kidletime-5.112.0/BUILD/src/CMakeFiles/KF5IdleTime.dir/DependInfo.cmake "--color="
make[2]: Leaving directory '/usr/src/RPM/BUILD/kidletime-5.112.0/BUILD'
make -f src/CMakeFiles/KF5IdleTime.dir/build.make src/CMakeFiles/KF5IdleTime.dir/build
make[2]: Entering directory '/usr/src/RPM/BUILD/kidletime-5.112.0/BUILD'
make[2]: Nothing to be done for 'src/CMakeFiles/KF5IdleTime.dir/build'.
make[2]: Leaving directory '/usr/src/RPM/BUILD/kidletime-5.112.0/BUILD'
[ 17%] Built target KF5IdleTime
make -f src/plugins/xscreensaver/CMakeFiles/KF5IdleTimeXcbPlugin1_autogen.dir/build.make src/plugins/xscreensaver/CMakeFiles/KF5IdleTimeXcbPlugin1_autogen.dir/depend
make[2]: Entering directory '/usr/src/RPM/BUILD/kidletime-5.112.0/BUILD'
cd /usr/src/RPM/BUILD/kidletime-5.112.0/BUILD && /usr/bin/cmake -E cmake_depends "Unix Makefiles" /usr/src/RPM/BUILD/kidletime-5.112.0 /usr/src/RPM/BUILD/kidletime-5.112.0/src/plugins/xscreensaver /usr/src/RPM/BUILD/kidletime-5.112.0/BUILD /usr/src/RPM/BUILD/kidletime-5.112.0/BUILD/src/plugins/xscreensaver /usr/src/RPM/BUILD/kidletime-5.112.0/BUILD/src/plugins/xscreensaver/CMakeFiles/KF5IdleTimeXcbPlugin1_autogen.dir/DependInfo.cmake "--color="
make[2]: Leaving directory '/usr/src/RPM/BUILD/kidletime-5.112.0/BUILD'
make -f src/plugins/xscreensaver/CMakeFiles/KF5IdleTimeXcbPlugin1_autogen.dir/build.make src/plugins/xscreensaver/CMakeFiles/KF5IdleTimeXcbPlugin1_autogen.dir/build
make[2]: Entering directory '/usr/src/RPM/BUILD/kidletime-5.112.0/BUILD'
[ 19%] Automatic MOC for target KF5IdleTimeXcbPlugin1
cd /usr/src/RPM/BUILD/kidletime-5.112.0/BUILD/src/plugins/xscreensaver && /usr/bin/cmake -E cmake_autogen /usr/src/RPM/BUILD/kidletime-5.112.0/BUILD/src/plugins/xscreensaver/CMakeFiles/KF5IdleTimeXcbPlugin1_autogen.dir/AutogenInfo.json Release
make[2]: Leaving directory '/usr/src/RPM/BUILD/kidletime-5.112.0/BUILD'
[ 19%] Built target KF5IdleTimeXcbPlugin1_autogen
make -f src/plugins/xscreensaver/CMakeFiles/KF5IdleTimeXcbPlugin1.dir/build.make src/plugins/xscreensaver/CMakeFiles/KF5IdleTimeXcbPlugin1.dir/depend
make[2]: Entering directory '/usr/src/RPM/BUILD/kidletime-5.112.0/BUILD'
cd /usr/src/RPM/BUILD/kidletime-5.112.0/BUILD && /usr/bin/cmake -E cmake_depends "Unix Makefiles" /usr/src/RPM/BUILD/kidletime-5.112.0 /usr/src/RPM/BUILD/kidletime-5.112.0/src/plugins/xscreensaver /usr/src/RPM/BUILD/kidletime-5.112.0/BUILD /usr/src/RPM/BUILD/kidletime-5.112.0/BUILD/src/plugins/xscreensaver /usr/src/RPM/BUILD/kidletime-5.112.0/BUILD/src/plugins/xscreensaver/CMakeFiles/KF5IdleTimeXcbPlugin1.dir/DependInfo.cmake "--color="
make[2]: Leaving directory '/usr/src/RPM/BUILD/kidletime-5.112.0/BUILD'
make -f src/plugins/xscreensaver/CMakeFiles/KF5IdleTimeXcbPlugin1.dir/build.make src/plugins/xscreensaver/CMakeFiles/KF5IdleTimeXcbPlugin1.dir/build
make[2]: Entering directory '/usr/src/RPM/BUILD/kidletime-5.112.0/BUILD'
make[2]: Nothing to be done for 'src/plugins/xscreensaver/CMakeFiles/KF5IdleTimeXcbPlugin1.dir/build'.
make[2]: Leaving directory '/usr/src/RPM/BUILD/kidletime-5.112.0/BUILD'
[ 34%] Built target KF5IdleTimeXcbPlugin1
make -f src/plugins/xsync/CMakeFiles/KF5IdleTimeXcbPlugin0_autogen.dir/build.make src/plugins/xsync/CMakeFiles/KF5IdleTimeXcbPlugin0_autogen.dir/depend
make[2]: Entering directory '/usr/src/RPM/BUILD/kidletime-5.112.0/BUILD'
cd /usr/src/RPM/BUILD/kidletime-5.112.0/BUILD && /usr/bin/cmake -E cmake_depends "Unix Makefiles" /usr/src/RPM/BUILD/kidletime-5.112.0 /usr/src/RPM/BUILD/kidletime-5.112.0/src/plugins/xsync /usr/src/RPM/BUILD/kidletime-5.112.0/BUILD /usr/src/RPM/BUILD/kidletime-5.112.0/BUILD/src/plugins/xsync /usr/src/RPM/BUILD/kidletime-5.112.0/BUILD/src/plugins/xsync/CMakeFiles/KF5IdleTimeXcbPlugin0_autogen.dir/DependInfo.cmake "--color="
make[2]: Leaving directory '/usr/src/RPM/BUILD/kidletime-5.112.0/BUILD'
make -f src/plugins/xsync/CMakeFiles/KF5IdleTimeXcbPlugin0_autogen.dir/build.make src/plugins/xsync/CMakeFiles/KF5IdleTimeXcbPlugin0_autogen.dir/build
make[2]: Entering directory '/usr/src/RPM/BUILD/kidletime-5.112.0/BUILD'
[ 36%] Automatic MOC for target KF5IdleTimeXcbPlugin0
cd /usr/src/RPM/BUILD/kidletime-5.112.0/BUILD/src/plugins/xsync && /usr/bin/cmake -E cmake_autogen /usr/src/RPM/BUILD/kidletime-5.112.0/BUILD/src/plugins/xsync/CMakeFiles/KF5IdleTimeXcbPlugin0_autogen.dir/AutogenInfo.json Release
make[2]: Leaving directory '/usr/src/RPM/BUILD/kidletime-5.112.0/BUILD'
[ 36%] Built target KF5IdleTimeXcbPlugin0_autogen
make -f src/plugins/xsync/CMakeFiles/KF5IdleTimeXcbPlugin0.dir/build.make src/plugins/xsync/CMakeFiles/KF5IdleTimeXcbPlugin0.dir/depend
make[2]: Entering directory '/usr/src/RPM/BUILD/kidletime-5.112.0/BUILD'
cd /usr/src/RPM/BUILD/kidletime-5.112.0/BUILD && /usr/bin/cmake -E cmake_depends "Unix Makefiles" /usr/src/RPM/BUILD/kidletime-5.112.0 /usr/src/RPM/BUILD/kidletime-5.112.0/src/plugins/xsync /usr/src/RPM/BUILD/kidletime-5.112.0/BUILD /usr/src/RPM/BUILD/kidletime-5.112.0/BUILD/src/plugins/xsync /usr/src/RPM/BUILD/kidletime-5.112.0/BUILD/src/plugins/xsync/CMakeFiles/KF5IdleTimeXcbPlugin0.dir/DependInfo.cmake "--color="
make[2]: Leaving directory '/usr/src/RPM/BUILD/kidletime-5.112.0/BUILD'
make -f src/plugins/xsync/CMakeFiles/KF5IdleTimeXcbPlugin0.dir/build.make src/plugins/xsync/CMakeFiles/KF5IdleTimeXcbPlugin0.dir/build
make[2]: Entering directory '/usr/src/RPM/BUILD/kidletime-5.112.0/BUILD'
make[2]: Nothing to be done for 'src/plugins/xsync/CMakeFiles/KF5IdleTimeXcbPlugin0.dir/build'.
make[2]: Leaving directory '/usr/src/RPM/BUILD/kidletime-5.112.0/BUILD'
[ 48%] Built target KF5IdleTimeXcbPlugin0
make -f src/plugins/wayland/CMakeFiles/KF5IdleTimeWaylandPlugin_autogen.dir/build.make src/plugins/wayland/CMakeFiles/KF5IdleTimeWaylandPlugin_autogen.dir/depend
make[2]: Entering directory '/usr/src/RPM/BUILD/kidletime-5.112.0/BUILD'
cd /usr/src/RPM/BUILD/kidletime-5.112.0/BUILD && /usr/bin/cmake -E cmake_depends "Unix Makefiles" /usr/src/RPM/BUILD/kidletime-5.112.0 /usr/src/RPM/BUILD/kidletime-5.112.0/src/plugins/wayland /usr/src/RPM/BUILD/kidletime-5.112.0/BUILD /usr/src/RPM/BUILD/kidletime-5.112.0/BUILD/src/plugins/wayland /usr/src/RPM/BUILD/kidletime-5.112.0/BUILD/src/plugins/wayland/CMakeFiles/KF5IdleTimeWaylandPlugin_autogen.dir/DependInfo.cmake "--color="
make[2]: Leaving directory '/usr/src/RPM/BUILD/kidletime-5.112.0/BUILD'
make -f src/plugins/wayland/CMakeFiles/KF5IdleTimeWaylandPlugin_autogen.dir/build.make src/plugins/wayland/CMakeFiles/KF5IdleTimeWaylandPlugin_autogen.dir/build
make[2]: Entering directory '/usr/src/RPM/BUILD/kidletime-5.112.0/BUILD'
[ 51%] Automatic MOC for target KF5IdleTimeWaylandPlugin
cd /usr/src/RPM/BUILD/kidletime-5.112.0/BUILD/src/plugins/wayland && /usr/bin/cmake -E cmake_autogen /usr/src/RPM/BUILD/kidletime-5.112.0/BUILD/src/plugins/wayland/CMakeFiles/KF5IdleTimeWaylandPlugin_autogen.dir/AutogenInfo.json Release
make[2]: Leaving directory '/usr/src/RPM/BUILD/kidletime-5.112.0/BUILD'
[ 51%] Built target KF5IdleTimeWaylandPlugin_autogen
make -f src/plugins/wayland/CMakeFiles/KF5IdleTimeWaylandPlugin.dir/build.make src/plugins/wayland/CMakeFiles/KF5IdleTimeWaylandPlugin.dir/depend
make[2]: Entering directory '/usr/src/RPM/BUILD/kidletime-5.112.0/BUILD'
cd /usr/src/RPM/BUILD/kidletime-5.112.0/BUILD && /usr/bin/cmake -E cmake_depends "Unix Makefiles" /usr/src/RPM/BUILD/kidletime-5.112.0 /usr/src/RPM/BUILD/kidletime-5.112.0/src/plugins/wayland /usr/src/RPM/BUILD/kidletime-5.112.0/BUILD /usr/src/RPM/BUILD/kidletime-5.112.0/BUILD/src/plugins/wayland /usr/src/RPM/BUILD/kidletime-5.112.0/BUILD/src/plugins/wayland/CMakeFiles/KF5IdleTimeWaylandPlugin.dir/DependInfo.cmake "--color="
make[2]: Leaving directory '/usr/src/RPM/BUILD/kidletime-5.112.0/BUILD'
make -f src/plugins/wayland/CMakeFiles/KF5IdleTimeWaylandPlugin.dir/build.make src/plugins/wayland/CMakeFiles/KF5IdleTimeWaylandPlugin.dir/build
make[2]: Entering directory '/usr/src/RPM/BUILD/kidletime-5.112.0/BUILD'
make[2]: Nothing to be done for 'src/plugins/wayland/CMakeFiles/KF5IdleTimeWaylandPlugin.dir/build'.
make[2]: Leaving directory '/usr/src/RPM/BUILD/kidletime-5.112.0/BUILD'
[ 87%] Built target KF5IdleTimeWaylandPlugin
make -f examples/CMakeFiles/kidletime_example_autogen.dir/build.make examples/CMakeFiles/kidletime_example_autogen.dir/depend
make[2]: Entering directory '/usr/src/RPM/BUILD/kidletime-5.112.0/BUILD'
cd /usr/src/RPM/BUILD/kidletime-5.112.0/BUILD && /usr/bin/cmake -E cmake_depends "Unix Makefiles" /usr/src/RPM/BUILD/kidletime-5.112.0 /usr/src/RPM/BUILD/kidletime-5.112.0/examples /usr/src/RPM/BUILD/kidletime-5.112.0/BUILD /usr/src/RPM/BUILD/kidletime-5.112.0/BUILD/examples /usr/src/RPM/BUILD/kidletime-5.112.0/BUILD/examples/CMakeFiles/kidletime_example_autogen.dir/DependInfo.cmake "--color="
make[2]: Leaving directory '/usr/src/RPM/BUILD/kidletime-5.112.0/BUILD'
make -f examples/CMakeFiles/kidletime_example_autogen.dir/build.make examples/CMakeFiles/kidletime_example_autogen.dir/build
make[2]: Entering directory '/usr/src/RPM/BUILD/kidletime-5.112.0/BUILD'
[ 90%] Automatic MOC for target kidletime_example
cd /usr/src/RPM/BUILD/kidletime-5.112.0/BUILD/examples && /usr/bin/cmake -E cmake_autogen /usr/src/RPM/BUILD/kidletime-5.112.0/BUILD/examples/CMakeFiles/kidletime_example_autogen.dir/AutogenInfo.json Release
make[2]: Leaving directory '/usr/src/RPM/BUILD/kidletime-5.112.0/BUILD'
[ 90%] Built target kidletime_example_autogen
make -f examples/CMakeFiles/kidletime_example.dir/build.make examples/CMakeFiles/kidletime_example.dir/depend
make[2]: Entering directory '/usr/src/RPM/BUILD/kidletime-5.112.0/BUILD'
cd /usr/src/RPM/BUILD/kidletime-5.112.0/BUILD && /usr/bin/cmake -E cmake_depends "Unix Makefiles" /usr/src/RPM/BUILD/kidletime-5.112.0 /usr/src/RPM/BUILD/kidletime-5.112.0/examples /usr/src/RPM/BUILD/kidletime-5.112.0/BUILD /usr/src/RPM/BUILD/kidletime-5.112.0/BUILD/examples /usr/src/RPM/BUILD/kidletime-5.112.0/BUILD/examples/CMakeFiles/kidletime_example.dir/DependInfo.cmake "--color="
make[2]: Leaving directory '/usr/src/RPM/BUILD/kidletime-5.112.0/BUILD'
make -f examples/CMakeFiles/kidletime_example.dir/build.make examples/CMakeFiles/kidletime_example.dir/build
make[2]: Entering directory '/usr/src/RPM/BUILD/kidletime-5.112.0/BUILD'
make[2]: Nothing to be done for 'examples/CMakeFiles/kidletime_example.dir/build'.
make[2]: Leaving directory '/usr/src/RPM/BUILD/kidletime-5.112.0/BUILD'
[100%] Built target kidletime_example
make[1]: Leaving directory '/usr/src/RPM/BUILD/kidletime-5.112.0/BUILD'
/usr/bin/cmake -E cmake_progress_start /usr/src/RPM/BUILD/kidletime-5.112.0/BUILD/CMakeFiles 0
make -f CMakeFiles/Makefile2 preinstall
make[1]: Entering directory '/usr/src/RPM/BUILD/kidletime-5.112.0/BUILD'
make[1]: Nothing to be done for 'preinstall'.
make[1]: Leaving directory '/usr/src/RPM/BUILD/kidletime-5.112.0/BUILD'
Install the project...
/usr/bin/cmake -P cmake_install.cmake
-- Install configuration: "Release"
-- Installing: /usr/src/tmp/kf5-kidletime-buildroot/usr/lib/qt5/plugins/kf5/org.kde.kidletime.platforms/KF5IdleTimeXcbPlugin1.so
-- Installing: /usr/src/tmp/kf5-kidletime-buildroot/usr/lib/qt5/plugins/kf5/org.kde.kidletime.platforms/KF5IdleTimeXcbPlugin0.so
-- Installing: /usr/src/tmp/kf5-kidletime-buildroot/usr/lib/qt5/plugins/kf5/org.kde.kidletime.platforms/KF5IdleTimeWaylandPlugin.so
-- Installing: /usr/src/tmp/kf5-kidletime-buildroot/usr/include/KF5/KIdleTime/kidletime_export.h
-- Installing: /usr/src/tmp/kf5-kidletime-buildroot/usr/include/KF5/KIdleTime/KIdleTime
-- Installing: /usr/src/tmp/kf5-kidletime-buildroot/usr/include/KF5/KIdleTime/kidletime.h
-- Installing: /usr/src/tmp/kf5-kidletime-buildroot/usr/include/KF5/KIdleTime/private/abstractsystempoller.h
-- Installing: /usr/src/tmp/kf5-kidletime-buildroot/usr/lib/libKF5IdleTime.so.5.112.0
-- Installing: /usr/src/tmp/kf5-kidletime-buildroot/usr/lib/libKF5IdleTime.so.5
-- Installing: /usr/src/tmp/kf5-kidletime-buildroot/usr/lib/libKF5IdleTime.so
-- Installing: /usr/src/tmp/kf5-kidletime-buildroot/usr/share/qlogging-categories5/kidletime.categories
-- Installing: /usr/src/tmp/kf5-kidletime-buildroot/usr/share/qlogging-categories5/kidletime.renamecategories
-- Installing: /usr/src/tmp/kf5-kidletime-buildroot/usr/lib/qt5/mkspecs/modules/qt_KIdleTime.pri
-- Installing: /usr/src/tmp/kf5-kidletime-buildroot/usr/lib/cmake/KF5IdleTime/KF5IdleTimeConfig.cmake
-- Installing: /usr/src/tmp/kf5-kidletime-buildroot/usr/lib/cmake/KF5IdleTime/KF5IdleTimeConfigVersion.cmake
-- Installing: /usr/src/tmp/kf5-kidletime-buildroot/usr/lib/cmake/KF5IdleTime/KF5IdleTimeTargets.cmake
-- Installing: /usr/src/tmp/kf5-kidletime-buildroot/usr/lib/cmake/KF5IdleTime/KF5IdleTimeTargets-release.cmake
-- Installing: /usr/src/tmp/kf5-kidletime-buildroot/usr/include/KF5/KIdleTime/kidletime_version.h
make: Leaving directory '/usr/src/RPM/BUILD/kidletime-5.112.0/BUILD'
+ '[' -d /usr/src/tmp/kf5-kidletime-buildroot//usr/share ']'
+ ls -1d '/usr/src/tmp/kf5-kidletime-buildroot//usr/share/kf5/k*5'
+ read d
ls: cannot access '/usr/src/tmp/kf5-kidletime-buildroot//usr/share/kf5/k*5': No such file or directory
+ '[' -d /usr/src/tmp/kf5-kidletime-buildroot//usr/share/kf5/lib64 ']'
+ '[' -d /usr/src/tmp/kf5-kidletime-buildroot//usr/share/kf5/lib ']'
+ ls -1 /usr/src/tmp/kf5-kidletime-buildroot//usr/lib/libKF5IdleTime.so
+ read p
+ '[' -L /usr/src/tmp/kf5-kidletime-buildroot//usr/lib/libKF5IdleTime.so ']'
+ mkdir -p /usr/src/tmp/kf5-kidletime-buildroot//usr/lib/kf5/devel
++ readlink /usr/src/tmp/kf5-kidletime-buildroot//usr/lib/libKF5IdleTime.so
+ f=libKF5IdleTime.so.5
++ basename /usr/src/tmp/kf5-kidletime-buildroot//usr/lib/libKF5IdleTime.so
+ l=libKF5IdleTime.so
++ relative /usr/src/tmp/kf5-kidletime-buildroot//usr/lib/libKF5IdleTime.so.5 /usr/src/tmp/kf5-kidletime-buildroot//usr/lib/kf5/devel/libKF5IdleTime.so.5
+ ln -sf ../../libKF5IdleTime.so.5 /usr/src/tmp/kf5-kidletime-buildroot//usr/lib/kf5/devel/libKF5IdleTime.so
+ rm -f /usr/src/tmp/kf5-kidletime-buildroot//usr/lib/libKF5IdleTime.so
+ read p
+ '[' -d /usr/src/tmp/kf5-kidletime-buildroot//usr/share/kf5/bin ']'
+ '[' -d /usr/src/tmp/kf5-kidletime-buildroot//usr/share/kf5/include ']'
+ '[' -d /usr/src/tmp/kf5-kidletime-buildroot//usr/lib/kf5/bin -a true == true ']'
+ '[' -d /usr/src/tmp/kf5-kidletime-buildroot//usr/share/akonadi ']'
+ '[' -d /usr/src/tmp/kf5-kidletime-buildroot//usr/share/kf5/akonadi ']'
+ '[' -d /usr/src/tmp/kf5-kidletime-buildroot//usr/share/man -a remove == remove ']'
+ '[' -d /usr/src/tmp/kf5-kidletime-buildroot//usr/share/appdata -a keep == remove ']'
+ '[' -d /usr/src/tmp/kf5-kidletime-buildroot//usr/share/metainfo -a keep == remove ']'
+ '[' -d /usr/src/tmp/kf5-kidletime-buildroot//usr/lib/cmake/ ']'
+ find /usr/src/tmp/kf5-kidletime-buildroot//usr/lib/cmake/ -type f -name '*.cmake'
+ read f
+ sed -i -e 's|\(set(.*\)${PACKAGE_PREFIX_DIR}//usr/|\1${PACKAGE_PREFIX_DIR}/|' /usr/src/tmp/kf5-kidletime-buildroot//usr/lib/cmake/KF5IdleTime/KF5IdleTimeTargets-release.cmake
+ sed -i -e 's|/usr//usr/|/usr/|' /usr/src/tmp/kf5-kidletime-buildroot//usr/lib/cmake/KF5IdleTime/KF5IdleTimeTargets-release.cmake
+ read f
+ sed -i -e 's|\(set(.*\)${PACKAGE_PREFIX_DIR}//usr/|\1${PACKAGE_PREFIX_DIR}/|' /usr/src/tmp/kf5-kidletime-buildroot//usr/lib/cmake/KF5IdleTime/KF5IdleTimeTargets.cmake
+ sed -i -e 's|/usr//usr/|/usr/|' /usr/src/tmp/kf5-kidletime-buildroot//usr/lib/cmake/KF5IdleTime/KF5IdleTimeTargets.cmake
+ read f
+ sed -i -e 's|\(set(.*\)${PACKAGE_PREFIX_DIR}//usr/|\1${PACKAGE_PREFIX_DIR}/|' /usr/src/tmp/kf5-kidletime-buildroot//usr/lib/cmake/KF5IdleTime/KF5IdleTimeConfigVersion.cmake
+ sed -i -e 's|/usr//usr/|/usr/|' /usr/src/tmp/kf5-kidletime-buildroot//usr/lib/cmake/KF5IdleTime/KF5IdleTimeConfigVersion.cmake
+ read f
+ sed -i -e 's|\(set(.*\)${PACKAGE_PREFIX_DIR}//usr/|\1${PACKAGE_PREFIX_DIR}/|' /usr/src/tmp/kf5-kidletime-buildroot//usr/lib/cmake/KF5IdleTime/KF5IdleTimeConfig.cmake
+ sed -i -e 's|/usr//usr/|/usr/|' /usr/src/tmp/kf5-kidletime-buildroot//usr/lib/cmake/KF5IdleTime/KF5IdleTimeConfig.cmake
+ read f
+ /usr/lib/rpm/find-lang kf5-kidletime --all-name
+ rpm-build-kf5-find-qtlang kf5-kidletime --all-name
+ /usr/lib/rpm/brp-alt
Cleaning files in /usr/src/tmp/kf5-kidletime-buildroot (auto)
mode of './usr/lib/libKF5IdleTime.so.5.112.0' changed from 0755 (rwxr-xr-x) to 0644 (rw-r--r--)
mode of './usr/lib/qt5/plugins/kf5/org.kde.kidletime.platforms/KF5IdleTimeWaylandPlugin.so' changed from 0755 (rwxr-xr-x) to 0644 (rw-r--r--)
mode of './usr/lib/qt5/plugins/kf5/org.kde.kidletime.platforms/KF5IdleTimeXcbPlugin0.so' changed from 0755 (rwxr-xr-x) to 0644 (rw-r--r--)
mode of './usr/lib/qt5/plugins/kf5/org.kde.kidletime.platforms/KF5IdleTimeXcbPlugin1.so' changed from 0755 (rwxr-xr-x) to 0644 (rw-r--r--)
Verifying and fixing files in /usr/src/tmp/kf5-kidletime-buildroot (binconfig,pkgconfig,libtool,desktop,gnuconfig)
Checking contents of files in /usr/src/tmp/kf5-kidletime-buildroot/ (default)
Compressing files in /usr/src/tmp/kf5-kidletime-buildroot (auto)
Adjusting library links in /usr/src/tmp/kf5-kidletime-buildroot
./usr/lib: (from :0)
libKF5IdleTime.so.5 -> libKF5IdleTime.so.5.112.0
Verifying ELF objects in /usr/src/tmp/kf5-kidletime-buildroot (arch=normal,fhs=normal,lfs=relaxed,lint=relaxed,rpath=normal,stack=normal,textrel=normal,unresolved=normal)
Hardlinking identical .pyc and .opt-?.pyc files
Processing files: kf5-kidletime-common-5.112.0-alt1
Executing(%doc): /bin/sh -e /usr/src/tmp/rpm-tmp.30312
+ umask 022
+ /bin/mkdir -p /usr/src/RPM/BUILD
+ cd /usr/src/RPM/BUILD
+ cd kidletime-5.112.0
+ DOCDIR=/usr/src/tmp/kf5-kidletime-buildroot/usr/share/doc/kf5-kidletime-common-5.112.0
+ export DOCDIR
+ rm -rf /usr/src/tmp/kf5-kidletime-buildroot/usr/share/doc/kf5-kidletime-common-5.112.0
+ /bin/mkdir -p /usr/src/tmp/kf5-kidletime-buildroot/usr/share/doc/kf5-kidletime-common-5.112.0
+ cp -prL LICENSES/CC0-1.0.txt LICENSES/GPL-2.0-or-later.txt LICENSES/LGPL-2.1-or-later.txt LICENSES/MIT.txt README.md /usr/src/tmp/kf5-kidletime-buildroot/usr/share/doc/kf5-kidletime-common-5.112.0
+ chmod -R go-w /usr/src/tmp/kf5-kidletime-buildroot/usr/share/doc/kf5-kidletime-common-5.112.0
+ chmod -R a+rX /usr/src/tmp/kf5-kidletime-buildroot/usr/share/doc/kf5-kidletime-common-5.112.0
+ exit 0
Finding Provides (using /usr/lib/rpm/find-provides)
Executing: /bin/sh -e /usr/src/tmp/rpm-tmp.ER5FZM
find-provides: running scripts (alternatives,debuginfo,gir,lib,pam,perl,pkgconfig,python,python3,qml,shell,typelib)
Finding Requires (using /usr/lib/rpm/find-requires)
Executing: /bin/sh -e /usr/src/tmp/rpm-tmp.s9lYIP
find-requires: running scripts (cpp,debuginfo,files,gir-js,gir-python,gir,lib,pam,perl,pkgconfig,pkgconfiglib,python,python3,qml,rpmlib,shebang,shell,static,symlinks,systemd-services,typelib)
Requires: kf5-filesystem
Processing files: kf5-kidletime-devel-5.112.0-alt1
Finding Provides (using /usr/lib/rpm/find-provides)
Executing: /bin/sh -e /usr/src/tmp/rpm-tmp.k9Wjnw
find-provides: running scripts (alternatives,debuginfo,gir,lib,pam,perl,pkgconfig,python,python3,qml,shell,typelib)
Finding Requires (using /usr/lib/rpm/find-requires)
Executing: /bin/sh -e /usr/src/tmp/rpm-tmp.PWwPCc
find-requires: running scripts (cpp,debuginfo,files,gir-js,gir-python,gir,lib,pam,perl,pkgconfig,pkgconfiglib,python,python3,qml,rpmlib,shebang,shell,static,symlinks,systemd-services,typelib)
/usr/src/tmp/kf5-kidletime-buildroot/usr/include/KF5/KIdleTime/kidletime.h:11:10: fatal error: QHash: No such file or directory
11 | #include
| ^~~~~~~
compilation terminated.
cpp.req: /usr/src/tmp/kf5-kidletime-buildroot/usr/include/KF5/KIdleTime/kidletime.h: cpp failed, trying c++ mode
/usr/src/tmp/kf5-kidletime-buildroot/usr/include/KF5/KIdleTime/kidletime.h:11:10: fatal error: QHash: No such file or directory
11 | #include
| ^~~~~~~
compilation terminated.
cpp.req: WARNING: /usr/src/tmp/kf5-kidletime-buildroot/usr/include/KF5/KIdleTime/kidletime.h: cpp failed
/usr/src/tmp/kf5-kidletime-buildroot/usr/include/KF5/KIdleTime/private/abstractsystempoller.h:12:10: fatal error: QObject: No such file or directory
12 | #include
| ^~~~~~~~~
compilation terminated.
cpp.req: /usr/src/tmp/kf5-kidletime-buildroot/usr/include/KF5/KIdleTime/private/abstractsystempoller.h: cpp failed, trying c++ mode
/usr/src/tmp/kf5-kidletime-buildroot/usr/include/KF5/KIdleTime/private/abstractsystempoller.h:12:10: fatal error: QObject: No such file or directory
12 | #include
| ^~~~~~~~~
compilation terminated.
cpp.req: WARNING: /usr/src/tmp/kf5-kidletime-buildroot/usr/include/KF5/KIdleTime/private/abstractsystempoller.h: cpp failed
Requires: /usr/lib/libKF5IdleTime.so.5
Finding debuginfo files (using /usr/lib/rpm/find-debuginfo-files)
Executing: /bin/sh -e /usr/src/tmp/rpm-tmp.5cHdZp
Processing files: libkf5idletime-5.112.0-alt1
Finding Provides (using /usr/lib/rpm/find-provides)
Executing: /bin/sh -e /usr/src/tmp/rpm-tmp.Rne46q
find-provides: running scripts (alternatives,debuginfo,gir,lib,pam,perl,pkgconfig,python,python3,qml,shell,typelib)
lib.prov: /usr/src/tmp/kf5-kidletime-buildroot/usr/lib/libKF5IdleTime.so.5: 62 symbols, 16 bpp
Finding Requires (using /usr/lib/rpm/find-requires)
Executing: /bin/sh -e /usr/src/tmp/rpm-tmp.tCaO2q
find-requires: running scripts (cpp,debuginfo,files,gir-js,gir-python,gir,lib,pam,perl,pkgconfig,pkgconfiglib,python,python3,qml,rpmlib,shebang,shell,static,symlinks,systemd-services,typelib)
Provides: libKF5IdleTime.so.5 = set:jdxNqO4VeyjFrJ6q3aLtWJSSNnALzbpX17ybK5JBI6jSgsHO0pTHeZ1CPedx7T2exigeaZDi3DyYEJBuWppuYFAuoQjaEEdGt1giK56cjpbVhSigfo3JsveFApf
Requires: kf5-kidletime-common = 5.112.0-alt1, libQt5Core.so.5 >= set:qjWAjoIrgM825WpkZzUawlYJjfn2puZhQEkYlHZhG0QBJgZL1fzJl54mJ5T0KsVic8W2KERskKsZeulVnU5KFO1kHpOZ0f0gtwlMTA8iBpbwQch21SfC2HD3EShtVo8RTQZsMUyVkkXK8UZBpQuDJZGCoX3G25DgC7hCmUPGRLKEQYvZ8Pvl2Zz2m9s0EZFMvh5zuz79vDYzjjLCvVZlGxoPJpgAewhKoWmuHh6Zmfou2pdEQKEYOC2ytwgATf4FOZe85txy1ubhrdxXhm2rm6c9UNSv130ZvZm0, libQt5Core.so.5(Qt_5), libQt5Core.so.5(Qt_5.15), libQt5DBus.so.5 >= set:mhL330UbxdTP30MgZbBEjJBF2YP7mn3doiZgKlK49Ec3Z8X0, libQt5DBus.so.5(Qt_5), libQt5Gui.so.5 >= set:rnZJa8HHh6323PLL5Z7S45a1BaOCFtdBTZFh, libQt5Gui.so.5(Qt_5), libQt5WaylandClient.so.5 >= set:plt80pZ4IfWLZdOzvsHvsWEOHrCZ9HXqxqDe, libQt5WaylandClient.so.5(Qt_5), libQt5X11Extras.so.5 >= set:ihqAa, libQt5X11Extras.so.5(Qt_5), libX11-xcb.so.1 >= set:edp7, libX11.so.6 >= set:omNQNZ0EPrQf0, libXext.so.6 >= set:lhnnxLbmf0iijQ9ZKo0L2aHGORWyqn60, libXss.so.1 >= set:hfK9V87, libc.so.6(GLIBC_2.0), libc.so.6(GLIBC_2.1.3), libc.so.6(GLIBC_2.4), libstdc++.so.6(CXXABI_1.3), libstdc++.so.6(CXXABI_1.3.9), libstdc++.so.6(GLIBCXX_3.4), libwayland-client.so.0 >= set:khZpmEICitBCD2, libxcb-sync.so.1 >= set:kjOcj, libxcb.so.1 >= set:nmCri2, rtld(GNU_HASH)
Requires(rpmlib): rpmlib(SetVersions)
Finding debuginfo files (using /usr/lib/rpm/find-debuginfo-files)
Executing: /bin/sh -e /usr/src/tmp/rpm-tmp.IfI0Bm
Creating libkf5idletime-debuginfo package
Processing files: libkf5idletime-debuginfo-5.112.0-alt1
Finding Provides (using /usr/lib/rpm/find-provides)
Executing: /bin/sh -e /usr/src/tmp/rpm-tmp.X3iRyF
find-provides: running scripts (debuginfo)
Finding Requires (using /usr/lib/rpm/find-requires)
Executing: /bin/sh -e /usr/src/tmp/rpm-tmp.EQbAmj
find-requires: running scripts (debuginfo)
Provides: debug(libKF5IdleTime.so.5)
Requires: libkf5idletime = 5.112.0-alt1, debug(libQt5Core.so.5), debug(libQt5DBus.so.5), debug(libQt5Gui.so.5), debug(libQt5WaylandClient.so.5), debug(libQt5X11Extras.so.5), debug(libX11-xcb.so.1), debug(libX11.so.6), debug(libXext.so.6), debug(libXss.so.1), debug(libc.so.6), debug(libstdc++.so.6), debug(libwayland-client.so.0), debug(libxcb-sync.so.1), debug(libxcb.so.1)
Adding to libkf5idletime a strict dependency on kf5-kidletime-common
Adding to libkf5idletime-debuginfo a strict dependency on libkf5idletime
Adding to kf5-kidletime-devel a strict dependency on libkf5idletime
Removing 1 extra deps from kf5-kidletime-devel due to dependency on libkf5idletime
Wrote: /usr/src/RPM/RPMS/noarch/kf5-kidletime-common-5.112.0-alt1.noarch.rpm (w2.lzdio)
Wrote: /usr/src/RPM/RPMS/i586/kf5-kidletime-devel-5.112.0-alt1.i586.rpm (w2.lzdio)
Wrote: /usr/src/RPM/RPMS/i586/libkf5idletime-5.112.0-alt1.i586.rpm (w2.lzdio)
Wrote: /usr/src/RPM/RPMS/i586/libkf5idletime-debuginfo-5.112.0-alt1.i586.rpm (w2.lzdio)
21.19user 4.79system 0:19.10elapsed 136%CPU (0avgtext+0avgdata 210256maxresident)k
0inputs+0outputs (0major+1972933minor)pagefaults 0swaps
/.out/kf5-kidletime-common-5.112.0-alt1.noarch.rpm: bad symbols in the license tag: /
/.out/kf5-kidletime-devel-5.112.0-alt1.i586.rpm: bad symbols in the license tag: /
/.out/libkf5idletime-5.112.0-alt1.i586.rpm: bad symbols in the license tag: /
/.out/libkf5idletime-debuginfo-5.112.0-alt1.i586.rpm: bad symbols in the license tag: /
4.67user 2.04system 0:42.35elapsed 15%CPU (0avgtext+0avgdata 125456maxresident)k
1240inputs+0outputs (0major+369281minor)pagefaults 0swaps