86>Dec 24 09:52:40 userdel[3982569]: delete user 'rooter'
<86>Dec 24 09:52:40 userdel[3982569]: removed group 'rooter' owned by 'rooter'
<86>Dec 24 09:52:40 userdel[3982569]: removed shadow group 'rooter' owned by 'rooter'
<86>Dec 24 09:52:40 groupadd[3982604]: group added to /etc/group: name=rooter, GID=954
<86>Dec 24 09:52:40 groupadd[3982604]: group added to /etc/gshadow: name=rooter
<86>Dec 24 09:52:40 groupadd[3982604]: new group: name=rooter, GID=954
<86>Dec 24 09:52:40 useradd[3982642]: new user: name=rooter, UID=954, GID=954, home=/root, shell=/bin/bash
<86>Dec 24 09:52:40 userdel[3982706]: delete user 'builder'
<86>Dec 24 09:52:40 userdel[3982706]: removed group 'builder' owned by 'builder'
<86>Dec 24 09:52:40 userdel[3982706]: removed shadow group 'builder' owned by 'builder'
<86>Dec 24 09:52:40 groupadd[3982739]: group added to /etc/group: name=builder, GID=955
<86>Dec 24 09:52:40 groupadd[3982739]: group added to /etc/gshadow: name=builder
<86>Dec 24 09:52:40 groupadd[3982739]: new group: name=builder, GID=955
<86>Dec 24 09:52:40 useradd[3982762]: new user: name=builder, UID=955, GID=955, home=/usr/src, shell=/bin/bash
/usr/src/in/srpm/kde5-kpkpass-22.08.3-alt1.src.rpm: bad symbols in the license tag: /
<13>Dec 24 09:52:42 rpmi: libxkbcommon-1.4.1-alt1 sisyphus+300420.100.1.1 1653246292 installed
<13>Dec 24 09:52:42 rpmi: libexpat-2.5.0-alt1 sisyphus+309227.100.1.1 1667075766 installed
<13>Dec 24 09:52:42 rpmi: libts0-1.22-alt3 sisyphus+278442.100.1.2 1626216683 installed
<13>Dec 24 09:52:42 rpmi: qt5-base-common-5.15.7-alt3 sisyphus+310218.100.1.1 1668772627 installed
<13>Dec 24 09:52:42 rpmi: qt5-declarative-common-5.15.7-alt5 sisyphus+312279.100.1.1 1671811327 installed
<13>Dec 24 09:52:42 rpmi: libmtdev-1.1.6-alt1 sisyphus+278361.100.1.1 1626091636 installed
<13>Dec 24 09:52:42 rpmi: libpng16-1.6.39-alt1 sisyphus+310490.100.1.1 1669195208 installed
<13>Dec 24 09:52:42 rpmi: libICE-1.1.1-alt1 sisyphus+311428.500.1.1 1670577559 installed
<13>Dec 24 09:52:42 rpmi: libglvnd-7:1.6.0-alt1 sisyphus+310974.100.1.1 1669906761 installed
<13>Dec 24 09:52:42 rpmi: libwayland-server-1.21.0-alt1.1 sisyphus+302874.200.2.1 1656661872 installed
<13>Dec 24 09:52:42 rpmi: libSM-1.2.4-alt1 sisyphus+312057.200.1.1 1671526918 installed
<13>Dec 24 09:52:42 rpmi: rpm-macros-ubt-0.4-alt1 sisyphus+279939.100.1.1 1626950850 installed
<13>Dec 24 09:52:42 rpmi: rpm-macros-qt5-5.15.7-alt3 sisyphus+310218.100.1.1 1668772453 installed
<13>Dec 24 09:52:42 rpmi: rpm-build-xdg-0.2-alt1 1250461503 installed
<13>Dec 24 09:52:42 rpmi: libsqlite3-3.40.0-alt1 sisyphus+310306.100.1.1 1668863357 installed
<13>Dec 24 09:52:42 rpmi: xml-utils-1:2.10.3-alt1 sisyphus+308392.100.3.1 1666013214 installed
<13>Dec 24 09:52:42 rpmi: libverto-0.3.2-alt1_1 sisyphus+279289.100.1.3 1626493872 installed
<13>Dec 24 09:52:42 rpmi: libproxy-0.4.18-alt1 sisyphus+307602.100.1.1 1664480605 installed
<13>Dec 24 09:52:42 rpmi: liblmdb-0.9.29-alt1.1 sisyphus+306630.100.1.1 1663072361 installed
<13>Dec 24 09:52:42 rpmi: libkeyutils-1.6.3-alt1 sisyphus+266061.100.1.1 1612919567 installed
<13>Dec 24 09:52:42 rpmi: libjpeg-2:2.1.2-alt1.2 sisyphus+300827.100.2.1 1653916654 installed
<13>Dec 24 09:52:42 rpmi: libwacom-data-2.5.0-alt2 sisyphus+308599.100.1.1 1666082915 installed
<13>Dec 24 09:52:42 rpmi: mpdecimal-2.5.1-alt1 sisyphus+291245.40.54.1 1643293464 installed
<13>Dec 24 09:52:43 rpmi: libicu72-1:7.2.1-alt1 sisyphus+308882.100.1.1 1666532135 installed
<13>Dec 24 09:52:43 rpmi: libqt5-core-5.15.7-alt3 sisyphus+310218.100.1.1 1668772627 installed
<13>Dec 24 09:52:43 rpmi: libqt5-sql-5.15.7-alt3 sisyphus+310218.100.1.1 1668772627 installed
<13>Dec 24 09:52:43 rpmi: libgudev-1:237-alt1 sisyphus+282754.100.1.1 1629006690 installed
<13>Dec 24 09:52:43 rpmi: libgraphite2-1.3.14-alt2.1 sisyphus+279571.100.1.2 1626605157 installed
<13>Dec 24 09:52:43 rpmi: libgdbm-1.8.3-alt10 sisyphus+278100.1600.1.1 1626059138 installed
<13>Dec 24 09:52:43 rpmi: libevdev-1.13.0-alt1 sisyphus+304671.100.1.1 1659461429 installed
<13>Dec 24 09:52:43 rpmi: liblz4-1:1.9.4-alt1 sisyphus+309416.100.1.1 1667413000 installed
<13>Dec 24 09:52:43 rpmi: libsystemd-1:251.10-alt1 sisyphus+312238.200.2.1 1671790299 installed
<13>Dec 24 09:52:43 rpmi: libdbus-1.14.4-alt2 sisyphus+312215.100.1.1 1671712111 installed
<13>Dec 24 09:52:43 rpmi: libqt5-dbus-5.15.7-alt3 sisyphus+310218.100.1.1 1668772627 installed
<13>Dec 24 09:52:43 rpmi: libcom_err-1.46.4.0.5.4cda-alt1 sisyphus+283826.100.1.1 1629975361 installed
<13>Dec 24 09:52:43 rpmi: libbrotlicommon-1.0.9-alt2 sisyphus+278430.100.1.2 1626213212 installed
<13>Dec 24 09:52:43 rpmi: libbrotlidec-1.0.9-alt2 sisyphus+278430.100.1.2 1626213212 installed
<13>Dec 24 09:52:43 rpmi: libharfbuzz-6.0.0-alt1 sisyphus+311978.200.2.1 1671493170 installed
<13>Dec 24 09:52:43 rpmi: libfreetype-2.12.1-alt1 sisyphus+299380.100.1.1 1651508335 installed
<13>Dec 24 09:52:43 rpmi: fontconfig-2.13.1-alt4 sisyphus+304281.100.1.1 1658733593 installed
Updating fonts cache: <29>Dec 24 09:52:44 fontconfig: Updating fonts cache: succeeded
[ DONE ]
<13>Dec 24 09:52:44 rpmi: libSDL2-2.26.1-alt1 sisyphus+311040.100.1.1 1669989800 installed
<13>Dec 24 09:52:44 rpmi: tslib-1.22-alt3 sisyphus+278442.100.1.2 1626216683 installed
<13>Dec 24 09:52:44 rpmi: libxshmfence-1.3.2-alt1 sisyphus+311428.400.1.1 1670577529 installed
<13>Dec 24 09:52:44 rpmi: libX11-locales-3:1.8.3-alt1 sisyphus+311851.100.1.1 1671173328 installed
<13>Dec 24 09:52:44 rpmi: libXdmcp-1.1.4-alt1 sisyphus+311188.1000.1.1 1670233860 installed
<13>Dec 24 09:52:44 rpmi: libXau-1.0.11-alt1 sisyphus+311428.100.1.1 1670577440 installed
<13>Dec 24 09:52:44 rpmi: libxcb-1.15-alt1 sisyphus+299436.300.1.1 1651655490 installed
<13>Dec 24 09:52:44 rpmi: libX11-3:1.8.3-alt1 sisyphus+311851.100.1.1 1671173332 installed
<13>Dec 24 09:52:44 rpmi: libXext-1.3.5-alt1 sisyphus+309285.100.1.1 1667212413 installed
<13>Dec 24 09:52:44 rpmi: libXxf86vm-1.1.5-alt1 sisyphus+308663.1400.1.1 1666168534 installed
<13>Dec 24 09:52:44 rpmi: libXfixes-6.0.0-alt1 sisyphus+284644.300.1.1 1630910333 installed
<13>Dec 24 09:52:44 rpmi: libXrender-0.9.11-alt1 sisyphus+308841.100.1.1 1666436131 installed
<13>Dec 24 09:52:44 rpmi: libxcbutil-icccm-0.4.1-alt2 sisyphus+278275.100.1.2 1626148617 installed
<13>Dec 24 09:52:44 rpmi: libxcbutil-1:0.4.1-alt1 sisyphus+312057.100.1.1 1671526889 installed
<13>Dec 24 09:52:44 rpmi: libxcbutil-image-0.4.0-alt1 sisyphus+275413.100.1.3 1624505806 installed
<13>Dec 24 09:52:44 rpmi: libxcbutil-keysyms-0.4.0-alt1 sisyphus+278187.100.1.1 1626075950 installed
<13>Dec 24 09:52:44 rpmi: libxcb-render-util-0.3.9-alt3 sisyphus+276916.100.1.2 1625275237 installed
<13>Dec 24 09:52:44 rpmi: libxkbcommon-x11-1.4.1-alt1 sisyphus+300420.100.1.1 1653246292 installed
<13>Dec 24 09:52:44 rpmi: libwayland-client-1.21.0-alt1.1 sisyphus+302874.200.2.1 1656661872 installed
<13>Dec 24 09:52:44 rpmi: libpciaccess-1:0.17-alt1 sisyphus+308663.300.1.1 1666168262 installed
<13>Dec 24 09:52:44 rpmi: libdrm-1:2.4.114-alt1 sisyphus+309630.100.1.1 1667826824 installed
<13>Dec 24 09:52:44 rpmi: libGLX-mesa-4:22.3.1-alt1 sisyphus+311782.100.1.1 1671089349 installed
<13>Dec 24 09:52:44 rpmi: libgbm-4:22.3.1-alt1 sisyphus+311782.100.1.1 1671089349 installed
<13>Dec 24 09:52:44 rpmi: libEGL-mesa-4:22.3.1-alt1 sisyphus+311782.100.1.1 1671089349 installed
<13>Dec 24 09:52:44 rpmi: libEGL-7:1.6.0-alt1 sisyphus+310974.100.1.1 1669906761 installed
<13>Dec 24 09:52:44 rpmi: libGLX-7:1.6.0-alt1 sisyphus+310974.100.1.1 1669906761 installed
<13>Dec 24 09:52:44 rpmi: libGL-7:1.6.0-alt1 sisyphus+310974.100.1.1 1669906761 installed
<13>Dec 24 09:52:44 rpmi: libdevmapper-1.02.185-alt1 sisyphus+305739.200.2.1 1661432011 installed
<13>Dec 24 09:52:44 rpmi: mount-2.38.1-alt1 sisyphus+308470.100.1.1 1665845352 installed
<13>Dec 24 09:52:44 rpmi: losetup-2.38.1-alt1 sisyphus+308470.100.1.1 1665845352 installed
<13>Dec 24 09:52:44 rpmi: lsblk-2.38.1-alt1 sisyphus+308470.100.1.1 1665845352 installed
<13>Dec 24 09:52:44 rpmi: libp11-kit-0.24.1-alt1 sisyphus+293720.100.1.1 1642535281 installed
<13>Dec 24 09:52:44 rpmi: libtasn1-4.19.0-alt1 sisyphus+305700.100.1.1 1661359628 installed
<13>Dec 24 09:52:44 rpmi: rpm-macros-alternatives-0.5.2-alt1 sisyphus+300869.100.1.1 1653844113 installed
<13>Dec 24 09:52:44 rpmi: alternatives-0.5.2-alt1 sisyphus+300869.100.1.1 1653844113 installed
<13>Dec 24 09:52:44 rpmi: ca-certificates-2022.12.14-alt1 sisyphus+311754.200.1.1 1671046143 installed
<13>Dec 24 09:52:44 rpmi: ca-trust-0.1.4-alt1 sisyphus+308690.100.1.1 1666182992 installed
<13>Dec 24 09:52:44 rpmi: p11-kit-trust-0.24.1-alt1 sisyphus+293720.100.1.1 1642535281 installed
<13>Dec 24 09:52:45 rpmi: libcrypto1.1-1.1.1q-alt1 sisyphus+303203.100.1.1 1657027052 installed
<13>Dec 24 09:52:45 rpmi: libssl1.1-1.1.1q-alt1 sisyphus+303203.100.1.1 1657027052 installed
<13>Dec 24 09:52:45 rpmi: python3-3.10.8-alt1.1 sisyphus+311926.100.2.1 1671363746 installed
<13>Dec 24 09:52:45 rpmi: python3-base-3.10.8-alt1.1 sisyphus+311926.100.2.1 1671363746 installed
<13>Dec 24 09:52:45 rpmi: libkmod-30-alt1 sisyphus+307195.200.2.1 1663842346 installed
<13>Dec 24 09:52:45 rpmi: kmod-30-alt1 sisyphus+307195.200.2.1 1663842346 installed
<13>Dec 24 09:52:45 rpmi: dmsetup-1.02.185-alt1 sisyphus+305739.200.2.1 1661432011 installed
<86>Dec 24 09:52:45 groupadd[4028790]: group added to /etc/group: name=tape, GID=499
<86>Dec 24 09:52:45 groupadd[4028790]: group added to /etc/gshadow: name=tape
<86>Dec 24 09:52:45 groupadd[4028790]: new group: name=tape, GID=499
<86>Dec 24 09:52:45 groupadd[4028804]: group added to /etc/group: name=dialout, GID=498
<86>Dec 24 09:52:45 groupadd[4028804]: group added to /etc/gshadow: name=dialout
<86>Dec 24 09:52:45 groupadd[4028804]: new group: name=dialout, GID=498
<86>Dec 24 09:52:45 groupadd[4028818]: group added to /etc/group: name=input, GID=497
<86>Dec 24 09:52:45 groupadd[4028818]: group added to /etc/gshadow: name=input
<86>Dec 24 09:52:45 groupadd[4028818]: new group: name=input, GID=497
<86>Dec 24 09:52:45 groupadd[4028829]: group added to /etc/group: name=video, GID=496
<86>Dec 24 09:52:45 groupadd[4028829]: group added to /etc/gshadow: name=video
<86>Dec 24 09:52:45 groupadd[4028829]: new group: name=video, GID=496
<86>Dec 24 09:52:45 groupadd[4028844]: group added to /etc/group: name=render, GID=495
<86>Dec 24 09:52:45 groupadd[4028844]: group added to /etc/gshadow: name=render
<86>Dec 24 09:52:45 groupadd[4028844]: new group: name=render, GID=495
<86>Dec 24 09:52:45 groupadd[4028857]: group added to /etc/group: name=sgx, GID=494
<86>Dec 24 09:52:45 groupadd[4028857]: group added to /etc/gshadow: name=sgx
<86>Dec 24 09:52:45 groupadd[4028857]: new group: name=sgx, GID=494
<13>Dec 24 09:52:45 rpmi: udev-1:251.10-alt1 sisyphus+312238.200.2.1 1671790299 installed
<13>Dec 24 09:52:46 rpmi: python3-module-pyudev-0.24.0-alt1 sisyphus+307006.100.1.1 1663406384 installed
<13>Dec 24 09:52:46 rpmi: python3-module-libevdev-0.11-alt1 sisyphus+300877.100.1.1 1653893962 installed
<13>Dec 24 09:52:46 rpmi: libwacom-2.5.0-alt2 sisyphus+308599.100.1.1 1666082916 installed
<13>Dec 24 09:52:46 rpmi: libinput-1.22.0-alt1 sisyphus+310385.100.1.1 1669024844 installed
<86>Dec 24 09:52:46 groupadd[4030351]: group added to /etc/group: name=_keytab, GID=493
<86>Dec 24 09:52:46 groupadd[4030351]: group added to /etc/gshadow: name=_keytab
<86>Dec 24 09:52:46 groupadd[4030351]: new group: name=_keytab, GID=493
<13>Dec 24 09:52:46 rpmi: libkrb5-1.19.4-alt1 sisyphus+310092.100.2.1 1668703628 installed
<13>Dec 24 09:52:46 rpmi: libqt5-network-5.15.7-alt3 sisyphus+310218.100.1.1 1668772627 installed
<13>Dec 24 09:52:46 rpmi: libqt5-xcbqpa-5.15.7-alt3 sisyphus+310218.100.1.1 1668772627 installed
<13>Dec 24 09:52:46 rpmi: libqt5-eglfskmssupport-5.15.7-alt3 sisyphus+310218.100.1.1 1668772627 installed
<13>Dec 24 09:52:46 rpmi: libqt5-eglfsdeviceintegration-5.15.7-alt3 sisyphus+310218.100.1.1 1668772627 installed
<13>Dec 24 09:52:46 rpmi: libqt5-gui-5.15.7-alt3 sisyphus+310218.100.1.1 1668772627 installed
<13>Dec 24 09:52:46 rpmi: libqt5-qmlmodels-5.15.7-alt5 sisyphus+312279.100.1.1 1671811327 installed
<13>Dec 24 09:52:46 rpmi: libqt5-qmlworkerscript-5.15.7-alt5 sisyphus+312279.100.1.1 1671811327 installed
<13>Dec 24 09:52:46 rpmi: libqt5-quick-5.15.7-alt5 sisyphus+312279.100.1.1 1671811327 installed
<13>Dec 24 09:52:46 rpmi: libqt5-quickshapes-5.15.7-alt5 sisyphus+312279.100.1.1 1671811327 installed
<13>Dec 24 09:52:46 rpmi: libqt5-qml-5.15.7-alt5 sisyphus+312279.100.1.1 1671811327 installed
<13>Dec 24 09:52:46 rpmi: rpm-build-qml-5.15.7-alt5 sisyphus+312279.100.1.1 1671811327 installed
<13>Dec 24 09:52:46 rpmi: rpm-build-kf5-5.12.0-alt2 sisyphus+226903.100.1.1 1554799142 installed
<13>Dec 24 09:52:46 rpmi: rpm-build-ubt-0.3.1-alt3 sisyphus+277013.100.1.2 1625346631 installed
<13>Dec 24 09:52:48 rpmi: libqt5-widgets-5.15.7-alt3 sisyphus+310218.100.1.1 1668772627 installed
<13>Dec 24 09:52:48 rpmi: xorg-proto-devel-2022.1-alt1 sisyphus+299488.100.1.1 1651731532 installed
<13>Dec 24 09:52:50 rpmi: libxcb-devel-1.15-alt1 sisyphus+299436.300.1.1 1651655490 installed
<13>Dec 24 09:52:50 rpmi: libX11-devel-3:1.8.3-alt1 sisyphus+311851.100.1.1 1671173332 installed
<13>Dec 24 09:52:50 rpmi: libidn2-2.3.4-alt1 sisyphus+309023.100.1.1 1666791089 installed
<13>Dec 24 09:52:50 rpmi: libqt5-opengl-5.15.7-alt3 sisyphus+310218.100.1.1 1668772627 installed
<13>Dec 24 09:52:50 rpmi: xxd-4:9.0.0984-alt1 sisyphus+311027.200.2.1 1669984438 installed
<13>Dec 24 09:52:50 rpmi: libxkbcommon-devel-1.4.1-alt1 sisyphus+300420.100.1.1 1653246292 installed
<13>Dec 24 09:52:50 rpmi: vulkan-filesystem-1.3.236-alt1 sisyphus+311625.500.2.1 1670931001 installed
<13>Dec 24 09:52:50 rpmi: libvulkan1-1.3.236-alt1 sisyphus+311625.500.2.1 1670931014 installed
<13>Dec 24 09:52:50 rpmi: libvulkan-devel-1.3.236-alt1 sisyphus+311625.500.2.1 1670931014 installed
<13>Dec 24 09:52:50 rpmi: libudev-devel-1:251.10-alt1 sisyphus+312238.200.2.1 1671790299 installed
<13>Dec 24 09:52:50 rpmi: libssl-devel-1.1.1q-alt1 sisyphus+303203.100.1.1 1657027052 installed
<13>Dec 24 09:52:50 rpmi: libqt5-xml-5.15.7-alt3 sisyphus+310218.100.1.1 1668772627 installed
<13>Dec 24 09:52:50 rpmi: libqt5-test-5.15.7-alt3 sisyphus+310218.100.1.1 1668772627 installed
<13>Dec 24 09:52:50 rpmi: libqt5-concurrent-5.15.7-alt3 sisyphus+310218.100.1.1 1668772627 installed
<13>Dec 24 09:52:50 rpmi: libavahi-0.8-alt2 sisyphus+279391.100.1.2 1626530700 installed
<13>Dec 24 09:52:50 rpmi: libcups-2.4.2-alt1 sisyphus+304732.100.2.1 1659624899 installed
<13>Dec 24 09:52:50 rpmi: libqt5-printsupport-5.15.7-alt3 sisyphus+310218.100.1.1 1668772627 installed
<13>Dec 24 09:52:50 rpmi: libOpenGL-7:1.6.0-alt1 sisyphus+310974.100.1.1 1669906761 installed
<13>Dec 24 09:52:50 rpmi: libGLES-7:1.6.0-alt1 sisyphus+310974.100.1.1 1669906761 installed
<13>Dec 24 09:52:50 rpmi: libglvnd-devel-7:1.6.0-alt1 sisyphus+310974.100.1.1 1669906761 installed
<13>Dec 24 09:52:50 rpmi: kf5-filesystem-5.98.0-alt1 sisyphus+308540.100.1.1 1665994477 installed
<13>Dec 24 09:52:50 rpmi: kf5-karchive-common-5.101.0-alt1 sisyphus+311862.2100.3.1 1671440076 installed
<13>Dec 24 09:52:50 rpmi: libkf5archive-5.101.0-alt1 sisyphus+311862.2100.3.1 1671440141 installed
<13>Dec 24 09:52:50 rpmi: icu-utils-1:7.2.1-alt1 sisyphus+308882.100.1.1 1666532135 installed
<13>Dec 24 09:52:50 rpmi: libicu-devel-1:7.2.1-alt1 sisyphus+308882.100.1.1 1666532135 installed
<13>Dec 24 09:52:50 rpmi: gcc-c++-common-1.4.27-alt1 sisyphus+278099.1300.1.1 1626028636 installed
<13>Dec 24 09:52:50 rpmi: libstdc++12-devel-12.1.1-alt2 sisyphus+307182.100.1.1 1663782147 installed
<13>Dec 24 09:52:51 rpmi: gcc12-c++-12.1.1-alt2 sisyphus+307182.100.1.1 1663782147 installed
<13>Dec 24 09:52:51 rpmi: gcc-c++-12-alt1 sisyphus+300988.300.1.1 1654033914 installed
<13>Dec 24 09:52:51 rpmi: libyaml2-0.2.5-alt1 sisyphus+278391.100.1.1 1626094932 installed
<13>Dec 24 09:52:51 rpmi: python3-module-yaml-6.0-alt1 sisyphus+295017.400.2.1 1644497824 installed
<13>Dec 24 09:52:51 rpmi: shared-mime-info-2.2-alt1 sisyphus+297388.100.1.1 1648466617 installed
<13>Dec 24 09:52:51 rpmi: python3-module-pyxdg-0.28-alt1 sisyphus+307998.100.1.1 1665090662 installed
<13>Dec 24 09:52:51 rpmi: python3-module-pycparser-2.21-alt1.1 sisyphus+309935.7300.4.1 1668527005 installed
<13>Dec 24 09:52:51 rpmi: python3-module-cffi-1.15.1-alt1 sisyphus+308243.100.2.1 1665650136 installed
<13>Dec 24 09:52:51 rpmi: python3-module-cryptography-38.0.1-alt1 sisyphus+306457.100.1.1 1662734765 installed
<13>Dec 24 09:52:51 rpmi: python3-module-openssl-22.0.0-alt1 sisyphus+297852.100.1.1 1649097500 installed
<13>Dec 24 09:52:51 rpmi: python3-module-six-1.16.0-alt1 sisyphus+283489.100.2.1 1629527308 installed
<13>Dec 24 09:52:51 rpmi: python3-module-urllib3-2:1.26.6-alt3 sisyphus+283224.100.2.2 1629257365 installed
<13>Dec 24 09:52:51 rpmi: python3-module-idna-3.4-alt1 sisyphus+307942.100.1.1 1665051373 installed
<13>Dec 24 09:52:51 rpmi: python3-module-charset-normalizer-2.1.1-alt1 sisyphus+311047.100.1.1 1669992940 installed
<13>Dec 24 09:52:51 rpmi: python3-module-requests-2.28.1-alt1 sisyphus+304334.300.1.1 1658841176 installed
<13>Dec 24 09:52:51 rpmi: rpm-macros-cmake-3.23.2-alt1.2 sisyphus+308755.100.1.1 1666345623 installed
<13>Dec 24 09:52:51 rpmi: cmake-modules-3.23.2-alt1.2 sisyphus+308755.100.1.1 1666345612 installed
<13>Dec 24 09:52:51 rpmi: libuv-1.44.2-alt1 sisyphus+303845.100.1.1 1658053887 installed
<13>Dec 24 09:52:51 rpmi: librhash-1.3.5-alt3 sisyphus+286141.40.2.1 1632982456 installed
<13>Dec 24 09:52:51 rpmi: libjsoncpp24-1.9.4-alt2 sisyphus+286441.100.1.1 1633444234 installed
<13>Dec 24 09:52:51 rpmi: publicsuffix-list-dafsa-20221003-alt1 sisyphus+308013.100.1.1 1665137688 installed
<13>Dec 24 09:52:51 rpmi: libpsl-0.21.1-alt3 sisyphus+311293.100.1.1 1670334548 installed
<13>Dec 24 09:52:51 rpmi: libnghttp2-1.51.0-alt1 sisyphus+310565.100.1.1 1669296600 installed
<13>Dec 24 09:52:51 rpmi: openldap-common-2.6.3-alt1 sisyphus+306372.60.8.1 1663095223 installed
<86>Dec 24 09:52:51 groupadd[4068908]: group added to /etc/group: name=sasl, GID=492
<86>Dec 24 09:52:51 groupadd[4068908]: group added to /etc/gshadow: name=sasl
<86>Dec 24 09:52:51 groupadd[4068908]: new group: name=sasl, GID=492
<13>Dec 24 09:52:51 rpmi: libsasl2-3-2.1.27-alt2.2 sisyphus+306372.1000.8.1 1663097332 installed
<13>Dec 24 09:52:51 rpmi: libldap2-2.6.3-alt1 sisyphus+306372.60.8.1 1663095246 installed
<13>Dec 24 09:52:51 rpmi: libcurl-7.87.0-alt1 sisyphus+312113.100.1.1 1671611248 installed
<13>Dec 24 09:52:51 rpmi: libarchive13-3.6.1-alt2 sisyphus+311213.100.1.1 1670244624 installed
<13>Dec 24 09:52:52 rpmi: cmake-3.23.2-alt1.2 sisyphus+308755.100.1.1 1666345623 installed
<13>Dec 24 09:52:52 rpmi: extra-cmake-modules-5.101.0-alt1 sisyphus+311862.100.3.1 1671439135 installed
<13>Dec 24 09:52:52 rpmi: qt5-base-devel-5.15.7-alt3 sisyphus+310218.100.1.1 1668772627 installed
<13>Dec 24 09:52:52 rpmi: kf5-karchive-devel-5.101.0-alt1 sisyphus+311862.2100.3.1 1671440141 installed
Building target platforms: i586
Building for target i586
Wrote: /usr/src/in/nosrpm/kde5-kpkpass-22.08.3-alt1.nosrc.rpm (w1.gzdio)
Installing kde5-kpkpass-22.08.3-alt1.src.rpm
Building target platforms: i586
Building for target i586
Executing(%prep): /bin/sh -e /usr/src/tmp/rpm-tmp.7848
+ umask 022
+ /bin/mkdir -p /usr/src/RPM/BUILD
+ cd /usr/src/RPM/BUILD
+ cd /usr/src/RPM/BUILD
+ rm -rf kpkpass-22.08.3
+ echo 'Source #0 (kpkpass-22.08.3.tar):'
Source #0 (kpkpass-22.08.3.tar):
+ /bin/tar -xf /usr/src/RPM/SOURCES/kpkpass-22.08.3.tar
+ cd kpkpass-22.08.3
+ /bin/chmod -c -Rf u+rwX,go-w .
+ exit 0
Executing(%build): /bin/sh -e /usr/src/tmp/rpm-tmp.32046
+ umask 022
+ /bin/mkdir -p /usr/src/RPM/BUILD
+ cd /usr/src/RPM/BUILD
+ cd kpkpass-22.08.3
+ __kf5_build -DKDE_INSTALL_INCLUDEDIR=/usr/include/KF5
+ mkdir -p BUILD
+ __kf5_cmake -DKDE_INSTALL_INCLUDEDIR=/usr/include/KF5
+ export PATH=/usr/lib/kf5/bin:/usr/src/bin:/bin:/usr/bin:/usr/X11R6/bin:/usr/games
+ PATH=/usr/lib/kf5/bin:/usr/src/bin:/bin:/usr/bin:/usr/X11R6/bin:/usr/games
+ export QTDIR=/usr/share/qt5
+ QTDIR=/usr/share/qt5
+ export 'CFLAGS=-pipe -frecord-gcc-switches -Wall -g -O2 -flto=auto -march=i586 -mtune=generic'
+ CFLAGS='-pipe -frecord-gcc-switches -Wall -g -O2 -flto=auto -march=i586 -mtune=generic'
+ export 'CXXFLAGS=-pipe -frecord-gcc-switches -Wall -g -O2 -flto=auto -march=i586 -mtune=generic'
+ CXXFLAGS='-pipe -frecord-gcc-switches -Wall -g -O2 -flto=auto -march=i586 -mtune=generic'
+ pushd BUILD
~/RPM/BUILD/kpkpass-22.08.3/BUILD ~/RPM/BUILD/kpkpass-22.08.3
+ cmake .. -DCMAKE_USE_RELATIVE_PATHS:BOOL=ON -DCMAKE_VERBOSE_MAKEFILE:BOOL=ON -DCMAKE_SKIP_RPATH:BOOL=ON -DBUILD_TESTING:BOOL=FALSE -DKDE_INSTALL_USE_QT_SYS_PATHS:BOOL=ON -DCMAKE_BUILD_TYPE=Release '-DCMAKE_EXE_LINKER_FLAGS:STRING=-L/usr/lib -L/usr/lib/kf5/devel' '-DCMAKE_MODULE_LINKER_FLAGS:STRING=-L/usr/lib -L/usr/lib/kf5/devel' '-DCMAKE_SHARED_LINKER_FLAGS:STRING=-L/usr/lib -L/usr/lib/kf5/devel' '-DCMAKE_LIBRARY_PATH=/usr/lib/kf5/devel;/usr/lib;/lib' '-DCMAKE_INCLUDE_PATH=/usr/include/KF5;/usr/include' -DCMAKE_INSTALL_PREFIX=/usr -DCMAKE_PREFIX_PATH=/usr -DCMAKE_INSTALL_BINDIR=/usr/lib/kf5/bin -DCMAKE_INSTALL_FULL_BINDIR=/usr/lib/kf5/bin -DBIN_INSTALL_DIR:PATH=/usr/lib/kf5/bin -DCMAKE_INSTALL_SBINDIR=/usr/lib/kf5/sbin -DCMAKE_INSTALL_FULL_SBINDIR=/usr/lib/kf5/sbin -DSBIN_INSTALL_DIR:PATH=/usr/lib/kf5/sbin -DLIBEXEC_INSTALL_DIR:PATH=/usr/libexec -DINCLUDE_INSTALL_DIR:PATH=/usr/include -DCMAKE_INSTALL_INCLUDEDIR_KF5=/usr/include/KF5 -DDATA_INSTALL_DIR:PATH=/usr/share -DCONFIG_INSTALL_DIR:PATH=/etc/kf5/xdg -DSERVICES_INSTALL_DIR:PATH=/usr/share/kservices5 -DSERVICETYPES_INSTALL_DIR:PATH=/usr/share/kservicetypes5 -DKNOTIFYRC_INSTALL_DIR:PATH=/usr/share/knotifications5 -DKXMLGUI_INSTALL_DIR:PATH=/usr/share/kxmlgui5 -DLIB_INSTALL_DIR:PATH=/usr/lib -DLIB_DESTINATION=lib -DLIB_SUFFIX= -DSYSCONF_INSTALL_DIR:PATH=/etc -DAUTOSTART_INSTALL_DIR=/etc/kf5/xdg/autostart -DHTML_INSTALL_DIR=/usr/share/kf5/doc/HTML -DICON_INSTALL_DIR=/usr/share/kf5/icons -DXDG_MIME_INSTALL_DIR=/usr/share/mime/packages -DXDG_APPS_INSTALL_DIR=/usr/share/kf5/applications/kf5 -DECM_MKSPECS_INSTALL_DIR:PATH=/usr/lib/qt5/mkspecs/modules -DKCFG_INSTALL_DIR:PATH=/usr/share/kf5/config.kcfg -DPLUGIN_INSTALL_DIR:PATH=/usr/lib/qt5/plugins -DQT_PLUGIN_INSTALL_DIR:PATH=/usr/lib/qt5/plugins -DQML_INSTALL_DIR:PATH=/usr/lib/qt5/qml -DIMPORTS_INSTALL_DIR:PATH=/usr/lib/qt5/imports -DDBUS_INTERFACES_INSTALL_DIR=/usr/share/kf5/dbus-1/interfaces -DDBUS_SERVICES_INSTALL_DIR=/usr/share/kf5/dbus-1/services -DDBUS_SYSTEM_SERVICES_INSTALL_DIR=/lib/dbus-1/system-services -DKDE_INSTALL_INCLUDEDIR=/usr/include/KF5
-- The C compiler identification is GNU 12.1.1
-- The CXX compiler identification is GNU 12.1.1
-- Detecting C compiler ABI info
-- Detecting C compiler ABI info - done
-- Check for working C compiler: /usr/bin/cc - skipped
-- Detecting C compile features
-- Detecting C compile features - done
-- Detecting CXX compiler ABI info
-- Detecting CXX compiler ABI info - done
-- Check for working CXX compiler: /usr/bin/c++ - skipped
-- Detecting CXX compile features
-- Detecting CXX compile features - done
-- Looking for __GLIBC__
-- Looking for __GLIBC__ - found
-- Performing Test _OFFT_IS_64BIT
-- Performing Test _OFFT_IS_64BIT - Failed
-- Performing Test HAVE_DATE_TIME
-- Performing Test HAVE_DATE_TIME - Success
CMake Deprecation Warning at /usr/share/ECM/kde-modules/KDEInstallDirsCommon.cmake:135 (message):
BIN_INSTALL_DIR is deprecated, use KDE_INSTALL_BINDIR instead.
Call Stack (most recent call first):
/usr/share/ECM/kde-modules/KDEInstallDirsCommon.cmake:236 (_define_relative)
/usr/share/ECM/kde-modules/KDEInstallDirs5.cmake:229 (include)
/usr/share/ECM/kde-modules/KDEInstallDirs.cmake:15 (include)
CMakeLists.txt:25 (include)
CMake Deprecation Warning at /usr/share/ECM/kde-modules/KDEInstallDirsCommon.cmake:135 (message):
SBIN_INSTALL_DIR is deprecated, use KDE_INSTALL_SBINDIR instead.
Call Stack (most recent call first):
/usr/share/ECM/kde-modules/KDEInstallDirsCommon.cmake:239 (_define_relative)
/usr/share/ECM/kde-modules/KDEInstallDirs5.cmake:229 (include)
/usr/share/ECM/kde-modules/KDEInstallDirs.cmake:15 (include)
CMakeLists.txt:25 (include)
CMake Deprecation Warning at /usr/share/ECM/kde-modules/KDEInstallDirsCommon.cmake:135 (message):
LIB_INSTALL_DIR is deprecated, use KDE_INSTALL_LIBDIR instead.
Call Stack (most recent call first):
/usr/share/ECM/kde-modules/KDEInstallDirsCommon.cmake:242 (_define_relative)
/usr/share/ECM/kde-modules/KDEInstallDirs5.cmake:229 (include)
/usr/share/ECM/kde-modules/KDEInstallDirs.cmake:15 (include)
CMakeLists.txt:25 (include)
CMake Deprecation Warning at /usr/share/ECM/kde-modules/KDEInstallDirsCommon.cmake:135 (message):
LIBEXEC_INSTALL_DIR is deprecated, use KDE_INSTALL_LIBEXECDIR instead.
Call Stack (most recent call first):
/usr/share/ECM/kde-modules/KDEInstallDirsCommon.cmake:251 (_define_relative)
/usr/share/ECM/kde-modules/KDEInstallDirs5.cmake:229 (include)
/usr/share/ECM/kde-modules/KDEInstallDirs.cmake:15 (include)
CMakeLists.txt:25 (include)
CMake Deprecation Warning at /usr/share/ECM/kde-modules/KDEInstallDirsCommon.cmake:135 (message):
DATA_INSTALL_DIR is deprecated, use KDE_INSTALL_DATADIR instead.
Call Stack (most recent call first):
/usr/share/ECM/kde-modules/KDEInstallDirsCommon.cmake:280 (_define_relative)
/usr/share/ECM/kde-modules/KDEInstallDirs5.cmake:229 (include)
/usr/share/ECM/kde-modules/KDEInstallDirs.cmake:15 (include)
CMakeLists.txt:25 (include)
CMake Deprecation Warning at /usr/share/ECM/kde-modules/KDEInstallDirsCommon.cmake:135 (message):
HTML_INSTALL_DIR is deprecated, use KDE_INSTALL_DOCBUNDLEDIR instead.
Call Stack (most recent call first):
/usr/share/ECM/kde-modules/KDEInstallDirsCommon.cmake:285 (_define_relative)
/usr/share/ECM/kde-modules/KDEInstallDirs5.cmake:229 (include)
/usr/share/ECM/kde-modules/KDEInstallDirs.cmake:15 (include)
CMakeLists.txt:25 (include)
CMake Deprecation Warning at /usr/share/ECM/kde-modules/KDEInstallDirsCommon.cmake:135 (message):
KCFG_INSTALL_DIR is deprecated, use KDE_INSTALL_KCFGDIR instead.
Call Stack (most recent call first):
/usr/share/ECM/kde-modules/KDEInstallDirsCommon.cmake:288 (_define_relative)
/usr/share/ECM/kde-modules/KDEInstallDirs5.cmake:229 (include)
/usr/share/ECM/kde-modules/KDEInstallDirs.cmake:15 (include)
CMakeLists.txt:25 (include)
CMake Deprecation Warning at /usr/share/ECM/kde-modules/KDEInstallDirsCommon.cmake:135 (message):
ICON_INSTALL_DIR is deprecated, use KDE_INSTALL_ICONDIR instead.
Call Stack (most recent call first):
/usr/share/ECM/kde-modules/KDEInstallDirsCommon.cmake:305 (_define_relative)
/usr/share/ECM/kde-modules/KDEInstallDirs5.cmake:229 (include)
/usr/share/ECM/kde-modules/KDEInstallDirs.cmake:15 (include)
CMakeLists.txt:25 (include)
CMake Deprecation Warning at /usr/share/ECM/kde-modules/KDEInstallDirsCommon.cmake:135 (message):
XDG_APPS_INSTALL_DIR is deprecated, use KDE_INSTALL_APPDIR instead.
Call Stack (most recent call first):
/usr/share/ECM/kde-modules/KDEInstallDirsCommon.cmake:320 (_define_relative)
/usr/share/ECM/kde-modules/KDEInstallDirs5.cmake:229 (include)
/usr/share/ECM/kde-modules/KDEInstallDirs.cmake:15 (include)
CMakeLists.txt:25 (include)
CMake Deprecation Warning at /usr/share/ECM/kde-modules/KDEInstallDirsCommon.cmake:135 (message):
XDG_MIME_INSTALL_DIR is deprecated, use KDE_INSTALL_MIMEDIR instead.
Call Stack (most recent call first):
/usr/share/ECM/kde-modules/KDEInstallDirsCommon.cmake:326 (_define_relative)
/usr/share/ECM/kde-modules/KDEInstallDirs5.cmake:229 (include)
/usr/share/ECM/kde-modules/KDEInstallDirs.cmake:15 (include)
CMakeLists.txt:25 (include)
CMake Deprecation Warning at /usr/share/ECM/kde-modules/KDEInstallDirsCommon.cmake:135 (message):
DBUS_INTERFACES_INSTALL_DIR is deprecated, use KDE_INSTALL_DBUSINTERFACEDIR
instead.
Call Stack (most recent call first):
/usr/share/ECM/kde-modules/KDEInstallDirsCommon.cmake:340 (_define_relative)
/usr/share/ECM/kde-modules/KDEInstallDirs5.cmake:229 (include)
/usr/share/ECM/kde-modules/KDEInstallDirs.cmake:15 (include)
CMakeLists.txt:25 (include)
CMake Deprecation Warning at /usr/share/ECM/kde-modules/KDEInstallDirsCommon.cmake:135 (message):
DBUS_SERVICES_INSTALL_DIR is deprecated, use KDE_INSTALL_DBUSSERVICEDIR
instead.
Call Stack (most recent call first):
/usr/share/ECM/kde-modules/KDEInstallDirsCommon.cmake:343 (_define_relative)
/usr/share/ECM/kde-modules/KDEInstallDirs5.cmake:229 (include)
/usr/share/ECM/kde-modules/KDEInstallDirs.cmake:15 (include)
CMakeLists.txt:25 (include)
CMake Deprecation Warning at /usr/share/ECM/kde-modules/KDEInstallDirsCommon.cmake:135 (message):
DBUS_SYSTEM_SERVICES_INSTALL_DIR is deprecated, use
KDE_INSTALL_DBUSSYSTEMSERVICEDIR instead.
Call Stack (most recent call first):
/usr/share/ECM/kde-modules/KDEInstallDirsCommon.cmake:346 (_define_relative)
/usr/share/ECM/kde-modules/KDEInstallDirs5.cmake:229 (include)
/usr/share/ECM/kde-modules/KDEInstallDirs.cmake:15 (include)
CMakeLists.txt:25 (include)
CMake Deprecation Warning at /usr/share/ECM/kde-modules/KDEInstallDirsCommon.cmake:135 (message):
SYSCONF_INSTALL_DIR is deprecated, use KDE_INSTALL_SYSCONFDIR instead.
Call Stack (most recent call first):
/usr/share/ECM/kde-modules/KDEInstallDirsCommon.cmake:200 (_define_relative)
/usr/share/ECM/kde-modules/KDEInstallDirsCommon.cmake:363 (_define_absolute)
/usr/share/ECM/kde-modules/KDEInstallDirs5.cmake:229 (include)
/usr/share/ECM/kde-modules/KDEInstallDirs.cmake:15 (include)
CMakeLists.txt:25 (include)
CMake Deprecation Warning at /usr/share/ECM/kde-modules/KDEInstallDirsCommon.cmake:135 (message):
CONFIG_INSTALL_DIR is deprecated, use KDE_INSTALL_CONFDIR instead.
Call Stack (most recent call first):
/usr/share/ECM/kde-modules/KDEInstallDirsCommon.cmake:366 (_define_relative)
/usr/share/ECM/kde-modules/KDEInstallDirs5.cmake:229 (include)
/usr/share/ECM/kde-modules/KDEInstallDirs.cmake:15 (include)
CMakeLists.txt:25 (include)
CMake Deprecation Warning at /usr/share/ECM/kde-modules/KDEInstallDirsCommon.cmake:135 (message):
AUTOSTART_INSTALL_DIR is deprecated, use KDE_INSTALL_AUTOSTARTDIR instead.
Call Stack (most recent call first):
/usr/share/ECM/kde-modules/KDEInstallDirsCommon.cmake:369 (_define_relative)
/usr/share/ECM/kde-modules/KDEInstallDirs5.cmake:229 (include)
/usr/share/ECM/kde-modules/KDEInstallDirs.cmake:15 (include)
CMakeLists.txt:25 (include)
CMake Deprecation Warning at /usr/share/ECM/kde-modules/KDEInstallDirsCommon.cmake:135 (message):
QT_PLUGIN_INSTALL_DIR is deprecated, use KDE_INSTALL_QTPLUGINDIR instead.
Call Stack (most recent call first):
/usr/share/ECM/kde-modules/KDEInstallDirsCommon.cmake:200 (_define_relative)
/usr/share/ECM/kde-modules/KDEInstallDirs5.cmake:260 (_define_absolute)
/usr/share/ECM/kde-modules/KDEInstallDirs.cmake:15 (include)
CMakeLists.txt:25 (include)
CMake Deprecation Warning at /usr/share/ECM/kde-modules/KDEInstallDirsCommon.cmake:135 (message):
IMPORTS_INSTALL_DIR is deprecated, use KDE_INSTALL_QTQUICKIMPORTSDIR
instead.
Call Stack (most recent call first):
/usr/share/ECM/kde-modules/KDEInstallDirsCommon.cmake:200 (_define_relative)
/usr/share/ECM/kde-modules/KDEInstallDirs5.cmake:269 (_define_absolute)
/usr/share/ECM/kde-modules/KDEInstallDirs.cmake:15 (include)
CMakeLists.txt:25 (include)
CMake Deprecation Warning at /usr/share/ECM/kde-modules/KDEInstallDirsCommon.cmake:135 (message):
QML_INSTALL_DIR is deprecated, use KDE_INSTALL_QMLDIR instead.
Call Stack (most recent call first):
/usr/share/ECM/kde-modules/KDEInstallDirsCommon.cmake:200 (_define_relative)
/usr/share/ECM/kde-modules/KDEInstallDirs5.cmake:278 (_define_absolute)
/usr/share/ECM/kde-modules/KDEInstallDirs.cmake:15 (include)
CMakeLists.txt:25 (include)
CMake Deprecation Warning at /usr/share/ECM/kde-modules/KDEInstallDirsCommon.cmake:135 (message):
PLUGIN_INSTALL_DIR is deprecated, use KDE_INSTALL_PLUGINDIR instead.
Call Stack (most recent call first):
/usr/share/ECM/kde-modules/KDEInstallDirs5.cmake:300 (_define_relative)
/usr/share/ECM/kde-modules/KDEInstallDirs.cmake:15 (include)
CMakeLists.txt:25 (include)
CMake Deprecation Warning at /usr/share/ECM/kde-modules/KDEInstallDirsCommon.cmake:135 (message):
SERVICES_INSTALL_DIR is deprecated, use KDE_INSTALL_KSERVICES5DIR instead.
Call Stack (most recent call first):
/usr/share/ECM/kde-modules/KDEInstallDirs5.cmake:328 (_define_relative)
/usr/share/ECM/kde-modules/KDEInstallDirs.cmake:15 (include)
CMakeLists.txt:25 (include)
CMake Deprecation Warning at /usr/share/ECM/kde-modules/KDEInstallDirsCommon.cmake:135 (message):
SERVICETYPES_INSTALL_DIR is deprecated, use KDE_INSTALL_KSERVICETYPES5DIR
instead.
Call Stack (most recent call first):
/usr/share/ECM/kde-modules/KDEInstallDirs5.cmake:331 (_define_relative)
/usr/share/ECM/kde-modules/KDEInstallDirs.cmake:15 (include)
CMakeLists.txt:25 (include)
CMake Deprecation Warning at /usr/share/ECM/kde-modules/KDEInstallDirsCommon.cmake:135 (message):
KNOTIFYRC_INSTALL_DIR is deprecated, use KDE_INSTALL_KNOTIFY5RCDIR instead.
Call Stack (most recent call first):
/usr/share/ECM/kde-modules/KDEInstallDirs5.cmake:334 (_define_relative)
/usr/share/ECM/kde-modules/KDEInstallDirs.cmake:15 (include)
CMakeLists.txt:25 (include)
CMake Deprecation Warning at /usr/share/ECM/kde-modules/KDEInstallDirsCommon.cmake:135 (message):
KXMLGUI_INSTALL_DIR is deprecated, use KDE_INSTALL_KXMLGUI5DIR instead.
Call Stack (most recent call first):
/usr/share/ECM/kde-modules/KDEInstallDirs5.cmake:337 (_define_relative)
/usr/share/ECM/kde-modules/KDEInstallDirs.cmake:15 (include)
CMakeLists.txt:25 (include)
-- Found KF5Archive: /usr/lib/cmake/KF5Archive/KF5ArchiveConfig.cmake (found version "5.101.0")
-- Found KF5: success (found suitable version "5.101.0", minimum required is "5.95.0") found components: Archive
-- Found SharedMimeInfo: /usr/bin/update-mime-database (found suitable version "2.2", minimum required is "1.3")
-- Performing Test COMPILER_HAS_HIDDEN_VISIBILITY
-- Performing Test COMPILER_HAS_HIDDEN_VISIBILITY - Success
-- Performing Test COMPILER_HAS_HIDDEN_INLINE_VISIBILITY
-- Performing Test COMPILER_HAS_HIDDEN_INLINE_VISIBILITY - Success
-- Performing Test COMPILER_HAS_DEPRECATED_ATTR
-- Performing Test COMPILER_HAS_DEPRECATED_ATTR - Success
-- The following OPTIONAL packages have been found:
* Qt5Core (required version >= 5.15.2)
-- The following REQUIRED packages have been found:
* ECM (required version >= 5.95.0)
* Qt5Gui
* Qt5 (required version >= 5.15.2)
* KF5Archive (required version >= 5.95.0)
* KF5 (required version >= 5.95.0)
* SharedMimeInfo (required version >= 1.3), A database of common MIME types,
-- The following features have been disabled:
* QCH, API documentation in QCH format (for e.g. Qt Assistant, Qt Creator & KDevelop)
-- Configuring done
-- Generating done
CMake Warning:
Manually-specified variables were not used by the project:
CMAKE_INCLUDE_PATH
CMAKE_USE_RELATIVE_PATHS
ECM_MKSPECS_INSTALL_DIR
LIB_DESTINATION
LIB_SUFFIX
-- Build files have been written to: /usr/src/RPM/BUILD/kpkpass-22.08.3/BUILD
+ popd
~/RPM/BUILD/kpkpass-22.08.3
+ __kf5_make
+ pushd BUILD
~/RPM/BUILD/kpkpass-22.08.3/BUILD ~/RPM/BUILD/kpkpass-22.08.3
+ make -j16
make: Entering directory '/usr/src/RPM/BUILD/kpkpass-22.08.3/BUILD'
/usr/bin/cmake -S/usr/src/RPM/BUILD/kpkpass-22.08.3 -B/usr/src/RPM/BUILD/kpkpass-22.08.3/BUILD --check-build-system CMakeFiles/Makefile.cmake 0
make: Leaving directory '/usr/src/RPM/BUILD/kpkpass-22.08.3/BUILD'
make: Entering directory '/usr/src/RPM/BUILD/kpkpass-22.08.3/BUILD'
/usr/bin/cmake -E cmake_progress_start /usr/src/RPM/BUILD/kpkpass-22.08.3/BUILD/CMakeFiles /usr/src/RPM/BUILD/kpkpass-22.08.3/BUILD//CMakeFiles/progress.marks
make: Leaving directory '/usr/src/RPM/BUILD/kpkpass-22.08.3/BUILD'
make -f CMakeFiles/Makefile2 all
make -f src/CMakeFiles/KPimPkPass_autogen.dir/build.make src/CMakeFiles/KPimPkPass_autogen.dir/depend
make[2]: Entering directory '/usr/src/RPM/BUILD/kpkpass-22.08.3/BUILD'
cd /usr/src/RPM/BUILD/kpkpass-22.08.3/BUILD && /usr/bin/cmake -E cmake_depends "Unix Makefiles" /usr/src/RPM/BUILD/kpkpass-22.08.3 /usr/src/RPM/BUILD/kpkpass-22.08.3/src /usr/src/RPM/BUILD/kpkpass-22.08.3/BUILD /usr/src/RPM/BUILD/kpkpass-22.08.3/BUILD/src /usr/src/RPM/BUILD/kpkpass-22.08.3/BUILD/src/CMakeFiles/KPimPkPass_autogen.dir/DependInfo.cmake --color=
make[2]: Leaving directory '/usr/src/RPM/BUILD/kpkpass-22.08.3/BUILD'
make -f src/CMakeFiles/KPimPkPass_autogen.dir/build.make src/CMakeFiles/KPimPkPass_autogen.dir/build
make[2]: Entering directory '/usr/src/RPM/BUILD/kpkpass-22.08.3/BUILD'
[ 11%] Automatic MOC for target KPimPkPass
cd /usr/src/RPM/BUILD/kpkpass-22.08.3/BUILD/src && /usr/bin/cmake -E cmake_autogen /usr/src/RPM/BUILD/kpkpass-22.08.3/BUILD/src/CMakeFiles/KPimPkPass_autogen.dir/AutogenInfo.json Release
make[2]: Leaving directory '/usr/src/RPM/BUILD/kpkpass-22.08.3/BUILD'
make[1]: Entering directory '/usr/src/RPM/BUILD/kpkpass-22.08.3/BUILD'
[ 11%] Built target KPimPkPass_autogen
make[1]: Leaving directory '/usr/src/RPM/BUILD/kpkpass-22.08.3/BUILD'
make -f src/CMakeFiles/KPimPkPass.dir/build.make src/CMakeFiles/KPimPkPass.dir/depend
make[2]: Entering directory '/usr/src/RPM/BUILD/kpkpass-22.08.3/BUILD'
cd /usr/src/RPM/BUILD/kpkpass-22.08.3/BUILD && /usr/bin/cmake -E cmake_depends "Unix Makefiles" /usr/src/RPM/BUILD/kpkpass-22.08.3 /usr/src/RPM/BUILD/kpkpass-22.08.3/src /usr/src/RPM/BUILD/kpkpass-22.08.3/BUILD /usr/src/RPM/BUILD/kpkpass-22.08.3/BUILD/src /usr/src/RPM/BUILD/kpkpass-22.08.3/BUILD/src/CMakeFiles/KPimPkPass.dir/DependInfo.cmake --color=
make[2]: Leaving directory '/usr/src/RPM/BUILD/kpkpass-22.08.3/BUILD'
make -f src/CMakeFiles/KPimPkPass.dir/build.make src/CMakeFiles/KPimPkPass.dir/build
make[2]: Entering directory '/usr/src/RPM/BUILD/kpkpass-22.08.3/BUILD'
[ 22%] Building CXX object src/CMakeFiles/KPimPkPass.dir/KPimPkPass_autogen/mocs_compilation.cpp.o
cd /usr/src/RPM/BUILD/kpkpass-22.08.3/BUILD/src && /usr/bin/c++ -DKF_DEPRECATED_WARNINGS_SINCE=0x60000 -DKF_DISABLE_DEPRECATED_BEFORE_AND_AT=0x56000 -DKPimPkPass_EXPORTS -DQT_CORE_LIB -DQT_DEPRECATED_WARNINGS_SINCE=0x60000 -DQT_DISABLE_DEPRECATED_BEFORE=0x50f02 -DQT_GUI_LIB -DQT_NO_CAST_FROM_ASCII -DQT_NO_CAST_FROM_BYTEARRAY -DQT_NO_CAST_TO_ASCII -DQT_NO_DEBUG -DQT_NO_FOREACH -DQT_NO_KEYWORDS -DQT_NO_NARROWING_CONVERSIONS_IN_CONNECT -DQT_NO_URL_CAST_FROM_STRING -DQT_STRICT_ITERATORS -DQT_USE_QSTRINGBUILDER -D_FILE_OFFSET_BITS=64 -D_GNU_SOURCE -D_LARGEFILE64_SOURCE -I/usr/src/RPM/BUILD/kpkpass-22.08.3/BUILD/src -I/usr/src/RPM/BUILD/kpkpass-22.08.3/src -I/usr/src/RPM/BUILD/kpkpass-22.08.3/BUILD/src/KPimPkPass_autogen/include -isystem /usr/include/qt5 -isystem /usr/include/qt5/QtGui -isystem /usr/include/qt5/QtCore -isystem /usr/share/qt5/../../lib/qt5/mkspecs/linux-g++ -isystem /usr/include/KF5/KArchive -isystem /usr/include/KF5 -pipe -frecord-gcc-switches -Wall -g -O2 -flto=auto -march=i586 -mtune=generic -fno-operator-names -fno-exceptions -Wall -Wextra -Wcast-align -Wchar-subscripts -Wformat-security -Wno-long-long -Wpointer-arith -Wundef -Wnon-virtual-dtor -Woverloaded-virtual -Werror=return-type -Werror=init-self -Wvla -Wdate-time -Wsuggest-override -Wlogical-op -pedantic -Wzero-as-null-pointer-constant -Wmissing-include-dirs -O2 -DNDEBUG -fPIC -fvisibility=hidden -fvisibility-inlines-hidden -fPIC -std=c++17 -MD -MT src/CMakeFiles/KPimPkPass.dir/KPimPkPass_autogen/mocs_compilation.cpp.o -MF CMakeFiles/KPimPkPass.dir/KPimPkPass_autogen/mocs_compilation.cpp.o.d -o CMakeFiles/KPimPkPass.dir/KPimPkPass_autogen/mocs_compilation.cpp.o -c /usr/src/RPM/BUILD/kpkpass-22.08.3/BUILD/src/KPimPkPass_autogen/mocs_compilation.cpp
make[2]: Leaving directory '/usr/src/RPM/BUILD/kpkpass-22.08.3/BUILD'
make[2]: Entering directory '/usr/src/RPM/BUILD/kpkpass-22.08.3/BUILD'
[ 88%] Building CXX object src/CMakeFiles/KPimPkPass.dir/logging.cpp.o
cd /usr/src/RPM/BUILD/kpkpass-22.08.3/BUILD/src && /usr/bin/c++ -DKF_DEPRECATED_WARNINGS_SINCE=0x60000 -DKF_DISABLE_DEPRECATED_BEFORE_AND_AT=0x56000 -DKPimPkPass_EXPORTS -DQT_CORE_LIB -DQT_DEPRECATED_WARNINGS_SINCE=0x60000 -DQT_DISABLE_DEPRECATED_BEFORE=0x50f02 -DQT_GUI_LIB -DQT_NO_CAST_FROM_ASCII -DQT_NO_CAST_FROM_BYTEARRAY -DQT_NO_CAST_TO_ASCII -DQT_NO_DEBUG -DQT_NO_FOREACH -DQT_NO_KEYWORDS -DQT_NO_NARROWING_CONVERSIONS_IN_CONNECT -DQT_NO_URL_CAST_FROM_STRING -DQT_STRICT_ITERATORS -DQT_USE_QSTRINGBUILDER -D_FILE_OFFSET_BITS=64 -D_GNU_SOURCE -D_LARGEFILE64_SOURCE -I/usr/src/RPM/BUILD/kpkpass-22.08.3/BUILD/src -I/usr/src/RPM/BUILD/kpkpass-22.08.3/src -I/usr/src/RPM/BUILD/kpkpass-22.08.3/BUILD/src/KPimPkPass_autogen/include -isystem /usr/include/qt5 -isystem /usr/include/qt5/QtGui -isystem /usr/include/qt5/QtCore -isystem /usr/share/qt5/../../lib/qt5/mkspecs/linux-g++ -isystem /usr/include/KF5/KArchive -isystem /usr/include/KF5 -pipe -frecord-gcc-switches -Wall -g -O2 -flto=auto -march=i586 -mtune=generic -fno-operator-names -fno-exceptions -Wall -Wextra -Wcast-align -Wchar-subscripts -Wformat-security -Wno-long-long -Wpointer-arith -Wundef -Wnon-virtual-dtor -Woverloaded-virtual -Werror=return-type -Werror=init-self -Wvla -Wdate-time -Wsuggest-override -Wlogical-op -pedantic -Wzero-as-null-pointer-constant -Wmissing-include-dirs -O2 -DNDEBUG -fPIC -fvisibility=hidden -fvisibility-inlines-hidden -fPIC -std=c++17 -MD -MT src/CMakeFiles/KPimPkPass.dir/logging.cpp.o -MF CMakeFiles/KPimPkPass.dir/logging.cpp.o.d -o CMakeFiles/KPimPkPass.dir/logging.cpp.o -c /usr/src/RPM/BUILD/kpkpass-22.08.3/BUILD/src/logging.cpp
make[2]: Leaving directory '/usr/src/RPM/BUILD/kpkpass-22.08.3/BUILD'
make[2]: Entering directory '/usr/src/RPM/BUILD/kpkpass-22.08.3/BUILD'
[ 44%] Building CXX object src/CMakeFiles/KPimPkPass.dir/boardingpass.cpp.o
cd /usr/src/RPM/BUILD/kpkpass-22.08.3/BUILD/src && /usr/bin/c++ -DKF_DEPRECATED_WARNINGS_SINCE=0x60000 -DKF_DISABLE_DEPRECATED_BEFORE_AND_AT=0x56000 -DKPimPkPass_EXPORTS -DQT_CORE_LIB -DQT_DEPRECATED_WARNINGS_SINCE=0x60000 -DQT_DISABLE_DEPRECATED_BEFORE=0x50f02 -DQT_GUI_LIB -DQT_NO_CAST_FROM_ASCII -DQT_NO_CAST_FROM_BYTEARRAY -DQT_NO_CAST_TO_ASCII -DQT_NO_DEBUG -DQT_NO_FOREACH -DQT_NO_KEYWORDS -DQT_NO_NARROWING_CONVERSIONS_IN_CONNECT -DQT_NO_URL_CAST_FROM_STRING -DQT_STRICT_ITERATORS -DQT_USE_QSTRINGBUILDER -D_FILE_OFFSET_BITS=64 -D_GNU_SOURCE -D_LARGEFILE64_SOURCE -I/usr/src/RPM/BUILD/kpkpass-22.08.3/BUILD/src -I/usr/src/RPM/BUILD/kpkpass-22.08.3/src -I/usr/src/RPM/BUILD/kpkpass-22.08.3/BUILD/src/KPimPkPass_autogen/include -isystem /usr/include/qt5 -isystem /usr/include/qt5/QtGui -isystem /usr/include/qt5/QtCore -isystem /usr/share/qt5/../../lib/qt5/mkspecs/linux-g++ -isystem /usr/include/KF5/KArchive -isystem /usr/include/KF5 -pipe -frecord-gcc-switches -Wall -g -O2 -flto=auto -march=i586 -mtune=generic -fno-operator-names -fno-exceptions -Wall -Wextra -Wcast-align -Wchar-subscripts -Wformat-security -Wno-long-long -Wpointer-arith -Wundef -Wnon-virtual-dtor -Woverloaded-virtual -Werror=return-type -Werror=init-self -Wvla -Wdate-time -Wsuggest-override -Wlogical-op -pedantic -Wzero-as-null-pointer-constant -Wmissing-include-dirs -O2 -DNDEBUG -fPIC -fvisibility=hidden -fvisibility-inlines-hidden -fPIC -std=c++17 -MD -MT src/CMakeFiles/KPimPkPass.dir/boardingpass.cpp.o -MF CMakeFiles/KPimPkPass.dir/boardingpass.cpp.o.d -o CMakeFiles/KPimPkPass.dir/boardingpass.cpp.o -c /usr/src/RPM/BUILD/kpkpass-22.08.3/src/boardingpass.cpp
make[2]: Leaving directory '/usr/src/RPM/BUILD/kpkpass-22.08.3/BUILD'
make[2]: Entering directory '/usr/src/RPM/BUILD/kpkpass-22.08.3/BUILD'
[ 33%] Building CXX object src/CMakeFiles/KPimPkPass.dir/barcode.cpp.o
cd /usr/src/RPM/BUILD/kpkpass-22.08.3/BUILD/src && /usr/bin/c++ -DKF_DEPRECATED_WARNINGS_SINCE=0x60000 -DKF_DISABLE_DEPRECATED_BEFORE_AND_AT=0x56000 -DKPimPkPass_EXPORTS -DQT_CORE_LIB -DQT_DEPRECATED_WARNINGS_SINCE=0x60000 -DQT_DISABLE_DEPRECATED_BEFORE=0x50f02 -DQT_GUI_LIB -DQT_NO_CAST_FROM_ASCII -DQT_NO_CAST_FROM_BYTEARRAY -DQT_NO_CAST_TO_ASCII -DQT_NO_DEBUG -DQT_NO_FOREACH -DQT_NO_KEYWORDS -DQT_NO_NARROWING_CONVERSIONS_IN_CONNECT -DQT_NO_URL_CAST_FROM_STRING -DQT_STRICT_ITERATORS -DQT_USE_QSTRINGBUILDER -D_FILE_OFFSET_BITS=64 -D_GNU_SOURCE -D_LARGEFILE64_SOURCE -I/usr/src/RPM/BUILD/kpkpass-22.08.3/BUILD/src -I/usr/src/RPM/BUILD/kpkpass-22.08.3/src -I/usr/src/RPM/BUILD/kpkpass-22.08.3/BUILD/src/KPimPkPass_autogen/include -isystem /usr/include/qt5 -isystem /usr/include/qt5/QtGui -isystem /usr/include/qt5/QtCore -isystem /usr/share/qt5/../../lib/qt5/mkspecs/linux-g++ -isystem /usr/include/KF5/KArchive -isystem /usr/include/KF5 -pipe -frecord-gcc-switches -Wall -g -O2 -flto=auto -march=i586 -mtune=generic -fno-operator-names -fno-exceptions -Wall -Wextra -Wcast-align -Wchar-subscripts -Wformat-security -Wno-long-long -Wpointer-arith -Wundef -Wnon-virtual-dtor -Woverloaded-virtual -Werror=return-type -Werror=init-self -Wvla -Wdate-time -Wsuggest-override -Wlogical-op -pedantic -Wzero-as-null-pointer-constant -Wmissing-include-dirs -O2 -DNDEBUG -fPIC -fvisibility=hidden -fvisibility-inlines-hidden -fPIC -std=c++17 -MD -MT src/CMakeFiles/KPimPkPass.dir/barcode.cpp.o -MF CMakeFiles/KPimPkPass.dir/barcode.cpp.o.d -o CMakeFiles/KPimPkPass.dir/barcode.cpp.o -c /usr/src/RPM/BUILD/kpkpass-22.08.3/src/barcode.cpp
make[2]: Leaving directory '/usr/src/RPM/BUILD/kpkpass-22.08.3/BUILD'
make[2]: Entering directory '/usr/src/RPM/BUILD/kpkpass-22.08.3/BUILD'
[ 66%] Building CXX object src/CMakeFiles/KPimPkPass.dir/location.cpp.o
cd /usr/src/RPM/BUILD/kpkpass-22.08.3/BUILD/src && /usr/bin/c++ -DKF_DEPRECATED_WARNINGS_SINCE=0x60000 -DKF_DISABLE_DEPRECATED_BEFORE_AND_AT=0x56000 -DKPimPkPass_EXPORTS -DQT_CORE_LIB -DQT_DEPRECATED_WARNINGS_SINCE=0x60000 -DQT_DISABLE_DEPRECATED_BEFORE=0x50f02 -DQT_GUI_LIB -DQT_NO_CAST_FROM_ASCII -DQT_NO_CAST_FROM_BYTEARRAY -DQT_NO_CAST_TO_ASCII -DQT_NO_DEBUG -DQT_NO_FOREACH -DQT_NO_KEYWORDS -DQT_NO_NARROWING_CONVERSIONS_IN_CONNECT -DQT_NO_URL_CAST_FROM_STRING -DQT_STRICT_ITERATORS -DQT_USE_QSTRINGBUILDER -D_FILE_OFFSET_BITS=64 -D_GNU_SOURCE -D_LARGEFILE64_SOURCE -I/usr/src/RPM/BUILD/kpkpass-22.08.3/BUILD/src -I/usr/src/RPM/BUILD/kpkpass-22.08.3/src -I/usr/src/RPM/BUILD/kpkpass-22.08.3/BUILD/src/KPimPkPass_autogen/include -isystem /usr/include/qt5 -isystem /usr/include/qt5/QtGui -isystem /usr/include/qt5/QtCore -isystem /usr/share/qt5/../../lib/qt5/mkspecs/linux-g++ -isystem /usr/include/KF5/KArchive -isystem /usr/include/KF5 -pipe -frecord-gcc-switches -Wall -g -O2 -flto=auto -march=i586 -mtune=generic -fno-operator-names -fno-exceptions -Wall -Wextra -Wcast-align -Wchar-subscripts -Wformat-security -Wno-long-long -Wpointer-arith -Wundef -Wnon-virtual-dtor -Woverloaded-virtual -Werror=return-type -Werror=init-self -Wvla -Wdate-time -Wsuggest-override -Wlogical-op -pedantic -Wzero-as-null-pointer-constant -Wmissing-include-dirs -O2 -DNDEBUG -fPIC -fvisibility=hidden -fvisibility-inlines-hidden -fPIC -std=c++17 -MD -MT src/CMakeFiles/KPimPkPass.dir/location.cpp.o -MF CMakeFiles/KPimPkPass.dir/location.cpp.o.d -o CMakeFiles/KPimPkPass.dir/location.cpp.o -c /usr/src/RPM/BUILD/kpkpass-22.08.3/src/location.cpp
make[2]: Leaving directory '/usr/src/RPM/BUILD/kpkpass-22.08.3/BUILD'
make[2]: Entering directory '/usr/src/RPM/BUILD/kpkpass-22.08.3/BUILD'
[ 55%] Building CXX object src/CMakeFiles/KPimPkPass.dir/field.cpp.o
cd /usr/src/RPM/BUILD/kpkpass-22.08.3/BUILD/src && /usr/bin/c++ -DKF_DEPRECATED_WARNINGS_SINCE=0x60000 -DKF_DISABLE_DEPRECATED_BEFORE_AND_AT=0x56000 -DKPimPkPass_EXPORTS -DQT_CORE_LIB -DQT_DEPRECATED_WARNINGS_SINCE=0x60000 -DQT_DISABLE_DEPRECATED_BEFORE=0x50f02 -DQT_GUI_LIB -DQT_NO_CAST_FROM_ASCII -DQT_NO_CAST_FROM_BYTEARRAY -DQT_NO_CAST_TO_ASCII -DQT_NO_DEBUG -DQT_NO_FOREACH -DQT_NO_KEYWORDS -DQT_NO_NARROWING_CONVERSIONS_IN_CONNECT -DQT_NO_URL_CAST_FROM_STRING -DQT_STRICT_ITERATORS -DQT_USE_QSTRINGBUILDER -D_FILE_OFFSET_BITS=64 -D_GNU_SOURCE -D_LARGEFILE64_SOURCE -I/usr/src/RPM/BUILD/kpkpass-22.08.3/BUILD/src -I/usr/src/RPM/BUILD/kpkpass-22.08.3/src -I/usr/src/RPM/BUILD/kpkpass-22.08.3/BUILD/src/KPimPkPass_autogen/include -isystem /usr/include/qt5 -isystem /usr/include/qt5/QtGui -isystem /usr/include/qt5/QtCore -isystem /usr/share/qt5/../../lib/qt5/mkspecs/linux-g++ -isystem /usr/include/KF5/KArchive -isystem /usr/include/KF5 -pipe -frecord-gcc-switches -Wall -g -O2 -flto=auto -march=i586 -mtune=generic -fno-operator-names -fno-exceptions -Wall -Wextra -Wcast-align -Wchar-subscripts -Wformat-security -Wno-long-long -Wpointer-arith -Wundef -Wnon-virtual-dtor -Woverloaded-virtual -Werror=return-type -Werror=init-self -Wvla -Wdate-time -Wsuggest-override -Wlogical-op -pedantic -Wzero-as-null-pointer-constant -Wmissing-include-dirs -O2 -DNDEBUG -fPIC -fvisibility=hidden -fvisibility-inlines-hidden -fPIC -std=c++17 -MD -MT src/CMakeFiles/KPimPkPass.dir/field.cpp.o -MF CMakeFiles/KPimPkPass.dir/field.cpp.o.d -o CMakeFiles/KPimPkPass.dir/field.cpp.o -c /usr/src/RPM/BUILD/kpkpass-22.08.3/src/field.cpp
make[2]: Leaving directory '/usr/src/RPM/BUILD/kpkpass-22.08.3/BUILD'
make[2]: Entering directory '/usr/src/RPM/BUILD/kpkpass-22.08.3/BUILD'
[ 77%] Building CXX object src/CMakeFiles/KPimPkPass.dir/pass.cpp.o
cd /usr/src/RPM/BUILD/kpkpass-22.08.3/BUILD/src && /usr/bin/c++ -DKF_DEPRECATED_WARNINGS_SINCE=0x60000 -DKF_DISABLE_DEPRECATED_BEFORE_AND_AT=0x56000 -DKPimPkPass_EXPORTS -DQT_CORE_LIB -DQT_DEPRECATED_WARNINGS_SINCE=0x60000 -DQT_DISABLE_DEPRECATED_BEFORE=0x50f02 -DQT_GUI_LIB -DQT_NO_CAST_FROM_ASCII -DQT_NO_CAST_FROM_BYTEARRAY -DQT_NO_CAST_TO_ASCII -DQT_NO_DEBUG -DQT_NO_FOREACH -DQT_NO_KEYWORDS -DQT_NO_NARROWING_CONVERSIONS_IN_CONNECT -DQT_NO_URL_CAST_FROM_STRING -DQT_STRICT_ITERATORS -DQT_USE_QSTRINGBUILDER -D_FILE_OFFSET_BITS=64 -D_GNU_SOURCE -D_LARGEFILE64_SOURCE -I/usr/src/RPM/BUILD/kpkpass-22.08.3/BUILD/src -I/usr/src/RPM/BUILD/kpkpass-22.08.3/src -I/usr/src/RPM/BUILD/kpkpass-22.08.3/BUILD/src/KPimPkPass_autogen/include -isystem /usr/include/qt5 -isystem /usr/include/qt5/QtGui -isystem /usr/include/qt5/QtCore -isystem /usr/share/qt5/../../lib/qt5/mkspecs/linux-g++ -isystem /usr/include/KF5/KArchive -isystem /usr/include/KF5 -pipe -frecord-gcc-switches -Wall -g -O2 -flto=auto -march=i586 -mtune=generic -fno-operator-names -fno-exceptions -Wall -Wextra -Wcast-align -Wchar-subscripts -Wformat-security -Wno-long-long -Wpointer-arith -Wundef -Wnon-virtual-dtor -Woverloaded-virtual -Werror=return-type -Werror=init-self -Wvla -Wdate-time -Wsuggest-override -Wlogical-op -pedantic -Wzero-as-null-pointer-constant -Wmissing-include-dirs -O2 -DNDEBUG -fPIC -fvisibility=hidden -fvisibility-inlines-hidden -fPIC -std=c++17 -MD -MT src/CMakeFiles/KPimPkPass.dir/pass.cpp.o -MF CMakeFiles/KPimPkPass.dir/pass.cpp.o.d -o CMakeFiles/KPimPkPass.dir/pass.cpp.o -c /usr/src/RPM/BUILD/kpkpass-22.08.3/src/pass.cpp
make[2]: Leaving directory '/usr/src/RPM/BUILD/kpkpass-22.08.3/BUILD'
make[2]: Entering directory '/usr/src/RPM/BUILD/kpkpass-22.08.3/BUILD'
[100%] Linking CXX shared library ../bin/libKPimPkPass.so
cd /usr/src/RPM/BUILD/kpkpass-22.08.3/BUILD/src && /usr/bin/cmake -E cmake_link_script CMakeFiles/KPimPkPass.dir/link.txt --verbose=1
/usr/bin/c++ -fPIC -pipe -frecord-gcc-switches -Wall -g -O2 -flto=auto -march=i586 -mtune=generic -fno-operator-names -fno-exceptions -Wall -Wextra -Wcast-align -Wchar-subscripts -Wformat-security -Wno-long-long -Wpointer-arith -Wundef -Wnon-virtual-dtor -Woverloaded-virtual -Werror=return-type -Werror=init-self -Wvla -Wdate-time -Wsuggest-override -Wlogical-op -pedantic -Wzero-as-null-pointer-constant -Wmissing-include-dirs -O2 -DNDEBUG -Wl,--no-undefined -Wl,--fatal-warnings -Wl,--enable-new-dtags -L/usr/lib -L/usr/lib/kf5/devel -shared -Wl,-soname,libKPimPkPass.so.5 -o ../bin/libKPimPkPass.so.5.21.3 CMakeFiles/KPimPkPass.dir/KPimPkPass_autogen/mocs_compilation.cpp.o CMakeFiles/KPimPkPass.dir/barcode.cpp.o CMakeFiles/KPimPkPass.dir/boardingpass.cpp.o CMakeFiles/KPimPkPass.dir/field.cpp.o CMakeFiles/KPimPkPass.dir/location.cpp.o CMakeFiles/KPimPkPass.dir/pass.cpp.o CMakeFiles/KPimPkPass.dir/logging.cpp.o /usr/lib/libQt5Gui.so.5.15.7 /usr/lib/libKF5Archive.so.5.101.0 /usr/lib/libQt5Core.so.5.15.7
cd /usr/src/RPM/BUILD/kpkpass-22.08.3/BUILD/src && /usr/bin/cmake -E cmake_symlink_library ../bin/libKPimPkPass.so.5.21.3 ../bin/libKPimPkPass.so.5 ../bin/libKPimPkPass.so
make[2]: Leaving directory '/usr/src/RPM/BUILD/kpkpass-22.08.3/BUILD'
make[1]: Entering directory '/usr/src/RPM/BUILD/kpkpass-22.08.3/BUILD'
[100%] Built target KPimPkPass
make[1]: Leaving directory '/usr/src/RPM/BUILD/kpkpass-22.08.3/BUILD'
make: Entering directory '/usr/src/RPM/BUILD/kpkpass-22.08.3/BUILD'
/usr/bin/cmake -E cmake_progress_start /usr/src/RPM/BUILD/kpkpass-22.08.3/BUILD/CMakeFiles 0
make: Leaving directory '/usr/src/RPM/BUILD/kpkpass-22.08.3/BUILD'
+ popd
~/RPM/BUILD/kpkpass-22.08.3
+ exit 0
Executing(%install): /bin/sh -e /usr/src/tmp/rpm-tmp.78172
+ umask 022
+ /bin/mkdir -p /usr/src/RPM/BUILD
+ cd /usr/src/RPM/BUILD
+ /bin/chmod -Rf u+rwX -- /usr/src/tmp/kde5-kpkpass-buildroot
+ :
+ /bin/rm -rf -- /usr/src/tmp/kde5-kpkpass-buildroot
+ PATH=/usr/libexec/rpm-build:/usr/src/bin:/bin:/usr/bin:/usr/X11R6/bin:/usr/games
+ cd kpkpass-22.08.3
+ __kf5_install
+ make -C BUILD DESTDIR=/usr/src/tmp/kde5-kpkpass-buildroot install
make: Entering directory '/usr/src/RPM/BUILD/kpkpass-22.08.3/BUILD'
/usr/bin/cmake -S/usr/src/RPM/BUILD/kpkpass-22.08.3 -B/usr/src/RPM/BUILD/kpkpass-22.08.3/BUILD --check-build-system CMakeFiles/Makefile.cmake 0
/usr/bin/cmake -E cmake_progress_start /usr/src/RPM/BUILD/kpkpass-22.08.3/BUILD/CMakeFiles /usr/src/RPM/BUILD/kpkpass-22.08.3/BUILD//CMakeFiles/progress.marks
make -f CMakeFiles/Makefile2 all
make[1]: Entering directory '/usr/src/RPM/BUILD/kpkpass-22.08.3/BUILD'
make -f src/CMakeFiles/KPimPkPass_autogen.dir/build.make src/CMakeFiles/KPimPkPass_autogen.dir/depend
make[2]: Entering directory '/usr/src/RPM/BUILD/kpkpass-22.08.3/BUILD'
cd /usr/src/RPM/BUILD/kpkpass-22.08.3/BUILD && /usr/bin/cmake -E cmake_depends "Unix Makefiles" /usr/src/RPM/BUILD/kpkpass-22.08.3 /usr/src/RPM/BUILD/kpkpass-22.08.3/src /usr/src/RPM/BUILD/kpkpass-22.08.3/BUILD /usr/src/RPM/BUILD/kpkpass-22.08.3/BUILD/src /usr/src/RPM/BUILD/kpkpass-22.08.3/BUILD/src/CMakeFiles/KPimPkPass_autogen.dir/DependInfo.cmake --color=
make[2]: Leaving directory '/usr/src/RPM/BUILD/kpkpass-22.08.3/BUILD'
make -f src/CMakeFiles/KPimPkPass_autogen.dir/build.make src/CMakeFiles/KPimPkPass_autogen.dir/build
make[2]: Entering directory '/usr/src/RPM/BUILD/kpkpass-22.08.3/BUILD'
[ 11%] Automatic MOC for target KPimPkPass
cd /usr/src/RPM/BUILD/kpkpass-22.08.3/BUILD/src && /usr/bin/cmake -E cmake_autogen /usr/src/RPM/BUILD/kpkpass-22.08.3/BUILD/src/CMakeFiles/KPimPkPass_autogen.dir/AutogenInfo.json Release
make[2]: Leaving directory '/usr/src/RPM/BUILD/kpkpass-22.08.3/BUILD'
[ 11%] Built target KPimPkPass_autogen
make -f src/CMakeFiles/KPimPkPass.dir/build.make src/CMakeFiles/KPimPkPass.dir/depend
make[2]: Entering directory '/usr/src/RPM/BUILD/kpkpass-22.08.3/BUILD'
cd /usr/src/RPM/BUILD/kpkpass-22.08.3/BUILD && /usr/bin/cmake -E cmake_depends "Unix Makefiles" /usr/src/RPM/BUILD/kpkpass-22.08.3 /usr/src/RPM/BUILD/kpkpass-22.08.3/src /usr/src/RPM/BUILD/kpkpass-22.08.3/BUILD /usr/src/RPM/BUILD/kpkpass-22.08.3/BUILD/src /usr/src/RPM/BUILD/kpkpass-22.08.3/BUILD/src/CMakeFiles/KPimPkPass.dir/DependInfo.cmake --color=
Consolidate compiler generated dependencies of target KPimPkPass
make[2]: Leaving directory '/usr/src/RPM/BUILD/kpkpass-22.08.3/BUILD'
make -f src/CMakeFiles/KPimPkPass.dir/build.make src/CMakeFiles/KPimPkPass.dir/build
make[2]: Entering directory '/usr/src/RPM/BUILD/kpkpass-22.08.3/BUILD'
make[2]: Nothing to be done for 'src/CMakeFiles/KPimPkPass.dir/build'.
make[2]: Leaving directory '/usr/src/RPM/BUILD/kpkpass-22.08.3/BUILD'
[100%] Built target KPimPkPass
make[1]: Leaving directory '/usr/src/RPM/BUILD/kpkpass-22.08.3/BUILD'
/usr/bin/cmake -E cmake_progress_start /usr/src/RPM/BUILD/kpkpass-22.08.3/BUILD/CMakeFiles 0
make -f CMakeFiles/Makefile2 preinstall
make[1]: Entering directory '/usr/src/RPM/BUILD/kpkpass-22.08.3/BUILD'
make[1]: Nothing to be done for 'preinstall'.
make[1]: Leaving directory '/usr/src/RPM/BUILD/kpkpass-22.08.3/BUILD'
Install the project...
/usr/bin/cmake -P cmake_install.cmake
-- Install configuration: "Release"
-- Installing: /usr/src/tmp/kde5-kpkpass-buildroot/usr/lib/libKPimPkPass.so.5.21.3
-- Installing: /usr/src/tmp/kde5-kpkpass-buildroot/usr/lib/libKPimPkPass.so.5
-- Installing: /usr/src/tmp/kde5-kpkpass-buildroot/usr/lib/libKPimPkPass.so
-- Installing: /usr/src/tmp/kde5-kpkpass-buildroot/usr/include/KF5/KPim/KPkPass/Barcode
-- Installing: /usr/src/tmp/kde5-kpkpass-buildroot/usr/include/KF5/KPim/KPkPass/BoardingPass
-- Installing: /usr/src/tmp/kde5-kpkpass-buildroot/usr/include/KF5/KPim/KPkPass/Field
-- Installing: /usr/src/tmp/kde5-kpkpass-buildroot/usr/include/KF5/KPim/KPkPass/Location
-- Installing: /usr/src/tmp/kde5-kpkpass-buildroot/usr/include/KF5/KPim/KPkPass/Pass
-- Installing: /usr/src/tmp/kde5-kpkpass-buildroot/usr/include/KF5/KPim/KPkPass/barcode.h
-- Installing: /usr/src/tmp/kde5-kpkpass-buildroot/usr/include/KF5/KPim/KPkPass/boardingpass.h
-- Installing: /usr/src/tmp/kde5-kpkpass-buildroot/usr/include/KF5/KPim/KPkPass/field.h
-- Installing: /usr/src/tmp/kde5-kpkpass-buildroot/usr/include/KF5/KPim/KPkPass/location.h
-- Installing: /usr/src/tmp/kde5-kpkpass-buildroot/usr/include/KF5/KPim/KPkPass/pass.h
-- Installing: /usr/src/tmp/kde5-kpkpass-buildroot/usr/include/KF5/KPim/KPkPass/kpkpass_export.h
-- Installing: /usr/src/tmp/kde5-kpkpass-buildroot/usr/include/KF5/KPim/KPkPass/kpkpass_version.h
-- Installing: /usr/src/tmp/kde5-kpkpass-buildroot/usr/share/qlogging-categories5/org_kde_kpkpass.categories
-- Installing: /usr/src/tmp/kde5-kpkpass-buildroot/usr/lib/cmake/KPimPkPass/KPimPkPassConfig.cmake
-- Installing: /usr/src/tmp/kde5-kpkpass-buildroot/usr/lib/cmake/KPimPkPass/KPimPkPassConfigVersion.cmake
-- Installing: /usr/src/tmp/kde5-kpkpass-buildroot/usr/lib/cmake/KPimPkPass/KPimPkPassTargets.cmake
-- Installing: /usr/src/tmp/kde5-kpkpass-buildroot/usr/lib/cmake/KPimPkPass/KPimPkPassTargets-release.cmake
make: Leaving directory '/usr/src/RPM/BUILD/kpkpass-22.08.3/BUILD'
+ '[' -d /usr/src/tmp/kde5-kpkpass-buildroot//usr/share ']'
+ ls -1d '/usr/src/tmp/kde5-kpkpass-buildroot//usr/share/kf5/k*5'
+ read d
ls: cannot access '/usr/src/tmp/kde5-kpkpass-buildroot//usr/share/kf5/k*5': No such file or directory
+ '[' -d /usr/src/tmp/kde5-kpkpass-buildroot//usr/share/kf5/lib64 ']'
+ '[' -d /usr/src/tmp/kde5-kpkpass-buildroot//usr/share/kf5/lib ']'
+ ls -1 /usr/src/tmp/kde5-kpkpass-buildroot//usr/lib/libKPimPkPass.so
+ read p
+ '[' -L /usr/src/tmp/kde5-kpkpass-buildroot//usr/lib/libKPimPkPass.so ']'
+ mkdir -p /usr/src/tmp/kde5-kpkpass-buildroot//usr/lib/kf5/devel
++ readlink /usr/src/tmp/kde5-kpkpass-buildroot//usr/lib/libKPimPkPass.so
+ f=libKPimPkPass.so.5
++ basename /usr/src/tmp/kde5-kpkpass-buildroot//usr/lib/libKPimPkPass.so
+ l=libKPimPkPass.so
++ relative /usr/src/tmp/kde5-kpkpass-buildroot//usr/lib/libKPimPkPass.so.5 /usr/src/tmp/kde5-kpkpass-buildroot//usr/lib/kf5/devel/libKPimPkPass.so.5
+ ln -sf ../../libKPimPkPass.so.5 /usr/src/tmp/kde5-kpkpass-buildroot//usr/lib/kf5/devel/libKPimPkPass.so
+ rm -f /usr/src/tmp/kde5-kpkpass-buildroot//usr/lib/libKPimPkPass.so
+ read p
+ '[' -d /usr/src/tmp/kde5-kpkpass-buildroot//usr/share/kf5/bin ']'
+ '[' -d /usr/src/tmp/kde5-kpkpass-buildroot//usr/share/kf5/include ']'
+ '[' -d /usr/src/tmp/kde5-kpkpass-buildroot//usr/lib/kf5/bin -a true == true ']'
+ ls -1 '/usr/src/tmp/kde5-kpkpass-buildroot//usr/share/kf5/dbus-1/services/*5*.service'
+ read s
+ '[' -d /usr/src/tmp/kde5-kpkpass-buildroot//usr/share/akonadi ']'
+ '[' -d /usr/src/tmp/kde5-kpkpass-buildroot//usr/share/kf5/akonadi ']'
+ '[' -d /usr/src/tmp/kde5-kpkpass-buildroot//usr/share/man -a remove == remove ']'
+ '[' -d /usr/src/tmp/kde5-kpkpass-buildroot//usr/share/appdata -a keep == remove ']'
+ '[' -d /usr/src/tmp/kde5-kpkpass-buildroot//usr/share/metainfo -a keep == remove ']'
+ '[' -d /usr/src/tmp/kde5-kpkpass-buildroot//usr/lib/cmake/ ']'
+ find /usr/src/tmp/kde5-kpkpass-buildroot//usr/lib/cmake/ -type f -name '*.cmake'
+ read f
+ sed -i -e 's|\(set(.*\)${PACKAGE_PREFIX_DIR}//usr/|\1${PACKAGE_PREFIX_DIR}/|' /usr/src/tmp/kde5-kpkpass-buildroot//usr/lib/cmake/KPimPkPass/KPimPkPassTargets-release.cmake
+ sed -i -e 's|/usr//usr/|/usr/|' /usr/src/tmp/kde5-kpkpass-buildroot//usr/lib/cmake/KPimPkPass/KPimPkPassTargets-release.cmake
+ read f
+ sed -i -e 's|\(set(.*\)${PACKAGE_PREFIX_DIR}//usr/|\1${PACKAGE_PREFIX_DIR}/|' /usr/src/tmp/kde5-kpkpass-buildroot//usr/lib/cmake/KPimPkPass/KPimPkPassTargets.cmake
+ sed -i -e 's|/usr//usr/|/usr/|' /usr/src/tmp/kde5-kpkpass-buildroot//usr/lib/cmake/KPimPkPass/KPimPkPassTargets.cmake
+ read f
+ sed -i -e 's|\(set(.*\)${PACKAGE_PREFIX_DIR}//usr/|\1${PACKAGE_PREFIX_DIR}/|' /usr/src/tmp/kde5-kpkpass-buildroot//usr/lib/cmake/KPimPkPass/KPimPkPassConfigVersion.cmake
+ sed -i -e 's|/usr//usr/|/usr/|' /usr/src/tmp/kde5-kpkpass-buildroot//usr/lib/cmake/KPimPkPass/KPimPkPassConfigVersion.cmake
+ read f
+ sed -i -e 's|\(set(.*\)${PACKAGE_PREFIX_DIR}//usr/|\1${PACKAGE_PREFIX_DIR}/|' /usr/src/tmp/kde5-kpkpass-buildroot//usr/lib/cmake/KPimPkPass/KPimPkPassConfig.cmake
+ sed -i -e 's|/usr//usr/|/usr/|' /usr/src/tmp/kde5-kpkpass-buildroot//usr/lib/cmake/KPimPkPass/KPimPkPassConfig.cmake
+ read f
+ /usr/lib/rpm/find-lang kde5-kpkpass --all-name
+ /usr/lib/rpm/brp-alt
Cleaning files in /usr/src/tmp/kde5-kpkpass-buildroot (auto)
mode of './usr/lib/libKPimPkPass.so.5.21.3' changed from 0755 (rwxr-xr-x) to 0644 (rw-r--r--)
Verifying and fixing files in /usr/src/tmp/kde5-kpkpass-buildroot (binconfig,pkgconfig,libtool,desktop,gnuconfig)
Checking contents of files in /usr/src/tmp/kde5-kpkpass-buildroot/ (default)
Compressing files in /usr/src/tmp/kde5-kpkpass-buildroot (auto)
Adjusting library links in /usr/src/tmp/kde5-kpkpass-buildroot
./usr/lib: (from :0)
libKPimPkPass.so.5 -> libKPimPkPass.so.5.21.3
Verifying ELF objects in /usr/src/tmp/kde5-kpkpass-buildroot (arch=normal,fhs=normal,lfs=relaxed,lint=relaxed,rpath=normal,stack=normal,textrel=normal,unresolved=normal)
Processing files: kde5-kpkpass-common-22.08.3-alt1
Executing(%doc): /bin/sh -e /usr/src/tmp/rpm-tmp.78172
+ umask 022
+ /bin/mkdir -p /usr/src/RPM/BUILD
+ cd /usr/src/RPM/BUILD
+ cd kpkpass-22.08.3
+ DOCDIR=/usr/src/tmp/kde5-kpkpass-buildroot/usr/share/doc/kde5-kpkpass-common-22.08.3
+ export DOCDIR
+ rm -rf /usr/src/tmp/kde5-kpkpass-buildroot/usr/share/doc/kde5-kpkpass-common-22.08.3
+ /bin/mkdir -p /usr/src/tmp/kde5-kpkpass-buildroot/usr/share/doc/kde5-kpkpass-common-22.08.3
+ cp -prL LICENSES/BSD-3-Clause.txt LICENSES/CC0-1.0.txt LICENSES/LGPL-2.0-or-later.txt README.md /usr/src/tmp/kde5-kpkpass-buildroot/usr/share/doc/kde5-kpkpass-common-22.08.3
+ chmod -R go-w /usr/src/tmp/kde5-kpkpass-buildroot/usr/share/doc/kde5-kpkpass-common-22.08.3
+ chmod -R a+rX /usr/src/tmp/kde5-kpkpass-buildroot/usr/share/doc/kde5-kpkpass-common-22.08.3
+ exit 0
Finding Provides (using /usr/lib/rpm/find-provides)
Executing: /bin/sh -e /usr/src/tmp/rpm-tmp.nm7CRD
find-provides: running scripts (alternatives,debuginfo,lib,pam,perl,pkgconfig,python,python3,qml,shell)
Finding Requires (using /usr/lib/rpm/find-requires)
Executing: /bin/sh -e /usr/src/tmp/rpm-tmp.q6qjib
find-requires: running scripts (cpp,debuginfo,files,lib,pam,perl,pkgconfig,pkgconfiglib,python,python3,qml,rpmlib,shebang,shell,static,symlinks,systemd-services)
Requires: kf5-filesystem
Processing files: kde5-kpkpass-devel-22.08.3-alt1
Finding Provides (using /usr/lib/rpm/find-provides)
Executing: /bin/sh -e /usr/src/tmp/rpm-tmp.62rsyy
find-provides: running scripts (alternatives,debuginfo,lib,pam,perl,pkgconfig,python,python3,qml,shell)
Finding Requires (using /usr/lib/rpm/find-requires)
Executing: /bin/sh -e /usr/src/tmp/rpm-tmp.sblw9T
find-requires: running scripts (cpp,debuginfo,files,lib,pam,perl,pkgconfig,pkgconfiglib,python,python3,qml,rpmlib,shebang,shell,static,symlinks,systemd-services)
In file included from /usr/src/tmp/kde5-kpkpass-buildroot/usr/include/KF5/KPim/KPkPass/pass.h:9:
/usr/src/tmp/kde5-kpkpass-buildroot/usr/include/KF5/KPim/KPkPass/field.h:11:10: fatal error: QMetaType: No such file or directory
11 | #include
| ^~~~~~~~~~~
compilation terminated.
cpp.req: /usr/src/tmp/kde5-kpkpass-buildroot/usr/include/KF5/KPim/KPkPass/pass.h: cpp failed, trying c++ mode
In file included from /usr/src/tmp/kde5-kpkpass-buildroot/usr/include/KF5/KPim/KPkPass/pass.h:9:
/usr/src/tmp/kde5-kpkpass-buildroot/usr/include/KF5/KPim/KPkPass/field.h:11:10: fatal error: QMetaType: No such file or directory
11 | #include
| ^~~~~~~~~~~
compilation terminated.
cpp.req: WARNING: /usr/src/tmp/kde5-kpkpass-buildroot/usr/include/KF5/KPim/KPkPass/pass.h: cpp failed
/usr/src/tmp/kde5-kpkpass-buildroot/usr/include/KF5/KPim/KPkPass/field.h:11:10: fatal error: QMetaType: No such file or directory
11 | #include
| ^~~~~~~~~~~
compilation terminated.
cpp.req: /usr/src/tmp/kde5-kpkpass-buildroot/usr/include/KF5/KPim/KPkPass/field.h: cpp failed, trying c++ mode
/usr/src/tmp/kde5-kpkpass-buildroot/usr/include/KF5/KPim/KPkPass/field.h:11:10: fatal error: QMetaType: No such file or directory
11 | #include
| ^~~~~~~~~~~
compilation terminated.
cpp.req: WARNING: /usr/src/tmp/kde5-kpkpass-buildroot/usr/include/KF5/KPim/KPkPass/field.h: cpp failed
/usr/src/tmp/kde5-kpkpass-buildroot/usr/include/KF5/KPim/KPkPass/barcode.h:11:10: fatal error: QMetaType: No such file or directory
11 | #include
| ^~~~~~~~~~~
compilation terminated.
cpp.req: /usr/src/tmp/kde5-kpkpass-buildroot/usr/include/KF5/KPim/KPkPass/barcode.h: cpp failed, trying c++ mode
/usr/src/tmp/kde5-kpkpass-buildroot/usr/include/KF5/KPim/KPkPass/barcode.h:11:10: fatal error: QMetaType: No such file or directory
11 | #include
| ^~~~~~~~~~~
compilation terminated.
cpp.req: WARNING: /usr/src/tmp/kde5-kpkpass-buildroot/usr/include/KF5/KPim/KPkPass/barcode.h: cpp failed
/usr/src/tmp/kde5-kpkpass-buildroot/usr/include/KF5/KPim/KPkPass/location.h:11:10: fatal error: QMetaType: No such file or directory
11 | #include
| ^~~~~~~~~~~
compilation terminated.
cpp.req: /usr/src/tmp/kde5-kpkpass-buildroot/usr/include/KF5/KPim/KPkPass/location.h: cpp failed, trying c++ mode
/usr/src/tmp/kde5-kpkpass-buildroot/usr/include/KF5/KPim/KPkPass/location.h:11:10: fatal error: QMetaType: No such file or directory
11 | #include
| ^~~~~~~~~~~
compilation terminated.
cpp.req: WARNING: /usr/src/tmp/kde5-kpkpass-buildroot/usr/include/KF5/KPim/KPkPass/location.h: cpp failed
In file included from /usr/src/tmp/kde5-kpkpass-buildroot/usr/include/KF5/KPim/KPkPass/pass.h:9,
from /usr/src/tmp/kde5-kpkpass-buildroot/usr/include/KF5/KPim/KPkPass/boardingpass.h:9:
/usr/src/tmp/kde5-kpkpass-buildroot/usr/include/KF5/KPim/KPkPass/field.h:11:10: fatal error: QMetaType: No such file or directory
11 | #include
| ^~~~~~~~~~~
compilation terminated.
cpp.req: /usr/src/tmp/kde5-kpkpass-buildroot/usr/include/KF5/KPim/KPkPass/boardingpass.h: cpp failed, trying c++ mode
In file included from /usr/src/tmp/kde5-kpkpass-buildroot/usr/include/KF5/KPim/KPkPass/pass.h:9,
from /usr/src/tmp/kde5-kpkpass-buildroot/usr/include/KF5/KPim/KPkPass/boardingpass.h:9:
/usr/src/tmp/kde5-kpkpass-buildroot/usr/include/KF5/KPim/KPkPass/field.h:11:10: fatal error: QMetaType: No such file or directory
11 | #include
| ^~~~~~~~~~~
compilation terminated.
cpp.req: WARNING: /usr/src/tmp/kde5-kpkpass-buildroot/usr/include/KF5/KPim/KPkPass/boardingpass.h: cpp failed
Requires: /usr/lib/libKPimPkPass.so.5
Finding debuginfo files (using /usr/lib/rpm/find-debuginfo-files)
Executing: /bin/sh -e /usr/src/tmp/rpm-tmp.QN50zC
Processing files: libkpimpkpass5-22.08.3-alt1
warning: File listed twice: /usr/lib/libKPimPkPass.so.5
Finding Provides (using /usr/lib/rpm/find-provides)
Executing: /bin/sh -e /usr/src/tmp/rpm-tmp.FWyD2C
find-provides: running scripts (alternatives,debuginfo,lib,pam,perl,pkgconfig,python,python3,qml,shell)
lib.prov: /usr/src/tmp/kde5-kpkpass-buildroot/usr/lib/libKPimPkPass.so.5: 120 symbols, 17 bpp
warning: hash collision: _ZN7KPkPass12BoardingPassC1EP7QObject _ZN7KPkPass4Pass11qt_metacallEN11QMetaObject4CallEiPPv
Finding Requires (using /usr/lib/rpm/find-requires)
Executing: /bin/sh -e /usr/src/tmp/rpm-tmp.TEEAFR
find-requires: running scripts (cpp,debuginfo,files,lib,pam,perl,pkgconfig,pkgconfiglib,python,python3,qml,rpmlib,shebang,shell,static,symlinks,systemd-services)
Provides: libkpimpkpass = 22.08.3-alt1, libKPimPkPass.so.5 = set:kdwicdqTy9j8XwIm66PuniRhrEcFsbccBerh6MXbZ1npZykJYdedgk8Nqu9ZsLU15lgZtuXPSZE0UPMmdVSy6ZykVNJzPI3J2PVx7igkvUrENCMdeJBCsPFoOykTd5ssXyCiloHF9g7j5r14TsbsKkqEDenlbC3xHJMnGi1fIgyoO5MZISUGZDwLHjhFNCOzje3bbHIN5DvcsiE9lBHwhN5R973m8RBpARqaUhZ9fWPX0
Requires: kde5-kpkpass-common = 22.08.3-alt1, libKF5Archive.so.5 >= set:liW8ifFWH8VSCe79Zcn, libQt5Core.so.5 >= set:qiUVPh9azx2x5jI4ackblZ0QB10jy8sOzFd8F9ZqXH90GZmxBQ1yzCQZ5MBMeL81fQDhO0wQORMojoTmNVOnIeT0uKstSkbj3F8GZIIsHi72R5yQv8eBCnU618fiMiwL9FwdVYTqC8LCtySYYBGsJJ2BOm1YlmpSTBzNe6HBw0q9ntLAh0nQuraivzwcjA4Zs969JRiG0SRmhY1wsW5ko7ZqbgqZntJ7UiRYPybkfqW2R7Z2FMd08hntx9ZpuDEUqTQ8bXhFPQmwBOkCZwgHeZuzgds8EzSLQvORirzRf2xomDroeiecdpUZzhF3y7wS0xUc7yLkvIP0dingXRdw5sURcBhokRzkj4cfETgbI4SIcoLDZCgiXLMA3zUUUXr0, libQt5Core.so.5(Qt_5), libQt5Core.so.5(Qt_5.15), libQt5Gui.so.5 >= set:rnSHCTdRvkzOwfSxIIELdZFd0TyixfZ8a, libQt5Gui.so.5(Qt_5), libc.so.6(GLIBC_2.0), libc.so.6(GLIBC_2.1.3), libc.so.6(GLIBC_2.32), libc.so.6(GLIBC_2.4), libstdc++.so.6(CXXABI_1.3), libstdc++.so.6(CXXABI_1.3.9), libstdc++.so.6(GLIBCXX_3.4), rtld(GNU_HASH)
Requires(rpmlib): rpmlib(SetVersions)
Obsoletes: libkpimpkpass < 22.08.3-alt1
Finding debuginfo files (using /usr/lib/rpm/find-debuginfo-files)
Executing: /bin/sh -e /usr/src/tmp/rpm-tmp.zNfpGt
Creating libkpimpkpass5-debuginfo package
Processing files: libkpimpkpass5-debuginfo-22.08.3-alt1
Finding Provides (using /usr/lib/rpm/find-provides)
Executing: /bin/sh -e /usr/src/tmp/rpm-tmp.SJMUa5
find-provides: running scripts (debuginfo)
Finding Requires (using /usr/lib/rpm/find-requires)
Executing: /bin/sh -e /usr/src/tmp/rpm-tmp.NbU53m
find-requires: running scripts (debuginfo)
Provides: debug(libKPimPkPass.so.5)
Requires: libkpimpkpass5 = 22.08.3-alt1, debug(libKF5Archive.so.5), debug(libQt5Core.so.5), debug(libQt5Gui.so.5), debug(libc.so.6), debug(libstdc++.so.6)
Adding to libkpimpkpass5 a strict dependency on kde5-kpkpass-common
Adding to libkpimpkpass5-debuginfo a strict dependency on libkpimpkpass5
Adding to kde5-kpkpass-devel a strict dependency on libkpimpkpass5
Removing 1 extra deps from kde5-kpkpass-devel due to dependency on libkpimpkpass5
Wrote: /usr/src/RPM/RPMS/noarch/kde5-kpkpass-common-22.08.3-alt1.noarch.rpm (w2.lzdio)
Wrote: /usr/src/RPM/RPMS/i586/kde5-kpkpass-devel-22.08.3-alt1.i586.rpm (w2.lzdio)
Wrote: /usr/src/RPM/RPMS/i586/libkpimpkpass5-22.08.3-alt1.i586.rpm (w2.lzdio)
Wrote: /usr/src/RPM/RPMS/i586/libkpimpkpass5-debuginfo-22.08.3-alt1.i586.rpm (w2.lzdio)
16.30user 2.71system 0:17.43elapsed 109%CPU (0avgtext+0avgdata 175336maxresident)k
0inputs+0outputs (0major+943234minor)pagefaults 0swaps
/.out/kde5-kpkpass-common-22.08.3-alt1.noarch.rpm: bad symbols in the license tag: /
/.out/kde5-kpkpass-devel-22.08.3-alt1.i586.rpm: bad symbols in the license tag: /
/.out/libkpimpkpass5-22.08.3-alt1.i586.rpm: bad symbols in the license tag: /
/.out/libkpimpkpass5-debuginfo-22.08.3-alt1.i586.rpm: bad symbols in the license tag: /
2.90user 1.55system 0:34.77elapsed 12%CPU (0avgtext+0avgdata 107080maxresident)k
56inputs+0outputs (47715major+279558minor)pagefaults 0swaps
--- libkpimpkpass5-22.08.3-alt1.i586.rpm.repo 2022-11-08 19:48:15.000000000 +0000
+++ libkpimpkpass5-22.08.3-alt1.i586.rpm.hasher 2022-12-24 09:53:13.487500468 +0000
@@ -24,3 +24,3 @@
File: /usr/lib/libKPimPkPass.so.5 120777 root:root libKPimPkPass.so.5.21.3
-File: /usr/lib/libKPimPkPass.so.5.21.3 100644 root:root f1b96afa017e3dee7172529f7f003ff2
-RPMIdentity: adf7c75d163372286b25d8f5caf57573e4929098c581584c34bc446044975f6ead379c4157e05e5765eb03be97a6283797574e7fb4e1d29d5515cb28e0ae1a45
+File: /usr/lib/libKPimPkPass.so.5.21.3 100644 root:root 4a7d24e51084ec9e2df7daa702079c12
+RPMIdentity: ba36bbffe3757a1bc54c54c44b9fab3cbb280074c7cf6cfe00a5443335a9df736718faf058903a301b398a6c61eaf7085a1533db2a741d9915b650358aa64660
--- libkpimpkpass5-debuginfo-22.08.3-alt1.i586.rpm.repo 2022-11-08 19:48:15.000000000 +0000
+++ libkpimpkpass5-debuginfo-22.08.3-alt1.i586.rpm.hasher 2022-12-24 09:53:13.582501546 +0000
@@ -1,4 +1,4 @@
-/usr/lib/debug/.build-id/90 40755 root:root
-/usr/lib/debug/.build-id/90/de112ef78d84538b49a69b2774a1286bcfb428 120777 root:root ../../../libKPimPkPass.so.5.21.3
-/usr/lib/debug/.build-id/90/de112ef78d84538b49a69b2774a1286bcfb428.debug 120777 root:root ../../usr/lib/libKPimPkPass.so.5.21.3.debug
+/usr/lib/debug/.build-id/6d 40755 root:root
+/usr/lib/debug/.build-id/6d/65e7e2effbbb4f8612a66b84e82c288a27511d 120777 root:root ../../../libKPimPkPass.so.5.21.3
+/usr/lib/debug/.build-id/6d/65e7e2effbbb4f8612a66b84e82c288a27511d.debug 120777 root:root ../../usr/lib/libKPimPkPass.so.5.21.3.debug
/usr/lib/debug/usr/lib/libKPimPkPass.so.5.21.3.debug 100644 root:root
@@ -40,6 +40,6 @@
Provides: libkpimpkpass5-debuginfo = 22.08.3-alt1:sisyphus+309680.100.1.2
-File: /usr/lib/debug/.build-id/90 40755 root:root
-File: /usr/lib/debug/.build-id/90/de112ef78d84538b49a69b2774a1286bcfb428 120777 root:root ../../../libKPimPkPass.so.5.21.3
-File: /usr/lib/debug/.build-id/90/de112ef78d84538b49a69b2774a1286bcfb428.debug 120777 root:root ../../usr/lib/libKPimPkPass.so.5.21.3.debug
-File: /usr/lib/debug/usr/lib/libKPimPkPass.so.5.21.3.debug 100644 root:root 5f94bf366b45744ee3d202f2093fd209
+File: /usr/lib/debug/.build-id/6d 40755 root:root
+File: /usr/lib/debug/.build-id/6d/65e7e2effbbb4f8612a66b84e82c288a27511d 120777 root:root ../../../libKPimPkPass.so.5.21.3
+File: /usr/lib/debug/.build-id/6d/65e7e2effbbb4f8612a66b84e82c288a27511d.debug 120777 root:root ../../usr/lib/libKPimPkPass.so.5.21.3.debug
+File: /usr/lib/debug/usr/lib/libKPimPkPass.so.5.21.3.debug 100644 root:root 8e90754ee5f3e5ae0d9a14b385ec9059
File: /usr/lib/debug/usr/lib/libKPimPkPass.so.5.debug 120777 root:root libKPimPkPass.so.5.21.3.debug
@@ -50,8 +50,8 @@
File: /usr/src/debug/kpkpass-22.08.3/BUILD/src/KPimPkPass_autogen/EWIEGA46WW 40755 root:root
-File: /usr/src/debug/kpkpass-22.08.3/BUILD/src/KPimPkPass_autogen/EWIEGA46WW/moc_barcode.cpp 100644 root:root a5b8161fd678301b24f91f56bb10d525
-File: /usr/src/debug/kpkpass-22.08.3/BUILD/src/KPimPkPass_autogen/EWIEGA46WW/moc_boardingpass.cpp 100644 root:root 814316bfd8065de935b0adcaeb7c9719
-File: /usr/src/debug/kpkpass-22.08.3/BUILD/src/KPimPkPass_autogen/EWIEGA46WW/moc_location.cpp 100644 root:root b17d6c928cad279fd3fcdd3de740f6d8
+File: /usr/src/debug/kpkpass-22.08.3/BUILD/src/KPimPkPass_autogen/EWIEGA46WW/moc_barcode.cpp 100644 root:root 85c01af5ea5238b91b777937cde7c6e2
+File: /usr/src/debug/kpkpass-22.08.3/BUILD/src/KPimPkPass_autogen/EWIEGA46WW/moc_boardingpass.cpp 100644 root:root 9a63482490cf3146aec50af6678ad859
+File: /usr/src/debug/kpkpass-22.08.3/BUILD/src/KPimPkPass_autogen/EWIEGA46WW/moc_location.cpp 100644 root:root aab448c3577a2c2bca91a1d9e151219c
File: /usr/src/debug/kpkpass-22.08.3/BUILD/src/KPimPkPass_autogen/include 40755 root:root
-File: /usr/src/debug/kpkpass-22.08.3/BUILD/src/KPimPkPass_autogen/include/moc_field.cpp 100644 root:root 41f28fb228f4502eac4b930f917cb016
-File: /usr/src/debug/kpkpass-22.08.3/BUILD/src/KPimPkPass_autogen/include/moc_pass.cpp 100644 root:root ddd03b0aed10fc879c0b196fecca81ed
+File: /usr/src/debug/kpkpass-22.08.3/BUILD/src/KPimPkPass_autogen/include/moc_field.cpp 100644 root:root 79bd796fe42bb4d9bc4f42bb7798aef7
+File: /usr/src/debug/kpkpass-22.08.3/BUILD/src/KPimPkPass_autogen/include/moc_pass.cpp 100644 root:root ed8ecdcae8e1ad343cb037f6c819bd34
File: /usr/src/debug/kpkpass-22.08.3/BUILD/src/KPimPkPass_autogen/mocs_compilation.cpp 100644 root:root 088341971645161f871675632e44cf8b
@@ -71,2 +71,2 @@
File: /usr/src/debug/kpkpass-22.08.3/src/pass_p.h 100644 root:root 6ab6d853a81d1eb0c35c5a6a0b7634a2
-RPMIdentity: 7b41ca66a6b36735654ed0d446ae4cf8daa4fced6e888f8a9cd9248bfbd63c413f23c8a0632a82560b5777834e7d4df6aaff333d55230a9f183b6f5350baa671
+RPMIdentity: 4370b4ef01cc6090648f4d5c2263f6fdf4a28cc2dd41fdd70ea91987060459f1746c32e4da146d8e3df034745558eba4ce6907346720671b8eb4fe414e30db9e