<86>Jul 30 05:22:50 userdel[904118]: delete user 'rooter'
<86>Jul 30 05:22:50 userdel[904118]: removed group 'rooter' owned by 'rooter'
<86>Jul 30 05:22:50 userdel[904118]: removed shadow group 'rooter' owned by 'rooter'
<86>Jul 30 05:22:50 groupadd[904131]: group added to /etc/group: name=rooter, GID=951
<86>Jul 30 05:22:50 groupadd[904131]: group added to /etc/gshadow: name=rooter
<86>Jul 30 05:22:50 groupadd[904131]: new group: name=rooter, GID=951
<86>Jul 30 05:22:50 useradd[904144]: new user: name=rooter, UID=951, GID=951, home=/root, shell=/bin/bash
<86>Jul 30 05:22:50 userdel[904163]: delete user 'builder'
<86>Jul 30 05:22:50 userdel[904163]: removed group 'builder' owned by 'builder'
<86>Jul 30 05:22:50 userdel[904163]: removed shadow group 'builder' owned by 'builder'
<86>Jul 30 05:22:50 groupadd[904173]: group added to /etc/group: name=builder, GID=952
<86>Jul 30 05:22:50 groupadd[904173]: group added to /etc/gshadow: name=builder
<86>Jul 30 05:22:50 groupadd[904173]: new group: name=builder, GID=952
<86>Jul 30 05:22:50 useradd[904179]: new user: name=builder, UID=952, GID=952, home=/usr/src, shell=/bin/bash
<13>Jul 30 05:22:52 rpmi: libruby-2.7.6-alt1 sisyphus+296637.220.56.4 1654656998 installed
<13>Jul 30 05:22:52 rpmi: libyaml2-0.2.5-alt1 sisyphus+278391.100.1.1 1626094932 installed
<13>Jul 30 05:22:52 rpmi: libgdbm-1.8.3-alt10 sisyphus+278100.1600.1.1 1626059138 installed
<13>Jul 30 05:22:52 rpmi: libgdbm-devel-1.8.3-alt10 sisyphus+278100.1600.1.1 1626059138 installed
<13>Jul 30 05:22:52 rpmi: libyaml-devel-0.2.5-alt1 sisyphus+278391.100.1.1 1626094932 installed
<13>Jul 30 05:22:52 rpmi: rpm-macros-ruby-1:1.0.0-alt19 sisyphus+296637.1.56.4 1654655569 installed
<13>Jul 30 05:22:54 rpmi: valgrind-3.17.0-alt3 sisyphus+284325.100.1.1 1630488728 installed
<13>Jul 30 05:22:54 rpmi: valgrind-devel-3.17.0-alt3 sisyphus+284325.100.1.1 1630488728 installed
<13>Jul 30 05:22:54 rpmi: zlib-devel-1.2.12-alt2 sisyphus+301913.100.1.1 1655062069 installed
<13>Jul 30 05:22:54 rpmi: libreadline-devel-7.0.3-alt4 sisyphus+283725.100.1.2 1629849381 installed
<13>Jul 30 05:22:54 rpmi: groff-base-1.22.3-alt2 sisyphus+275306.100.2.1 1624538359 installed
<13>Jul 30 05:22:54 rpmi: libncurses-6.3.20220618-alt1 sisyphus+302449.100.1.1 1655835262 installed
<13>Jul 30 05:22:54 rpmi: libtinfo-devel-6.3.20220618-alt1 sisyphus+302449.100.1.1 1655835262 installed
<13>Jul 30 05:22:54 rpmi: libncurses-devel-6.3.20220618-alt1 sisyphus+302449.100.1.1 1655835262 installed
<13>Jul 30 05:22:54 rpmi: libncursesw-devel-6.3.20220618-alt1 sisyphus+302449.100.1.1 1655835262 installed
<13>Jul 30 05:22:54 rpmi: libffi-devel-1:3.4.2-alt2 sisyphus+287629.100.2.1 1634659534 installed
<13>Jul 30 05:22:54 rpmi: libdb4.7-devel-4.7.25-alt12 sisyphus+283793.100.2.1 1629966884 installed
<13>Jul 30 05:22:55 rpmi: doxygen-1:1.9.1-alt1 sisyphus+283348.100.1.1 1629370710 installed
<13>Jul 30 05:22:55 rpmi: chrpath-0.16-alt1 sisyphus+278100.500.1.1 1626056638 installed
<13>Jul 30 05:22:55 rpmi: libp11-kit-0.24.1-alt1 sisyphus+293720.100.1.1 1642535281 installed
<13>Jul 30 05:22:55 rpmi: libtasn1-4.18.0-alt2 sisyphus+301112.100.1.1 1654185769 installed
<13>Jul 30 05:22:55 rpmi: rpm-macros-alternatives-0.5.2-alt1 sisyphus+300869.100.1.1 1653844113 installed
<13>Jul 30 05:22:55 rpmi: alternatives-0.5.2-alt1 sisyphus+300869.100.1.1 1653844113 installed
<13>Jul 30 05:22:55 rpmi: ca-certificates-2022.07.22-alt1 sisyphus+304126.100.1.2 1658509204 installed
<13>Jul 30 05:22:55 rpmi: ca-trust-0.1.3-alt1 sisyphus+299449.100.1.1 1651660001 installed
<13>Jul 30 05:22:55 rpmi: p11-kit-trust-0.24.1-alt1 sisyphus+293720.100.1.1 1642535281 installed
<13>Jul 30 05:22:55 rpmi: libcrypto1.1-1.1.1q-alt1 sisyphus+303203.100.1.1 1657027052 installed
<13>Jul 30 05:22:55 rpmi: libssl1.1-1.1.1q-alt1 sisyphus+303203.100.1.1 1657027052 installed
<13>Jul 30 05:22:55 rpmi: gem-minitest-5.15.0-alt1 sisyphus+293712.300.9.1 1646119914 installed
<13>Jul 30 05:22:55 rpmi: gem-net-telnet-0.2.0.1-alt0.1 sisyphus+238996.14500.5.1 1630597117 installed
<13>Jul 30 05:22:55 rpmi: gem-power-assert-2.0.1-alt1 sisyphus+296637.272.56.4 1654656448 installed
<13>Jul 30 05:22:55 rpmi: gem-rake-13.0.6-alt1 sisyphus+296637.11240.56.4 1654660010 installed
<13>Jul 30 05:22:55 rpmi: gem-test-unit-3.3.5-alt1 sisyphus+248971.620.47.1 1586260035 installed
<13>Jul 30 05:22:55 rpmi: gem-xmlrpc-0.3.2-alt1 sisyphus+238996.13400.5.1 1630596769 installed
<13>Jul 30 05:22:55 rpmi: gem-2:3.1.6-alt1.5 sisyphus+296637.220.56.4 1654656369 installed
<13>Jul 30 05:22:55 rpmi: gem-psych-4.0.1-alt1 sisyphus+263530.36000.88.5 1629563629 installed
<13>Jul 30 05:22:55 rpmi: ri-6.4.0-alt1 sisyphus+296637.20200.56.4 1654666974 installed
<13>Jul 30 05:22:55 rpmi: gem-rdoc-6.4.0-alt1 sisyphus+296637.20200.56.4 1654666974 installed
<13>Jul 30 05:22:55 rpmi: rdoc-6.4.0-alt1 sisyphus+296637.20200.56.4 1654666974 installed
<13>Jul 30 05:22:55 rpmi: rake-13.0.6-alt1 sisyphus+296637.11240.56.4 1654660010 installed
<13>Jul 30 05:22:55 rpmi: erb-2.7.6-alt1 sisyphus+296637.220.56.4 1654656369 installed
<13>Jul 30 05:22:55 rpmi: irb-2.7.6-alt1 sisyphus+296637.220.56.4 1654656369 installed
<13>Jul 30 05:22:55 rpmi: bundle-2.2.19-alt1 sisyphus+263530.240.88.5 1629542341 installed
<13>Jul 30 05:22:56 rpmi: gem-bundler-2.2.19-alt1 sisyphus+263530.240.88.5 1629542341 installed
<13>Jul 30 05:22:56 rpmi: ruby-2.7.6-alt1 sisyphus+296637.220.56.4 1654656998 installed
<13>Jul 30 05:23:02 rpmi: ruby-stdlibs-2.7.6-alt1 sisyphus+296637.220.56.4 1654656998 installed
<13>Jul 30 05:23:02 rpmi: setup-rb-5.999.6-alt1 sisyphus+296637.174.56.4 1654655596 installed
<13>Jul 30 05:23:02 rpmi: gem-setup-5.999.6-alt1 sisyphus+296637.174.56.4 1654655596 installed
<13>Jul 30 05:23:02 rpmi: libssl-devel-1.1.1q-alt1 sisyphus+303203.100.1.1 1657027052 installed
<13>Jul 30 05:23:02 rpmi: libruby-devel-2.7.6-alt1 sisyphus+296637.220.56.4 1654656998 installed
<13>Jul 30 05:23:02 rpmi: rpm-build-ruby-1:1.0.0-alt19 sisyphus+296637.1.56.4 1654655569 installed
warning: Macro %pkgname not found
<13>Jul 30 05:23:06 rpmi: gem-debase-ruby-core-source-0.10.15-alt1 sisyphus+296637.21400.56.4 1654667325 installed
warning: Macro %pkgname not found
Building target platforms: i586
Building for target i586
Wrote: /usr/src/in/nosrpm/gem-debase-0.2.5.beta2-alt1.nosrc.rpm (w1.gzdio)
warning: Macro %pkgname not found
Installing gem-debase-0.2.5.beta2-alt1.src.rpm
Building target platforms: i586
Building for target i586
Executing(%prep): /bin/sh -e /usr/src/tmp/rpm-tmp.67149
+ umask 022
+ /bin/mkdir -p /usr/src/RPM/BUILD
+ cd /usr/src/RPM/BUILD
+ cd /usr/src/RPM/BUILD
+ rm -rf gem-debase-0.2.5.beta2
+ echo 'Source #0 (gem-debase-0.2.5.beta2.tar):'
Source #0 (gem-debase-0.2.5.beta2.tar):
+ /bin/tar -xf /usr/src/RPM/SOURCES/gem-debase-0.2.5.beta2.tar
+ cd gem-debase-0.2.5.beta2
+ /bin/chmod -c -Rf u+rwX,go-w .
+ exit 0
Executing(%build): /bin/sh -e /usr/src/tmp/rpm-tmp.67149
+ umask 022
+ /bin/mkdir -p /usr/src/RPM/BUILD
+ cd /usr/src/RPM/BUILD
+ cd gem-debase-0.2.5.beta2
+ rm -f Gemfile.lock
+ /usr/bin/ruby -rvendor-specific /usr/bin/setup.rb build --shebang=auto --prefixes=gem,ruby,rails-engine --gem-version-replace= --ignore-names= --regard-names= --alias=:: --use-gem-dependencies= --pre= --use-gem-version= --alias=%pkgname:debase --ignore-path-tokens=templates,example,examples,sample,samples,spec,test,features,fixtures,doc,docs,contrib,demo,acceptance,conformance,myapp,website,benchmarks,benchmark,gemfiles,misc,steer --debug-io=/usr/src/tmp/debug.log --verbose=debug
(ruby 2.7.6 i586-linux)
sh: git: command not found
sh: git: command not found
sh: git: command not found
sh: git: command not found
[setup.rb][INFO]> Source list are the following:
[setup.rb][INFO]> V *debase:0.2.5.beta2 [./Rakefile]
[setup.rb][INFO]> = *debase:0.2.5.beta2 [./Rakefile]
[setup.rb][INFO]> = *debase:0.2.5.beta2 [./debase.gemspec]

- - PRECONFIG - - - - - - - - - - - - - - - - - - - - - - - - - - - - 

SetupConfig was saved. Edit to customize configuration.

- - COMPILE - - - - - - - - - - - - - - - - - - - - - - - - - - - - - 

checking for vm_core.h... no
checking for vm_core.h... no
**************************************************************************
No source for ruby-2.7.6-p219 (revision a21a3b7d23704a01d34bd79d09dc37897e00922a) provided with
debase-ruby_core_source gem. Falling back to ruby-2.7.0-p0.
**************************************************************************
checking for vm_core.h... yes
checking for iseq.h... yes
checking for version.h... yes
creating Makefile
checking for vm_core.h... no
checking for vm_core.h... no
**************************************************************************
No source for ruby-2.7.6-p219 (revision a21a3b7d23704a01d34bd79d09dc37897e00922a) provided with
debase-ruby_core_source gem. Falling back to ruby-2.7.0-p0.
**************************************************************************
checking for vm_core.h... yes
checking for iseq.h... yes
checking for version.h... yes
creating Makefile
checking for vm_core.h... no
checking for vm_core.h... no
**************************************************************************
No source for ruby-2.7.6-p219 (revision a21a3b7d23704a01d34bd79d09dc37897e00922a) provided with
debase-ruby_core_source gem. Falling back to ruby-2.7.0-p0.
**************************************************************************
checking for vm_core.h... yes
checking for iseq.h... yes
checking for version.h... yes
creating Makefile
make: Entering directory '/usr/src/RPM/BUILD/gem-debase-0.2.5.beta2/ext'
compiling breakpoint.c
compiling context.c
compiling debase_internals.c
debase_internals.c: In function 'count_stack_size':
debase_internals.c:319:37: warning: initialization discards 'const' qualifier from pointer target type [-Wdiscarded-qualifiers]
  319 |     rb_control_frame_t *start_cfp = RUBY_VM_END_CONTROL_FRAME(TH_INFO(thread));
      |                                     ^~~~~~~~~~~~~~~~~~~~~~~~~
debase_internals.c: In function 'Init_debase_internals':
debase_internals.c:770:3: warning: passing argument 3 of 'rb_define_module_function1' from incompatible pointer type [-Wincompatible-pointer-types]
  770 |   rb_define_module_function(mDebase, "set_trace_flag_to_iseq", Debase_set_trace_flag_to_iseq, 1);
      |   ^~~~~~~~~~~~~~~~~~~~~~~~~
      |   |
      |   void (*)(VALUE,  VALUE) {aka void (*)(long unsigned int,  long unsigned int)}
In file included from /usr/include/ruby/ruby.h:2150,
                 from /usr/include/ruby.h:33,
                 from ./debase_internals.h:4,
                 from debase_internals.c:1:
/usr/include/ruby/ruby.h:2804:1: note: expected 'VALUE (*)(VALUE,  VALUE)' {aka 'long unsigned int (*)(long unsigned int,  long unsigned int)'} but argument is of type 'void (*)(VALUE,  VALUE)' {aka 'void (*)(long unsigned int,  long unsigned int)'}
 2804 | RB_METHOD_DEFINITION_DECL(rb_define_module_function, (2,3), (VALUE klass, const char *name), (klass, name))
      | ^~~~~~~~~~~~~~~~~~~~~~~~~
debase_internals.c:773:3: warning: passing argument 3 of 'rb_define_module_function1' from incompatible pointer type [-Wincompatible-pointer-types]
  773 |   rb_define_module_function(mDebase, "unset_iseq_flags", Debase_unset_trace_flags, 1);
      |   ^~~~~~~~~~~~~~~~~~~~~~~~~
      |   |
      |   void (*)(VALUE,  VALUE) {aka void (*)(long unsigned int,  long unsigned int)}
/usr/include/ruby/ruby.h:2804:1: note: expected 'VALUE (*)(VALUE,  VALUE)' {aka 'long unsigned int (*)(long unsigned int,  long unsigned int)'} but argument is of type 'void (*)(VALUE,  VALUE)' {aka 'void (*)(long unsigned int,  long unsigned int)'}
 2804 | RB_METHOD_DEFINITION_DECL(rb_define_module_function, (2,3), (VALUE klass, const char *name), (klass, name))
      | ^~~~~~~~~~~~~~~~~~~~~~~~~
compiling locker.c
linking shared-object debase_internals.so
make: Leaving directory '/usr/src/RPM/BUILD/gem-debase-0.2.5.beta2/ext'
make: Entering directory '/usr/src/RPM/BUILD/gem-debase-0.2.5.beta2/ext'
/bin/install -c -m 0755 debase_internals.so /usr/src/RPM/BUILD/gem-debase-0.2.5.beta2/.so.debase/usr/lib/ruby/site_ruby/2.7.0/i586-linux
make: Leaving directory '/usr/src/RPM/BUILD/gem-debase-0.2.5.beta2/ext'
make: Entering directory '/usr/src/RPM/BUILD/gem-debase-0.2.5.beta2/ext/attach'
compiling attach.c
linking shared-object attach.so
make: Leaving directory '/usr/src/RPM/BUILD/gem-debase-0.2.5.beta2/ext/attach'
make: Entering directory '/usr/src/RPM/BUILD/gem-debase-0.2.5.beta2/ext/attach'
/bin/install -c -m 0755 attach.so /usr/src/RPM/BUILD/gem-debase-0.2.5.beta2/.so.debase/usr/lib/ruby/site_ruby/2.7.0/i586-linux
make: Leaving directory '/usr/src/RPM/BUILD/gem-debase-0.2.5.beta2/ext/attach'
make: Entering directory '/usr/src/RPM/BUILD/gem-debase-0.2.5.beta2/ext/attach'
make: Nothing to be done for 'all'.
make: Leaving directory '/usr/src/RPM/BUILD/gem-debase-0.2.5.beta2/ext/attach'
make: Entering directory '/usr/src/RPM/BUILD/gem-debase-0.2.5.beta2/ext/attach'
/bin/install -c -m 0755 attach.so /usr/src/RPM/BUILD/gem-debase-0.2.5.beta2/.so.debase/usr/lib/ruby/site_ruby/2.7.0/i586-linux
make: Leaving directory '/usr/src/RPM/BUILD/gem-debase-0.2.5.beta2/ext/attach'
/usr/lib/ruby/gems/2.7.0/gems/strscan-1.0.3/lib/cgi/util.rb:30: warning: already initialized constant CGI::Util::TABLE_FOR_ESCAPE_HTML__
/usr/lib/ruby/cgi/util.rb:30: warning: previous definition of TABLE_FOR_ESCAPE_HTML__ was here
/usr/lib/ruby/gems/2.7.0/gems/strscan-1.0.3/lib/cgi/util.rb:178: warning: already initialized constant CGI::Util::RFC822_DAYS
/usr/lib/ruby/cgi/util.rb:178: warning: previous definition of RFC822_DAYS was here
/usr/lib/ruby/gems/2.7.0/gems/strscan-1.0.3/lib/cgi/util.rb:181: warning: already initialized constant CGI::Util::RFC822_MONTHS
/usr/lib/ruby/cgi/util.rb:181: warning: previous definition of RFC822_MONTHS was here

- - DOCUMENT- - - - - - - - - - - - - - - - - - - - - - - - - - - - - 


+ exit 0
Executing(%install): /bin/sh -e /usr/src/tmp/rpm-tmp.41973
+ umask 022
+ /bin/mkdir -p /usr/src/RPM/BUILD
+ cd /usr/src/RPM/BUILD
+ /bin/chmod -Rf u+rwX -- /usr/src/tmp/gem-debase-buildroot
+ :
+ /bin/rm -rf -- /usr/src/tmp/gem-debase-buildroot
+ PATH=/usr/libexec/rpm-build:/usr/src/bin:/bin:/usr/bin:/usr/X11R6/bin:/usr/games
+ cd gem-debase-0.2.5.beta2
+ /usr/bin/ruby -rvendor-specific /usr/bin/setup.rb install --install_prefix=/usr/src/tmp/gem-debase-buildroot --gem-version-replace=
[setup.rb][INFO]> Source list are the following:
[setup.rb][INFO]> V *debase:0.2.5.beta2 [./Rakefile]
[setup.rb][INFO]> = *debase:0.2.5.beta2 [./Rakefile]
[setup.rb][INFO]> = *debase:0.2.5.beta2 [./debase.gemspec]
sh: git: command not found
sh: git: command not found
(ruby 2.7.6 i586-linux)

- - INSTALL - - - - - - - - - - - - - - - - - - - - - - - - - - - - - 

* {exe} ->
* {lib} ->
  % debase < lib
    debase/version.rb => [/usr/src/tmp/gem-debase-buildroot]/usr/lib/ruby/gems/2.7.0/gems/debase-0.2.5.beta2/lib/debase/version.rb
    debase/rbx/monkey.rb => [/usr/src/tmp/gem-debase-buildroot]/usr/lib/ruby/gems/2.7.0/gems/debase-0.2.5.beta2/lib/debase/rbx/monkey.rb
    debase/rbx/frame.rb => [/usr/src/tmp/gem-debase-buildroot]/usr/lib/ruby/gems/2.7.0/gems/debase-0.2.5.beta2/lib/debase/rbx/frame.rb
    debase/rbx/context.rb => [/usr/src/tmp/gem-debase-buildroot]/usr/lib/ruby/gems/2.7.0/gems/debase-0.2.5.beta2/lib/debase/rbx/context.rb
    debase/rbx/breakpoint.rb => [/usr/src/tmp/gem-debase-buildroot]/usr/lib/ruby/gems/2.7.0/gems/debase-0.2.5.beta2/lib/debase/rbx/breakpoint.rb
    debase/rbx.rb => [/usr/src/tmp/gem-debase-buildroot]/usr/lib/ruby/gems/2.7.0/gems/debase-0.2.5.beta2/lib/debase/rbx.rb
    debase/context.rb => [/usr/src/tmp/gem-debase-buildroot]/usr/lib/ruby/gems/2.7.0/gems/debase-0.2.5.beta2/lib/debase/context.rb
    debase.rb => [/usr/src/tmp/gem-debase-buildroot]/usr/lib/ruby/gems/2.7.0/gems/debase-0.2.5.beta2/lib/debase.rb
* {man} ->
* {ri} ->
  % debase < .ri.debase
    cache.ri => [/usr/src/tmp/gem-debase-buildroot]/usr/lib/ruby/gems/2.7.0/doc/debase-0.2.5.beta2/ri/cache.ri
    Debugger/current_context-c.ri => [/usr/src/tmp/gem-debase-buildroot]/usr/lib/ruby/gems/2.7.0/doc/debase-0.2.5.beta2/ri/Debugger/current_context-c.ri
    Debugger/breakpoints-c.ri => [/usr/src/tmp/gem-debase-buildroot]/usr/lib/ruby/gems/2.7.0/doc/debase-0.2.5.beta2/ri/Debugger/breakpoints-c.ri
    Debugger/tracing-c.ri => [/usr/src/tmp/gem-debase-buildroot]/usr/lib/ruby/gems/2.7.0/doc/debase-0.2.5.beta2/ri/Debugger/tracing-c.ri
    Debugger/keep_frame_binding-c.ri => [/usr/src/tmp/gem-debase-buildroot]/usr/lib/ruby/gems/2.7.0/doc/debase-0.2.5.beta2/ri/Debugger/keep_frame_binding-c.ri
    Debugger/handler-c.ri => [/usr/src/tmp/gem-debase-buildroot]/usr/lib/ruby/gems/2.7.0/doc/debase-0.2.5.beta2/ri/Debugger/handler-c.ri
    Debugger/stop-c.ri => [/usr/src/tmp/gem-debase-buildroot]/usr/lib/ruby/gems/2.7.0/doc/debase-0.2.5.beta2/ri/Debugger/stop-c.ri
    Debugger/started%3f-c.ri => [/usr/src/tmp/gem-debase-buildroot]/usr/lib/ruby/gems/2.7.0/doc/debase-0.2.5.beta2/ri/Debugger/started%3f-c.ri
    Debugger/start_-c.ri => [/usr/src/tmp/gem-debase-buildroot]/usr/lib/ruby/gems/2.7.0/doc/debase-0.2.5.beta2/ri/Debugger/start_-c.ri
    Debugger/start-c.ri => [/usr/src/tmp/gem-debase-buildroot]/usr/lib/ruby/gems/2.7.0/doc/debase-0.2.5.beta2/ri/Debugger/start-c.ri
    Debugger/spinup_thread-c.ri => [/usr/src/tmp/gem-debase-buildroot]/usr/lib/ruby/gems/2.7.0/doc/debase-0.2.5.beta2/ri/Debugger/spinup_thread-c.ri
    Debugger/source_reload-c.ri => [/usr/src/tmp/gem-debase-buildroot]/usr/lib/ruby/gems/2.7.0/doc/debase-0.2.5.beta2/ri/Debugger/source_reload-c.ri
    Debugger/skip-c.ri => [/usr/src/tmp/gem-debase-buildroot]/usr/lib/ruby/gems/2.7.0/doc/debase-0.2.5.beta2/ri/Debugger/skip-c.ri
    Debugger/setup_tracepoints-c.ri => [/usr/src/tmp/gem-debase-buildroot]/usr/lib/ruby/gems/2.7.0/doc/debase-0.2.5.beta2/ri/Debugger/setup_tracepoints-c.ri
    Debugger/remove_tracepoints-c.ri => [/usr/src/tmp/gem-debase-buildroot]/usr/lib/ruby/gems/2.7.0/doc/debase-0.2.5.beta2/ri/Debugger/remove_tracepoints-c.ri
    Debugger/remove_catchpoint-c.ri => [/usr/src/tmp/gem-debase-buildroot]/usr/lib/ruby/gems/2.7.0/doc/debase-0.2.5.beta2/ri/Debugger/remove_catchpoint-c.ri
    Debugger/remove_breakpoint-c.ri => [/usr/src/tmp/gem-debase-buildroot]/usr/lib/ruby/gems/2.7.0/doc/debase-0.2.5.beta2/ri/Debugger/remove_breakpoint-c.ri
    Debugger/prepare_context-c.ri => [/usr/src/tmp/gem-debase-buildroot]/usr/lib/ruby/gems/2.7.0/doc/debase-0.2.5.beta2/ri/Debugger/prepare_context-c.ri
    Debugger/post_mortem%3f-c.ri => [/usr/src/tmp/gem-debase-buildroot]/usr/lib/ruby/gems/2.7.0/doc/debase-0.2.5.beta2/ri/Debugger/post_mortem%3f-c.ri
    Debugger/monkey_patch_prepend-c.ri => [/usr/src/tmp/gem-debase-buildroot]/usr/lib/ruby/gems/2.7.0/doc/debase-0.2.5.beta2/ri/Debugger/monkey_patch_prepend-c.ri
    Debugger/listen-c.ri => [/usr/src/tmp/gem-debase-buildroot]/usr/lib/ruby/gems/2.7.0/doc/debase-0.2.5.beta2/ri/Debugger/listen-c.ri
    Debugger/last_context-c.ri => [/usr/src/tmp/gem-debase-buildroot]/usr/lib/ruby/gems/2.7.0/doc/debase-0.2.5.beta2/ri/Debugger/last_context-c.ri
    Debugger/file_filter-c.ri => [/usr/src/tmp/gem-debase-buildroot]/usr/lib/ruby/gems/2.7.0/doc/debase-0.2.5.beta2/ri/Debugger/file_filter-c.ri
    Debugger/debug_load-c.ri => [/usr/src/tmp/gem-debase-buildroot]/usr/lib/ruby/gems/2.7.0/doc/debase-0.2.5.beta2/ri/Debugger/debug_load-c.ri
    Debugger/debug-c.ri => [/usr/src/tmp/gem-debase-buildroot]/usr/lib/ruby/gems/2.7.0/doc/debase-0.2.5.beta2/ri/Debugger/debug-c.ri
    Debugger/contexts-c.ri => [/usr/src/tmp/gem-debase-buildroot]/usr/lib/ruby/gems/2.7.0/doc/debase-0.2.5.beta2/ri/Debugger/contexts-c.ri
    Debugger/clear_catchpoints-c.ri => [/usr/src/tmp/gem-debase-buildroot]/usr/lib/ruby/gems/2.7.0/doc/debase-0.2.5.beta2/ri/Debugger/clear_catchpoints-c.ri
    Debugger/cleanup_contexts-c.ri => [/usr/src/tmp/gem-debase-buildroot]/usr/lib/ruby/gems/2.7.0/doc/debase-0.2.5.beta2/ri/Debugger/cleanup_contexts-c.ri
    Debugger/add_catchpoint-c.ri => [/usr/src/tmp/gem-debase-buildroot]/usr/lib/ruby/gems/2.7.0/doc/debase-0.2.5.beta2/ri/Debugger/add_catchpoint-c.ri
    Debugger/add_breakpoint-c.ri => [/usr/src/tmp/gem-debase-buildroot]/usr/lib/ruby/gems/2.7.0/doc/debase-0.2.5.beta2/ri/Debugger/add_breakpoint-c.ri
    Debugger/cdesc-Debugger.ri => [/usr/src/tmp/gem-debase-buildroot]/usr/lib/ruby/gems/2.7.0/doc/debase-0.2.5.beta2/ri/Debugger/cdesc-Debugger.ri
    Rubinius/cdesc-Rubinius.ri => [/usr/src/tmp/gem-debase-buildroot]/usr/lib/ruby/gems/2.7.0/doc/debase-0.2.5.beta2/ri/Rubinius/cdesc-Rubinius.ri
    Rubinius/Location/receiver-i.ri => [/usr/src/tmp/gem-debase-buildroot]/usr/lib/ruby/gems/2.7.0/doc/debase-0.2.5.beta2/ri/Rubinius/Location/receiver-i.ri
    Rubinius/Location/cdesc-Location.ri => [/usr/src/tmp/gem-debase-buildroot]/usr/lib/ruby/gems/2.7.0/doc/debase-0.2.5.beta2/ri/Rubinius/Location/cdesc-Location.ri
    Object/method_missing-i.ri => [/usr/src/tmp/gem-debase-buildroot]/usr/lib/ruby/gems/2.7.0/doc/debase-0.2.5.beta2/ri/Object/method_missing-i.ri
    Object/cdesc-Object.ri => [/usr/src/tmp/gem-debase-buildroot]/usr/lib/ruby/gems/2.7.0/doc/debase-0.2.5.beta2/ri/Object/cdesc-Object.ri
    Debase/current_context-c.ri => [/usr/src/tmp/gem-debase-buildroot]/usr/lib/ruby/gems/2.7.0/doc/debase-0.2.5.beta2/ri/Debase/current_context-c.ri
    Debase/breakpoints-c.ri => [/usr/src/tmp/gem-debase-buildroot]/usr/lib/ruby/gems/2.7.0/doc/debase-0.2.5.beta2/ri/Debase/breakpoints-c.ri
    Debase/tracing-c.ri => [/usr/src/tmp/gem-debase-buildroot]/usr/lib/ruby/gems/2.7.0/doc/debase-0.2.5.beta2/ri/Debase/tracing-c.ri
    Debase/keep_frame_binding-c.ri => [/usr/src/tmp/gem-debase-buildroot]/usr/lib/ruby/gems/2.7.0/doc/debase-0.2.5.beta2/ri/Debase/keep_frame_binding-c.ri
    Debase/handler-c.ri => [/usr/src/tmp/gem-debase-buildroot]/usr/lib/ruby/gems/2.7.0/doc/debase-0.2.5.beta2/ri/Debase/handler-c.ri
    Debase/InstructionSequenceMixin/load_iseq-i.ri => [/usr/src/tmp/gem-debase-buildroot]/usr/lib/ruby/gems/2.7.0/doc/debase-0.2.5.beta2/ri/Debase/InstructionSequenceMixin/load_iseq-i.ri
    Debase/InstructionSequenceMixin/do_set_flags-i.ri => [/usr/src/tmp/gem-debase-buildroot]/usr/lib/ruby/gems/2.7.0/doc/debase-0.2.5.beta2/ri/Debase/InstructionSequenceMixin/do_set_flags-i.ri
    Debase/InstructionSequenceMixin/cdesc-InstructionSequenceMixin.ri => [/usr/src/tmp/gem-debase-buildroot]/usr/lib/ruby/gems/2.7.0/doc/debase-0.2.5.beta2/ri/Debase/InstructionSequenceMixin/cdesc-InstructionSequenceMixin.ri
    Debase/RubyVM/InstructionSequence/prepend-c.ri => [/usr/src/tmp/gem-debase-buildroot]/usr/lib/ruby/gems/2.7.0/doc/debase-0.2.5.beta2/ri/Debase/RubyVM/InstructionSequence/prepend-c.ri
    Debase/RubyVM/InstructionSequence/cdesc-InstructionSequence.ri => [/usr/src/tmp/gem-debase-buildroot]/usr/lib/ruby/gems/2.7.0/doc/debase-0.2.5.beta2/ri/Debase/RubyVM/InstructionSequence/cdesc-InstructionSequence.ri
    Debase/stop-c.ri => [/usr/src/tmp/gem-debase-buildroot]/usr/lib/ruby/gems/2.7.0/doc/debase-0.2.5.beta2/ri/Debase/stop-c.ri
    Debase/started%3f-c.ri => [/usr/src/tmp/gem-debase-buildroot]/usr/lib/ruby/gems/2.7.0/doc/debase-0.2.5.beta2/ri/Debase/started%3f-c.ri
    Debase/start_-c.ri => [/usr/src/tmp/gem-debase-buildroot]/usr/lib/ruby/gems/2.7.0/doc/debase-0.2.5.beta2/ri/Debase/start_-c.ri
    Debase/start-c.ri => [/usr/src/tmp/gem-debase-buildroot]/usr/lib/ruby/gems/2.7.0/doc/debase-0.2.5.beta2/ri/Debase/start-c.ri
    Debase/spinup_thread-c.ri => [/usr/src/tmp/gem-debase-buildroot]/usr/lib/ruby/gems/2.7.0/doc/debase-0.2.5.beta2/ri/Debase/spinup_thread-c.ri
    Debase/source_reload-c.ri => [/usr/src/tmp/gem-debase-buildroot]/usr/lib/ruby/gems/2.7.0/doc/debase-0.2.5.beta2/ri/Debase/source_reload-c.ri
    Debase/skip-c.ri => [/usr/src/tmp/gem-debase-buildroot]/usr/lib/ruby/gems/2.7.0/doc/debase-0.2.5.beta2/ri/Debase/skip-c.ri
    Debase/setup_tracepoints-c.ri => [/usr/src/tmp/gem-debase-buildroot]/usr/lib/ruby/gems/2.7.0/doc/debase-0.2.5.beta2/ri/Debase/setup_tracepoints-c.ri
    Debase/remove_tracepoints-c.ri => [/usr/src/tmp/gem-debase-buildroot]/usr/lib/ruby/gems/2.7.0/doc/debase-0.2.5.beta2/ri/Debase/remove_tracepoints-c.ri
    Debase/remove_catchpoint-c.ri => [/usr/src/tmp/gem-debase-buildroot]/usr/lib/ruby/gems/2.7.0/doc/debase-0.2.5.beta2/ri/Debase/remove_catchpoint-c.ri
    Debase/remove_breakpoint-c.ri => [/usr/src/tmp/gem-debase-buildroot]/usr/lib/ruby/gems/2.7.0/doc/debase-0.2.5.beta2/ri/Debase/remove_breakpoint-c.ri
    Debase/prepare_context-c.ri => [/usr/src/tmp/gem-debase-buildroot]/usr/lib/ruby/gems/2.7.0/doc/debase-0.2.5.beta2/ri/Debase/prepare_context-c.ri
    Debase/post_mortem%3f-c.ri => [/usr/src/tmp/gem-debase-buildroot]/usr/lib/ruby/gems/2.7.0/doc/debase-0.2.5.beta2/ri/Debase/post_mortem%3f-c.ri
    Debase/monkey_patch_prepend-c.ri => [/usr/src/tmp/gem-debase-buildroot]/usr/lib/ruby/gems/2.7.0/doc/debase-0.2.5.beta2/ri/Debase/monkey_patch_prepend-c.ri
    Debase/listen-c.ri => [/usr/src/tmp/gem-debase-buildroot]/usr/lib/ruby/gems/2.7.0/doc/debase-0.2.5.beta2/ri/Debase/listen-c.ri
    Debase/last_context-c.ri => [/usr/src/tmp/gem-debase-buildroot]/usr/lib/ruby/gems/2.7.0/doc/debase-0.2.5.beta2/ri/Debase/last_context-c.ri
    Debase/file_filter-c.ri => [/usr/src/tmp/gem-debase-buildroot]/usr/lib/ruby/gems/2.7.0/doc/debase-0.2.5.beta2/ri/Debase/file_filter-c.ri
    Debase/debug_load-c.ri => [/usr/src/tmp/gem-debase-buildroot]/usr/lib/ruby/gems/2.7.0/doc/debase-0.2.5.beta2/ri/Debase/debug_load-c.ri
    Debase/debug-c.ri => [/usr/src/tmp/gem-debase-buildroot]/usr/lib/ruby/gems/2.7.0/doc/debase-0.2.5.beta2/ri/Debase/debug-c.ri
    Debase/contexts-c.ri => [/usr/src/tmp/gem-debase-buildroot]/usr/lib/ruby/gems/2.7.0/doc/debase-0.2.5.beta2/ri/Debase/contexts-c.ri
    Debase/clear_catchpoints-c.ri => [/usr/src/tmp/gem-debase-buildroot]/usr/lib/ruby/gems/2.7.0/doc/debase-0.2.5.beta2/ri/Debase/clear_catchpoints-c.ri
    Debase/cleanup_contexts-c.ri => [/usr/src/tmp/gem-debase-buildroot]/usr/lib/ruby/gems/2.7.0/doc/debase-0.2.5.beta2/ri/Debase/cleanup_contexts-c.ri
    Debase/add_catchpoint-c.ri => [/usr/src/tmp/gem-debase-buildroot]/usr/lib/ruby/gems/2.7.0/doc/debase-0.2.5.beta2/ri/Debase/add_catchpoint-c.ri
    Debase/add_breakpoint-c.ri => [/usr/src/tmp/gem-debase-buildroot]/usr/lib/ruby/gems/2.7.0/doc/debase-0.2.5.beta2/ri/Debase/add_breakpoint-c.ri
    Debase/cdesc-Debase.ri => [/usr/src/tmp/gem-debase-buildroot]/usr/lib/ruby/gems/2.7.0/doc/debase-0.2.5.beta2/ri/Debase/cdesc-Debase.ri
    Debase/Frame/self-i.ri => [/usr/src/tmp/gem-debase-buildroot]/usr/lib/ruby/gems/2.7.0/doc/debase-0.2.5.beta2/ri/Debase/Frame/self-i.ri
    Debase/Frame/line-i.ri => [/usr/src/tmp/gem-debase-buildroot]/usr/lib/ruby/gems/2.7.0/doc/debase-0.2.5.beta2/ri/Debase/Frame/line-i.ri
    Debase/Frame/file-i.ri => [/usr/src/tmp/gem-debase-buildroot]/usr/lib/ruby/gems/2.7.0/doc/debase-0.2.5.beta2/ri/Debase/Frame/file-i.ri
    Debase/Frame/binding-i.ri => [/usr/src/tmp/gem-debase-buildroot]/usr/lib/ruby/gems/2.7.0/doc/debase-0.2.5.beta2/ri/Debase/Frame/binding-i.ri
    Debase/Frame/new-c.ri => [/usr/src/tmp/gem-debase-buildroot]/usr/lib/ruby/gems/2.7.0/doc/debase-0.2.5.beta2/ri/Debase/Frame/new-c.ri
    Debase/Frame/cdesc-Frame.ri => [/usr/src/tmp/gem-debase-buildroot]/usr/lib/ruby/gems/2.7.0/doc/debase-0.2.5.beta2/ri/Debase/Frame/cdesc-Frame.ri
    Debase/Breakpoint/id-i.ri => [/usr/src/tmp/gem-debase-buildroot]/usr/lib/ruby/gems/2.7.0/doc/debase-0.2.5.beta2/ri/Debase/Breakpoint/id-i.ri
    Debase/Breakpoint/enabled-i.ri => [/usr/src/tmp/gem-debase-buildroot]/usr/lib/ruby/gems/2.7.0/doc/debase-0.2.5.beta2/ri/Debase/Breakpoint/enabled-i.ri
    Debase/Breakpoint/expr-i.ri => [/usr/src/tmp/gem-debase-buildroot]/usr/lib/ruby/gems/2.7.0/doc/debase-0.2.5.beta2/ri/Debase/Breakpoint/expr-i.ri
    Debase/Breakpoint/pos-i.ri => [/usr/src/tmp/gem-debase-buildroot]/usr/lib/ruby/gems/2.7.0/doc/debase-0.2.5.beta2/ri/Debase/Breakpoint/pos-i.ri
    Debase/Breakpoint/source-i.ri => [/usr/src/tmp/gem-debase-buildroot]/usr/lib/ruby/gems/2.7.0/doc/debase-0.2.5.beta2/ri/Debase/Breakpoint/source-i.ri
    Debase/Breakpoint/delete%21-i.ri => [/usr/src/tmp/gem-debase-buildroot]/usr/lib/ruby/gems/2.7.0/doc/debase-0.2.5.beta2/ri/Debase/Breakpoint/delete%21-i.ri
    Debase/Breakpoint/remove-c.ri => [/usr/src/tmp/gem-debase-buildroot]/usr/lib/ruby/gems/2.7.0/doc/debase-0.2.5.beta2/ri/Debase/Breakpoint/remove-c.ri
    Debase/Breakpoint/new-c.ri => [/usr/src/tmp/gem-debase-buildroot]/usr/lib/ruby/gems/2.7.0/doc/debase-0.2.5.beta2/ri/Debase/Breakpoint/new-c.ri
    Debase/Breakpoint/cdesc-Breakpoint.ri => [/usr/src/tmp/gem-debase-buildroot]/usr/lib/ruby/gems/2.7.0/doc/debase-0.2.5.beta2/ri/Debase/Breakpoint/cdesc-Breakpoint.ri
    Debase/Context/thnum-i.ri => [/usr/src/tmp/gem-debase-buildroot]/usr/lib/ruby/gems/2.7.0/doc/debase-0.2.5.beta2/ri/Debase/Context/thnum-i.ri
    Debase/Context/thread-i.ri => [/usr/src/tmp/gem-debase-buildroot]/usr/lib/ruby/gems/2.7.0/doc/debase-0.2.5.beta2/ri/Debase/Context/thread-i.ri
    Debase/Context/stop_reason-i.ri => [/usr/src/tmp/gem-debase-buildroot]/usr/lib/ruby/gems/2.7.0/doc/debase-0.2.5.beta2/ri/Debase/Context/stop_reason-i.ri
    Debase/Context/stack_size-i.ri => [/usr/src/tmp/gem-debase-buildroot]/usr/lib/ruby/gems/2.7.0/doc/debase-0.2.5.beta2/ri/Debase/Context/stack_size-i.ri
    Debase/Context/ignored%3f-i.ri => [/usr/src/tmp/gem-debase-buildroot]/usr/lib/ruby/gems/2.7.0/doc/debase-0.2.5.beta2/ri/Debase/Context/ignored%3f-i.ri
    Debase/Context/handler-i.ri => [/usr/src/tmp/gem-debase-buildroot]/usr/lib/ruby/gems/2.7.0/doc/debase-0.2.5.beta2/ri/Debase/Context/handler-i.ri
    Debase/Context/frame_self-i.ri => [/usr/src/tmp/gem-debase-buildroot]/usr/lib/ruby/gems/2.7.0/doc/debase-0.2.5.beta2/ri/Debase/Context/frame_self-i.ri
    Debase/Context/frame_locals-i.ri => [/usr/src/tmp/gem-debase-buildroot]/usr/lib/ruby/gems/2.7.0/doc/debase-0.2.5.beta2/ri/Debase/Context/frame_locals-i.ri
    Debase/Context/frame_line-i.ri => [/usr/src/tmp/gem-debase-buildroot]/usr/lib/ruby/gems/2.7.0/doc/debase-0.2.5.beta2/ri/Debase/Context/frame_line-i.ri
    Debase/Context/frame_file-i.ri => [/usr/src/tmp/gem-debase-buildroot]/usr/lib/ruby/gems/2.7.0/doc/debase-0.2.5.beta2/ri/Debase/Context/frame_file-i.ri
    Debase/Context/frame_class-i.ri => [/usr/src/tmp/gem-debase-buildroot]/usr/lib/ruby/gems/2.7.0/doc/debase-0.2.5.beta2/ri/Debase/Context/frame_class-i.ri
    Debase/Context/frame_binding-i.ri => [/usr/src/tmp/gem-debase-buildroot]/usr/lib/ruby/gems/2.7.0/doc/debase-0.2.5.beta2/ri/Debase/Context/frame_binding-i.ri
    Debase/Context/frame_args_info-i.ri => [/usr/src/tmp/gem-debase-buildroot]/usr/lib/ruby/gems/2.7.0/doc/debase-0.2.5.beta2/ri/Debase/Context/frame_args_info-i.ri
    Debase/Context/fill_frame_info-i.ri => [/usr/src/tmp/gem-debase-buildroot]/usr/lib/ruby/gems/2.7.0/doc/debase-0.2.5.beta2/ri/Debase/Context/fill_frame_info-i.ri
    Debase/Context/dead%3f-i.ri => [/usr/src/tmp/gem-debase-buildroot]/usr/lib/ruby/gems/2.7.0/doc/debase-0.2.5.beta2/ri/Debase/Context/dead%3f-i.ri
    Debase/Context/clear_frame_info-i.ri => [/usr/src/tmp/gem-debase-buildroot]/usr/lib/ruby/gems/2.7.0/doc/debase-0.2.5.beta2/ri/Debase/Context/clear_frame_info-i.ri//////////////////////////
------------------------
"# -*- encoding: utf-8 -*-\n# stub: debase 0.2.5.beta2 ruby lib\n# stub: ext/extconf.rb\u0000ext/attach/extconf.rb\n\nGem::Specification.new do |s|\n  s.name = \"debase\".freeze\n  s.version = \"0.2.5.beta2\"\n\n  s.required_rubygems_version = Gem::Requirement.new(\"> 1.3.1\".freeze) if s.respond_to? :required_rubygems_version=\n  s.require_paths = [\"lib\".freeze]\n  s.authors = [\"Alexandr Evstigneev\".freeze, \"Dennis Ushakov\".freeze]\n  s.date = \"2022-07-30\"\n  s.description = \"    debase is a fast implementation of the standard Ruby debugger debug.rb for Ruby 2.0+.\\n    It is implemented by utilizing a new Ruby TracePoint class. The core component\\n    provides support that front-ends can build on. It provides breakpoint\\n    handling, bindings for stack frames among other things.\\n\".freeze\n  s.email = [\"hurricup@gmail.com\".freeze, \"dennis.ushakov@gmail.com\".freeze]\n  s.extensions = [\"ext/extconf.rb\".freeze, \"ext/attach/extconf.rb\".freeze]\n  s.files = [\".gitignore\".freeze, \".travis.yml\".freeze, \"Gemfile\".freeze, \"LICENSE\".freeze, \"MIT_LICENSE\".freeze, \"README.md\".freeze, \"Rakefile\".freeze, \"debase.gemspec\".freeze, \"ext/attach/attach.c\".freeze, \"ext/attach/attach.h\".freeze, \"ext/attach/extconf.rb\".freeze, \"ext/breakpoint.c\".freeze, \"ext/context.c\".freeze, \"ext/debase_internals.c\".freeze, \"ext/debase_internals.h\".freeze, \"ext/extconf.rb\".freeze, \"ext/hacks.h\".freeze, \"ext/locker.c\".freeze, \"lib/debase.rb\".freeze, \"lib/debase/context.rb\".freeze, \"lib/debase/rbx.rb\".freeze, \"lib/debase/rbx/breakpoint.rb\".freeze, \"lib/debase/rbx/context.rb\".freeze, \"lib/debase/rbx/frame.rb\".freeze, \"lib/debase/rbx/monkey.rb\".freeze, \"lib/debase/version.rb\".freeze, \"test/example/a/example.rb\".freeze, \"test/example/at-exit.rb\".freeze, \"test/example/b/example.rb\".freeze, \"test/example/bootsnap/a.rb\".freeze, \"test/example/bootsnap/bootsnap.rb\".freeze, \"test/example/bp_loop_issue.rb\".freeze, \"test/example/breakpoints-basename.rb\".freeze, \"test/example/brkpt-class-bug.rb\".freeze, \"test/example/classes.rb\".freeze, \"test/example/dollar-0.rb\".freeze, \"test/example/except-bug1.rb\".freeze, \"test/example/file with space.rb\".freeze, \"test/example/gcd.rb\".freeze, \"test/example/info-var-bug.rb\".freeze, \"test/example/info-var-bug2.rb\".freeze, \"test/example/null.rb\".freeze, \"test/example/output.rb\".freeze, \"test/example/pm-bug.rb\".freeze, \"test/example/pm.rb\".freeze, \"test/example/raise.rb\".freeze, \"test/helper.rb\".freeze, \"test/test_base.rb\".freeze, \"test/test_breakpoints.rb\".freeze, \"test/test_catchpoint.rb\".freeze, \"test/test_load.rb\".freeze, \"test/test_reload_bug.rb\".freeze]\n  s.homepage = \"https://github.com/ruby-debug/debase\".freeze\n  s.licenses = [\"MIT\".freeze]\n  s.required_ruby_version = Gem::Requirement.new(\">= 2.0\".freeze)\n  s.rubygems_version = \"3.1.6\".freeze\n  s.summary = \"debase is a fast implementation of the standard Ruby debugger debug.rb for Ruby 2.0\".freeze\n  s.test_files = [\"test/test_reload_bug.rb\".freeze, \"test/test_load.rb\".freeze, \"test/test_catchpoint.rb\".freeze, \"test/test_breakpoints.rb\".freeze, \"test/test_base.rb\".freeze, \"test/helper.rb\".freeze, \"test/example/raise.rb\".freeze, \"test/example/pm.rb\".freeze, \"test/example/pm-bug.rb\".freeze, \"test/example/output.rb\".freeze, \"test/example/null.rb\".freeze, \"test/example/info-var-bug2.rb\".freeze, \"test/example/info-var-bug.rb\".freeze, \"test/example/gcd.rb\".freeze, \"test/example/file with space.rb\".freeze, \"test/example/except-bug1.rb\".freeze, \"test/example/dollar-0.rb\".freeze, \"test/example/classes.rb\".freeze, \"test/example/brkpt-class-bug.rb\".freeze, \"test/example/breakpoints-basename.rb\".freeze, \"test/example/bp_loop_issue.rb\".freeze, \"test/example/bootsnap/bootsnap.rb\".freeze, \"test/example/bootsnap/a.rb\".freeze, \"test/example/b/example.rb\".freeze, \"test/example/at-exit.rb\".freeze, \"test/example/a/example.rb\".freeze]\n\n  if s.respond_to? :specification_version then\n    s.specification_version = 4\n  end\n\n  if s.respond_to? :add_runtime_dependency then\n    s.add_runtime_dependency(%q<debase-ruby_core_source>.freeze, [\">= 0.10.12\"])\n    s.add_development_dependency(%q<test-unit>.freeze, [\">= 0\"])\n    s.add_development_dependency(%q<rake>.freeze, [\">= 0\"])\n  else\n    s.add_dependency(%q<debase-ruby_core_source>.freeze, [\">= 0.10.12\"])\n    s.add_dependency(%q<test-unit>.freeze, [\">= 0\"])\n    s.add_dependency(%q<rake>.freeze, [\">= 0\"])\n  end\nend\n"
|||||||||||||||||||||||/
"# -*- encoding: utf-8 -*-\n# stub: debase 0.2.5.beta2 ruby lib\n# stub: ext/extconf.rb\u0000ext/attach/extconf.rb\n\nGem::Specification.new do |s|\n  s.name = \"debase\".freeze\n  s.version = \"0.2.5.beta2\"\n\n  s.required_rubygems_version = Gem::Requirement.new(\"> 1.3.1\".freeze) if s.respond_to? :required_rubygems_version=\n  s.require_paths = [\"lib\".freeze]\n  s.authors = [\"Alexandr Evstigneev\".freeze, \"Dennis Ushakov\".freeze]\n  s.date = \"2022-07-30\"\n  s.description = \"    debase is a fast implementation of the standard Ruby debugger debug.rb for Ruby 2.0+.\\n    It is implemented by utilizing a new Ruby TracePoint class. The core component\\n    provides support that front-ends can build on. It provides breakpoint\\n    handling, bindings for stack frames among other things.\\n\".freeze\n  s.email = [\"hurricup@gmail.com\".freeze, \"dennis.ushakov@gmail.com\".freeze]\n  s.extensions = [\"ext/extconf.rb\".freeze, \"ext/attach/extconf.rb\".freeze]\n  s.files = [\".gitignore\".freeze, \".travis.yml\".freeze, \"Gemfile\".freeze, \"LICENSE\".freeze, \"MIT_LICENSE\".freeze, \"README.md\".freeze, \"Rakefile\".freeze, \"debase.gemspec\".freeze, \"ext/attach/attach.c\".freeze, \"ext/attach/attach.h\".freeze, \"ext/attach/extconf.rb\".freeze, \"ext/breakpoint.c\".freeze, \"ext/context.c\".freeze, \"ext/debase_internals.c\".freeze, \"ext/debase_internals.h\".freeze, \"ext/extconf.rb\".freeze, \"ext/hacks.h\".freeze, \"ext/locker.c\".freeze, \"lib/debase.rb\".freeze, \"lib/debase/context.rb\".freeze, \"lib/debase/rbx.rb\".freeze, \"lib/debase/rbx/breakpoint.rb\".freeze, \"lib/debase/rbx/context.rb\".freeze, \"lib/debase/rbx/frame.rb\".freeze, \"lib/debase/rbx/monkey.rb\".freeze, \"lib/debase/version.rb\".freeze, \"test/example/a/example.rb\".freeze, \"test/example/at-exit.rb\".freeze, \"test/example/b/example.rb\".freeze, \"test/example/bootsnap/a.rb\".freeze, \"test/example/bootsnap/bootsnap.rb\".freeze, \"test/example/bp_loop_issue.rb\".freeze, \"test/example/breakpoints-basename.rb\".freeze, \"test/example/brkpt-class-bug.rb\".freeze, \"test/example/classes.rb\".freeze, \"test/example/dollar-0.rb\".freeze, \"test/example/except-bug1.rb\".freeze, \"test/example/file with space.rb\".freeze, \"test/example/gcd.rb\".freeze, \"test/example/info-var-bug.rb\".freeze, \"test/example/info-var-bug2.rb\".freeze, \"test/example/null.rb\".freeze, \"test/example/output.rb\".freeze, \"test/example/pm-bug.rb\".freeze, \"test/example/pm.rb\".freeze, \"test/example/raise.rb\".freeze, \"test/helper.rb\".freeze, \"test/test_base.rb\".freeze, \"test/test_breakpoints.rb\".freeze, \"test/test_catchpoint.rb\".freeze, \"test/test_load.rb\".freeze, \"test/test_reload_bug.rb\".freeze]\n  s.homepage = \"https://github.com/ruby-debug/debase\".freeze\n  s.licenses = [\"MIT\".freeze]\n  s.required_ruby_version = Gem::Requirement.new(\">= 2.0\".freeze)\n  s.rubygems_version = \"3.1.6\".freeze\n  s.summary = \"debase is a fast implementation of the standard Ruby debugger debug.rb for Ruby 2.0\".freeze\n  s.test_files = [\"test/test_reload_bug.rb\".freeze, \"test/test_load.rb\".freeze, \"test/test_catchpoint.rb\".freeze, \"test/test_breakpoints.rb\".freeze, \"test/test_base.rb\".freeze, \"test/helper.rb\".freeze, \"test/example/raise.rb\".freeze, \"test/example/pm.rb\".freeze, \"test/example/pm-bug.rb\".freeze, \"test/example/output.rb\".freeze, \"test/example/null.rb\".freeze, \"test/example/info-var-bug2.rb\".freeze, \"test/example/info-var-bug.rb\".freeze, \"test/example/gcd.rb\".freeze, \"test/example/file with space.rb\".freeze, \"test/example/except-bug1.rb\".freeze, \"test/example/dollar-0.rb\".freeze, \"test/example/classes.rb\".freeze, \"test/example/brkpt-class-bug.rb\".freeze, \"test/example/breakpoints-basename.rb\".freeze, \"test/example/bp_loop_issue.rb\".freeze, \"test/example/bootsnap/bootsnap.rb\".freeze, \"test/example/bootsnap/a.rb\".freeze, \"test/example/b/example.rb\".freeze, \"test/example/at-exit.rb\".freeze, \"test/example/a/example.rb\".freeze]\n\n  if s.respond_to? :specification_version then\n    s.specification_version = 4\n  end\n\n  if s.respond_to? :add_runtime_dependency then\n    s.add_runtime_dependency(%q<debase-ruby_core_source>.freeze, [\">= 0.10.12\"])\n    s.add_development_dependency(%q<test-unit>.freeze, [\">= 0\"])\n    s.add_development_dependency(%q<rake>.freeze, [\">= 0\"])\n  else\n    s.add_dependency(%q<debase-ruby_core_source>.freeze, [\">= 0.10.12\"])\n    s.add_dependency(%q<test-unit>.freeze, [\">= 0\"])\n    s.add_dependency(%q<rake>.freeze, [\">= 0\"])\n  end\nend\n"

    Debase/Context/at_tracing-i.ri => [/usr/src/tmp/gem-debase-buildroot]/usr/lib/ruby/gems/2.7.0/doc/debase-0.2.5.beta2/ri/Debase/Context/at_tracing-i.ri
    Debase/Context/at_return-i.ri => [/usr/src/tmp/gem-debase-buildroot]/usr/lib/ruby/gems/2.7.0/doc/debase-0.2.5.beta2/ri/Debase/Context/at_return-i.ri
    Debase/Context/at_line-i.ri => [/usr/src/tmp/gem-debase-buildroot]/usr/lib/ruby/gems/2.7.0/doc/debase-0.2.5.beta2/ri/Debase/Context/at_line-i.ri
    Debase/Context/at_catchpoint-i.ri => [/usr/src/tmp/gem-debase-buildroot]/usr/lib/ruby/gems/2.7.0/doc/debase-0.2.5.beta2/ri/Debase/Context/at_catchpoint-i.ri
    Debase/Context/at_breakpoint-i.ri => [/usr/src/tmp/gem-debase-buildroot]/usr/lib/ruby/gems/2.7.0/doc/debase-0.2.5.beta2/ri/Debase/Context/at_breakpoint-i.ri
    Debase/Context/new-c.ri => [/usr/src/tmp/gem-debase-buildroot]/usr/lib/ruby/gems/2.7.0/doc/debase-0.2.5.beta2/ri/Debase/Context/new-c.ri
    Debase/Context/cdesc-Context.ri => [/usr/src/tmp/gem-debase-buildroot]/usr/lib/ruby/gems/2.7.0/doc/debase-0.2.5.beta2/ri/Debase/Context/cdesc-Context.ri
    Debase/DebugThread/set_debugger_thread-i.ri => [/usr/src/tmp/gem-debase-buildroot]/usr/lib/ruby/gems/2.7.0/doc/debase-0.2.5.beta2/ri/Debase/DebugThread/set_debugger_thread-i.ri
    Debase/DebugThread/inherited-c.ri => [/usr/src/tmp/gem-debase-buildroot]/usr/lib/ruby/gems/2.7.0/doc/debase-0.2.5.beta2/ri/Debase/DebugThread/inherited-c.ri
    Debase/DebugThread/cdesc-DebugThread.ri => [/usr/src/tmp/gem-debase-buildroot]/usr/lib/ruby/gems/2.7.0/doc/debase-0.2.5.beta2/ri/Debase/DebugThread/cdesc-DebugThread.ri
    Debase/FileFilter/include-i.ri => [/usr/src/tmp/gem-debase-buildroot]/usr/lib/ruby/gems/2.7.0/doc/debase-0.2.5.beta2/ri/Debase/FileFilter/include-i.ri
    Debase/FileFilter/exclude-i.ri => [/usr/src/tmp/gem-debase-buildroot]/usr/lib/ruby/gems/2.7.0/doc/debase-0.2.5.beta2/ri/Debase/FileFilter/exclude-i.ri
    Debase/FileFilter/enable-i.ri => [/usr/src/tmp/gem-debase-buildroot]/usr/lib/ruby/gems/2.7.0/doc/debase-0.2.5.beta2/ri/Debase/FileFilter/enable-i.ri
    Debase/FileFilter/disable-i.ri => [/usr/src/tmp/gem-debase-buildroot]/usr/lib/ruby/gems/2.7.0/doc/debase-0.2.5.beta2/ri/Debase/FileFilter/disable-i.ri
    Debase/FileFilter/accept%3f-i.ri => [/usr/src/tmp/gem-debase-buildroot]/usr/lib/ruby/gems/2.7.0/doc/debase-0.2.5.beta2/ri/Debase/FileFilter/accept%3f-i.ri
    Debase/FileFilter/new-c.ri => [/usr/src/tmp/gem-debase-buildroot]/usr/lib/ruby/gems/2.7.0/doc/debase-0.2.5.beta2/ri/Debase/FileFilter/new-c.ri
    Debase/FileFilter/cdesc-FileFilter.ri => [/usr/src/tmp/gem-debase-buildroot]/usr/lib/ruby/gems/2.7.0/doc/debase-0.2.5.beta2/ri/Debase/FileFilter/cdesc-FileFilter.ri
* {inc} ->
  % debase < ext
    hacks.h => [/usr/src/tmp/gem-debase-buildroot]/usr/include/hacks.h
    debase_internals.h => [/usr/src/tmp/gem-debase-buildroot]/usr/include/debase_internals.h
    attach/attach.h => [/usr/src/tmp/gem-debase-buildroot]/usr/include/attach/attach.h
    /usr/include -> [/usr/src/tmp/gem-debase-buildroot]/usr/lib/ruby/gems/2.7.0/gems/debase-0.2.5.beta2/ext
* {app} ->
* {log} ->
* {state} ->
* {test} ->
  % debase < test
    test_reload_bug.rb => [/usr/src/tmp/gem-debase-buildroot]/usr/lib/ruby/gems/2.7.0/gems/debase-0.2.5.beta2/test/test_reload_bug.rb
    test_load.rb => [/usr/src/tmp/gem-debase-buildroot]/usr/lib/ruby/gems/2.7.0/gems/debase-0.2.5.beta2/test/test_load.rb
    test_catchpoint.rb => [/usr/src/tmp/gem-debase-buildroot]/usr/lib/ruby/gems/2.7.0/gems/debase-0.2.5.beta2/test/test_catchpoint.rb
    test_breakpoints.rb => [/usr/src/tmp/gem-debase-buildroot]/usr/lib/ruby/gems/2.7.0/gems/debase-0.2.5.beta2/test/test_breakpoints.rb
    test_base.rb => [/usr/src/tmp/gem-debase-buildroot]/usr/lib/ruby/gems/2.7.0/gems/debase-0.2.5.beta2/test/test_base.rb
    helper.rb => [/usr/src/tmp/gem-debase-buildroot]/usr/lib/ruby/gems/2.7.0/gems/debase-0.2.5.beta2/test/helper.rb
    example/raise.rb => [/usr/src/tmp/gem-debase-buildroot]/usr/lib/ruby/gems/2.7.0/gems/debase-0.2.5.beta2/test/example/raise.rb
    example/pm.rb => [/usr/src/tmp/gem-debase-buildroot]/usr/lib/ruby/gems/2.7.0/gems/debase-0.2.5.beta2/test/example/pm.rb
    example/pm-bug.rb => [/usr/src/tmp/gem-debase-buildroot]/usr/lib/ruby/gems/2.7.0/gems/debase-0.2.5.beta2/test/example/pm-bug.rb
    example/output.rb => [/usr/src/tmp/gem-debase-buildroot]/usr/lib/ruby/gems/2.7.0/gems/debase-0.2.5.beta2/test/example/output.rb
    example/null.rb => [/usr/src/tmp/gem-debase-buildroot]/usr/lib/ruby/gems/2.7.0/gems/debase-0.2.5.beta2/test/example/null.rb
    example/info-var-bug2.rb => [/usr/src/tmp/gem-debase-buildroot]/usr/lib/ruby/gems/2.7.0/gems/debase-0.2.5.beta2/test/example/info-var-bug2.rb
    example/info-var-bug.rb => [/usr/src/tmp/gem-debase-buildroot]/usr/lib/ruby/gems/2.7.0/gems/debase-0.2.5.beta2/test/example/info-var-bug.rb
    example/gcd.rb => [/usr/src/tmp/gem-debase-buildroot]/usr/lib/ruby/gems/2.7.0/gems/debase-0.2.5.beta2/test/example/gcd.rb
    example/file with space.rb => [/usr/src/tmp/gem-debase-buildroot]/usr/lib/ruby/gems/2.7.0/gems/debase-0.2.5.beta2/test/example/file with space.rb
    example/except-bug1.rb => [/usr/src/tmp/gem-debase-buildroot]/usr/lib/ruby/gems/2.7.0/gems/debase-0.2.5.beta2/test/example/except-bug1.rb
    example/dollar-0.rb => [/usr/src/tmp/gem-debase-buildroot]/usr/lib/ruby/gems/2.7.0/gems/debase-0.2.5.beta2/test/example/dollar-0.rb
    example/classes.rb => [/usr/src/tmp/gem-debase-buildroot]/usr/lib/ruby/gems/2.7.0/gems/debase-0.2.5.beta2/test/example/classes.rb
    example/brkpt-class-bug.rb => [/usr/src/tmp/gem-debase-buildroot]/usr/lib/ruby/gems/2.7.0/gems/debase-0.2.5.beta2/test/example/brkpt-class-bug.rb
    example/breakpoints-basename.rb => [/usr/src/tmp/gem-debase-buildroot]/usr/lib/ruby/gems/2.7.0/gems/debase-0.2.5.beta2/test/example/breakpoints-basename.rb
    example/bp_loop_issue.rb => [/usr/src/tmp/gem-debase-buildroot]/usr/lib/ruby/gems/2.7.0/gems/debase-0.2.5.beta2/test/example/bp_loop_issue.rb
    example/bootsnap/bootsnap.rb => [/usr/src/tmp/gem-debase-buildroot]/usr/lib/ruby/gems/2.7.0/gems/debase-0.2.5.beta2/test/example/bootsnap/bootsnap.rb
    example/bootsnap/a.rb => [/usr/src/tmp/gem-debase-buildroot]/usr/lib/ruby/gems/2.7.0/gems/debase-0.2.5.beta2/test/example/bootsnap/a.rb
    example/b/example.rb => [/usr/src/tmp/gem-debase-buildroot]/usr/lib/ruby/gems/2.7.0/gems/debase-0.2.5.beta2/test/example/b/example.rb
    example/at-exit.rb => [/usr/src/tmp/gem-debase-buildroot]/usr/lib/ruby/gems/2.7.0/gems/debase-0.2.5.beta2/test/example/at-exit.rb
    example/a/example.rb => [/usr/src/tmp/gem-debase-buildroot]/usr/lib/ruby/gems/2.7.0/gems/debase-0.2.5.beta2/test/example/a/example.rb
* {sup} ->
* {conf} ->
* {data} ->
  % debase < .
    .gitignore => [/usr/src/tmp/gem-debase-buildroot]/usr/lib/ruby/gems/2.7.0/gems/debase-0.2.5.beta2/.gitignore
    .travis.yml => [/usr/src/tmp/gem-debase-buildroot]/usr/lib/ruby/gems/2.7.0/gems/debase-0.2.5.beta2/.travis.yml
    Gemfile => [/usr/src/tmp/gem-debase-buildroot]/usr/lib/ruby/gems/2.7.0/gems/debase-0.2.5.beta2/Gemfile
    LICENSE => [/usr/src/tmp/gem-debase-buildroot]/usr/lib/ruby/gems/2.7.0/gems/debase-0.2.5.beta2/LICENSE
    MIT_LICENSE => [/usr/src/tmp/gem-debase-buildroot]/usr/lib/ruby/gems/2.7.0/gems/debase-0.2.5.beta2/MIT_LICENSE
    README.md => [/usr/src/tmp/gem-debase-buildroot]/usr/lib/ruby/gems/2.7.0/gems/debase-0.2.5.beta2/README.md
    Rakefile => [/usr/src/tmp/gem-debase-buildroot]/usr/lib/ruby/gems/2.7.0/gems/debase-0.2.5.beta2/Rakefile
    debase.gemspec => [/usr/src/tmp/gem-debase-buildroot]/usr/lib/ruby/gems/2.7.0/gems/debase-0.2.5.beta2/debase.gemspec
* {.gemspec} ->
  %debase
    /usr/src/tmp/gemspec.20220730-1028696-16c5cs9 => [/usr/src/tmp/gem-debase-buildroot]/usr/lib/ruby/gems/2.7.0/specifications/debase-0.2.5.beta2.gemspec
* {gemfile} ->
  %debase
    /usr/src/tmp/Gemfile.20220730-1028696-zgfs0b => [/usr/src/tmp/gem-debase-buildroot]/usr/lib/ruby/gems/2.7.0/gems/debase-0.2.5.beta2/Gemfile
* scheme
{debase}
  /usr/src/RPM/BUILD/gem-debase-0.2.5.beta2/.so.debase/usr/lib/ruby/site_ruby/2.7.0/i586-linux/attach.so => /usr/src/tmp/gem-debase-buildroot/usr/lib/ruby/gems/2.7.0/extensions/x86-linux/2.7.0/debase-0.2.5.beta2/attach.so
  /usr/lib/ruby/gems/2.7.0/extensions/x86-linux/2.7.0/debase-0.2.5.beta2/attach.so -> /usr/src/tmp/gem-debase-buildroot/usr/lib/ruby/gems/2.7.0/gems/debase-0.2.5.beta2/lib/attach.so
  >> /usr/src/tmp/gem-debase-buildroot/usr/lib/ruby/gems/2.7.0/extensions/x86-linux/2.7.0/debase-0.2.5.beta2/./gem.build_complete
  /usr/src/RPM/BUILD/gem-debase-0.2.5.beta2/.so.debase/usr/lib/ruby/site_ruby/2.7.0/i586-linux/debase_internals.so => /usr/src/tmp/gem-debase-buildroot/usr/lib/ruby/gems/2.7.0/extensions/x86-linux/2.7.0/debase-0.2.5.beta2/debase_internals.so
  /usr/lib/ruby/gems/2.7.0/extensions/x86-linux/2.7.0/debase-0.2.5.beta2/debase_internals.so -> /usr/src/tmp/gem-debase-buildroot/usr/lib/ruby/gems/2.7.0/gems/debase-0.2.5.beta2/lib/debase_internals.so
  >> /usr/src/tmp/gem-debase-buildroot/usr/lib/ruby/gems/2.7.0/extensions/x86-linux/2.7.0/debase-0.2.5.beta2/./gem.build_complete

+ /usr/lib/rpm/brp-alt
Cleaning files in /usr/src/tmp/gem-debase-buildroot (auto)
removed './usr/lib/ruby/gems/2.7.0/gems/debase-0.2.5.beta2/.gitignore'
mode of './usr/lib/ruby/gems/2.7.0/extensions/x86-linux/2.7.0/debase-0.2.5.beta2/debase_internals.so' changed from 0755 (rwxr-xr-x) to 0644 (rw-r--r--)
mode of './usr/lib/ruby/gems/2.7.0/extensions/x86-linux/2.7.0/debase-0.2.5.beta2/attach.so' changed from 0755 (rwxr-xr-x) to 0644 (rw-r--r--)
Verifying and fixing files in /usr/src/tmp/gem-debase-buildroot (binconfig,pkgconfig,libtool,desktop,gnuconfig)
Checking contents of files in /usr/src/tmp/gem-debase-buildroot/ (default)
Compressing files in /usr/src/tmp/gem-debase-buildroot (auto)
Adjusting library links in /usr/src/tmp/gem-debase-buildroot
./usr/lib: (from <cmdline>:0)
./usr/lib/ruby/gems/2.7.0/gems/debase-0.2.5.beta2/lib: (from <cmdline>:0)
debugedit: ./usr/lib/ruby/gems/2.7.0/extensions/x86-linux/2.7.0/debase-0.2.5.beta2/attach.so: DWARF version 591 unhandled
debugedit: ./usr/lib/ruby/gems/2.7.0/extensions/x86-linux/2.7.0/debase-0.2.5.beta2/debase_internals.so: DWARF version 40088 unhandled
[25] .debug_aranges NOT compressed, wouldn't be smaller
Verifying ELF objects in /usr/src/tmp/gem-debase-buildroot (arch=normal,fhs=normal,lfs=relaxed,lint=relaxed,rpath=normal,stack=normal,textrel=normal,unresolved=normal)
Executing(%check): /bin/sh -e /usr/src/tmp/rpm-tmp.41973
+ umask 022
+ /bin/mkdir -p /usr/src/RPM/BUILD
+ cd /usr/src/RPM/BUILD
+ cd gem-debase-0.2.5.beta2
+ /usr/bin/ruby -rvendor-specific /usr/bin/setup.rb test
(ruby 2.7.6 i586-linux)
[setup.rb][INFO]> Source list are the following:
[setup.rb][INFO]> V *debase:0.2.5.beta2 [./Rakefile]
[setup.rb][INFO]> = *debase:0.2.5.beta2 [./Rakefile]
[setup.rb][INFO]> = *debase:0.2.5.beta2 [./debase.gemspec]
sh: git: command not found
sh: git: command not found

+ exit 0
Processing files: gem-debase-0.2.5.beta2-alt1
Executing(%doc): /bin/sh -e /usr/src/tmp/rpm-tmp.5938
+ umask 022
+ /bin/mkdir -p /usr/src/RPM/BUILD
+ cd /usr/src/RPM/BUILD
+ cd gem-debase-0.2.5.beta2
+ DOCDIR=/usr/src/tmp/gem-debase-buildroot/usr/share/doc/gem-debase-0.2.5.beta2
+ export DOCDIR
+ rm -rf /usr/src/tmp/gem-debase-buildroot/usr/share/doc/gem-debase-0.2.5.beta2
+ /bin/mkdir -p /usr/src/tmp/gem-debase-buildroot/usr/share/doc/gem-debase-0.2.5.beta2
+ cp -prL README.md /usr/src/tmp/gem-debase-buildroot/usr/share/doc/gem-debase-0.2.5.beta2
+ chmod -R go-w /usr/src/tmp/gem-debase-buildroot/usr/share/doc/gem-debase-0.2.5.beta2
+ chmod -R a+rX /usr/src/tmp/gem-debase-buildroot/usr/share/doc/gem-debase-0.2.5.beta2
+ exit 0
warning: absolute symlink: /usr/src/tmp/gem-debase-buildroot/usr/lib/ruby/gems/2.7.0/gems/debase-0.2.5.beta2/ext -> /usr/include
warning: absolute symlink: /usr/src/tmp/gem-debase-buildroot/usr/lib/ruby/gems/2.7.0/gems/debase-0.2.5.beta2/lib/attach.so -> /usr/lib/ruby/gems/2.7.0/extensions/x86-linux/2.7.0/debase-0.2.5.beta2/attach.so
warning: absolute symlink: /usr/src/tmp/gem-debase-buildroot/usr/lib/ruby/gems/2.7.0/gems/debase-0.2.5.beta2/lib/debase_internals.so -> /usr/lib/ruby/gems/2.7.0/extensions/x86-linux/2.7.0/debase-0.2.5.beta2/debase_internals.so
Finding Provides (using /usr/lib/rpm/find-provides)
Executing: /bin/sh -e /usr/src/tmp/rpm-tmp.XurY2f
find-provides: running scripts (alternatives,debuginfo,lib,pam,perl,pkgconfig,python,python3,ruby,shell)
ruby.prov: detecting ruby provides for gem-debase...
ruby.prov: project file is '/usr/src/RPM/BUILD/gem-debase-0.2.5.beta2/SetupConfig'
ruby.prov: setup.rb provides --install_prefix=/usr/src/tmp/gem-debase-buildroot --package=gem-debase -q
[setup.rb][INFO]> Source list are the following:
[setup.rb][INFO]> V *debase:0.2.5.beta2 [./Rakefile]
[setup.rb][INFO]> = *debase:0.2.5.beta2 [./Rakefile]
[setup.rb][INFO]> = *debase:0.2.5.beta2 [./debase.gemspec]
sh: git: command not found
sh: git: command not found
(ruby 2.7.6 i586-linux)
* provs ->
  - [debase]
    [lib]:
      gem(debase) = 0.2.5.beta2
      ruby-gem(debase) = 0.2.5.beta2
      rubygem(debase) = 0.2.5.beta2
Finding Requires (using /usr/lib/rpm/find-requires)
Executing: /bin/sh -e /usr/src/tmp/rpm-tmp.NlaEWI
find-requires: running scripts (cpp,debuginfo,files,lib,pam,perl,pkgconfig,pkgconfiglib,python,python3,rpmlib,ruby,shebang,shell,static,symlinks,systemd-services)
ruby.req: detecting ruby requires for gem-debase...
ruby.req: ruby project file is '/usr/src/RPM/BUILD/gem-debase-0.2.5.beta2/SetupConfig'
ruby.req: setup.rb requires --install_prefix=/usr/src/tmp/gem-debase-buildroot --package=gem-debase -q
[setup.rb][INFO]> Source list are the following:
[setup.rb][INFO]> V *debase:0.2.5.beta2 [./Rakefile]
[setup.rb][INFO]> = *debase:0.2.5.beta2 [./Rakefile]
[setup.rb][INFO]> = *debase:0.2.5.beta2 [./debase.gemspec]
sh: git: command not found
sh: git: command not found
(ruby 2.7.6 i586-linux)
* reqs ->
  - [debase]
    [lib]:
      
      gem(debase-ruby_core_source) >= 0.10.12
      ruby >= 0
      rubygems >= 0
Provides: gem(debase) = 0.2.5.beta2, ruby-gem(debase) = 0.2.5.beta2, rubygem(debase) = 0.2.5.beta2
Requires: gem(debase-ruby_core_source) >= 0.10.12, libc.so.6(GLIBC_2.0), libc.so.6(GLIBC_2.1.3), libc.so.6(GLIBC_2.3.4), libc.so.6(GLIBC_2.4), libruby.so.2.7 >= set:ohoq0Dy1WI3A8KRLLvZFUHKp0HY4xJgZniMl0uZk3tlmBdIEiZJm4PCRRjMws46DuWDhhDR14e7eScZponc2fDy838dHgAZu5h5ud7WjWwIDiB7o5I2gVLo2jj2Ad7P3eZga6r1tW73q8Of8i5gZkrMCZrCAe2ImTeS4wTf2g1mRrvqjExpv2jvG4sEykL92bJuKb8PnheT1, rtld(GNU_HASH), ruby >= 0, rubygems >= 0
Requires(rpmlib): rpmlib(SetVersions)
Finding debuginfo files (using /usr/lib/rpm/find-debuginfo-files)
Executing: /bin/sh -e /usr/src/tmp/rpm-tmp.R1NGH2
Creating gem-debase-debuginfo package
Processing files: gem-debase-doc-0.2.5.beta2-alt1
Executing(%doc): /bin/sh -e /usr/src/tmp/rpm-tmp.72590
+ umask 022
+ /bin/mkdir -p /usr/src/RPM/BUILD
+ cd /usr/src/RPM/BUILD
+ cd gem-debase-0.2.5.beta2
+ DOCDIR=/usr/src/tmp/gem-debase-buildroot/usr/share/doc/gem-debase-doc-0.2.5.beta2
+ export DOCDIR
+ rm -rf /usr/src/tmp/gem-debase-buildroot/usr/share/doc/gem-debase-doc-0.2.5.beta2
+ /bin/mkdir -p /usr/src/tmp/gem-debase-buildroot/usr/share/doc/gem-debase-doc-0.2.5.beta2
+ cp -prL README.md /usr/src/tmp/gem-debase-buildroot/usr/share/doc/gem-debase-doc-0.2.5.beta2
+ chmod -R go-w /usr/src/tmp/gem-debase-buildroot/usr/share/doc/gem-debase-doc-0.2.5.beta2
+ chmod -R a+rX /usr/src/tmp/gem-debase-buildroot/usr/share/doc/gem-debase-doc-0.2.5.beta2
+ exit 0
Finding Provides (using /usr/lib/rpm/find-provides)
Executing: /bin/sh -e /usr/src/tmp/rpm-tmp.7GcfeS
find-provides: running scripts (alternatives,debuginfo,lib,pam,perl,pkgconfig,python,python3,ruby,shell)
ruby.prov: detecting ruby provides for gem-debase-doc...
ruby.prov: project file is '/usr/src/RPM/BUILD/gem-debase-0.2.5.beta2/SetupConfig'
ruby.prov: setup.rb provides --install_prefix=/usr/src/tmp/gem-debase-buildroot --package=gem-debase-doc -q
[setup.rb][INFO]> Source list are the following:
[setup.rb][INFO]> V *debase:0.2.5.beta2 [./Rakefile]
[setup.rb][INFO]> = *debase:0.2.5.beta2 [./Rakefile]
[setup.rb][INFO]> = *debase:0.2.5.beta2 [./debase.gemspec]
sh: git: command not found
sh: git: command not found
(ruby 2.7.6 i586-linux)
* provs ->
  - [debase]
Finding Requires (using /usr/lib/rpm/find-requires)
Executing: /bin/sh -e /usr/src/tmp/rpm-tmp.3MIg3T
find-requires: running scripts (cpp,debuginfo,files,lib,pam,perl,pkgconfig,pkgconfiglib,python,python3,rpmlib,ruby,shebang,shell,static,symlinks,systemd-services)
ruby.req: detecting ruby requires for gem-debase-doc...
ruby.req: ruby project file is '/usr/src/RPM/BUILD/gem-debase-0.2.5.beta2/SetupConfig'
ruby.req: setup.rb requires --install_prefix=/usr/src/tmp/gem-debase-buildroot --package=gem-debase-doc -q
[setup.rb][INFO]> Source list are the following:
[setup.rb][INFO]> V *debase:0.2.5.beta2 [./Rakefile]
[setup.rb][INFO]> = *debase:0.2.5.beta2 [./Rakefile]
[setup.rb][INFO]> = *debase:0.2.5.beta2 [./debase.gemspec]
sh: git: command not found
sh: git: command not found
(ruby 2.7.6 i586-linux)
* reqs ->
  - [debase]
    [doc]:
      gem(debase) = 0.2.5.beta2
Requires: gem(debase) = 0.2.5.beta2
Processing files: gem-debase-devel-0.2.5.beta2-alt1
Executing(%doc): /bin/sh -e /usr/src/tmp/rpm-tmp.27553
+ umask 022
+ /bin/mkdir -p /usr/src/RPM/BUILD
+ cd /usr/src/RPM/BUILD
+ cd gem-debase-0.2.5.beta2
+ DOCDIR=/usr/src/tmp/gem-debase-buildroot/usr/share/doc/gem-debase-devel-0.2.5.beta2
+ export DOCDIR
+ rm -rf /usr/src/tmp/gem-debase-buildroot/usr/share/doc/gem-debase-devel-0.2.5.beta2
+ /bin/mkdir -p /usr/src/tmp/gem-debase-buildroot/usr/share/doc/gem-debase-devel-0.2.5.beta2
+ cp -prL README.md /usr/src/tmp/gem-debase-buildroot/usr/share/doc/gem-debase-devel-0.2.5.beta2
+ chmod -R go-w /usr/src/tmp/gem-debase-buildroot/usr/share/doc/gem-debase-devel-0.2.5.beta2
+ chmod -R a+rX /usr/src/tmp/gem-debase-buildroot/usr/share/doc/gem-debase-devel-0.2.5.beta2
+ exit 0
Finding Provides (using /usr/lib/rpm/find-provides)
Executing: /bin/sh -e /usr/src/tmp/rpm-tmp.ZDtCPS
find-provides: running scripts (alternatives,debuginfo,lib,pam,perl,pkgconfig,python,python3,ruby,shell)
ruby.prov: detecting ruby provides for gem-debase-devel...
ruby.prov: project file is '/usr/src/RPM/BUILD/gem-debase-0.2.5.beta2/SetupConfig'
ruby.prov: setup.rb provides --install_prefix=/usr/src/tmp/gem-debase-buildroot --package=gem-debase-devel -q
[setup.rb][INFO]> Source list are the following:
[setup.rb][INFO]> V *debase:0.2.5.beta2 [./Rakefile]
[setup.rb][INFO]> = *debase:0.2.5.beta2 [./Rakefile]
[setup.rb][INFO]> = *debase:0.2.5.beta2 [./debase.gemspec]
sh: git: command not found
sh: git: command not found
(ruby 2.7.6 i586-linux)
* provs ->
  - [debase]
Finding Requires (using /usr/lib/rpm/find-requires)
Executing: /bin/sh -e /usr/src/tmp/rpm-tmp.fXJKLZ
find-requires: running scripts (cpp,debuginfo,files,lib,pam,perl,pkgconfig,pkgconfiglib,python,python3,rpmlib,ruby,shebang,shell,static,symlinks,systemd-services)
/usr/src/tmp/gem-debase-buildroot/usr/include/hacks.h:1:10: fatal error: vm_core.h: No such file or directory
    1 | #include <vm_core.h>
      |          ^~~~~~~~~~~
compilation terminated.
cpp.req: /usr/src/tmp/gem-debase-buildroot/usr/include/hacks.h: cpp failed, trying c++ mode
i586-alt-linux-cpp: fatal error: cannot execute 'cc1plus': execvp: No such file or directory
compilation terminated.
cpp.req: WARNING: /usr/src/tmp/gem-debase-buildroot/usr/include/hacks.h: cpp failed
/usr/src/tmp/gem-debase-buildroot/usr/include/debase_internals.h:7:10: fatal error: version.h: No such file or directory
    7 | #include <version.h>
      |          ^~~~~~~~~~~
compilation terminated.
cpp.req: WARNING: /usr/src/tmp/gem-debase-buildroot/usr/include/debase_internals.h: cpp failed
ruby.req: detecting ruby requires for gem-debase-devel...
ruby.req: ruby project file is '/usr/src/RPM/BUILD/gem-debase-0.2.5.beta2/SetupConfig'
ruby.req: setup.rb requires --install_prefix=/usr/src/tmp/gem-debase-buildroot --package=gem-debase-devel -q
[setup.rb][INFO]> Source list are the following:
[setup.rb][INFO]> V *debase:0.2.5.beta2 [./Rakefile]
[setup.rb][INFO]> = *debase:0.2.5.beta2 [./Rakefile]
[setup.rb][INFO]> = *debase:0.2.5.beta2 [./debase.gemspec]
sh: git: command not found
sh: git: command not found
(ruby 2.7.6 i586-linux)
* reqs ->
  - [debase]
    [devel]:
      gem(test-unit) >= 0
      gem(rake) >= 0
Requires: gem(debase) = 0.2.5.beta2, gem(test-unit) >= 0, gem(rake) >= 0, libruby-devel
Processing files: gem-debase-debuginfo-0.2.5.beta2-alt1
Finding Provides (using /usr/lib/rpm/find-provides)
Executing: /bin/sh -e /usr/src/tmp/rpm-tmp.Dd1QFW
find-provides: running scripts (debuginfo)
Finding Requires (using /usr/lib/rpm/find-requires)
Executing: /bin/sh -e /usr/src/tmp/rpm-tmp.mucU0v
find-requires: running scripts (debuginfo)
objdump: '/usr/src/tmp/gem-debase-buildroot/usr/lib/ruby/gems/2.7.0/gems/debase-0.2.5.beta2/lib/attach.so': No such file
debuginfo.req: WARNING: /usr/src/tmp/gem-debase-buildroot/usr/lib/ruby/gems/2.7.0/gems/debase-0.2.5.beta2/lib/attach.so: objdump failed
objdump: '/usr/src/tmp/gem-debase-buildroot/usr/lib/ruby/gems/2.7.0/gems/debase-0.2.5.beta2/lib/debase_internals.so': No such file
debuginfo.req: WARNING: /usr/src/tmp/gem-debase-buildroot/usr/lib/ruby/gems/2.7.0/gems/debase-0.2.5.beta2/lib/debase_internals.so: objdump failed
Requires: gem-debase = 0.2.5.beta2-alt1, debug(libc.so.6), debug(libruby.so.2.7)
Adding to gem-debase-debuginfo a strict dependency on gem-debase
warning: gem-debase-doc: non-strict dependency on gem-debase
warning: gem-debase-devel: non-strict dependency on gem-debase
Wrote: /usr/src/RPM/RPMS/i586/gem-debase-0.2.5.beta2-alt1.i586.rpm (w2.lzdio)
Wrote: /usr/src/RPM/RPMS/noarch/gem-debase-doc-0.2.5.beta2-alt1.noarch.rpm (w2.lzdio)
Wrote: /usr/src/RPM/RPMS/noarch/gem-debase-devel-0.2.5.beta2-alt1.noarch.rpm (w2.lzdio)
Wrote: /usr/src/RPM/RPMS/i586/gem-debase-debuginfo-0.2.5.beta2-alt1.i586.rpm (w2.lzdio)
4.97user 1.53system 0:12.73elapsed 51%CPU (0avgtext+0avgdata 41216maxresident)k
0inputs+0outputs (0major+463741minor)pagefaults 0swaps
19.43user 10.36system 0:35.46elapsed 84%CPU (0avgtext+0avgdata 148448maxresident)k
1128inputs+0outputs (45610major+999872minor)pagefaults 0swaps
--- gem-debase-0.2.5.beta2-alt1.i586.rpm.repo	2022-06-08 06:38:30.000000000 +0000
+++ gem-debase-0.2.5.beta2-alt1.i586.rpm.hasher	2022-07-30 05:23:23.921577924 +0000
@@ -132,5 +132,5 @@
 File: /usr/lib/ruby/gems/2.7.0/gems/debase-0.2.5.beta2/test/test_reload_bug.rb	100755	root:root	14e83f8302d958eb54293ce725993906	
-File: /usr/lib/ruby/gems/2.7.0/specifications/debase-0.2.5.beta2.gemspec	100644	root:root	07b7c4a53ff87bf42a7a64b2b8ffe540	
+File: /usr/lib/ruby/gems/2.7.0/specifications/debase-0.2.5.beta2.gemspec	100644	root:root	51b8251a904a1cb20b40ece4178d58d8	
 File: /usr/share/doc/gem-debase-0.2.5.beta2	40755	root:root		
 File: /usr/share/doc/gem-debase-0.2.5.beta2/README.md	100644	root:root	cc2c9679351b233027233a1716bf6a03	
-RPMIdentity: bfdb6bf24590c0d4dcbb75285472afbdbaa3480ea5a1ecabf05c2eee20b295c9d39f9040624b84efcb6b86af743eaa77d6eb7b0ea59d7fcb8b841e3c0369167d
+RPMIdentity: 696b1536b4e00bd4240c8ad6a13e0294c2e8a7bc1826578065e038361d9c8ed55892e269c1cc00873a487b5b19b22786c20ef8115cd0091c89a0f5de4d66c92d