86>Jun 11 05:10:55 userdel[301516]: delete user 'rooter'
<86>Jun 11 05:10:55 userdel[301516]: removed group 'rooter' owned by 'rooter'
<86>Jun 11 05:10:55 userdel[301516]: removed shadow group 'rooter' owned by 'rooter'
<86>Jun 11 05:10:55 groupadd[301524]: group added to /etc/group: name=rooter, GID=963
<86>Jun 11 05:10:55 groupadd[301524]: group added to /etc/gshadow: name=rooter
<86>Jun 11 05:10:55 groupadd[301524]: new group: name=rooter, GID=963
<86>Jun 11 05:10:55 useradd[301528]: new user: name=rooter, UID=963, GID=963, home=/root, shell=/bin/bash
<86>Jun 11 05:10:55 userdel[301534]: delete user 'builder'
<86>Jun 11 05:10:55 userdel[301534]: removed group 'builder' owned by 'builder'
<86>Jun 11 05:10:55 userdel[301534]: removed shadow group 'builder' owned by 'builder'
<86>Jun 11 05:10:55 groupadd[301539]: group added to /etc/group: name=builder, GID=964
<86>Jun 11 05:10:55 groupadd[301539]: group added to /etc/gshadow: name=builder
<86>Jun 11 05:10:55 groupadd[301539]: new group: name=builder, GID=964
<86>Jun 11 05:10:55 useradd[301543]: new user: name=builder, UID=964, GID=964, home=/usr/src, shell=/bin/bash
/usr/src/in/srpm/kf5-kidletime-5.94.0-alt1.src.rpm: bad symbols in the license tag: /
<13>Jun 11 05:10:56 rpmi: libxkbcommon-1.4.1-alt1 sisyphus+300420.100.1.1 1653246292 installed
<13>Jun 11 05:10:56 rpmi: libexpat-2.4.7-alt1 sisyphus+296417.100.1.1 1646812526 installed
<13>Jun 11 05:10:56 rpmi: libts0-1.22-alt3 sisyphus+278442.100.1.2 1626216683 installed
<13>Jun 11 05:10:56 rpmi: qt5-base-common-5.15.2-alt15 sisyphus+300911.100.1.1 1653911344 installed
<13>Jun 11 05:10:56 rpmi: qt5-declarative-common-5.15.2-alt8 sisyphus+293819.60.16.3 1643922765 installed
<13>Jun 11 05:10:56 rpmi: libmtdev-1.1.6-alt1 sisyphus+278361.100.1.1 1626091636 installed
<13>Jun 11 05:10:57 rpmi: libpng16-1.6.37-alt1 sisyphus+275734.100.2.1 1624788812 installed
<13>Jun 11 05:10:57 rpmi: libICE-1.0.10-alt1 sisyphus+278827.100.1.1 1626220281 installed
<13>Jun 11 05:10:57 rpmi: libglvnd-7:1.4.0-alt1 sisyphus+292743.100.1.1 1640688166 installed
<13>Jun 11 05:10:57 rpmi: libwayland-server-1.20.0-alt1.1 sisyphus+296452.100.1.1 1646839578 installed
<13>Jun 11 05:10:57 rpmi: libSM-1.2.3-alt1 sisyphus+278820.100.1.1 1626219266 installed
<13>Jun 11 05:10:57 rpmi: rpm-macros-ubt-0.4-alt1 sisyphus+279939.100.1.1 1626950850 installed
<13>Jun 11 05:10:57 rpmi: rpm-macros-qt5-5.15.2-alt15 sisyphus+300911.100.1.1 1653911121 installed
<13>Jun 11 05:10:57 rpmi: rpm-build-xdg-0.2-alt1 1250461503 installed
<13>Jun 11 05:10:57 rpmi: libsqlite3-3.38.5-alt1 sisyphus+299670.100.1.1 1651926005 installed
<13>Jun 11 05:10:57 rpmi: xml-utils-1:2.9.14-alt1 sisyphus+299383.100.1.1 1651519556 installed
<13>Jun 11 05:10:57 rpmi: libproxy-0.4.17-alt2 sisyphus+297079.100.1.1 1648068473 installed
<13>Jun 11 05:10:57 rpmi: libjpeg-2:2.1.2-alt1.2 sisyphus+300827.100.2.1 1653916654 installed
<13>Jun 11 05:10:57 rpmi: libwacom-data-2.2.0-alt1.1 sisyphus+297878.100.1.1 1649150399 installed
<13>Jun 11 05:10:57 rpmi: mpdecimal-2.5.1-alt1 sisyphus+291245.40.54.1 1643293464 installed
<13>Jun 11 05:10:57 rpmi: libicu71-1:7.1.1-alt1 sisyphus+289194.300.3.1 1650228483 installed
<13>Jun 11 05:10:57 rpmi: libqt5-core-5.15.2-alt15 sisyphus+300911.100.1.1 1653911344 installed
<13>Jun 11 05:10:57 rpmi: libqt5-sql-5.15.2-alt15 sisyphus+300911.100.1.1 1653911344 installed
<13>Jun 11 05:10:57 rpmi: libgudev-1:237-alt1 sisyphus+282754.100.1.1 1629006690 installed
<13>Jun 11 05:10:57 rpmi: libgraphite2-1.3.14-alt2.1 sisyphus+279571.100.1.2 1626605157 installed
<13>Jun 11 05:10:57 rpmi: libgdbm-1.8.3-alt10 sisyphus+278100.1600.1.1 1626059138 installed
<13>Jun 11 05:10:57 rpmi: libevdev-1.12.1-alt1 sisyphus+297182.100.1.1 1648197083 installed
<13>Jun 11 05:10:57 rpmi: liblz4-1:1.9.3-alt1 sisyphus+278100.4000.1.1 1626060252 installed
<13>Jun 11 05:10:57 rpmi: libsystemd-1:249.12-alt2 sisyphus+299531.100.2.1 1652296687 installed
<13>Jun 11 05:10:57 rpmi: libdbus-1.12.22-alt1 sisyphus+298998.100.1.1 1650885228 installed
<13>Jun 11 05:10:58 rpmi: libqt5-dbus-5.15.2-alt15 sisyphus+300911.100.1.1 1653911344 installed
<13>Jun 11 05:10:58 rpmi: libbrotlicommon-1.0.9-alt2 sisyphus+278430.100.1.2 1626213212 installed
<13>Jun 11 05:10:58 rpmi: libbrotlidec-1.0.9-alt2 sisyphus+278430.100.1.2 1626213212 installed
<13>Jun 11 05:10:58 rpmi: libharfbuzz-4.2.1-alt1 sisyphus+299180.100.1.1 1651137941 installed
<13>Jun 11 05:10:58 rpmi: libfreetype-2.12.1-alt1 sisyphus+299380.100.1.1 1651508335 installed
<13>Jun 11 05:10:58 rpmi: fontconfig-2.13.1-alt3 sisyphus+297937.100.1.1 1649228301 installed
Updating fonts cache: <29>Jun 11 05:10:59 fontconfig: Updating fonts cache: succeeded
[ DONE ]
<13>Jun 11 05:10:59 rpmi: libSDL2-2.0.22-alt1 sisyphus+299093.100.1.1 1651044072 installed
<13>Jun 11 05:10:59 rpmi: tslib-1.22-alt3 sisyphus+278442.100.1.2 1626216683 installed
<13>Jun 11 05:10:59 rpmi: libxshmfence-1.3-alt1 sisyphus+278248.100.1.1 1626080763 installed
<13>Jun 11 05:10:59 rpmi: libX11-locales-3:1.8-alt1 sisyphus+299436.100.1.1 1651655356 installed
<13>Jun 11 05:10:59 rpmi: libXdmcp-1.1.3-alt1 sisyphus+278816.100.1.1 1626219233 installed
<13>Jun 11 05:10:59 rpmi: libXau-1.0.9-alt1 sisyphus+278247.100.1.1 1626080738 installed
<13>Jun 11 05:10:59 rpmi: libxcb-1.15-alt1 sisyphus+299436.300.1.1 1651655490 installed
<13>Jun 11 05:10:59 rpmi: libX11-3:1.8-alt1 sisyphus+299436.100.1.1 1651655362 installed
<13>Jun 11 05:10:59 rpmi: libXext-1.3.4-alt1 sisyphus+278817.100.1.3 1626262589 installed
<13>Jun 11 05:10:59 rpmi: libXxf86vm-1.1.4-alt2 sisyphus+275334.100.2.2 1624577012 installed
<13>Jun 11 05:10:59 rpmi: libXfixes-6.0.0-alt1 sisyphus+284644.300.1.1 1630910333 installed
<13>Jun 11 05:10:59 rpmi: libXrender-0.9.10-alt1 sisyphus+278480.100.1.2 1626227741 installed
<13>Jun 11 05:10:59 rpmi: libxcbutil-icccm-0.4.1-alt2 sisyphus+278275.100.1.2 1626148617 installed
<13>Jun 11 05:10:59 rpmi: libxcbutil-1:0.4.0-alt1 sisyphus+275412.100.2.2 1624579109 installed
<13>Jun 11 05:10:59 rpmi: libxcbutil-image-0.4.0-alt1 sisyphus+275413.100.1.3 1624505806 installed
<13>Jun 11 05:10:59 rpmi: libxcbutil-keysyms-0.4.0-alt1 sisyphus+278187.100.1.1 1626075950 installed
<13>Jun 11 05:10:59 rpmi: libxcb-render-util-0.3.9-alt3 sisyphus+276916.100.1.2 1625275237 installed
<13>Jun 11 05:10:59 rpmi: libxkbcommon-x11-1.4.1-alt1 sisyphus+300420.100.1.1 1653246292 installed
<13>Jun 11 05:10:59 rpmi: libwayland-client-1.20.0-alt1.1 sisyphus+296452.100.1.1 1646839578 installed
<13>Jun 11 05:10:59 rpmi: libpciaccess-1:0.16-alt1 sisyphus+278288.100.1.1 1626084208 installed
<13>Jun 11 05:10:59 rpmi: libdrm-1:2.4.111-alt1 sisyphus+301189.100.1.1 1654263349 installed
<13>Jun 11 05:10:59 rpmi: libGLX-mesa-4:22.1.1-alt1 sisyphus+301189.200.1.1 1654263637 installed
<13>Jun 11 05:10:59 rpmi: libgbm-4:22.1.1-alt1 sisyphus+301189.200.1.1 1654263637 installed
<13>Jun 11 05:10:59 rpmi: libEGL-mesa-4:22.1.1-alt1 sisyphus+301189.200.1.1 1654263637 installed
<13>Jun 11 05:10:59 rpmi: libEGL-7:1.4.0-alt1 sisyphus+292743.100.1.1 1640688166 installed
<13>Jun 11 05:10:59 rpmi: libGLX-7:1.4.0-alt1 sisyphus+292743.100.1.1 1640688166 installed
<13>Jun 11 05:10:59 rpmi: libGL-7:1.4.0-alt1 sisyphus+292743.100.1.1 1640688166 installed
<13>Jun 11 05:10:59 rpmi: libdevmapper-1.02.179-alt2 sisyphus+287340.100.1.1 1634383917 installed
<13>Jun 11 05:10:59 rpmi: mount-2.37.3-alt2 sisyphus+294073.100.1.1 1643117189 installed
<13>Jun 11 05:10:59 rpmi: losetup-2.37.3-alt2 sisyphus+294073.100.1.1 1643117189 installed
<13>Jun 11 05:10:59 rpmi: lsblk-2.37.3-alt2 sisyphus+294073.100.1.1 1643117189 installed
<13>Jun 11 05:10:59 rpmi: libp11-kit-0.24.1-alt1 sisyphus+293720.100.1.1 1642535281 installed
<13>Jun 11 05:10:59 rpmi: libtasn1-4.18.0-alt2 sisyphus+301112.100.1.1 1654185769 installed
<13>Jun 11 05:10:59 rpmi: rpm-macros-alternatives-0.5.2-alt1 sisyphus+300869.100.1.1 1653844113 installed
<13>Jun 11 05:10:59 rpmi: alternatives-0.5.2-alt1 sisyphus+300869.100.1.1 1653844113 installed
<13>Jun 11 05:10:59 rpmi: ca-certificates-2022.04.01-alt1 sisyphus+297635.100.1.1 1648830809 installed
<13>Jun 11 05:10:59 rpmi: ca-trust-0.1.3-alt1 sisyphus+299449.100.1.1 1651660001 installed
<13>Jun 11 05:10:59 rpmi: p11-kit-trust-0.24.1-alt1 sisyphus+293720.100.1.1 1642535281 installed
<13>Jun 11 05:10:59 rpmi: libcrypto1.1-1.1.1n-alt2 sisyphus+297394.100.2.1 1648745164 installed
<13>Jun 11 05:10:59 rpmi: libkmod-29-alt1 sisyphus+288763.100.1.1 1635886492 installed
<13>Jun 11 05:10:59 rpmi: libssl1.1-1.1.1n-alt2 sisyphus+297394.100.2.1 1648745164 installed
<13>Jun 11 05:10:59 rpmi: libqt5-network-5.15.2-alt15 sisyphus+300911.100.1.1 1653911344 installed
<13>Jun 11 05:10:59 rpmi: python3-3.10.4-alt1 sisyphus+297487.100.1.1 1648620133 installed
<13>Jun 11 05:11:00 rpmi: python3-base-3.10.4-alt1 sisyphus+297487.100.1.1 1648620133 installed
<13>Jun 11 05:11:00 rpmi: kmod-29-alt1 sisyphus+288763.100.1.1 1635886492 installed
<13>Jun 11 05:11:00 rpmi: dmsetup-1.02.179-alt2 sisyphus+287340.100.1.1 1634383917 installed
<86>Jun 11 05:11:00 groupadd[324519]: group added to /etc/group: name=tape, GID=499
<86>Jun 11 05:11:00 groupadd[324519]: group added to /etc/gshadow: name=tape
<86>Jun 11 05:11:00 groupadd[324519]: new group: name=tape, GID=499
<86>Jun 11 05:11:00 groupadd[324532]: group added to /etc/group: name=dialout, GID=498
<86>Jun 11 05:11:00 groupadd[324532]: group added to /etc/gshadow: name=dialout
<86>Jun 11 05:11:00 groupadd[324532]: new group: name=dialout, GID=498
<86>Jun 11 05:11:00 groupadd[324545]: group added to /etc/group: name=input, GID=497
<86>Jun 11 05:11:00 groupadd[324545]: group added to /etc/gshadow: name=input
<86>Jun 11 05:11:00 groupadd[324545]: new group: name=input, GID=497
<86>Jun 11 05:11:00 groupadd[324557]: group added to /etc/group: name=video, GID=496
<86>Jun 11 05:11:00 groupadd[324557]: group added to /etc/gshadow: name=video
<86>Jun 11 05:11:00 groupadd[324557]: new group: name=video, GID=496
<86>Jun 11 05:11:00 groupadd[324572]: group added to /etc/group: name=render, GID=495
<86>Jun 11 05:11:00 groupadd[324572]: group added to /etc/gshadow: name=render
<86>Jun 11 05:11:00 groupadd[324572]: new group: name=render, GID=495
<13>Jun 11 05:11:00 rpmi: udev-1:249.12-alt2 sisyphus+299531.100.2.1 1652296687 installed
<13>Jun 11 05:11:00 rpmi: libwacom-2.2.0-alt1.1 sisyphus+297878.100.1.1 1649150399 installed
<13>Jun 11 05:11:00 rpmi: libinput-1.20.1-alt1 sisyphus+298749.100.1.1 1650439880 installed
<13>Jun 11 05:11:00 rpmi: libqt5-xcbqpa-5.15.2-alt15 sisyphus+300911.100.1.1 1653911344 installed
<13>Jun 11 05:11:00 rpmi: libqt5-eglfskmssupport-5.15.2-alt15 sisyphus+300911.100.1.1 1653911344 installed
<13>Jun 11 05:11:00 rpmi: libqt5-eglfsdeviceintegration-5.15.2-alt15 sisyphus+300911.100.1.1 1653911344 installed
<13>Jun 11 05:11:00 rpmi: libqt5-gui-5.15.2-alt15 sisyphus+300911.100.1.1 1653911344 installed
<13>Jun 11 05:11:00 rpmi: libqt5-qmlmodels-5.15.2-alt8 sisyphus+293819.60.16.3 1643922765 installed
<13>Jun 11 05:11:00 rpmi: libqt5-qmlworkerscript-5.15.2-alt8 sisyphus+293819.60.16.3 1643922765 installed
<13>Jun 11 05:11:01 rpmi: libqt5-quick-5.15.2-alt8 sisyphus+293819.60.16.3 1643922765 installed
<13>Jun 11 05:11:01 rpmi: libqt5-quickshapes-5.15.2-alt8 sisyphus+293819.60.16.3 1643922765 installed
<13>Jun 11 05:11:01 rpmi: libqt5-qml-5.15.2-alt8 sisyphus+293819.60.16.3 1643922765 installed
<13>Jun 11 05:11:01 rpmi: rpm-build-qml-5.15.2-alt8 sisyphus+293819.60.16.3 1643922765 installed
<13>Jun 11 05:11:01 rpmi: rpm-build-kf5-5.12.0-alt2 sisyphus+226903.100.1.1 1554799142 installed
<13>Jun 11 05:11:01 rpmi: rpm-build-ubt-0.3.1-alt3 sisyphus+277013.100.1.2 1625346631 installed
egrep: warning: egrep is obsolescent; using grep -E
<13>Jun 11 05:11:03 rpmi: xorg-proto-devel-2022.1-alt1 sisyphus+299488.100.1.1 1651731532 installed
<13>Jun 11 05:11:04 rpmi: libxcb-devel-1.15-alt1 sisyphus+299436.300.1.1 1651655490 installed
<13>Jun 11 05:11:04 rpmi: libX11-devel-3:1.8-alt1 sisyphus+299436.100.1.1 1651655362 installed
<13>Jun 11 05:11:04 rpmi: libXfixes-devel-6.0.0-alt1 sisyphus+284644.300.1.1 1630910333 installed
<13>Jun 11 05:11:04 rpmi: libXt-1.2.1-alt1 sisyphus+265202.200.1.1 1611565459 installed
<13>Jun 11 05:11:04 rpmi: libidn2-2.3.2-alt1 sisyphus+281238.100.1.2 1627476328 installed
<13>Jun 11 05:11:04 rpmi: libXrender-devel-0.9.10-alt1 sisyphus+278480.100.1.2 1626227741 installed
<13>Jun 11 05:11:04 rpmi: libqt5-widgets-5.15.2-alt15 sisyphus+300911.100.1.1 1653911344 installed
<13>Jun 11 05:11:04 rpmi: libnettle8-3.7.3-alt1 sisyphus+276723.100.1.2 1625211849 installed
<13>Jun 11 05:11:04 rpmi: libhogweed6-3.7.3-alt1 sisyphus+276723.100.1.2 1625211849 installed
<13>Jun 11 05:11:04 rpmi: libgnutls30-3.6.16-alt1 sisyphus+273086.100.1.1 1622478374 installed
<13>Jun 11 05:11:04 rpmi: libqt5-opengl-5.15.2-alt15 sisyphus+300911.100.1.1 1653911344 installed
<13>Jun 11 05:11:04 rpmi: libXmu-1.1.3-alt1 sisyphus+278818.100.1.3 1626263299 installed
<13>Jun 11 05:11:04 rpmi: libXpm-3.5.13-alt1 sisyphus+278339.100.1.2 1626171703 installed
<13>Jun 11 05:11:04 rpmi: libXpm-devel-3.5.13-alt1 sisyphus+278339.100.1.2 1626171703 installed
<13>Jun 11 05:11:04 rpmi: libxcbutil-keysyms-devel-0.4.0-alt1 sisyphus+278187.100.1.1 1626075950 installed
<13>Jun 11 05:11:04 rpmi: libICE-devel-1.0.10-alt1 sisyphus+278827.100.1.1 1626220281 installed
<13>Jun 11 05:11:04 rpmi: libSM-devel-1.2.3-alt1 sisyphus+278820.100.1.1 1626219266 installed
<13>Jun 11 05:11:04 rpmi: libXt-devel-1.2.1-alt1 sisyphus+265202.200.1.1 1611565459 installed
<13>Jun 11 05:11:04 rpmi: libXmu-devel-1.1.3-alt1 sisyphus+278818.100.1.3 1626263299 installed
<13>Jun 11 05:11:04 rpmi: libXau-devel-1.0.9-alt1 sisyphus+278247.100.1.1 1626080738 installed
<13>Jun 11 05:11:04 rpmi: libXext-devel-1.3.4-alt1 sisyphus+278817.100.1.3 1626262589 installed
<13>Jun 11 05:11:04 rpmi: libXdmcp-devel-1.1.3-alt1 sisyphus+278816.100.1.1 1626219233 installed
<13>Jun 11 05:11:04 rpmi: libXxf86vm-devel-1.1.4-alt2 sisyphus+275334.100.2.2 1624577012 installed
<13>Jun 11 05:11:04 rpmi: xxd-4:8.2.5062-alt1 sisyphus+301428.200.3.1 1654563383 installed
<13>Jun 11 05:11:04 rpmi: libxkbfile-1.1.0-alt1 sisyphus+278257.100.1.2 1626134575 installed
<13>Jun 11 05:11:04 rpmi: libxkbfile-devel-1.1.0-alt1 sisyphus+278257.100.1.2 1626134575 installed
<13>Jun 11 05:11:04 rpmi: libxkbcommon-devel-1.4.1-alt1 sisyphus+300420.100.1.1 1653246292 installed
<13>Jun 11 05:11:04 rpmi: vulkan-filesystem-1.3.211-alt1 sisyphus+298198.700.1.1 1649588358 installed
<13>Jun 11 05:11:04 rpmi: libvulkan1-1.3.211-alt1 sisyphus+298198.700.1.1 1649588378 installed
<13>Jun 11 05:11:04 rpmi: libvulkan-devel-1.3.211-alt1 sisyphus+298198.700.1.1 1649588378 installed
<13>Jun 11 05:11:04 rpmi: libudev-devel-1:249.12-alt2 sisyphus+299531.100.2.1 1652296687 installed
<13>Jun 11 05:11:04 rpmi: libssl-devel-1.1.1n-alt2 sisyphus+297394.100.2.1 1648745164 installed
<13>Jun 11 05:11:04 rpmi: libqt5-xml-5.15.2-alt15 sisyphus+300911.100.1.1 1653911344 installed
<13>Jun 11 05:11:04 rpmi: qt5-x11extras-common-5.15.2-alt1 sisyphus+279083.100.1.1 1626376026 installed
<13>Jun 11 05:11:04 rpmi: libqt5-x11extras-5.15.2-alt1 sisyphus+279083.100.1.1 1626376030 installed
<13>Jun 11 05:11:04 rpmi: libqt5-test-5.15.2-alt15 sisyphus+300911.100.1.1 1653911344 installed
<13>Jun 11 05:11:04 rpmi: libqt5-concurrent-5.15.2-alt15 sisyphus+300911.100.1.1 1653911344 installed
<13>Jun 11 05:11:04 rpmi: libavahi-0.8-alt2 sisyphus+279391.100.1.2 1626530700 installed
<13>Jun 11 05:11:04 rpmi: libcups-2.3.3-alt7.op2 sisyphus+289457.100.2.1 1636771530 installed
<13>Jun 11 05:11:04 rpmi: libqt5-printsupport-5.15.2-alt15 sisyphus+300911.100.1.1 1653911344 installed
<13>Jun 11 05:11:04 rpmi: xorg-xf86miscproto-devel-0.9.3-alt1 sisyphus+277136.100.1.1 1625405239 installed
<13>Jun 11 05:11:04 rpmi: libXxf86misc-1.0.4-alt1 sisyphus+275333.100.2.2 1624577011 installed
<13>Jun 11 05:11:04 rpmi: libXxf86misc-devel-1.0.4-alt1 sisyphus+275333.100.2.2 1624577011 installed
<13>Jun 11 05:11:04 rpmi: libXv-1.0.11-alt1 sisyphus+278228.100.1.1 1626079280 installed
<13>Jun 11 05:11:04 rpmi: libXv-devel-1.0.11-alt1 sisyphus+278228.100.1.1 1626079280 installed
<13>Jun 11 05:11:04 rpmi: libXtst-1.2.3-alt1 sisyphus+278848.100.1.2 1626298057 installed
<13>Jun 11 05:11:04 rpmi: libXrandr-1.5.2-alt1 sisyphus+275330.100.2.2 1624575560 installed
<13>Jun 11 05:11:04 rpmi: libXrandr-devel-1.5.2-alt1 sisyphus+275330.100.2.2 1624575560 installed
<13>Jun 11 05:11:04 rpmi: libXinerama-1.1.4-alt1 sisyphus+275328.100.2.2 1624575558 installed
<13>Jun 11 05:11:04 rpmi: libXinerama-devel-1.1.4-alt1 sisyphus+275328.100.2.2 1624575558 installed
<13>Jun 11 05:11:04 rpmi: libXi-1.8-alt1 sisyphus+285490.200.1.1 1632124180 installed
<13>Jun 11 05:11:04 rpmi: libXi-devel-1.8-alt1 sisyphus+285490.200.1.1 1632124180 installed
<13>Jun 11 05:11:04 rpmi: libXtst-devel-1.2.3-alt1 sisyphus+278848.100.1.2 1626298057 installed
<13>Jun 11 05:11:04 rpmi: libXft-2.3.4-alt1 sisyphus+284644.500.1.1 1630910448 installed
<13>Jun 11 05:11:04 rpmi: libXdamage-1.1.5-alt1 sisyphus+275324.100.2.2 1624573270 installed
<13>Jun 11 05:11:04 rpmi: libXdamage-devel-1.1.5-alt1 sisyphus+275324.100.2.2 1624573270 installed
<13>Jun 11 05:11:04 rpmi: libXcursor-1.2.1-alt1 sisyphus+297765.200.1.1 1649053934 installed
<13>Jun 11 05:11:04 rpmi: libXcursor-devel-1.2.1-alt1 sisyphus+297765.200.1.1 1649053934 installed
<13>Jun 11 05:11:04 rpmi: libXcomposite-0.4.5-alt1 sisyphus+275323.100.2.2 1624573270 installed
<13>Jun 11 05:11:04 rpmi: libXcomposite-devel-0.4.5-alt1 sisyphus+275323.100.2.2 1624573270 installed
<13>Jun 11 05:11:04 rpmi: libXScrnSaver-1.2.3-alt1 sisyphus+275322.100.2.2 1624573270 installed
<13>Jun 11 05:11:04 rpmi: libXScrnSaver-devel-1.2.3-alt1 sisyphus+275322.100.2.2 1624573270 installed
<13>Jun 11 05:11:04 rpmi: libOpenGL-7:1.4.0-alt1 sisyphus+292743.100.1.1 1640688166 installed
<13>Jun 11 05:11:04 rpmi: libGLES-7:1.4.0-alt1 sisyphus+292743.100.1.1 1640688166 installed
<13>Jun 11 05:11:04 rpmi: libglvnd-devel-7:1.4.0-alt1 sisyphus+292743.100.1.1 1640688166 installed
<13>Jun 11 05:11:04 rpmi: gcc-c++-common-1.4.27-alt1 sisyphus+278099.1300.1.1 1626028636 installed
<13>Jun 11 05:11:05 rpmi: libstdc++12-devel-12.1.1-alt1 sisyphus+300988.100.1.1 1654028661 installed
<13>Jun 11 05:11:05 rpmi: gcc12-c++-12.1.1-alt1 sisyphus+300988.100.1.1 1654028661 installed
<13>Jun 11 05:11:05 rpmi: gcc-c++-12-alt1 sisyphus+300988.300.1.1 1654033914 installed
<13>Jun 11 05:11:05 rpmi: libharfbuzz-gobject-4.2.1-alt1 sisyphus+299180.100.1.1 1651137941 installed
<13>Jun 11 05:11:05 rpmi: libharfbuzz-icu-4.2.1-alt1 sisyphus+299180.100.1.1 1651137941 installed
<13>Jun 11 05:11:05 rpmi: icu-utils-1:7.1.1-alt1 sisyphus+289194.300.3.1 1650228483 installed
<13>Jun 11 05:11:05 rpmi: libicu-devel-1:7.1.1-alt1 sisyphus+289194.300.3.1 1650228483 installed
<13>Jun 11 05:11:06 rpmi: qt5-base-devel-5.15.2-alt15 sisyphus+300911.100.1.1 1653911344 installed
<13>Jun 11 05:11:06 rpmi: libgraphite2-devel-1.3.14-alt2.1 sisyphus+279571.100.1.2 1626605157 installed
<13>Jun 11 05:11:06 rpmi: rpm-build-gir-0.7.3-alt3 sisyphus+242150.100.1.1 1575312005 installed
<13>Jun 11 05:11:06 rpmi: glib2-devel-2.72.2-alt1 sisyphus+300949.100.1.1 1653934005 installed
<13>Jun 11 05:11:06 rpmi: libfreetype-devel-2.12.1-alt1 sisyphus+299380.100.1.1 1651508335 installed
<13>Jun 11 05:11:06 rpmi: libharfbuzz-devel-4.2.1-alt1 sisyphus+299180.100.1.1 1651137941 installed
<13>Jun 11 05:11:06 rpmi: fontconfig-devel-2.13.1-alt3 sisyphus+297937.100.1.1 1649228301 installed
<13>Jun 11 05:11:06 rpmi: libXft-devel-2.3.4-alt1 sisyphus+284644.500.1.1 1630910448 installed
<13>Jun 11 05:11:06 rpmi: libyaml2-0.2.5-alt1 sisyphus+278391.100.1.1 1626094932 installed
<13>Jun 11 05:11:06 rpmi: python3-module-yaml-6.0-alt1 sisyphus+295017.400.2.1 1644497824 installed
<13>Jun 11 05:11:06 rpmi: shared-mime-info-2.2-alt1 sisyphus+297388.100.1.1 1648466617 installed
<13>Jun 11 05:11:06 rpmi: python3-module-pyxdg-0.27-alt1 sisyphus+275990.100.1.1 1624810448 installed
<13>Jun 11 05:11:06 rpmi: python3-module-pycparser-2.20-alt2 sisyphus+278697.200.1.1 1626167452 installed
<13>Jun 11 05:11:06 rpmi: python3-module-cffi-1.15.0-alt1 sisyphus+291245.7540.54.1 1643302047 installed
<13>Jun 11 05:11:06 rpmi: python3-module-cryptography-37.0.2-alt1 sisyphus+299462.200.1.1 1651672035 installed
<13>Jun 11 05:11:06 rpmi: python3-module-openssl-22.0.0-alt1 sisyphus+297852.100.1.1 1649097500 installed
<13>Jun 11 05:11:06 rpmi: python3-module-six-1.16.0-alt1 sisyphus+283489.100.2.1 1629527308 installed
<13>Jun 11 05:11:06 rpmi: python3-module-urllib3-2:1.26.6-alt3 sisyphus+283224.100.2.2 1629257365 installed
<13>Jun 11 05:11:06 rpmi: python3-module-idna-3.3-alt1 sisyphus+288800.100.1.1 1635936399 installed
<13>Jun 11 05:11:06 rpmi: python3-module-charset-normalizer-2.0.6-alt1 sisyphus+286375.600.1.1 1633362792 installed
<13>Jun 11 05:11:06 rpmi: python3-module-requests-2.27.1-alt1 sisyphus+295017.300.2.1 1644497798 installed
<13>Jun 11 05:11:06 rpmi: rpm-macros-cmake-3.23.1-alt1 sisyphus+298388.100.2.1 1649938508 installed
<13>Jun 11 05:11:06 rpmi: cmake-modules-3.23.1-alt1 sisyphus+298388.100.2.1 1649938494 installed
<13>Jun 11 05:11:06 rpmi: libuv-1.44.1-alt1 sisyphus+297750.100.1.1 1648981567 installed
<13>Jun 11 05:11:06 rpmi: librhash-1.3.5-alt3 sisyphus+286141.40.2.1 1632982456 installed
<13>Jun 11 05:11:06 rpmi: libjsoncpp24-1.9.4-alt2 sisyphus+286441.100.1.1 1633444234 installed
<13>Jun 11 05:11:06 rpmi: publicsuffix-list-dafsa-20220406-alt1 sisyphus+297986.100.1.1 1649274774 installed
<13>Jun 11 05:11:06 rpmi: libpsl-0.21.1-alt2 sisyphus+279461.100.1.1 1626547555 installed
<13>Jun 11 05:11:06 rpmi: libnghttp2-1.47.0-alt1 sisyphus+297351.100.1.1 1648403633 installed
<13>Jun 11 05:11:06 rpmi: openldap-common-2.4.59-alt1 sisyphus+282933.100.1.1 1629124747 installed
<13>Jun 11 05:11:06 rpmi: libverto-0.3.2-alt1_1 sisyphus+279289.100.1.3 1626493872 installed
<13>Jun 11 05:11:06 rpmi: liblmdb-0.9.23-alt1 sisyphus+275369.100.1.2 1624493869 installed
<13>Jun 11 05:11:06 rpmi: libkeyutils-1.6.3-alt1 sisyphus+266061.100.1.1 1612919567 installed
<13>Jun 11 05:11:06 rpmi: libcom_err-1.46.4.0.5.4cda-alt1 sisyphus+283826.100.1.1 1629975361 installed
<86>Jun 11 05:11:06 groupadd[382302]: group added to /etc/group: name=_keytab, GID=494
<86>Jun 11 05:11:06 groupadd[382302]: group added to /etc/gshadow: name=_keytab
<86>Jun 11 05:11:06 groupadd[382302]: new group: name=_keytab, GID=494
<13>Jun 11 05:11:06 rpmi: libkrb5-1.19.3-alt1 sisyphus+296671.100.1.1 1647339985 installed
<86>Jun 11 05:11:06 groupadd[382736]: group added to /etc/group: name=sasl, GID=493
<86>Jun 11 05:11:06 groupadd[382736]: group added to /etc/gshadow: name=sasl
<86>Jun 11 05:11:06 groupadd[382736]: new group: name=sasl, GID=493
<13>Jun 11 05:11:06 rpmi: libsasl2-3-2.1.27-alt2.2 sisyphus+282040.40.2.1 1628929849 installed
<13>Jun 11 05:11:06 rpmi: libldap-2.4.59-alt1 sisyphus+282933.100.1.1 1629124742 installed
<13>Jun 11 05:11:06 rpmi: libcurl-7.83.1-alt1 sisyphus+299767.100.1.1 1652258416 installed
<13>Jun 11 05:11:06 rpmi: libarchive13-3.6.0-alt1 sisyphus+296421.100.1.1 1646814097 installed
<13>Jun 11 05:11:07 rpmi: cmake-3.23.1-alt1 sisyphus+298388.100.2.1 1649938508 installed
<13>Jun 11 05:11:07 rpmi: extra-cmake-modules-5.94.0-alt1 sisyphus+300088.100.6.1 1652863863 installed
<13>Jun 11 05:11:07 rpmi: qt5-x11extras-devel-5.15.2-alt1 sisyphus+279083.100.1.1 1626376030 installed
egrep: warning: egrep is obsolescent; using grep -E
Building target platforms: i586
Building for target i586
Wrote: /usr/src/in/nosrpm/kf5-kidletime-5.94.0-alt1.nosrc.rpm (w1.gzdio)
Installing kf5-kidletime-5.94.0-alt1.src.rpm
Building target platforms: i586
Building for target i586
Executing(%prep): /bin/sh -e /usr/src/tmp/rpm-tmp.13754
+ umask 022
+ /bin/mkdir -p /usr/src/RPM/BUILD
+ cd /usr/src/RPM/BUILD
+ cd /usr/src/RPM/BUILD
+ rm -rf kidletime-5.94.0
+ echo 'Source #0 (kidletime-5.94.0.tar):'
Source #0 (kidletime-5.94.0.tar):
+ /bin/tar -xf /usr/src/RPM/SOURCES/kidletime-5.94.0.tar
+ cd kidletime-5.94.0
+ /bin/chmod -c -Rf u+rwX,go-w .
+ exit 0
Executing(%build): /bin/sh -e /usr/src/tmp/rpm-tmp.13754
+ umask 022
+ /bin/mkdir -p /usr/src/RPM/BUILD
+ cd /usr/src/RPM/BUILD
+ cd kidletime-5.94.0
+ __kf5_build
+ mkdir -p BUILD
+ __kf5_cmake
+ export PATH=/usr/lib/kf5/bin:/usr/src/bin:/bin:/usr/bin:/usr/X11R6/bin:/usr/games
+ PATH=/usr/lib/kf5/bin:/usr/src/bin:/bin:/usr/bin:/usr/X11R6/bin:/usr/games
+ export QTDIR=/usr/share/qt5
+ QTDIR=/usr/share/qt5
+ export 'CFLAGS=-pipe -frecord-gcc-switches -Wall -g -O2 -flto=auto -march=i586 -mtune=generic'
+ CFLAGS='-pipe -frecord-gcc-switches -Wall -g -O2 -flto=auto -march=i586 -mtune=generic'
+ export 'CXXFLAGS=-pipe -frecord-gcc-switches -Wall -g -O2 -flto=auto -march=i586 -mtune=generic'
+ CXXFLAGS='-pipe -frecord-gcc-switches -Wall -g -O2 -flto=auto -march=i586 -mtune=generic'
+ pushd BUILD
~/RPM/BUILD/kidletime-5.94.0/BUILD ~/RPM/BUILD/kidletime-5.94.0
+ cmake .. -DCMAKE_USE_RELATIVE_PATHS:BOOL=ON -DCMAKE_VERBOSE_MAKEFILE:BOOL=ON -DCMAKE_SKIP_RPATH:BOOL=ON -DBUILD_TESTING:BOOL=FALSE -DKDE_INSTALL_USE_QT_SYS_PATHS:BOOL=ON -DCMAKE_BUILD_TYPE=Release '-DCMAKE_EXE_LINKER_FLAGS:STRING=-L/usr/lib -L/usr/lib/kf5/devel' '-DCMAKE_MODULE_LINKER_FLAGS:STRING=-L/usr/lib -L/usr/lib/kf5/devel' '-DCMAKE_SHARED_LINKER_FLAGS:STRING=-L/usr/lib -L/usr/lib/kf5/devel' '-DCMAKE_LIBRARY_PATH=/usr/lib/kf5/devel;/usr/lib;/lib' '-DCMAKE_INCLUDE_PATH=/usr/include/KF5;/usr/include' -DCMAKE_INSTALL_PREFIX=/usr -DCMAKE_PREFIX_PATH=/usr -DCMAKE_INSTALL_BINDIR=/usr/lib/kf5/bin -DCMAKE_INSTALL_FULL_BINDIR=/usr/lib/kf5/bin -DBIN_INSTALL_DIR:PATH=/usr/lib/kf5/bin -DCMAKE_INSTALL_SBINDIR=/usr/lib/kf5/sbin -DCMAKE_INSTALL_FULL_SBINDIR=/usr/lib/kf5/sbin -DSBIN_INSTALL_DIR:PATH=/usr/lib/kf5/sbin -DLIBEXEC_INSTALL_DIR:PATH=/usr/libexec -DINCLUDE_INSTALL_DIR:PATH=/usr/include -DCMAKE_INSTALL_INCLUDEDIR_KF5=/usr/include/KF5 -DDATA_INSTALL_DIR:PATH=/usr/share -DCONFIG_INSTALL_DIR:PATH=/etc/kf5/xdg -DSERVICES_INSTALL_DIR:PATH=/usr/share/kservices5 -DSERVICETYPES_INSTALL_DIR:PATH=/usr/share/kservicetypes5 -DKNOTIFYRC_INSTALL_DIR:PATH=/usr/share/knotifications5 -DKXMLGUI_INSTALL_DIR:PATH=/usr/share/kxmlgui5 -DLIB_INSTALL_DIR:PATH=/usr/lib -DLIB_DESTINATION=lib -DLIB_SUFFIX= -DSYSCONF_INSTALL_DIR:PATH=/etc -DAUTOSTART_INSTALL_DIR=/etc/kf5/xdg/autostart -DHTML_INSTALL_DIR=/usr/share/kf5/doc/HTML -DICON_INSTALL_DIR=/usr/share/kf5/icons -DXDG_MIME_INSTALL_DIR=/usr/share/mime/packages -DXDG_APPS_INSTALL_DIR=/usr/share/kf5/applications/kf5 -DECM_MKSPECS_INSTALL_DIR:PATH=/usr/lib/qt5/mkspecs/modules -DKCFG_INSTALL_DIR:PATH=/usr/share/kf5/config.kcfg -DPLUGIN_INSTALL_DIR:PATH=/usr/lib/qt5/plugins -DQT_PLUGIN_INSTALL_DIR:PATH=/usr/lib/qt5/plugins -DQML_INSTALL_DIR:PATH=/usr/lib/qt5/qml -DIMPORTS_INSTALL_DIR:PATH=/usr/lib/qt5/imports -DDBUS_INTERFACES_INSTALL_DIR=/usr/share/kf5/dbus-1/interfaces -DDBUS_SERVICES_INSTALL_DIR=/usr/share/kf5/dbus-1/services -DDBUS_SYSTEM_SERVICES_INSTALL_DIR=/lib/dbus-1/system-services
-- The C compiler identification is GNU 12.1.1
-- The CXX compiler identification is GNU 12.1.1
-- Detecting C compiler ABI info
-- Detecting C compiler ABI info - done
-- Check for working C compiler: /usr/bin/cc - skipped
-- Detecting C compile features
-- Detecting C compile features - done
-- Detecting CXX compiler ABI info
-- Detecting CXX compiler ABI info - done
-- Check for working CXX compiler: /usr/bin/c++ - skipped
-- Detecting CXX compile features
-- Detecting CXX compile features - done
--
CMake Deprecation Warning at /usr/share/ECM/kde-modules/KDEInstallDirsCommon.cmake:133 (message):
BIN_INSTALL_DIR is deprecated, use KDE_INSTALL_BINDIR instead.
Call Stack (most recent call first):
/usr/share/ECM/kde-modules/KDEInstallDirsCommon.cmake:234 (_define_relative)
/usr/share/ECM/kde-modules/KDEInstallDirs5.cmake:223 (include)
/usr/share/ECM/kde-modules/KDEInstallDirs.cmake:15 (include)
CMakeLists.txt:29 (include)
CMake Deprecation Warning at /usr/share/ECM/kde-modules/KDEInstallDirsCommon.cmake:133 (message):
SBIN_INSTALL_DIR is deprecated, use KDE_INSTALL_SBINDIR instead.
Call Stack (most recent call first):
/usr/share/ECM/kde-modules/KDEInstallDirsCommon.cmake:237 (_define_relative)
/usr/share/ECM/kde-modules/KDEInstallDirs5.cmake:223 (include)
/usr/share/ECM/kde-modules/KDEInstallDirs.cmake:15 (include)
CMakeLists.txt:29 (include)
CMake Deprecation Warning at /usr/share/ECM/kde-modules/KDEInstallDirsCommon.cmake:133 (message):
LIB_INSTALL_DIR is deprecated, use KDE_INSTALL_LIBDIR instead.
Call Stack (most recent call first):
/usr/share/ECM/kde-modules/KDEInstallDirsCommon.cmake:240 (_define_relative)
/usr/share/ECM/kde-modules/KDEInstallDirs5.cmake:223 (include)
/usr/share/ECM/kde-modules/KDEInstallDirs.cmake:15 (include)
CMakeLists.txt:29 (include)
CMake Deprecation Warning at /usr/share/ECM/kde-modules/KDEInstallDirsCommon.cmake:133 (message):
LIBEXEC_INSTALL_DIR is deprecated, use KDE_INSTALL_LIBEXECDIR instead.
Call Stack (most recent call first):
/usr/share/ECM/kde-modules/KDEInstallDirsCommon.cmake:249 (_define_relative)
/usr/share/ECM/kde-modules/KDEInstallDirs5.cmake:223 (include)
/usr/share/ECM/kde-modules/KDEInstallDirs.cmake:15 (include)
CMakeLists.txt:29 (include)
CMake Deprecation Warning at /usr/share/ECM/kde-modules/KDEInstallDirsCommon.cmake:133 (message):
INCLUDE_INSTALL_DIR is deprecated, use KDE_INSTALL_INCLUDEDIR instead.
Call Stack (most recent call first):
/usr/share/ECM/kde-modules/KDEInstallDirsCommon.cmake:198 (_define_relative)
/usr/share/ECM/kde-modules/KDEInstallDirsCommon.cmake:258 (_define_absolute)
/usr/share/ECM/kde-modules/KDEInstallDirs5.cmake:223 (include)
/usr/share/ECM/kde-modules/KDEInstallDirs.cmake:15 (include)
CMakeLists.txt:29 (include)
CMake Deprecation Warning at /usr/share/ECM/kde-modules/KDEInstallDirsCommon.cmake:133 (message):
DATA_INSTALL_DIR is deprecated, use KDE_INSTALL_DATADIR instead.
Call Stack (most recent call first):
/usr/share/ECM/kde-modules/KDEInstallDirsCommon.cmake:278 (_define_relative)
/usr/share/ECM/kde-modules/KDEInstallDirs5.cmake:223 (include)
/usr/share/ECM/kde-modules/KDEInstallDirs.cmake:15 (include)
CMakeLists.txt:29 (include)
CMake Deprecation Warning at /usr/share/ECM/kde-modules/KDEInstallDirsCommon.cmake:133 (message):
HTML_INSTALL_DIR is deprecated, use KDE_INSTALL_DOCBUNDLEDIR instead.
Call Stack (most recent call first):
/usr/share/ECM/kde-modules/KDEInstallDirsCommon.cmake:283 (_define_relative)
/usr/share/ECM/kde-modules/KDEInstallDirs5.cmake:223 (include)
/usr/share/ECM/kde-modules/KDEInstallDirs.cmake:15 (include)
CMakeLists.txt:29 (include)
CMake Deprecation Warning at /usr/share/ECM/kde-modules/KDEInstallDirsCommon.cmake:133 (message):
KCFG_INSTALL_DIR is deprecated, use KDE_INSTALL_KCFGDIR instead.
Call Stack (most recent call first):
/usr/share/ECM/kde-modules/KDEInstallDirsCommon.cmake:286 (_define_relative)
/usr/share/ECM/kde-modules/KDEInstallDirs5.cmake:223 (include)
/usr/share/ECM/kde-modules/KDEInstallDirs.cmake:15 (include)
CMakeLists.txt:29 (include)
CMake Deprecation Warning at /usr/share/ECM/kde-modules/KDEInstallDirsCommon.cmake:133 (message):
ICON_INSTALL_DIR is deprecated, use KDE_INSTALL_ICONDIR instead.
Call Stack (most recent call first):
/usr/share/ECM/kde-modules/KDEInstallDirsCommon.cmake:303 (_define_relative)
/usr/share/ECM/kde-modules/KDEInstallDirs5.cmake:223 (include)
/usr/share/ECM/kde-modules/KDEInstallDirs.cmake:15 (include)
CMakeLists.txt:29 (include)
CMake Deprecation Warning at /usr/share/ECM/kde-modules/KDEInstallDirsCommon.cmake:133 (message):
XDG_APPS_INSTALL_DIR is deprecated, use KDE_INSTALL_APPDIR instead.
Call Stack (most recent call first):
/usr/share/ECM/kde-modules/KDEInstallDirsCommon.cmake:318 (_define_relative)
/usr/share/ECM/kde-modules/KDEInstallDirs5.cmake:223 (include)
/usr/share/ECM/kde-modules/KDEInstallDirs.cmake:15 (include)
CMakeLists.txt:29 (include)
CMake Deprecation Warning at /usr/share/ECM/kde-modules/KDEInstallDirsCommon.cmake:133 (message):
XDG_MIME_INSTALL_DIR is deprecated, use KDE_INSTALL_MIMEDIR instead.
Call Stack (most recent call first):
/usr/share/ECM/kde-modules/KDEInstallDirsCommon.cmake:324 (_define_relative)
/usr/share/ECM/kde-modules/KDEInstallDirs5.cmake:223 (include)
/usr/share/ECM/kde-modules/KDEInstallDirs.cmake:15 (include)
CMakeLists.txt:29 (include)
CMake Deprecation Warning at /usr/share/ECM/kde-modules/KDEInstallDirsCommon.cmake:133 (message):
DBUS_INTERFACES_INSTALL_DIR is deprecated, use KDE_INSTALL_DBUSINTERFACEDIR
instead.
Call Stack (most recent call first):
/usr/share/ECM/kde-modules/KDEInstallDirsCommon.cmake:338 (_define_relative)
/usr/share/ECM/kde-modules/KDEInstallDirs5.cmake:223 (include)
/usr/share/ECM/kde-modules/KDEInstallDirs.cmake:15 (include)
CMakeLists.txt:29 (include)
CMake Deprecation Warning at /usr/share/ECM/kde-modules/KDEInstallDirsCommon.cmake:133 (message):
DBUS_SERVICES_INSTALL_DIR is deprecated, use KDE_INSTALL_DBUSSERVICEDIR
instead.
Call Stack (most recent call first):
/usr/share/ECM/kde-modules/KDEInstallDirsCommon.cmake:341 (_define_relative)
/usr/share/ECM/kde-modules/KDEInstallDirs5.cmake:223 (include)
/usr/share/ECM/kde-modules/KDEInstallDirs.cmake:15 (include)
CMakeLists.txt:29 (include)
CMake Deprecation Warning at /usr/share/ECM/kde-modules/KDEInstallDirsCommon.cmake:133 (message):
DBUS_SYSTEM_SERVICES_INSTALL_DIR is deprecated, use
KDE_INSTALL_DBUSSYSTEMSERVICEDIR instead.
Call Stack (most recent call first):
/usr/share/ECM/kde-modules/KDEInstallDirsCommon.cmake:344 (_define_relative)
/usr/share/ECM/kde-modules/KDEInstallDirs5.cmake:223 (include)
/usr/share/ECM/kde-modules/KDEInstallDirs.cmake:15 (include)
CMakeLists.txt:29 (include)
CMake Deprecation Warning at /usr/share/ECM/kde-modules/KDEInstallDirsCommon.cmake:133 (message):
SYSCONF_INSTALL_DIR is deprecated, use KDE_INSTALL_SYSCONFDIR instead.
Call Stack (most recent call first):
/usr/share/ECM/kde-modules/KDEInstallDirsCommon.cmake:198 (_define_relative)
/usr/share/ECM/kde-modules/KDEInstallDirsCommon.cmake:360 (_define_absolute)
/usr/share/ECM/kde-modules/KDEInstallDirs5.cmake:223 (include)
/usr/share/ECM/kde-modules/KDEInstallDirs.cmake:15 (include)
CMakeLists.txt:29 (include)
CMake Deprecation Warning at /usr/share/ECM/kde-modules/KDEInstallDirsCommon.cmake:133 (message):
CONFIG_INSTALL_DIR is deprecated, use KDE_INSTALL_CONFDIR instead.
Call Stack (most recent call first):
/usr/share/ECM/kde-modules/KDEInstallDirsCommon.cmake:363 (_define_relative)
/usr/share/ECM/kde-modules/KDEInstallDirs5.cmake:223 (include)
/usr/share/ECM/kde-modules/KDEInstallDirs.cmake:15 (include)
CMakeLists.txt:29 (include)
CMake Deprecation Warning at /usr/share/ECM/kde-modules/KDEInstallDirsCommon.cmake:133 (message):
AUTOSTART_INSTALL_DIR is deprecated, use KDE_INSTALL_AUTOSTARTDIR instead.
Call Stack (most recent call first):
/usr/share/ECM/kde-modules/KDEInstallDirsCommon.cmake:366 (_define_relative)
/usr/share/ECM/kde-modules/KDEInstallDirs5.cmake:223 (include)
/usr/share/ECM/kde-modules/KDEInstallDirs.cmake:15 (include)
CMakeLists.txt:29 (include)
CMake Deprecation Warning at /usr/share/ECM/kde-modules/KDEInstallDirsCommon.cmake:133 (message):
QT_PLUGIN_INSTALL_DIR is deprecated, use KDE_INSTALL_QTPLUGINDIR instead.
Call Stack (most recent call first):
/usr/share/ECM/kde-modules/KDEInstallDirsCommon.cmake:198 (_define_relative)
/usr/share/ECM/kde-modules/KDEInstallDirs5.cmake:254 (_define_absolute)
/usr/share/ECM/kde-modules/KDEInstallDirs.cmake:15 (include)
CMakeLists.txt:29 (include)
CMake Deprecation Warning at /usr/share/ECM/kde-modules/KDEInstallDirsCommon.cmake:133 (message):
IMPORTS_INSTALL_DIR is deprecated, use KDE_INSTALL_QTQUICKIMPORTSDIR
instead.
Call Stack (most recent call first):
/usr/share/ECM/kde-modules/KDEInstallDirsCommon.cmake:198 (_define_relative)
/usr/share/ECM/kde-modules/KDEInstallDirs5.cmake:263 (_define_absolute)
/usr/share/ECM/kde-modules/KDEInstallDirs.cmake:15 (include)
CMakeLists.txt:29 (include)
CMake Deprecation Warning at /usr/share/ECM/kde-modules/KDEInstallDirsCommon.cmake:133 (message):
QML_INSTALL_DIR is deprecated, use KDE_INSTALL_QMLDIR instead.
Call Stack (most recent call first):
/usr/share/ECM/kde-modules/KDEInstallDirsCommon.cmake:198 (_define_relative)
/usr/share/ECM/kde-modules/KDEInstallDirs5.cmake:272 (_define_absolute)
/usr/share/ECM/kde-modules/KDEInstallDirs.cmake:15 (include)
CMakeLists.txt:29 (include)
CMake Deprecation Warning at /usr/share/ECM/kde-modules/KDEInstallDirsCommon.cmake:133 (message):
PLUGIN_INSTALL_DIR is deprecated, use KDE_INSTALL_PLUGINDIR instead.
Call Stack (most recent call first):
/usr/share/ECM/kde-modules/KDEInstallDirs5.cmake:294 (_define_relative)
/usr/share/ECM/kde-modules/KDEInstallDirs.cmake:15 (include)
CMakeLists.txt:29 (include)
CMake Deprecation Warning at /usr/share/ECM/kde-modules/KDEInstallDirsCommon.cmake:133 (message):
SERVICES_INSTALL_DIR is deprecated, use KDE_INSTALL_KSERVICES5DIR instead.
Call Stack (most recent call first):
/usr/share/ECM/kde-modules/KDEInstallDirs5.cmake:322 (_define_relative)
/usr/share/ECM/kde-modules/KDEInstallDirs.cmake:15 (include)
CMakeLists.txt:29 (include)
CMake Deprecation Warning at /usr/share/ECM/kde-modules/KDEInstallDirsCommon.cmake:133 (message):
SERVICETYPES_INSTALL_DIR is deprecated, use KDE_INSTALL_KSERVICETYPES5DIR
instead.
Call Stack (most recent call first):
/usr/share/ECM/kde-modules/KDEInstallDirs5.cmake:325 (_define_relative)
/usr/share/ECM/kde-modules/KDEInstallDirs.cmake:15 (include)
CMakeLists.txt:29 (include)
CMake Deprecation Warning at /usr/share/ECM/kde-modules/KDEInstallDirsCommon.cmake:133 (message):
KNOTIFYRC_INSTALL_DIR is deprecated, use KDE_INSTALL_KNOTIFY5RCDIR instead.
Call Stack (most recent call first):
/usr/share/ECM/kde-modules/KDEInstallDirs5.cmake:328 (_define_relative)
/usr/share/ECM/kde-modules/KDEInstallDirs.cmake:15 (include)
CMakeLists.txt:29 (include)
CMake Deprecation Warning at /usr/share/ECM/kde-modules/KDEInstallDirsCommon.cmake:133 (message):
KXMLGUI_INSTALL_DIR is deprecated, use KDE_INSTALL_KXMLGUI5DIR instead.
Call Stack (most recent call first):
/usr/share/ECM/kde-modules/KDEInstallDirs5.cmake:331 (_define_relative)
/usr/share/ECM/kde-modules/KDEInstallDirs.cmake:15 (include)
CMakeLists.txt:29 (include)
-- Looking for __GLIBC__
-- Looking for __GLIBC__ - found
-- Performing Test _OFFT_IS_64BIT
-- Performing Test _OFFT_IS_64BIT - Failed
-- Performing Test HAVE_DATE_TIME
-- Performing Test HAVE_DATE_TIME - Success
-- Performing Test BSYMBOLICFUNCTIONS_AVAILABLE
-- Performing Test BSYMBOLICFUNCTIONS_AVAILABLE - Success
Package zlib was not found in the pkg-config search path.
Perhaps you should add the directory containing `zlib.pc'
to the PKG_CONFIG_PATH environment variable
Package 'zlib', required by 'freetype2', not found
Package zlib was not found in the pkg-config search path.
Perhaps you should add the directory containing `zlib.pc'
to the PKG_CONFIG_PATH environment variable
Package 'zlib', required by 'freetype2', not found
Package zlib was not found in the pkg-config search path.
Perhaps you should add the directory containing `zlib.pc'
to the PKG_CONFIG_PATH environment variable
Package 'zlib', required by 'freetype2', not found
Package zlib was not found in the pkg-config search path.
Perhaps you should add the directory containing `zlib.pc'
to the PKG_CONFIG_PATH environment variable
Package 'zlib', required by 'freetype2', not found
-- Found X11: /usr/include
-- Looking for XOpenDisplay in /usr/lib/libX11.so;/usr/lib/libXext.so
-- Looking for XOpenDisplay in /usr/lib/libX11.so;/usr/lib/libXext.so - found
-- Looking for gethostbyname
-- Looking for gethostbyname - found
-- Looking for connect
-- Looking for connect - found
-- Looking for remove
-- Looking for remove - found
-- Looking for shmat
-- Looking for shmat - found
-- Looking for IceConnectionNumber in ICE
-- Looking for IceConnectionNumber in ICE - found
-- Found XCB_XCB: /usr/lib/libxcb.so (found version "1.15")
-- Found XCB: /usr/lib/libxcb.so (found version "1.15") found components: XCB
-- Found XCB_SYNC: /usr/lib/libxcb-sync.so (found version "1.15")
-- Found XCB: /usr/lib/libxcb.so;/usr/lib/libxcb-sync.so (found version "1.15") found components: XCB SYNC
-- Found X11_XCB: /usr/lib/libX11-xcb.so (found version "1.8")
-- Performing Test COMPILER_HAS_HIDDEN_VISIBILITY
-- Performing Test COMPILER_HAS_HIDDEN_VISIBILITY - Success
-- Performing Test COMPILER_HAS_HIDDEN_INLINE_VISIBILITY
-- Performing Test COMPILER_HAS_HIDDEN_INLINE_VISIBILITY - Success
-- Performing Test COMPILER_HAS_DEPRECATED_ATTR
-- Performing Test COMPILER_HAS_DEPRECATED_ATTR - Success
-- The following features have been enabled:
* libXext, required for X-Sync based poller
* libX11-xcb, required for X-Sync based poller
* libxcb, required for X-Sync based poller
* libxcb-sync, required for X-Sync based poller
* X-Sync based poller, efficient operation of KIdleTime. STRONGLY RECOMMENDED (requires libXext, libX11-xcb, libxcb and libxcb-sync)
* X-Screensaver based poller, KIdleTime fallback mode (libXss)
-- The following OPTIONAL packages have been found:
* X11
* XCB, X protocol C-language Binding,
* X11_XCB, A compatibility library for code that translates Xlib API calls into XCB calls,
-- The following REQUIRED packages have been found:
* ECM (required version >= 5.93.0), Extra CMake Modules.,
* Qt5Gui
* Qt5X11Extras
* Qt5DBus
* Qt5 (required version >= 5.15.2)
-- The following features have been disabled:
* QCH, API documentation in QCH format (for e.g. Qt Assistant, Qt Creator & KDevelop)
-- Configuring done
-- Generating done
CMake Warning:
Manually-specified variables were not used by the project:
CMAKE_USE_RELATIVE_PATHS
LIB_DESTINATION
LIB_SUFFIX
-- Build files have been written to: /usr/src/RPM/BUILD/kidletime-5.94.0/BUILD
+ popd
~/RPM/BUILD/kidletime-5.94.0
+ __kf5_make
+ pushd BUILD
~/RPM/BUILD/kidletime-5.94.0/BUILD ~/RPM/BUILD/kidletime-5.94.0
+ make -j16
make: Entering directory '/usr/src/RPM/BUILD/kidletime-5.94.0/BUILD'
/usr/bin/cmake -S/usr/src/RPM/BUILD/kidletime-5.94.0 -B/usr/src/RPM/BUILD/kidletime-5.94.0/BUILD --check-build-system CMakeFiles/Makefile.cmake 0
make: Leaving directory '/usr/src/RPM/BUILD/kidletime-5.94.0/BUILD'
make: Entering directory '/usr/src/RPM/BUILD/kidletime-5.94.0/BUILD'
/usr/bin/cmake -E cmake_progress_start /usr/src/RPM/BUILD/kidletime-5.94.0/BUILD/CMakeFiles /usr/src/RPM/BUILD/kidletime-5.94.0/BUILD//CMakeFiles/progress.marks
make: Leaving directory '/usr/src/RPM/BUILD/kidletime-5.94.0/BUILD'
make -f CMakeFiles/Makefile2 all
make -f src/CMakeFiles/KF5IdleTime_autogen.dir/build.make src/CMakeFiles/KF5IdleTime_autogen.dir/depend
make[2]: Entering directory '/usr/src/RPM/BUILD/kidletime-5.94.0/BUILD'
cd /usr/src/RPM/BUILD/kidletime-5.94.0/BUILD && /usr/bin/cmake -E cmake_depends "Unix Makefiles" /usr/src/RPM/BUILD/kidletime-5.94.0 /usr/src/RPM/BUILD/kidletime-5.94.0/src /usr/src/RPM/BUILD/kidletime-5.94.0/BUILD /usr/src/RPM/BUILD/kidletime-5.94.0/BUILD/src /usr/src/RPM/BUILD/kidletime-5.94.0/BUILD/src/CMakeFiles/KF5IdleTime_autogen.dir/DependInfo.cmake --color=
make[2]: Leaving directory '/usr/src/RPM/BUILD/kidletime-5.94.0/BUILD'
make -f src/CMakeFiles/KF5IdleTime_autogen.dir/build.make src/CMakeFiles/KF5IdleTime_autogen.dir/build
make[2]: Entering directory '/usr/src/RPM/BUILD/kidletime-5.94.0/BUILD'
[ 4%] Automatic MOC for target KF5IdleTime
cd /usr/src/RPM/BUILD/kidletime-5.94.0/BUILD/src && /usr/bin/cmake -E cmake_autogen /usr/src/RPM/BUILD/kidletime-5.94.0/BUILD/src/CMakeFiles/KF5IdleTime_autogen.dir/AutogenInfo.json Release
make[2]: Leaving directory '/usr/src/RPM/BUILD/kidletime-5.94.0/BUILD'
make[1]: Entering directory '/usr/src/RPM/BUILD/kidletime-5.94.0/BUILD'
[ 4%] Built target KF5IdleTime_autogen
make[1]: Leaving directory '/usr/src/RPM/BUILD/kidletime-5.94.0/BUILD'
make -f src/CMakeFiles/KF5IdleTime.dir/build.make src/CMakeFiles/KF5IdleTime.dir/depend
make[2]: Entering directory '/usr/src/RPM/BUILD/kidletime-5.94.0/BUILD'
cd /usr/src/RPM/BUILD/kidletime-5.94.0/BUILD && /usr/bin/cmake -E cmake_depends "Unix Makefiles" /usr/src/RPM/BUILD/kidletime-5.94.0 /usr/src/RPM/BUILD/kidletime-5.94.0/src /usr/src/RPM/BUILD/kidletime-5.94.0/BUILD /usr/src/RPM/BUILD/kidletime-5.94.0/BUILD/src /usr/src/RPM/BUILD/kidletime-5.94.0/BUILD/src/CMakeFiles/KF5IdleTime.dir/DependInfo.cmake --color=
make[2]: Leaving directory '/usr/src/RPM/BUILD/kidletime-5.94.0/BUILD'
make -f src/CMakeFiles/KF5IdleTime.dir/build.make src/CMakeFiles/KF5IdleTime.dir/build
make[2]: Entering directory '/usr/src/RPM/BUILD/kidletime-5.94.0/BUILD'
[ 12%] Building CXX object src/CMakeFiles/KF5IdleTime.dir/abstractsystempoller.cpp.o
cd /usr/src/RPM/BUILD/kidletime-5.94.0/BUILD/src && /usr/bin/c++ -DKF5IdleTime_EXPORTS -DKF_DEPRECATED_WARNINGS_SINCE=0x060000 -DKF_DISABLE_DEPRECATED_BEFORE_AND_AT=0x055900 -DKIDLETIME_DEPRECATED_WARNINGS_SINCE=0x0 -DKIDLETIME_DISABLE_DEPRECATED_BEFORE_AND_AT=0x0 -DQT_CORE_LIB -DQT_DEPRECATED_WARNINGS_SINCE=0x060000 -DQT_DISABLE_DEPRECATED_BEFORE=0x050f02 -DQT_GUI_LIB -DQT_NO_CAST_FROM_ASCII -DQT_NO_CAST_FROM_BYTEARRAY -DQT_NO_CAST_TO_ASCII -DQT_NO_DEBUG -DQT_NO_FOREACH -DQT_NO_KEYWORDS -DQT_NO_NARROWING_CONVERSIONS_IN_CONNECT -DQT_NO_URL_CAST_FROM_STRING -DQT_STRICT_ITERATORS -DQT_USE_QSTRINGBUILDER -D_FILE_OFFSET_BITS=64 -D_GNU_SOURCE -D_LARGEFILE64_SOURCE -I/usr/src/RPM/BUILD/kidletime-5.94.0/BUILD/src -I/usr/src/RPM/BUILD/kidletime-5.94.0/src -I/usr/src/RPM/BUILD/kidletime-5.94.0/BUILD/src/KF5IdleTime_autogen/include -isystem /usr/include/qt5 -isystem /usr/include/qt5/QtCore -isystem /usr/share/qt5/../../lib/qt5/mkspecs/linux-g++ -isystem /usr/include/qt5/QtGui -pipe -frecord-gcc-switches -Wall -g -O2 -flto=auto -march=i586 -mtune=generic -fno-operator-names -fno-exceptions -Wall -Wextra -Wcast-align -Wchar-subscripts -Wformat-security -Wno-long-long -Wpointer-arith -Wundef -Wnon-virtual-dtor -Woverloaded-virtual -Werror=return-type -Werror=init-self -Wvla -Wdate-time -Wsuggest-override -Wlogical-op -pedantic -Wzero-as-null-pointer-constant -Wmissing-include-dirs -O2 -DNDEBUG -fPIC -fvisibility=hidden -fvisibility-inlines-hidden -fPIC -std=c++17 -MD -MT src/CMakeFiles/KF5IdleTime.dir/abstractsystempoller.cpp.o -MF CMakeFiles/KF5IdleTime.dir/abstractsystempoller.cpp.o.d -o CMakeFiles/KF5IdleTime.dir/abstractsystempoller.cpp.o -c /usr/src/RPM/BUILD/kidletime-5.94.0/src/abstractsystempoller.cpp
make[2]: Leaving directory '/usr/src/RPM/BUILD/kidletime-5.94.0/BUILD'
make[2]: Entering directory '/usr/src/RPM/BUILD/kidletime-5.94.0/BUILD'
[ 8%] Building CXX object src/CMakeFiles/KF5IdleTime.dir/KF5IdleTime_autogen/mocs_compilation.cpp.o
cd /usr/src/RPM/BUILD/kidletime-5.94.0/BUILD/src && /usr/bin/c++ -DKF5IdleTime_EXPORTS -DKF_DEPRECATED_WARNINGS_SINCE=0x060000 -DKF_DISABLE_DEPRECATED_BEFORE_AND_AT=0x055900 -DKIDLETIME_DEPRECATED_WARNINGS_SINCE=0x0 -DKIDLETIME_DISABLE_DEPRECATED_BEFORE_AND_AT=0x0 -DQT_CORE_LIB -DQT_DEPRECATED_WARNINGS_SINCE=0x060000 -DQT_DISABLE_DEPRECATED_BEFORE=0x050f02 -DQT_GUI_LIB -DQT_NO_CAST_FROM_ASCII -DQT_NO_CAST_FROM_BYTEARRAY -DQT_NO_CAST_TO_ASCII -DQT_NO_DEBUG -DQT_NO_FOREACH -DQT_NO_KEYWORDS -DQT_NO_NARROWING_CONVERSIONS_IN_CONNECT -DQT_NO_URL_CAST_FROM_STRING -DQT_STRICT_ITERATORS -DQT_USE_QSTRINGBUILDER -D_FILE_OFFSET_BITS=64 -D_GNU_SOURCE -D_LARGEFILE64_SOURCE -I/usr/src/RPM/BUILD/kidletime-5.94.0/BUILD/src -I/usr/src/RPM/BUILD/kidletime-5.94.0/src -I/usr/src/RPM/BUILD/kidletime-5.94.0/BUILD/src/KF5IdleTime_autogen/include -isystem /usr/include/qt5 -isystem /usr/include/qt5/QtCore -isystem /usr/share/qt5/../../lib/qt5/mkspecs/linux-g++ -isystem /usr/include/qt5/QtGui -pipe -frecord-gcc-switches -Wall -g -O2 -flto=auto -march=i586 -mtune=generic -fno-operator-names -fno-exceptions -Wall -Wextra -Wcast-align -Wchar-subscripts -Wformat-security -Wno-long-long -Wpointer-arith -Wundef -Wnon-virtual-dtor -Woverloaded-virtual -Werror=return-type -Werror=init-self -Wvla -Wdate-time -Wsuggest-override -Wlogical-op -pedantic -Wzero-as-null-pointer-constant -Wmissing-include-dirs -O2 -DNDEBUG -fPIC -fvisibility=hidden -fvisibility-inlines-hidden -fPIC -std=c++17 -MD -MT src/CMakeFiles/KF5IdleTime.dir/KF5IdleTime_autogen/mocs_compilation.cpp.o -MF CMakeFiles/KF5IdleTime.dir/KF5IdleTime_autogen/mocs_compilation.cpp.o.d -o CMakeFiles/KF5IdleTime.dir/KF5IdleTime_autogen/mocs_compilation.cpp.o -c /usr/src/RPM/BUILD/kidletime-5.94.0/BUILD/src/KF5IdleTime_autogen/mocs_compilation.cpp
make[2]: Leaving directory '/usr/src/RPM/BUILD/kidletime-5.94.0/BUILD'
make[2]: Entering directory '/usr/src/RPM/BUILD/kidletime-5.94.0/BUILD'
[ 24%] Building CXX object src/CMakeFiles/KF5IdleTime.dir/logging.cpp.o
cd /usr/src/RPM/BUILD/kidletime-5.94.0/BUILD/src && /usr/bin/c++ -DKF5IdleTime_EXPORTS -DKF_DEPRECATED_WARNINGS_SINCE=0x060000 -DKF_DISABLE_DEPRECATED_BEFORE_AND_AT=0x055900 -DKIDLETIME_DEPRECATED_WARNINGS_SINCE=0x0 -DKIDLETIME_DISABLE_DEPRECATED_BEFORE_AND_AT=0x0 -DQT_CORE_LIB -DQT_DEPRECATED_WARNINGS_SINCE=0x060000 -DQT_DISABLE_DEPRECATED_BEFORE=0x050f02 -DQT_GUI_LIB -DQT_NO_CAST_FROM_ASCII -DQT_NO_CAST_FROM_BYTEARRAY -DQT_NO_CAST_TO_ASCII -DQT_NO_DEBUG -DQT_NO_FOREACH -DQT_NO_KEYWORDS -DQT_NO_NARROWING_CONVERSIONS_IN_CONNECT -DQT_NO_URL_CAST_FROM_STRING -DQT_STRICT_ITERATORS -DQT_USE_QSTRINGBUILDER -D_FILE_OFFSET_BITS=64 -D_GNU_SOURCE -D_LARGEFILE64_SOURCE -I/usr/src/RPM/BUILD/kidletime-5.94.0/BUILD/src -I/usr/src/RPM/BUILD/kidletime-5.94.0/src -I/usr/src/RPM/BUILD/kidletime-5.94.0/BUILD/src/KF5IdleTime_autogen/include -isystem /usr/include/qt5 -isystem /usr/include/qt5/QtCore -isystem /usr/share/qt5/../../lib/qt5/mkspecs/linux-g++ -isystem /usr/include/qt5/QtGui -pipe -frecord-gcc-switches -Wall -g -O2 -flto=auto -march=i586 -mtune=generic -fno-operator-names -fno-exceptions -Wall -Wextra -Wcast-align -Wchar-subscripts -Wformat-security -Wno-long-long -Wpointer-arith -Wundef -Wnon-virtual-dtor -Woverloaded-virtual -Werror=return-type -Werror=init-self -Wvla -Wdate-time -Wsuggest-override -Wlogical-op -pedantic -Wzero-as-null-pointer-constant -Wmissing-include-dirs -O2 -DNDEBUG -fPIC -fvisibility=hidden -fvisibility-inlines-hidden -fPIC -std=c++17 -MD -MT src/CMakeFiles/KF5IdleTime.dir/logging.cpp.o -MF CMakeFiles/KF5IdleTime.dir/logging.cpp.o.d -o CMakeFiles/KF5IdleTime.dir/logging.cpp.o -c /usr/src/RPM/BUILD/kidletime-5.94.0/BUILD/src/logging.cpp
make[2]: Leaving directory '/usr/src/RPM/BUILD/kidletime-5.94.0/BUILD'
make[2]: Entering directory '/usr/src/RPM/BUILD/kidletime-5.94.0/BUILD'
[ 24%] Building CXX object src/CMakeFiles/KF5IdleTime.dir/widgetbasedpoller.cpp.o
cd /usr/src/RPM/BUILD/kidletime-5.94.0/BUILD/src && /usr/bin/c++ -DKF5IdleTime_EXPORTS -DKF_DEPRECATED_WARNINGS_SINCE=0x060000 -DKF_DISABLE_DEPRECATED_BEFORE_AND_AT=0x055900 -DKIDLETIME_DEPRECATED_WARNINGS_SINCE=0x0 -DKIDLETIME_DISABLE_DEPRECATED_BEFORE_AND_AT=0x0 -DQT_CORE_LIB -DQT_DEPRECATED_WARNINGS_SINCE=0x060000 -DQT_DISABLE_DEPRECATED_BEFORE=0x050f02 -DQT_GUI_LIB -DQT_NO_CAST_FROM_ASCII -DQT_NO_CAST_FROM_BYTEARRAY -DQT_NO_CAST_TO_ASCII -DQT_NO_DEBUG -DQT_NO_FOREACH -DQT_NO_KEYWORDS -DQT_NO_NARROWING_CONVERSIONS_IN_CONNECT -DQT_NO_URL_CAST_FROM_STRING -DQT_STRICT_ITERATORS -DQT_USE_QSTRINGBUILDER -D_FILE_OFFSET_BITS=64 -D_GNU_SOURCE -D_LARGEFILE64_SOURCE -I/usr/src/RPM/BUILD/kidletime-5.94.0/BUILD/src -I/usr/src/RPM/BUILD/kidletime-5.94.0/src -I/usr/src/RPM/BUILD/kidletime-5.94.0/BUILD/src/KF5IdleTime_autogen/include -isystem /usr/include/qt5 -isystem /usr/include/qt5/QtCore -isystem /usr/share/qt5/../../lib/qt5/mkspecs/linux-g++ -isystem /usr/include/qt5/QtGui -pipe -frecord-gcc-switches -Wall -g -O2 -flto=auto -march=i586 -mtune=generic -fno-operator-names -fno-exceptions -Wall -Wextra -Wcast-align -Wchar-subscripts -Wformat-security -Wno-long-long -Wpointer-arith -Wundef -Wnon-virtual-dtor -Woverloaded-virtual -Werror=return-type -Werror=init-self -Wvla -Wdate-time -Wsuggest-override -Wlogical-op -pedantic -Wzero-as-null-pointer-constant -Wmissing-include-dirs -O2 -DNDEBUG -fPIC -fvisibility=hidden -fvisibility-inlines-hidden -fPIC -std=c++17 -MD -MT src/CMakeFiles/KF5IdleTime.dir/widgetbasedpoller.cpp.o -MF CMakeFiles/KF5IdleTime.dir/widgetbasedpoller.cpp.o.d -o CMakeFiles/KF5IdleTime.dir/widgetbasedpoller.cpp.o -c /usr/src/RPM/BUILD/kidletime-5.94.0/src/widgetbasedpoller.cpp
make[2]: Leaving directory '/usr/src/RPM/BUILD/kidletime-5.94.0/BUILD'
make[2]: Entering directory '/usr/src/RPM/BUILD/kidletime-5.94.0/BUILD'
[ 16%] Building CXX object src/CMakeFiles/KF5IdleTime.dir/kidletime.cpp.o
cd /usr/src/RPM/BUILD/kidletime-5.94.0/BUILD/src && /usr/bin/c++ -DKF5IdleTime_EXPORTS -DKF_DEPRECATED_WARNINGS_SINCE=0x060000 -DKF_DISABLE_DEPRECATED_BEFORE_AND_AT=0x055900 -DKIDLETIME_DEPRECATED_WARNINGS_SINCE=0x0 -DKIDLETIME_DISABLE_DEPRECATED_BEFORE_AND_AT=0x0 -DQT_CORE_LIB -DQT_DEPRECATED_WARNINGS_SINCE=0x060000 -DQT_DISABLE_DEPRECATED_BEFORE=0x050f02 -DQT_GUI_LIB -DQT_NO_CAST_FROM_ASCII -DQT_NO_CAST_FROM_BYTEARRAY -DQT_NO_CAST_TO_ASCII -DQT_NO_DEBUG -DQT_NO_FOREACH -DQT_NO_KEYWORDS -DQT_NO_NARROWING_CONVERSIONS_IN_CONNECT -DQT_NO_URL_CAST_FROM_STRING -DQT_STRICT_ITERATORS -DQT_USE_QSTRINGBUILDER -D_FILE_OFFSET_BITS=64 -D_GNU_SOURCE -D_LARGEFILE64_SOURCE -I/usr/src/RPM/BUILD/kidletime-5.94.0/BUILD/src -I/usr/src/RPM/BUILD/kidletime-5.94.0/src -I/usr/src/RPM/BUILD/kidletime-5.94.0/BUILD/src/KF5IdleTime_autogen/include -isystem /usr/include/qt5 -isystem /usr/include/qt5/QtCore -isystem /usr/share/qt5/../../lib/qt5/mkspecs/linux-g++ -isystem /usr/include/qt5/QtGui -pipe -frecord-gcc-switches -Wall -g -O2 -flto=auto -march=i586 -mtune=generic -fno-operator-names -fno-exceptions -Wall -Wextra -Wcast-align -Wchar-subscripts -Wformat-security -Wno-long-long -Wpointer-arith -Wundef -Wnon-virtual-dtor -Woverloaded-virtual -Werror=return-type -Werror=init-self -Wvla -Wdate-time -Wsuggest-override -Wlogical-op -pedantic -Wzero-as-null-pointer-constant -Wmissing-include-dirs -O2 -DNDEBUG -fPIC -fvisibility=hidden -fvisibility-inlines-hidden -fPIC -std=c++17 -MD -MT src/CMakeFiles/KF5IdleTime.dir/kidletime.cpp.o -MF CMakeFiles/KF5IdleTime.dir/kidletime.cpp.o.d -o CMakeFiles/KF5IdleTime.dir/kidletime.cpp.o -c /usr/src/RPM/BUILD/kidletime-5.94.0/src/kidletime.cpp
make[2]: Leaving directory '/usr/src/RPM/BUILD/kidletime-5.94.0/BUILD'
make[2]: Entering directory '/usr/src/RPM/BUILD/kidletime-5.94.0/BUILD'
[ 28%] Linking CXX shared library ../bin/libKF5IdleTime.so
cd /usr/src/RPM/BUILD/kidletime-5.94.0/BUILD/src && /usr/bin/cmake -E cmake_link_script CMakeFiles/KF5IdleTime.dir/link.txt --verbose=1
/usr/bin/c++ -fPIC -pipe -frecord-gcc-switches -Wall -g -O2 -flto=auto -march=i586 -mtune=generic -fno-operator-names -fno-exceptions -Wall -Wextra -Wcast-align -Wchar-subscripts -Wformat-security -Wno-long-long -Wpointer-arith -Wundef -Wnon-virtual-dtor -Woverloaded-virtual -Werror=return-type -Werror=init-self -Wvla -Wdate-time -Wsuggest-override -Wlogical-op -pedantic -Wzero-as-null-pointer-constant -Wmissing-include-dirs -O2 -DNDEBUG -Wl,--no-undefined -Wl,--fatal-warnings -Wl,--enable-new-dtags -L/usr/lib -L/usr/lib/kf5/devel -Wl,-Bsymbolic-functions -shared -Wl,-soname,libKF5IdleTime.so.5 -o ../bin/libKF5IdleTime.so.5.94.0 CMakeFiles/KF5IdleTime.dir/KF5IdleTime_autogen/mocs_compilation.cpp.o CMakeFiles/KF5IdleTime.dir/kidletime.cpp.o CMakeFiles/KF5IdleTime.dir/abstractsystempoller.cpp.o CMakeFiles/KF5IdleTime.dir/widgetbasedpoller.cpp.o CMakeFiles/KF5IdleTime.dir/logging.cpp.o /usr/lib/libQt5Gui.so.5.15.2 /usr/lib/libQt5Core.so.5.15.2
cd /usr/src/RPM/BUILD/kidletime-5.94.0/BUILD/src && /usr/bin/cmake -E cmake_symlink_library ../bin/libKF5IdleTime.so.5.94.0 ../bin/libKF5IdleTime.so.5 ../bin/libKF5IdleTime.so
make[2]: Leaving directory '/usr/src/RPM/BUILD/kidletime-5.94.0/BUILD'
make[1]: Entering directory '/usr/src/RPM/BUILD/kidletime-5.94.0/BUILD'
[ 28%] Built target KF5IdleTime
make[1]: Leaving directory '/usr/src/RPM/BUILD/kidletime-5.94.0/BUILD'
make -f src/plugins/xscreensaver/CMakeFiles/KF5IdleTimeXcbPlugin1_autogen.dir/build.make src/plugins/xscreensaver/CMakeFiles/KF5IdleTimeXcbPlugin1_autogen.dir/depend
make -f src/plugins/xsync/CMakeFiles/KF5IdleTimeXcbPlugin0_autogen.dir/build.make src/plugins/xsync/CMakeFiles/KF5IdleTimeXcbPlugin0_autogen.dir/depend
make -f examples/CMakeFiles/kidletime_example_autogen.dir/build.make examples/CMakeFiles/kidletime_example_autogen.dir/depend
make[2]: Entering directory '/usr/src/RPM/BUILD/kidletime-5.94.0/BUILD'
cd /usr/src/RPM/BUILD/kidletime-5.94.0/BUILD && /usr/bin/cmake -E cmake_depends "Unix Makefiles" /usr/src/RPM/BUILD/kidletime-5.94.0 /usr/src/RPM/BUILD/kidletime-5.94.0/src/plugins/xsync /usr/src/RPM/BUILD/kidletime-5.94.0/BUILD /usr/src/RPM/BUILD/kidletime-5.94.0/BUILD/src/plugins/xsync /usr/src/RPM/BUILD/kidletime-5.94.0/BUILD/src/plugins/xsync/CMakeFiles/KF5IdleTimeXcbPlugin0_autogen.dir/DependInfo.cmake --color=
make[2]: Leaving directory '/usr/src/RPM/BUILD/kidletime-5.94.0/BUILD'
make[2]: Entering directory '/usr/src/RPM/BUILD/kidletime-5.94.0/BUILD'
cd /usr/src/RPM/BUILD/kidletime-5.94.0/BUILD && /usr/bin/cmake -E cmake_depends "Unix Makefiles" /usr/src/RPM/BUILD/kidletime-5.94.0 /usr/src/RPM/BUILD/kidletime-5.94.0/src/plugins/xscreensaver /usr/src/RPM/BUILD/kidletime-5.94.0/BUILD /usr/src/RPM/BUILD/kidletime-5.94.0/BUILD/src/plugins/xscreensaver /usr/src/RPM/BUILD/kidletime-5.94.0/BUILD/src/plugins/xscreensaver/CMakeFiles/KF5IdleTimeXcbPlugin1_autogen.dir/DependInfo.cmake --color=
make[2]: Leaving directory '/usr/src/RPM/BUILD/kidletime-5.94.0/BUILD'
make -f src/plugins/xsync/CMakeFiles/KF5IdleTimeXcbPlugin0_autogen.dir/build.make src/plugins/xsync/CMakeFiles/KF5IdleTimeXcbPlugin0_autogen.dir/build
make -f src/plugins/xscreensaver/CMakeFiles/KF5IdleTimeXcbPlugin1_autogen.dir/build.make src/plugins/xscreensaver/CMakeFiles/KF5IdleTimeXcbPlugin1_autogen.dir/build
make[2]: Entering directory '/usr/src/RPM/BUILD/kidletime-5.94.0/BUILD'
cd /usr/src/RPM/BUILD/kidletime-5.94.0/BUILD && /usr/bin/cmake -E cmake_depends "Unix Makefiles" /usr/src/RPM/BUILD/kidletime-5.94.0 /usr/src/RPM/BUILD/kidletime-5.94.0/examples /usr/src/RPM/BUILD/kidletime-5.94.0/BUILD /usr/src/RPM/BUILD/kidletime-5.94.0/BUILD/examples /usr/src/RPM/BUILD/kidletime-5.94.0/BUILD/examples/CMakeFiles/kidletime_example_autogen.dir/DependInfo.cmake --color=
make[2]: Leaving directory '/usr/src/RPM/BUILD/kidletime-5.94.0/BUILD'
make -f examples/CMakeFiles/kidletime_example_autogen.dir/build.make examples/CMakeFiles/kidletime_example_autogen.dir/build
make[2]: Entering directory '/usr/src/RPM/BUILD/kidletime-5.94.0/BUILD'
[ 40%] Automatic MOC for target kidletime_example
cd /usr/src/RPM/BUILD/kidletime-5.94.0/BUILD/examples && /usr/bin/cmake -E cmake_autogen /usr/src/RPM/BUILD/kidletime-5.94.0/BUILD/examples/CMakeFiles/kidletime_example_autogen.dir/AutogenInfo.json Release
make[2]: Leaving directory '/usr/src/RPM/BUILD/kidletime-5.94.0/BUILD'
make[2]: Entering directory '/usr/src/RPM/BUILD/kidletime-5.94.0/BUILD'
[ 36%] Automatic MOC for target KF5IdleTimeXcbPlugin1
cd /usr/src/RPM/BUILD/kidletime-5.94.0/BUILD/src/plugins/xscreensaver && /usr/bin/cmake -E cmake_autogen /usr/src/RPM/BUILD/kidletime-5.94.0/BUILD/src/plugins/xscreensaver/CMakeFiles/KF5IdleTimeXcbPlugin1_autogen.dir/AutogenInfo.json Release
make[2]: Leaving directory '/usr/src/RPM/BUILD/kidletime-5.94.0/BUILD'
make[1]: Entering directory '/usr/src/RPM/BUILD/kidletime-5.94.0/BUILD'
[ 40%] Built target KF5IdleTimeXcbPlugin1_autogen
make[1]: Leaving directory '/usr/src/RPM/BUILD/kidletime-5.94.0/BUILD'
make[1]: Entering directory '/usr/src/RPM/BUILD/kidletime-5.94.0/BUILD'
[ 40%] Built target kidletime_example_autogen
make[1]: Leaving directory '/usr/src/RPM/BUILD/kidletime-5.94.0/BUILD'
make -f src/plugins/xscreensaver/CMakeFiles/KF5IdleTimeXcbPlugin1.dir/build.make src/plugins/xscreensaver/CMakeFiles/KF5IdleTimeXcbPlugin1.dir/depend
make -f examples/CMakeFiles/kidletime_example.dir/build.make examples/CMakeFiles/kidletime_example.dir/depend
make[2]: Entering directory '/usr/src/RPM/BUILD/kidletime-5.94.0/BUILD'
cd /usr/src/RPM/BUILD/kidletime-5.94.0/BUILD && /usr/bin/cmake -E cmake_depends "Unix Makefiles" /usr/src/RPM/BUILD/kidletime-5.94.0 /usr/src/RPM/BUILD/kidletime-5.94.0/examples /usr/src/RPM/BUILD/kidletime-5.94.0/BUILD /usr/src/RPM/BUILD/kidletime-5.94.0/BUILD/examples /usr/src/RPM/BUILD/kidletime-5.94.0/BUILD/examples/CMakeFiles/kidletime_example.dir/DependInfo.cmake --color=
make[2]: Leaving directory '/usr/src/RPM/BUILD/kidletime-5.94.0/BUILD'
make -f examples/CMakeFiles/kidletime_example.dir/build.make examples/CMakeFiles/kidletime_example.dir/build
make[2]: Entering directory '/usr/src/RPM/BUILD/kidletime-5.94.0/BUILD'
[ 32%] Automatic MOC for target KF5IdleTimeXcbPlugin0
cd /usr/src/RPM/BUILD/kidletime-5.94.0/BUILD/src/plugins/xsync && /usr/bin/cmake -E cmake_autogen /usr/src/RPM/BUILD/kidletime-5.94.0/BUILD/src/plugins/xsync/CMakeFiles/KF5IdleTimeXcbPlugin0_autogen.dir/AutogenInfo.json Release
make[2]: Leaving directory '/usr/src/RPM/BUILD/kidletime-5.94.0/BUILD'
make[2]: Entering directory '/usr/src/RPM/BUILD/kidletime-5.94.0/BUILD'
[ 44%] Generating screensaver_interface.cpp, screensaver_interface.h
cd /usr/src/RPM/BUILD/kidletime-5.94.0/BUILD/src/plugins/xscreensaver && /usr/share/qt5/bin/qdbusxml2cpp -m -p screensaver_interface /usr/src/RPM/BUILD/kidletime-5.94.0/src/plugins/xscreensaver/org.freedesktop.ScreenSaver.xml
make[2]: Leaving directory '/usr/src/RPM/BUILD/kidletime-5.94.0/BUILD'
make[1]: Entering directory '/usr/src/RPM/BUILD/kidletime-5.94.0/BUILD'
[ 56%] Built target KF5IdleTimeXcbPlugin0_autogen
make[1]: Leaving directory '/usr/src/RPM/BUILD/kidletime-5.94.0/BUILD'
make -f src/plugins/xsync/CMakeFiles/KF5IdleTimeXcbPlugin0.dir/build.make src/plugins/xsync/CMakeFiles/KF5IdleTimeXcbPlugin0.dir/depend
make[2]: Entering directory '/usr/src/RPM/BUILD/kidletime-5.94.0/BUILD'
cd /usr/src/RPM/BUILD/kidletime-5.94.0/BUILD && /usr/bin/cmake -E cmake_depends "Unix Makefiles" /usr/src/RPM/BUILD/kidletime-5.94.0 /usr/src/RPM/BUILD/kidletime-5.94.0/src/plugins/xsync /usr/src/RPM/BUILD/kidletime-5.94.0/BUILD /usr/src/RPM/BUILD/kidletime-5.94.0/BUILD/src/plugins/xsync /usr/src/RPM/BUILD/kidletime-5.94.0/BUILD/src/plugins/xsync/CMakeFiles/KF5IdleTimeXcbPlugin0.dir/DependInfo.cmake --color=
make[2]: Leaving directory '/usr/src/RPM/BUILD/kidletime-5.94.0/BUILD'
make -f src/plugins/xsync/CMakeFiles/KF5IdleTimeXcbPlugin0.dir/build.make src/plugins/xsync/CMakeFiles/KF5IdleTimeXcbPlugin0.dir/build
make[2]: Entering directory '/usr/src/RPM/BUILD/kidletime-5.94.0/BUILD'
[ 60%] Generating screensaver_interface.moc
cd /usr/src/RPM/BUILD/kidletime-5.94.0/BUILD/src/plugins/xscreensaver && /usr/share/qt5/bin/moc @/usr/src/RPM/BUILD/kidletime-5.94.0/BUILD/src/plugins/xscreensaver/screensaver_interface.moc_parameters
make[2]: Leaving directory '/usr/src/RPM/BUILD/kidletime-5.94.0/BUILD'
make[2]: Entering directory '/usr/src/RPM/BUILD/kidletime-5.94.0/BUILD'
cd /usr/src/RPM/BUILD/kidletime-5.94.0/BUILD && /usr/bin/cmake -E cmake_depends "Unix Makefiles" /usr/src/RPM/BUILD/kidletime-5.94.0 /usr/src/RPM/BUILD/kidletime-5.94.0/src/plugins/xscreensaver /usr/src/RPM/BUILD/kidletime-5.94.0/BUILD /usr/src/RPM/BUILD/kidletime-5.94.0/BUILD/src/plugins/xscreensaver /usr/src/RPM/BUILD/kidletime-5.94.0/BUILD/src/plugins/xscreensaver/CMakeFiles/KF5IdleTimeXcbPlugin1.dir/DependInfo.cmake --color=
make[2]: Leaving directory '/usr/src/RPM/BUILD/kidletime-5.94.0/BUILD'
make -f src/plugins/xscreensaver/CMakeFiles/KF5IdleTimeXcbPlugin1.dir/build.make src/plugins/xscreensaver/CMakeFiles/KF5IdleTimeXcbPlugin1.dir/build
make[2]: Entering directory '/usr/src/RPM/BUILD/kidletime-5.94.0/BUILD'
[ 52%] Building CXX object examples/CMakeFiles/kidletime_example.dir/main.cpp.o
cd /usr/src/RPM/BUILD/kidletime-5.94.0/BUILD/examples && /usr/bin/c++ -DKF_DEPRECATED_WARNINGS_SINCE=0x060000 -DKF_DISABLE_DEPRECATED_BEFORE_AND_AT=0x055900 -DKIDLETIME_DEPRECATED_WARNINGS_SINCE=0x0 -DKIDLETIME_DISABLE_DEPRECATED_BEFORE_AND_AT=0x0 -DQT_CORE_LIB -DQT_DEPRECATED_WARNINGS_SINCE=0x060000 -DQT_DISABLE_DEPRECATED_BEFORE=0x050f02 -DQT_GUI_LIB -DQT_NO_CAST_FROM_ASCII -DQT_NO_CAST_FROM_BYTEARRAY -DQT_NO_CAST_TO_ASCII -DQT_NO_DEBUG -DQT_NO_FOREACH -DQT_NO_KEYWORDS -DQT_NO_NARROWING_CONVERSIONS_IN_CONNECT -DQT_NO_URL_CAST_FROM_STRING -DQT_STRICT_ITERATORS -DQT_USE_QSTRINGBUILDER -D_FILE_OFFSET_BITS=64 -D_GNU_SOURCE -D_LARGEFILE64_SOURCE -I/usr/src/RPM/BUILD/kidletime-5.94.0/BUILD/examples -I/usr/src/RPM/BUILD/kidletime-5.94.0/examples -I/usr/src/RPM/BUILD/kidletime-5.94.0/BUILD/examples/kidletime_example_autogen/include -I/usr/src/RPM/BUILD/kidletime-5.94.0/BUILD/src -I/usr/src/RPM/BUILD/kidletime-5.94.0/src -isystem /usr/include/qt5 -isystem /usr/include/qt5/QtCore -isystem /usr/share/qt5/../../lib/qt5/mkspecs/linux-g++ -isystem /usr/include/qt5/QtGui -pipe -frecord-gcc-switches -Wall -g -O2 -flto=auto -march=i586 -mtune=generic -fno-operator-names -fno-exceptions -Wall -Wextra -Wcast-align -Wchar-subscripts -Wformat-security -Wno-long-long -Wpointer-arith -Wundef -Wnon-virtual-dtor -Woverloaded-virtual -Werror=return-type -Werror=init-self -Wvla -Wdate-time -Wsuggest-override -Wlogical-op -pedantic -Wzero-as-null-pointer-constant -Wmissing-include-dirs -O2 -DNDEBUG -fvisibility=hidden -fvisibility-inlines-hidden -fPIC -std=c++17 -MD -MT examples/CMakeFiles/kidletime_example.dir/main.cpp.o -MF CMakeFiles/kidletime_example.dir/main.cpp.o.d -o CMakeFiles/kidletime_example.dir/main.cpp.o -c /usr/src/RPM/BUILD/kidletime-5.94.0/examples/main.cpp
make[2]: Leaving directory '/usr/src/RPM/BUILD/kidletime-5.94.0/BUILD'
make[2]: Entering directory '/usr/src/RPM/BUILD/kidletime-5.94.0/BUILD'
[ 68%] Building CXX object src/plugins/xsync/CMakeFiles/KF5IdleTimeXcbPlugin0.dir/__/__/logging.cpp.o
cd /usr/src/RPM/BUILD/kidletime-5.94.0/BUILD/src/plugins/xsync && /usr/bin/c++ -DKF5IdleTimeXcbPlugin0_EXPORTS -DKF_DEPRECATED_WARNINGS_SINCE=0x060000 -DKF_DISABLE_DEPRECATED_BEFORE_AND_AT=0x055900 -DKIDLETIME_DEPRECATED_WARNINGS_SINCE=0x0 -DKIDLETIME_DISABLE_DEPRECATED_BEFORE_AND_AT=0x0 -DQT_CORE_LIB -DQT_DEPRECATED_WARNINGS_SINCE=0x060000 -DQT_DISABLE_DEPRECATED_BEFORE=0x050f02 -DQT_GUI_LIB -DQT_NO_CAST_FROM_ASCII -DQT_NO_CAST_FROM_BYTEARRAY -DQT_NO_CAST_TO_ASCII -DQT_NO_DEBUG -DQT_NO_FOREACH -DQT_NO_KEYWORDS -DQT_NO_NARROWING_CONVERSIONS_IN_CONNECT -DQT_NO_URL_CAST_FROM_STRING -DQT_STRICT_ITERATORS -DQT_USE_QSTRINGBUILDER -DQT_X11EXTRAS_LIB -D_FILE_OFFSET_BITS=64 -D_GNU_SOURCE -D_LARGEFILE64_SOURCE -I/usr/src/RPM/BUILD/kidletime-5.94.0/BUILD/src/plugins/xsync -I/usr/src/RPM/BUILD/kidletime-5.94.0/src/plugins/xsync -I/usr/src/RPM/BUILD/kidletime-5.94.0/BUILD/src/plugins/xsync/KF5IdleTimeXcbPlugin0_autogen/include -I/usr/src/RPM/BUILD/kidletime-5.94.0/BUILD/src -I/usr/src/RPM/BUILD/kidletime-5.94.0/src -isystem /usr/include/qt5 -isystem /usr/include/qt5/QtCore -isystem /usr/share/qt5/../../lib/qt5/mkspecs/linux-g++ -isystem /usr/include/qt5/QtX11Extras -isystem /usr/include/qt5/QtGui -pipe -frecord-gcc-switches -Wall -g -O2 -flto=auto -march=i586 -mtune=generic -fno-operator-names -fno-exceptions -Wall -Wextra -Wcast-align -Wchar-subscripts -Wformat-security -Wno-long-long -Wpointer-arith -Wundef -Wnon-virtual-dtor -Woverloaded-virtual -Werror=return-type -Werror=init-self -Wvla -Wdate-time -Wsuggest-override -Wlogical-op -pedantic -Wzero-as-null-pointer-constant -Wmissing-include-dirs -O2 -DNDEBUG -fPIC -fvisibility=hidden -fvisibility-inlines-hidden -fPIC -std=c++17 -MD -MT src/plugins/xsync/CMakeFiles/KF5IdleTimeXcbPlugin0.dir/__/__/logging.cpp.o -MF CMakeFiles/KF5IdleTimeXcbPlugin0.dir/__/__/logging.cpp.o.d -o CMakeFiles/KF5IdleTimeXcbPlugin0.dir/__/__/logging.cpp.o -c /usr/src/RPM/BUILD/kidletime-5.94.0/BUILD/src/logging.cpp
make[2]: Leaving directory '/usr/src/RPM/BUILD/kidletime-5.94.0/BUILD'
make[2]: Entering directory '/usr/src/RPM/BUILD/kidletime-5.94.0/BUILD'
[ 56%] Building CXX object examples/CMakeFiles/kidletime_example.dir/KIdleTest.cpp.o
cd /usr/src/RPM/BUILD/kidletime-5.94.0/BUILD/examples && /usr/bin/c++ -DKF_DEPRECATED_WARNINGS_SINCE=0x060000 -DKF_DISABLE_DEPRECATED_BEFORE_AND_AT=0x055900 -DKIDLETIME_DEPRECATED_WARNINGS_SINCE=0x0 -DKIDLETIME_DISABLE_DEPRECATED_BEFORE_AND_AT=0x0 -DQT_CORE_LIB -DQT_DEPRECATED_WARNINGS_SINCE=0x060000 -DQT_DISABLE_DEPRECATED_BEFORE=0x050f02 -DQT_GUI_LIB -DQT_NO_CAST_FROM_ASCII -DQT_NO_CAST_FROM_BYTEARRAY -DQT_NO_CAST_TO_ASCII -DQT_NO_DEBUG -DQT_NO_FOREACH -DQT_NO_KEYWORDS -DQT_NO_NARROWING_CONVERSIONS_IN_CONNECT -DQT_NO_URL_CAST_FROM_STRING -DQT_STRICT_ITERATORS -DQT_USE_QSTRINGBUILDER -D_FILE_OFFSET_BITS=64 -D_GNU_SOURCE -D_LARGEFILE64_SOURCE -I/usr/src/RPM/BUILD/kidletime-5.94.0/BUILD/examples -I/usr/src/RPM/BUILD/kidletime-5.94.0/examples -I/usr/src/RPM/BUILD/kidletime-5.94.0/BUILD/examples/kidletime_example_autogen/include -I/usr/src/RPM/BUILD/kidletime-5.94.0/BUILD/src -I/usr/src/RPM/BUILD/kidletime-5.94.0/src -isystem /usr/include/qt5 -isystem /usr/include/qt5/QtCore -isystem /usr/share/qt5/../../lib/qt5/mkspecs/linux-g++ -isystem /usr/include/qt5/QtGui -pipe -frecord-gcc-switches -Wall -g -O2 -flto=auto -march=i586 -mtune=generic -fno-operator-names -fno-exceptions -Wall -Wextra -Wcast-align -Wchar-subscripts -Wformat-security -Wno-long-long -Wpointer-arith -Wundef -Wnon-virtual-dtor -Woverloaded-virtual -Werror=return-type -Werror=init-self -Wvla -Wdate-time -Wsuggest-override -Wlogical-op -pedantic -Wzero-as-null-pointer-constant -Wmissing-include-dirs -O2 -DNDEBUG -fvisibility=hidden -fvisibility-inlines-hidden -fPIC -std=c++17 -MD -MT examples/CMakeFiles/kidletime_example.dir/KIdleTest.cpp.o -MF CMakeFiles/kidletime_example.dir/KIdleTest.cpp.o.d -o CMakeFiles/kidletime_example.dir/KIdleTest.cpp.o -c /usr/src/RPM/BUILD/kidletime-5.94.0/examples/KIdleTest.cpp
make[2]: Leaving directory '/usr/src/RPM/BUILD/kidletime-5.94.0/BUILD'
make[2]: Entering directory '/usr/src/RPM/BUILD/kidletime-5.94.0/BUILD'
[ 72%] Building CXX object src/plugins/xsync/CMakeFiles/KF5IdleTimeXcbPlugin0.dir/xsync_logging.cpp.o
cd /usr/src/RPM/BUILD/kidletime-5.94.0/BUILD/src/plugins/xsync && /usr/bin/c++ -DKF5IdleTimeXcbPlugin0_EXPORTS -DKF_DEPRECATED_WARNINGS_SINCE=0x060000 -DKF_DISABLE_DEPRECATED_BEFORE_AND_AT=0x055900 -DKIDLETIME_DEPRECATED_WARNINGS_SINCE=0x0 -DKIDLETIME_DISABLE_DEPRECATED_BEFORE_AND_AT=0x0 -DQT_CORE_LIB -DQT_DEPRECATED_WARNINGS_SINCE=0x060000 -DQT_DISABLE_DEPRECATED_BEFORE=0x050f02 -DQT_GUI_LIB -DQT_NO_CAST_FROM_ASCII -DQT_NO_CAST_FROM_BYTEARRAY -DQT_NO_CAST_TO_ASCII -DQT_NO_DEBUG -DQT_NO_FOREACH -DQT_NO_KEYWORDS -DQT_NO_NARROWING_CONVERSIONS_IN_CONNECT -DQT_NO_URL_CAST_FROM_STRING -DQT_STRICT_ITERATORS -DQT_USE_QSTRINGBUILDER -DQT_X11EXTRAS_LIB -D_FILE_OFFSET_BITS=64 -D_GNU_SOURCE -D_LARGEFILE64_SOURCE -I/usr/src/RPM/BUILD/kidletime-5.94.0/BUILD/src/plugins/xsync -I/usr/src/RPM/BUILD/kidletime-5.94.0/src/plugins/xsync -I/usr/src/RPM/BUILD/kidletime-5.94.0/BUILD/src/plugins/xsync/KF5IdleTimeXcbPlugin0_autogen/include -I/usr/src/RPM/BUILD/kidletime-5.94.0/BUILD/src -I/usr/src/RPM/BUILD/kidletime-5.94.0/src -isystem /usr/include/qt5 -isystem /usr/include/qt5/QtCore -isystem /usr/share/qt5/../../lib/qt5/mkspecs/linux-g++ -isystem /usr/include/qt5/QtX11Extras -isystem /usr/include/qt5/QtGui -pipe -frecord-gcc-switches -Wall -g -O2 -flto=auto -march=i586 -mtune=generic -fno-operator-names -fno-exceptions -Wall -Wextra -Wcast-align -Wchar-subscripts -Wformat-security -Wno-long-long -Wpointer-arith -Wundef -Wnon-virtual-dtor -Woverloaded-virtual -Werror=return-type -Werror=init-self -Wvla -Wdate-time -Wsuggest-override -Wlogical-op -pedantic -Wzero-as-null-pointer-constant -Wmissing-include-dirs -O2 -DNDEBUG -fPIC -fvisibility=hidden -fvisibility-inlines-hidden -fPIC -std=c++17 -MD -MT src/plugins/xsync/CMakeFiles/KF5IdleTimeXcbPlugin0.dir/xsync_logging.cpp.o -MF CMakeFiles/KF5IdleTimeXcbPlugin0.dir/xsync_logging.cpp.o.d -o CMakeFiles/KF5IdleTimeXcbPlugin0.dir/xsync_logging.cpp.o -c /usr/src/RPM/BUILD/kidletime-5.94.0/BUILD/src/plugins/xsync/xsync_logging.cpp
make[2]: Leaving directory '/usr/src/RPM/BUILD/kidletime-5.94.0/BUILD'
make[2]: Entering directory '/usr/src/RPM/BUILD/kidletime-5.94.0/BUILD'
[ 48%] Building CXX object examples/CMakeFiles/kidletime_example.dir/kidletime_example_autogen/mocs_compilation.cpp.o
cd /usr/src/RPM/BUILD/kidletime-5.94.0/BUILD/examples && /usr/bin/c++ -DKF_DEPRECATED_WARNINGS_SINCE=0x060000 -DKF_DISABLE_DEPRECATED_BEFORE_AND_AT=0x055900 -DKIDLETIME_DEPRECATED_WARNINGS_SINCE=0x0 -DKIDLETIME_DISABLE_DEPRECATED_BEFORE_AND_AT=0x0 -DQT_CORE_LIB -DQT_DEPRECATED_WARNINGS_SINCE=0x060000 -DQT_DISABLE_DEPRECATED_BEFORE=0x050f02 -DQT_GUI_LIB -DQT_NO_CAST_FROM_ASCII -DQT_NO_CAST_FROM_BYTEARRAY -DQT_NO_CAST_TO_ASCII -DQT_NO_DEBUG -DQT_NO_FOREACH -DQT_NO_KEYWORDS -DQT_NO_NARROWING_CONVERSIONS_IN_CONNECT -DQT_NO_URL_CAST_FROM_STRING -DQT_STRICT_ITERATORS -DQT_USE_QSTRINGBUILDER -D_FILE_OFFSET_BITS=64 -D_GNU_SOURCE -D_LARGEFILE64_SOURCE -I/usr/src/RPM/BUILD/kidletime-5.94.0/BUILD/examples -I/usr/src/RPM/BUILD/kidletime-5.94.0/examples -I/usr/src/RPM/BUILD/kidletime-5.94.0/BUILD/examples/kidletime_example_autogen/include -I/usr/src/RPM/BUILD/kidletime-5.94.0/BUILD/src -I/usr/src/RPM/BUILD/kidletime-5.94.0/src -isystem /usr/include/qt5 -isystem /usr/include/qt5/QtCore -isystem /usr/share/qt5/../../lib/qt5/mkspecs/linux-g++ -isystem /usr/include/qt5/QtGui -pipe -frecord-gcc-switches -Wall -g -O2 -flto=auto -march=i586 -mtune=generic -fno-operator-names -fno-exceptions -Wall -Wextra -Wcast-align -Wchar-subscripts -Wformat-security -Wno-long-long -Wpointer-arith -Wundef -Wnon-virtual-dtor -Woverloaded-virtual -Werror=return-type -Werror=init-self -Wvla -Wdate-time -Wsuggest-override -Wlogical-op -pedantic -Wzero-as-null-pointer-constant -Wmissing-include-dirs -O2 -DNDEBUG -fvisibility=hidden -fvisibility-inlines-hidden -fPIC -std=c++17 -MD -MT examples/CMakeFiles/kidletime_example.dir/kidletime_example_autogen/mocs_compilation.cpp.o -MF CMakeFiles/kidletime_example.dir/kidletime_example_autogen/mocs_compilation.cpp.o.d -o CMakeFiles/kidletime_example.dir/kidletime_example_autogen/mocs_compilation.cpp.o -c /usr/src/RPM/BUILD/kidletime-5.94.0/BUILD/examples/kidletime_example_autogen/mocs_compilation.cpp
make[2]: Leaving directory '/usr/src/RPM/BUILD/kidletime-5.94.0/BUILD'
make[2]: Entering directory '/usr/src/RPM/BUILD/kidletime-5.94.0/BUILD'
[ 92%] Linking CXX executable ../bin/kidletime_example
cd /usr/src/RPM/BUILD/kidletime-5.94.0/BUILD/examples && /usr/bin/cmake -E cmake_link_script CMakeFiles/kidletime_example.dir/link.txt --verbose=1
/usr/bin/c++ -pipe -frecord-gcc-switches -Wall -g -O2 -flto=auto -march=i586 -mtune=generic -fno-operator-names -fno-exceptions -Wall -Wextra -Wcast-align -Wchar-subscripts -Wformat-security -Wno-long-long -Wpointer-arith -Wundef -Wnon-virtual-dtor -Woverloaded-virtual -Werror=return-type -Werror=init-self -Wvla -Wdate-time -Wsuggest-override -Wlogical-op -pedantic -Wzero-as-null-pointer-constant -Wmissing-include-dirs -O2 -DNDEBUG -Wl,--enable-new-dtags -L/usr/lib -L/usr/lib/kf5/devel CMakeFiles/kidletime_example.dir/kidletime_example_autogen/mocs_compilation.cpp.o CMakeFiles/kidletime_example.dir/main.cpp.o CMakeFiles/kidletime_example.dir/KIdleTest.cpp.o -o ../bin/kidletime_example ../bin/libKF5IdleTime.so.5.94.0 /usr/lib/libQt5Gui.so.5.15.2 /usr/lib/libQt5Core.so.5.15.2
make[2]: Leaving directory '/usr/src/RPM/BUILD/kidletime-5.94.0/BUILD'
make[1]: Entering directory '/usr/src/RPM/BUILD/kidletime-5.94.0/BUILD'
[ 92%] Built target kidletime_example
make[1]: Leaving directory '/usr/src/RPM/BUILD/kidletime-5.94.0/BUILD'
make[2]: Entering directory '/usr/src/RPM/BUILD/kidletime-5.94.0/BUILD'
[ 76%] Building CXX object src/plugins/xsync/CMakeFiles/KF5IdleTimeXcbPlugin0.dir/xsyncbasedpoller.cpp.o
cd /usr/src/RPM/BUILD/kidletime-5.94.0/BUILD/src/plugins/xsync && /usr/bin/c++ -DKF5IdleTimeXcbPlugin0_EXPORTS -DKF_DEPRECATED_WARNINGS_SINCE=0x060000 -DKF_DISABLE_DEPRECATED_BEFORE_AND_AT=0x055900 -DKIDLETIME_DEPRECATED_WARNINGS_SINCE=0x0 -DKIDLETIME_DISABLE_DEPRECATED_BEFORE_AND_AT=0x0 -DQT_CORE_LIB -DQT_DEPRECATED_WARNINGS_SINCE=0x060000 -DQT_DISABLE_DEPRECATED_BEFORE=0x050f02 -DQT_GUI_LIB -DQT_NO_CAST_FROM_ASCII -DQT_NO_CAST_FROM_BYTEARRAY -DQT_NO_CAST_TO_ASCII -DQT_NO_DEBUG -DQT_NO_FOREACH -DQT_NO_KEYWORDS -DQT_NO_NARROWING_CONVERSIONS_IN_CONNECT -DQT_NO_URL_CAST_FROM_STRING -DQT_STRICT_ITERATORS -DQT_USE_QSTRINGBUILDER -DQT_X11EXTRAS_LIB -D_FILE_OFFSET_BITS=64 -D_GNU_SOURCE -D_LARGEFILE64_SOURCE -I/usr/src/RPM/BUILD/kidletime-5.94.0/BUILD/src/plugins/xsync -I/usr/src/RPM/BUILD/kidletime-5.94.0/src/plugins/xsync -I/usr/src/RPM/BUILD/kidletime-5.94.0/BUILD/src/plugins/xsync/KF5IdleTimeXcbPlugin0_autogen/include -I/usr/src/RPM/BUILD/kidletime-5.94.0/BUILD/src -I/usr/src/RPM/BUILD/kidletime-5.94.0/src -isystem /usr/include/qt5 -isystem /usr/include/qt5/QtCore -isystem /usr/share/qt5/../../lib/qt5/mkspecs/linux-g++ -isystem /usr/include/qt5/QtX11Extras -isystem /usr/include/qt5/QtGui -pipe -frecord-gcc-switches -Wall -g -O2 -flto=auto -march=i586 -mtune=generic -fno-operator-names -fno-exceptions -Wall -Wextra -Wcast-align -Wchar-subscripts -Wformat-security -Wno-long-long -Wpointer-arith -Wundef -Wnon-virtual-dtor -Woverloaded-virtual -Werror=return-type -Werror=init-self -Wvla -Wdate-time -Wsuggest-override -Wlogical-op -pedantic -Wzero-as-null-pointer-constant -Wmissing-include-dirs -O2 -DNDEBUG -fPIC -fvisibility=hidden -fvisibility-inlines-hidden -fPIC -std=c++17 -MD -MT src/plugins/xsync/CMakeFiles/KF5IdleTimeXcbPlugin0.dir/xsyncbasedpoller.cpp.o -MF CMakeFiles/KF5IdleTimeXcbPlugin0.dir/xsyncbasedpoller.cpp.o.d -o CMakeFiles/KF5IdleTimeXcbPlugin0.dir/xsyncbasedpoller.cpp.o -c /usr/src/RPM/BUILD/kidletime-5.94.0/src/plugins/xsync/xsyncbasedpoller.cpp
make[2]: Leaving directory '/usr/src/RPM/BUILD/kidletime-5.94.0/BUILD'
make[2]: Entering directory '/usr/src/RPM/BUILD/kidletime-5.94.0/BUILD'
[ 64%] Building CXX object src/plugins/xsync/CMakeFiles/KF5IdleTimeXcbPlugin0.dir/KF5IdleTimeXcbPlugin0_autogen/mocs_compilation.cpp.o
cd /usr/src/RPM/BUILD/kidletime-5.94.0/BUILD/src/plugins/xsync && /usr/bin/c++ -DKF5IdleTimeXcbPlugin0_EXPORTS -DKF_DEPRECATED_WARNINGS_SINCE=0x060000 -DKF_DISABLE_DEPRECATED_BEFORE_AND_AT=0x055900 -DKIDLETIME_DEPRECATED_WARNINGS_SINCE=0x0 -DKIDLETIME_DISABLE_DEPRECATED_BEFORE_AND_AT=0x0 -DQT_CORE_LIB -DQT_DEPRECATED_WARNINGS_SINCE=0x060000 -DQT_DISABLE_DEPRECATED_BEFORE=0x050f02 -DQT_GUI_LIB -DQT_NO_CAST_FROM_ASCII -DQT_NO_CAST_FROM_BYTEARRAY -DQT_NO_CAST_TO_ASCII -DQT_NO_DEBUG -DQT_NO_FOREACH -DQT_NO_KEYWORDS -DQT_NO_NARROWING_CONVERSIONS_IN_CONNECT -DQT_NO_URL_CAST_FROM_STRING -DQT_STRICT_ITERATORS -DQT_USE_QSTRINGBUILDER -DQT_X11EXTRAS_LIB -D_FILE_OFFSET_BITS=64 -D_GNU_SOURCE -D_LARGEFILE64_SOURCE -I/usr/src/RPM/BUILD/kidletime-5.94.0/BUILD/src/plugins/xsync -I/usr/src/RPM/BUILD/kidletime-5.94.0/src/plugins/xsync -I/usr/src/RPM/BUILD/kidletime-5.94.0/BUILD/src/plugins/xsync/KF5IdleTimeXcbPlugin0_autogen/include -I/usr/src/RPM/BUILD/kidletime-5.94.0/BUILD/src -I/usr/src/RPM/BUILD/kidletime-5.94.0/src -isystem /usr/include/qt5 -isystem /usr/include/qt5/QtCore -isystem /usr/share/qt5/../../lib/qt5/mkspecs/linux-g++ -isystem /usr/include/qt5/QtX11Extras -isystem /usr/include/qt5/QtGui -pipe -frecord-gcc-switches -Wall -g -O2 -flto=auto -march=i586 -mtune=generic -fno-operator-names -fno-exceptions -Wall -Wextra -Wcast-align -Wchar-subscripts -Wformat-security -Wno-long-long -Wpointer-arith -Wundef -Wnon-virtual-dtor -Woverloaded-virtual -Werror=return-type -Werror=init-self -Wvla -Wdate-time -Wsuggest-override -Wlogical-op -pedantic -Wzero-as-null-pointer-constant -Wmissing-include-dirs -O2 -DNDEBUG -fPIC -fvisibility=hidden -fvisibility-inlines-hidden -fPIC -std=c++17 -MD -MT src/plugins/xsync/CMakeFiles/KF5IdleTimeXcbPlugin0.dir/KF5IdleTimeXcbPlugin0_autogen/mocs_compilation.cpp.o -MF CMakeFiles/KF5IdleTimeXcbPlugin0.dir/KF5IdleTimeXcbPlugin0_autogen/mocs_compilation.cpp.o.d -o CMakeFiles/KF5IdleTimeXcbPlugin0.dir/KF5IdleTimeXcbPlugin0_autogen/mocs_compilation.cpp.o -c /usr/src/RPM/BUILD/kidletime-5.94.0/BUILD/src/plugins/xsync/KF5IdleTimeXcbPlugin0_autogen/mocs_compilation.cpp
make[2]: Leaving directory '/usr/src/RPM/BUILD/kidletime-5.94.0/BUILD'
make[2]: Entering directory '/usr/src/RPM/BUILD/kidletime-5.94.0/BUILD'
[ 80%] Building CXX object src/plugins/xscreensaver/CMakeFiles/KF5IdleTimeXcbPlugin1.dir/KF5IdleTimeXcbPlugin1_autogen/mocs_compilation.cpp.o
cd /usr/src/RPM/BUILD/kidletime-5.94.0/BUILD/src/plugins/xscreensaver && /usr/bin/c++ -DKF5IdleTimeXcbPlugin1_EXPORTS -DKF_DEPRECATED_WARNINGS_SINCE=0x060000 -DKF_DISABLE_DEPRECATED_BEFORE_AND_AT=0x055900 -DKIDLETIME_DEPRECATED_WARNINGS_SINCE=0x0 -DKIDLETIME_DISABLE_DEPRECATED_BEFORE_AND_AT=0x0 -DQT_CORE_LIB -DQT_DBUS_LIB -DQT_DEPRECATED_WARNINGS_SINCE=0x060000 -DQT_DISABLE_DEPRECATED_BEFORE=0x050f02 -DQT_GUI_LIB -DQT_NO_CAST_FROM_ASCII -DQT_NO_CAST_FROM_BYTEARRAY -DQT_NO_CAST_TO_ASCII -DQT_NO_DEBUG -DQT_NO_FOREACH -DQT_NO_KEYWORDS -DQT_NO_NARROWING_CONVERSIONS_IN_CONNECT -DQT_NO_URL_CAST_FROM_STRING -DQT_STRICT_ITERATORS -DQT_USE_QSTRINGBUILDER -DQT_X11EXTRAS_LIB -D_FILE_OFFSET_BITS=64 -D_GNU_SOURCE -D_LARGEFILE64_SOURCE -I/usr/src/RPM/BUILD/kidletime-5.94.0/BUILD/src/plugins/xscreensaver -I/usr/src/RPM/BUILD/kidletime-5.94.0/src/plugins/xscreensaver -I/usr/src/RPM/BUILD/kidletime-5.94.0/BUILD/src/plugins/xscreensaver/KF5IdleTimeXcbPlugin1_autogen/include -I/usr/src/RPM/BUILD/kidletime-5.94.0/BUILD/src -I/usr/src/RPM/BUILD/kidletime-5.94.0/src -isystem /usr/include/qt5 -isystem /usr/include/qt5/QtCore -isystem /usr/share/qt5/../../lib/qt5/mkspecs/linux-g++ -isystem /usr/include/qt5/QtDBus -isystem /usr/include/qt5/QtX11Extras -isystem /usr/include/qt5/QtGui -pipe -frecord-gcc-switches -Wall -g -O2 -flto=auto -march=i586 -mtune=generic -fno-operator-names -fno-exceptions -Wall -Wextra -Wcast-align -Wchar-subscripts -Wformat-security -Wno-long-long -Wpointer-arith -Wundef -Wnon-virtual-dtor -Woverloaded-virtual -Werror=return-type -Werror=init-self -Wvla -Wdate-time -Wsuggest-override -Wlogical-op -pedantic -Wzero-as-null-pointer-constant -Wmissing-include-dirs -O2 -DNDEBUG -fPIC -fvisibility=hidden -fvisibility-inlines-hidden -fPIC -std=c++17 -MD -MT src/plugins/xscreensaver/CMakeFiles/KF5IdleTimeXcbPlugin1.dir/KF5IdleTimeXcbPlugin1_autogen/mocs_compilation.cpp.o -MF CMakeFiles/KF5IdleTimeXcbPlugin1.dir/KF5IdleTimeXcbPlugin1_autogen/mocs_compilation.cpp.o.d -o CMakeFiles/KF5IdleTimeXcbPlugin1.dir/KF5IdleTimeXcbPlugin1_autogen/mocs_compilation.cpp.o -c /usr/src/RPM/BUILD/kidletime-5.94.0/BUILD/src/plugins/xscreensaver/KF5IdleTimeXcbPlugin1_autogen/mocs_compilation.cpp
make[2]: Leaving directory '/usr/src/RPM/BUILD/kidletime-5.94.0/BUILD'
make[2]: Entering directory '/usr/src/RPM/BUILD/kidletime-5.94.0/BUILD'
[ 96%] Linking CXX shared module ../../../bin/KF5IdleTimeXcbPlugin0.so
cd /usr/src/RPM/BUILD/kidletime-5.94.0/BUILD/src/plugins/xsync && /usr/bin/cmake -E cmake_link_script CMakeFiles/KF5IdleTimeXcbPlugin0.dir/link.txt --verbose=1
/usr/bin/c++ -fPIC -pipe -frecord-gcc-switches -Wall -g -O2 -flto=auto -march=i586 -mtune=generic -fno-operator-names -fno-exceptions -Wall -Wextra -Wcast-align -Wchar-subscripts -Wformat-security -Wno-long-long -Wpointer-arith -Wundef -Wnon-virtual-dtor -Woverloaded-virtual -Werror=return-type -Werror=init-self -Wvla -Wdate-time -Wsuggest-override -Wlogical-op -pedantic -Wzero-as-null-pointer-constant -Wmissing-include-dirs -O2 -DNDEBUG -Wl,--no-undefined -Wl,--fatal-warnings -Wl,--enable-new-dtags -L/usr/lib -L/usr/lib/kf5/devel -Wl,-Bsymbolic-functions -shared -o ../../../bin/KF5IdleTimeXcbPlugin0.so CMakeFiles/KF5IdleTimeXcbPlugin0.dir/KF5IdleTimeXcbPlugin0_autogen/mocs_compilation.cpp.o CMakeFiles/KF5IdleTimeXcbPlugin0.dir/xsyncbasedpoller.cpp.o CMakeFiles/KF5IdleTimeXcbPlugin0.dir/__/__/logging.cpp.o CMakeFiles/KF5IdleTimeXcbPlugin0.dir/xsync_logging.cpp.o ../../../bin/libKF5IdleTime.so.5.94.0 /usr/lib/libxcb.so /usr/lib/libxcb-sync.so /usr/lib/libX11-xcb.so /usr/lib/libSM.so /usr/lib/libICE.so /usr/lib/libX11.so /usr/lib/libXext.so /usr/lib/libXext.so /usr/lib/libQt5X11Extras.so.5.15.2 /usr/lib/libxcb.so /usr/lib/libQt5Gui.so.5.15.2 /usr/lib/libQt5Core.so.5.15.2
make[2]: Leaving directory '/usr/src/RPM/BUILD/kidletime-5.94.0/BUILD'
make[1]: Entering directory '/usr/src/RPM/BUILD/kidletime-5.94.0/BUILD'
[ 96%] Built target KF5IdleTimeXcbPlugin0
make[1]: Leaving directory '/usr/src/RPM/BUILD/kidletime-5.94.0/BUILD'
make[2]: Entering directory '/usr/src/RPM/BUILD/kidletime-5.94.0/BUILD'
[ 84%] Building CXX object src/plugins/xscreensaver/CMakeFiles/KF5IdleTimeXcbPlugin1.dir/screensaver_interface.cpp.o
cd /usr/src/RPM/BUILD/kidletime-5.94.0/BUILD/src/plugins/xscreensaver && /usr/bin/c++ -DKF5IdleTimeXcbPlugin1_EXPORTS -DKF_DEPRECATED_WARNINGS_SINCE=0x060000 -DKF_DISABLE_DEPRECATED_BEFORE_AND_AT=0x055900 -DKIDLETIME_DEPRECATED_WARNINGS_SINCE=0x0 -DKIDLETIME_DISABLE_DEPRECATED_BEFORE_AND_AT=0x0 -DQT_CORE_LIB -DQT_DBUS_LIB -DQT_DEPRECATED_WARNINGS_SINCE=0x060000 -DQT_DISABLE_DEPRECATED_BEFORE=0x050f02 -DQT_GUI_LIB -DQT_NO_CAST_FROM_ASCII -DQT_NO_CAST_FROM_BYTEARRAY -DQT_NO_CAST_TO_ASCII -DQT_NO_DEBUG -DQT_NO_FOREACH -DQT_NO_KEYWORDS -DQT_NO_NARROWING_CONVERSIONS_IN_CONNECT -DQT_NO_URL_CAST_FROM_STRING -DQT_STRICT_ITERATORS -DQT_USE_QSTRINGBUILDER -DQT_X11EXTRAS_LIB -D_FILE_OFFSET_BITS=64 -D_GNU_SOURCE -D_LARGEFILE64_SOURCE -I/usr/src/RPM/BUILD/kidletime-5.94.0/BUILD/src/plugins/xscreensaver -I/usr/src/RPM/BUILD/kidletime-5.94.0/src/plugins/xscreensaver -I/usr/src/RPM/BUILD/kidletime-5.94.0/BUILD/src/plugins/xscreensaver/KF5IdleTimeXcbPlugin1_autogen/include -I/usr/src/RPM/BUILD/kidletime-5.94.0/BUILD/src -I/usr/src/RPM/BUILD/kidletime-5.94.0/src -isystem /usr/include/qt5 -isystem /usr/include/qt5/QtCore -isystem /usr/share/qt5/../../lib/qt5/mkspecs/linux-g++ -isystem /usr/include/qt5/QtDBus -isystem /usr/include/qt5/QtX11Extras -isystem /usr/include/qt5/QtGui -pipe -frecord-gcc-switches -Wall -g -O2 -flto=auto -march=i586 -mtune=generic -fno-operator-names -fno-exceptions -Wall -Wextra -Wcast-align -Wchar-subscripts -Wformat-security -Wno-long-long -Wpointer-arith -Wundef -Wnon-virtual-dtor -Woverloaded-virtual -Werror=return-type -Werror=init-self -Wvla -Wdate-time -Wsuggest-override -Wlogical-op -pedantic -Wzero-as-null-pointer-constant -Wmissing-include-dirs -O2 -DNDEBUG -fPIC -fvisibility=hidden -fvisibility-inlines-hidden -fPIC -std=c++17 -MD -MT src/plugins/xscreensaver/CMakeFiles/KF5IdleTimeXcbPlugin1.dir/screensaver_interface.cpp.o -MF CMakeFiles/KF5IdleTimeXcbPlugin1.dir/screensaver_interface.cpp.o.d -o CMakeFiles/KF5IdleTimeXcbPlugin1.dir/screensaver_interface.cpp.o -c /usr/src/RPM/BUILD/kidletime-5.94.0/BUILD/src/plugins/xscreensaver/screensaver_interface.cpp
make[2]: Leaving directory '/usr/src/RPM/BUILD/kidletime-5.94.0/BUILD'
make[2]: Entering directory '/usr/src/RPM/BUILD/kidletime-5.94.0/BUILD'
[ 88%] Building CXX object src/plugins/xscreensaver/CMakeFiles/KF5IdleTimeXcbPlugin1.dir/xscreensaverbasedpoller.cpp.o
cd /usr/src/RPM/BUILD/kidletime-5.94.0/BUILD/src/plugins/xscreensaver && /usr/bin/c++ -DKF5IdleTimeXcbPlugin1_EXPORTS -DKF_DEPRECATED_WARNINGS_SINCE=0x060000 -DKF_DISABLE_DEPRECATED_BEFORE_AND_AT=0x055900 -DKIDLETIME_DEPRECATED_WARNINGS_SINCE=0x0 -DKIDLETIME_DISABLE_DEPRECATED_BEFORE_AND_AT=0x0 -DQT_CORE_LIB -DQT_DBUS_LIB -DQT_DEPRECATED_WARNINGS_SINCE=0x060000 -DQT_DISABLE_DEPRECATED_BEFORE=0x050f02 -DQT_GUI_LIB -DQT_NO_CAST_FROM_ASCII -DQT_NO_CAST_FROM_BYTEARRAY -DQT_NO_CAST_TO_ASCII -DQT_NO_DEBUG -DQT_NO_FOREACH -DQT_NO_KEYWORDS -DQT_NO_NARROWING_CONVERSIONS_IN_CONNECT -DQT_NO_URL_CAST_FROM_STRING -DQT_STRICT_ITERATORS -DQT_USE_QSTRINGBUILDER -DQT_X11EXTRAS_LIB -D_FILE_OFFSET_BITS=64 -D_GNU_SOURCE -D_LARGEFILE64_SOURCE -I/usr/src/RPM/BUILD/kidletime-5.94.0/BUILD/src/plugins/xscreensaver -I/usr/src/RPM/BUILD/kidletime-5.94.0/src/plugins/xscreensaver -I/usr/src/RPM/BUILD/kidletime-5.94.0/BUILD/src/plugins/xscreensaver/KF5IdleTimeXcbPlugin1_autogen/include -I/usr/src/RPM/BUILD/kidletime-5.94.0/BUILD/src -I/usr/src/RPM/BUILD/kidletime-5.94.0/src -isystem /usr/include/qt5 -isystem /usr/include/qt5/QtCore -isystem /usr/share/qt5/../../lib/qt5/mkspecs/linux-g++ -isystem /usr/include/qt5/QtDBus -isystem /usr/include/qt5/QtX11Extras -isystem /usr/include/qt5/QtGui -pipe -frecord-gcc-switches -Wall -g -O2 -flto=auto -march=i586 -mtune=generic -fno-operator-names -fno-exceptions -Wall -Wextra -Wcast-align -Wchar-subscripts -Wformat-security -Wno-long-long -Wpointer-arith -Wundef -Wnon-virtual-dtor -Woverloaded-virtual -Werror=return-type -Werror=init-self -Wvla -Wdate-time -Wsuggest-override -Wlogical-op -pedantic -Wzero-as-null-pointer-constant -Wmissing-include-dirs -O2 -DNDEBUG -fPIC -fvisibility=hidden -fvisibility-inlines-hidden -fPIC -std=c++17 -MD -MT src/plugins/xscreensaver/CMakeFiles/KF5IdleTimeXcbPlugin1.dir/xscreensaverbasedpoller.cpp.o -MF CMakeFiles/KF5IdleTimeXcbPlugin1.dir/xscreensaverbasedpoller.cpp.o.d -o CMakeFiles/KF5IdleTimeXcbPlugin1.dir/xscreensaverbasedpoller.cpp.o -c /usr/src/RPM/BUILD/kidletime-5.94.0/src/plugins/xscreensaver/xscreensaverbasedpoller.cpp
make[2]: Leaving directory '/usr/src/RPM/BUILD/kidletime-5.94.0/BUILD'
make[2]: Entering directory '/usr/src/RPM/BUILD/kidletime-5.94.0/BUILD'
[100%] Linking CXX shared module ../../../bin/KF5IdleTimeXcbPlugin1.so
cd /usr/src/RPM/BUILD/kidletime-5.94.0/BUILD/src/plugins/xscreensaver && /usr/bin/cmake -E cmake_link_script CMakeFiles/KF5IdleTimeXcbPlugin1.dir/link.txt --verbose=1
/usr/bin/c++ -fPIC -pipe -frecord-gcc-switches -Wall -g -O2 -flto=auto -march=i586 -mtune=generic -fno-operator-names -fno-exceptions -Wall -Wextra -Wcast-align -Wchar-subscripts -Wformat-security -Wno-long-long -Wpointer-arith -Wundef -Wnon-virtual-dtor -Woverloaded-virtual -Werror=return-type -Werror=init-self -Wvla -Wdate-time -Wsuggest-override -Wlogical-op -pedantic -Wzero-as-null-pointer-constant -Wmissing-include-dirs -O2 -DNDEBUG -Wl,--no-undefined -Wl,--fatal-warnings -Wl,--enable-new-dtags -L/usr/lib -L/usr/lib/kf5/devel -Wl,-Bsymbolic-functions -shared -o ../../../bin/KF5IdleTimeXcbPlugin1.so CMakeFiles/KF5IdleTimeXcbPlugin1.dir/KF5IdleTimeXcbPlugin1_autogen/mocs_compilation.cpp.o CMakeFiles/KF5IdleTimeXcbPlugin1.dir/xscreensaverbasedpoller.cpp.o CMakeFiles/KF5IdleTimeXcbPlugin1.dir/screensaver_interface.cpp.o ../../../bin/libKF5IdleTime.so.5.94.0 /usr/lib/libQt5DBus.so.5.15.2 /usr/lib/libSM.so /usr/lib/libICE.so /usr/lib/libX11.so /usr/lib/libXext.so /usr/lib/libXss.so /usr/lib/libQt5X11Extras.so.5.15.2 /usr/lib/libQt5Gui.so.5.15.2 /usr/lib/libQt5Core.so.5.15.2
make[2]: Leaving directory '/usr/src/RPM/BUILD/kidletime-5.94.0/BUILD'
make[1]: Entering directory '/usr/src/RPM/BUILD/kidletime-5.94.0/BUILD'
[100%] Built target KF5IdleTimeXcbPlugin1
make[1]: Leaving directory '/usr/src/RPM/BUILD/kidletime-5.94.0/BUILD'
make: Entering directory '/usr/src/RPM/BUILD/kidletime-5.94.0/BUILD'
/usr/bin/cmake -E cmake_progress_start /usr/src/RPM/BUILD/kidletime-5.94.0/BUILD/CMakeFiles 0
make: Leaving directory '/usr/src/RPM/BUILD/kidletime-5.94.0/BUILD'
+ popd
~/RPM/BUILD/kidletime-5.94.0
+ exit 0
Executing(%install): /bin/sh -e /usr/src/tmp/rpm-tmp.16369
+ umask 022
+ /bin/mkdir -p /usr/src/RPM/BUILD
+ cd /usr/src/RPM/BUILD
+ /bin/chmod -Rf u+rwX -- /usr/src/tmp/kf5-kidletime-buildroot
+ :
+ /bin/rm -rf -- /usr/src/tmp/kf5-kidletime-buildroot
+ PATH=/usr/libexec/rpm-build:/usr/src/bin:/bin:/usr/bin:/usr/X11R6/bin:/usr/games
+ cd kidletime-5.94.0
+ __kf5_install
+ make -C BUILD DESTDIR=/usr/src/tmp/kf5-kidletime-buildroot install
make: Entering directory '/usr/src/RPM/BUILD/kidletime-5.94.0/BUILD'
/usr/bin/cmake -S/usr/src/RPM/BUILD/kidletime-5.94.0 -B/usr/src/RPM/BUILD/kidletime-5.94.0/BUILD --check-build-system CMakeFiles/Makefile.cmake 0
/usr/bin/cmake -E cmake_progress_start /usr/src/RPM/BUILD/kidletime-5.94.0/BUILD/CMakeFiles /usr/src/RPM/BUILD/kidletime-5.94.0/BUILD//CMakeFiles/progress.marks
make -f CMakeFiles/Makefile2 all
make[1]: Entering directory '/usr/src/RPM/BUILD/kidletime-5.94.0/BUILD'
make -f src/CMakeFiles/KF5IdleTime_autogen.dir/build.make src/CMakeFiles/KF5IdleTime_autogen.dir/depend
make[2]: Entering directory '/usr/src/RPM/BUILD/kidletime-5.94.0/BUILD'
cd /usr/src/RPM/BUILD/kidletime-5.94.0/BUILD && /usr/bin/cmake -E cmake_depends "Unix Makefiles" /usr/src/RPM/BUILD/kidletime-5.94.0 /usr/src/RPM/BUILD/kidletime-5.94.0/src /usr/src/RPM/BUILD/kidletime-5.94.0/BUILD /usr/src/RPM/BUILD/kidletime-5.94.0/BUILD/src /usr/src/RPM/BUILD/kidletime-5.94.0/BUILD/src/CMakeFiles/KF5IdleTime_autogen.dir/DependInfo.cmake --color=
make[2]: Leaving directory '/usr/src/RPM/BUILD/kidletime-5.94.0/BUILD'
make -f src/CMakeFiles/KF5IdleTime_autogen.dir/build.make src/CMakeFiles/KF5IdleTime_autogen.dir/build
make[2]: Entering directory '/usr/src/RPM/BUILD/kidletime-5.94.0/BUILD'
[ 4%] Automatic MOC for target KF5IdleTime
cd /usr/src/RPM/BUILD/kidletime-5.94.0/BUILD/src && /usr/bin/cmake -E cmake_autogen /usr/src/RPM/BUILD/kidletime-5.94.0/BUILD/src/CMakeFiles/KF5IdleTime_autogen.dir/AutogenInfo.json Release
make[2]: Leaving directory '/usr/src/RPM/BUILD/kidletime-5.94.0/BUILD'
[ 4%] Built target KF5IdleTime_autogen
make -f src/CMakeFiles/KF5IdleTime.dir/build.make src/CMakeFiles/KF5IdleTime.dir/depend
make[2]: Entering directory '/usr/src/RPM/BUILD/kidletime-5.94.0/BUILD'
cd /usr/src/RPM/BUILD/kidletime-5.94.0/BUILD && /usr/bin/cmake -E cmake_depends "Unix Makefiles" /usr/src/RPM/BUILD/kidletime-5.94.0 /usr/src/RPM/BUILD/kidletime-5.94.0/src /usr/src/RPM/BUILD/kidletime-5.94.0/BUILD /usr/src/RPM/BUILD/kidletime-5.94.0/BUILD/src /usr/src/RPM/BUILD/kidletime-5.94.0/BUILD/src/CMakeFiles/KF5IdleTime.dir/DependInfo.cmake --color=
Consolidate compiler generated dependencies of target KF5IdleTime
make[2]: Leaving directory '/usr/src/RPM/BUILD/kidletime-5.94.0/BUILD'
make -f src/CMakeFiles/KF5IdleTime.dir/build.make src/CMakeFiles/KF5IdleTime.dir/build
make[2]: Entering directory '/usr/src/RPM/BUILD/kidletime-5.94.0/BUILD'
make[2]: Nothing to be done for 'src/CMakeFiles/KF5IdleTime.dir/build'.
make[2]: Leaving directory '/usr/src/RPM/BUILD/kidletime-5.94.0/BUILD'
[ 28%] Built target KF5IdleTime
make -f src/plugins/xscreensaver/CMakeFiles/KF5IdleTimeXcbPlugin1_autogen.dir/build.make src/plugins/xscreensaver/CMakeFiles/KF5IdleTimeXcbPlugin1_autogen.dir/depend
make[2]: Entering directory '/usr/src/RPM/BUILD/kidletime-5.94.0/BUILD'
cd /usr/src/RPM/BUILD/kidletime-5.94.0/BUILD && /usr/bin/cmake -E cmake_depends "Unix Makefiles" /usr/src/RPM/BUILD/kidletime-5.94.0 /usr/src/RPM/BUILD/kidletime-5.94.0/src/plugins/xscreensaver /usr/src/RPM/BUILD/kidletime-5.94.0/BUILD /usr/src/RPM/BUILD/kidletime-5.94.0/BUILD/src/plugins/xscreensaver /usr/src/RPM/BUILD/kidletime-5.94.0/BUILD/src/plugins/xscreensaver/CMakeFiles/KF5IdleTimeXcbPlugin1_autogen.dir/DependInfo.cmake --color=
make[2]: Leaving directory '/usr/src/RPM/BUILD/kidletime-5.94.0/BUILD'
make -f src/plugins/xscreensaver/CMakeFiles/KF5IdleTimeXcbPlugin1_autogen.dir/build.make src/plugins/xscreensaver/CMakeFiles/KF5IdleTimeXcbPlugin1_autogen.dir/build
make[2]: Entering directory '/usr/src/RPM/BUILD/kidletime-5.94.0/BUILD'
[ 32%] Automatic MOC for target KF5IdleTimeXcbPlugin1
cd /usr/src/RPM/BUILD/kidletime-5.94.0/BUILD/src/plugins/xscreensaver && /usr/bin/cmake -E cmake_autogen /usr/src/RPM/BUILD/kidletime-5.94.0/BUILD/src/plugins/xscreensaver/CMakeFiles/KF5IdleTimeXcbPlugin1_autogen.dir/AutogenInfo.json Release
make[2]: Leaving directory '/usr/src/RPM/BUILD/kidletime-5.94.0/BUILD'
[ 32%] Built target KF5IdleTimeXcbPlugin1_autogen
make -f src/plugins/xscreensaver/CMakeFiles/KF5IdleTimeXcbPlugin1.dir/build.make src/plugins/xscreensaver/CMakeFiles/KF5IdleTimeXcbPlugin1.dir/depend
make[2]: Entering directory '/usr/src/RPM/BUILD/kidletime-5.94.0/BUILD'
cd /usr/src/RPM/BUILD/kidletime-5.94.0/BUILD && /usr/bin/cmake -E cmake_depends "Unix Makefiles" /usr/src/RPM/BUILD/kidletime-5.94.0 /usr/src/RPM/BUILD/kidletime-5.94.0/src/plugins/xscreensaver /usr/src/RPM/BUILD/kidletime-5.94.0/BUILD /usr/src/RPM/BUILD/kidletime-5.94.0/BUILD/src/plugins/xscreensaver /usr/src/RPM/BUILD/kidletime-5.94.0/BUILD/src/plugins/xscreensaver/CMakeFiles/KF5IdleTimeXcbPlugin1.dir/DependInfo.cmake --color=
Consolidate compiler generated dependencies of target KF5IdleTimeXcbPlugin1
make[2]: Leaving directory '/usr/src/RPM/BUILD/kidletime-5.94.0/BUILD'
make -f src/plugins/xscreensaver/CMakeFiles/KF5IdleTimeXcbPlugin1.dir/build.make src/plugins/xscreensaver/CMakeFiles/KF5IdleTimeXcbPlugin1.dir/build
make[2]: Entering directory '/usr/src/RPM/BUILD/kidletime-5.94.0/BUILD'
make[2]: Nothing to be done for 'src/plugins/xscreensaver/CMakeFiles/KF5IdleTimeXcbPlugin1.dir/build'.
make[2]: Leaving directory '/usr/src/RPM/BUILD/kidletime-5.94.0/BUILD'
[ 56%] Built target KF5IdleTimeXcbPlugin1
make -f src/plugins/xsync/CMakeFiles/KF5IdleTimeXcbPlugin0_autogen.dir/build.make src/plugins/xsync/CMakeFiles/KF5IdleTimeXcbPlugin0_autogen.dir/depend
make[2]: Entering directory '/usr/src/RPM/BUILD/kidletime-5.94.0/BUILD'
cd /usr/src/RPM/BUILD/kidletime-5.94.0/BUILD && /usr/bin/cmake -E cmake_depends "Unix Makefiles" /usr/src/RPM/BUILD/kidletime-5.94.0 /usr/src/RPM/BUILD/kidletime-5.94.0/src/plugins/xsync /usr/src/RPM/BUILD/kidletime-5.94.0/BUILD /usr/src/RPM/BUILD/kidletime-5.94.0/BUILD/src/plugins/xsync /usr/src/RPM/BUILD/kidletime-5.94.0/BUILD/src/plugins/xsync/CMakeFiles/KF5IdleTimeXcbPlugin0_autogen.dir/DependInfo.cmake --color=
make[2]: Leaving directory '/usr/src/RPM/BUILD/kidletime-5.94.0/BUILD'
make -f src/plugins/xsync/CMakeFiles/KF5IdleTimeXcbPlugin0_autogen.dir/build.make src/plugins/xsync/CMakeFiles/KF5IdleTimeXcbPlugin0_autogen.dir/build
make[2]: Entering directory '/usr/src/RPM/BUILD/kidletime-5.94.0/BUILD'
[ 60%] Automatic MOC for target KF5IdleTimeXcbPlugin0
cd /usr/src/RPM/BUILD/kidletime-5.94.0/BUILD/src/plugins/xsync && /usr/bin/cmake -E cmake_autogen /usr/src/RPM/BUILD/kidletime-5.94.0/BUILD/src/plugins/xsync/CMakeFiles/KF5IdleTimeXcbPlugin0_autogen.dir/AutogenInfo.json Release
make[2]: Leaving directory '/usr/src/RPM/BUILD/kidletime-5.94.0/BUILD'
[ 60%] Built target KF5IdleTimeXcbPlugin0_autogen
make -f src/plugins/xsync/CMakeFiles/KF5IdleTimeXcbPlugin0.dir/build.make src/plugins/xsync/CMakeFiles/KF5IdleTimeXcbPlugin0.dir/depend
make[2]: Entering directory '/usr/src/RPM/BUILD/kidletime-5.94.0/BUILD'
cd /usr/src/RPM/BUILD/kidletime-5.94.0/BUILD && /usr/bin/cmake -E cmake_depends "Unix Makefiles" /usr/src/RPM/BUILD/kidletime-5.94.0 /usr/src/RPM/BUILD/kidletime-5.94.0/src/plugins/xsync /usr/src/RPM/BUILD/kidletime-5.94.0/BUILD /usr/src/RPM/BUILD/kidletime-5.94.0/BUILD/src/plugins/xsync /usr/src/RPM/BUILD/kidletime-5.94.0/BUILD/src/plugins/xsync/CMakeFiles/KF5IdleTimeXcbPlugin0.dir/DependInfo.cmake --color=
Consolidate compiler generated dependencies of target KF5IdleTimeXcbPlugin0
make[2]: Leaving directory '/usr/src/RPM/BUILD/kidletime-5.94.0/BUILD'
make -f src/plugins/xsync/CMakeFiles/KF5IdleTimeXcbPlugin0.dir/build.make src/plugins/xsync/CMakeFiles/KF5IdleTimeXcbPlugin0.dir/build
make[2]: Entering directory '/usr/src/RPM/BUILD/kidletime-5.94.0/BUILD'
make[2]: Nothing to be done for 'src/plugins/xsync/CMakeFiles/KF5IdleTimeXcbPlugin0.dir/build'.
make[2]: Leaving directory '/usr/src/RPM/BUILD/kidletime-5.94.0/BUILD'
[ 80%] Built target KF5IdleTimeXcbPlugin0
make -f examples/CMakeFiles/kidletime_example_autogen.dir/build.make examples/CMakeFiles/kidletime_example_autogen.dir/depend
make[2]: Entering directory '/usr/src/RPM/BUILD/kidletime-5.94.0/BUILD'
cd /usr/src/RPM/BUILD/kidletime-5.94.0/BUILD && /usr/bin/cmake -E cmake_depends "Unix Makefiles" /usr/src/RPM/BUILD/kidletime-5.94.0 /usr/src/RPM/BUILD/kidletime-5.94.0/examples /usr/src/RPM/BUILD/kidletime-5.94.0/BUILD /usr/src/RPM/BUILD/kidletime-5.94.0/BUILD/examples /usr/src/RPM/BUILD/kidletime-5.94.0/BUILD/examples/CMakeFiles/kidletime_example_autogen.dir/DependInfo.cmake --color=
make[2]: Leaving directory '/usr/src/RPM/BUILD/kidletime-5.94.0/BUILD'
make -f examples/CMakeFiles/kidletime_example_autogen.dir/build.make examples/CMakeFiles/kidletime_example_autogen.dir/build
make[2]: Entering directory '/usr/src/RPM/BUILD/kidletime-5.94.0/BUILD'
[ 84%] Automatic MOC for target kidletime_example
cd /usr/src/RPM/BUILD/kidletime-5.94.0/BUILD/examples && /usr/bin/cmake -E cmake_autogen /usr/src/RPM/BUILD/kidletime-5.94.0/BUILD/examples/CMakeFiles/kidletime_example_autogen.dir/AutogenInfo.json Release
make[2]: Leaving directory '/usr/src/RPM/BUILD/kidletime-5.94.0/BUILD'
[ 84%] Built target kidletime_example_autogen
make -f examples/CMakeFiles/kidletime_example.dir/build.make examples/CMakeFiles/kidletime_example.dir/depend
make[2]: Entering directory '/usr/src/RPM/BUILD/kidletime-5.94.0/BUILD'
cd /usr/src/RPM/BUILD/kidletime-5.94.0/BUILD && /usr/bin/cmake -E cmake_depends "Unix Makefiles" /usr/src/RPM/BUILD/kidletime-5.94.0 /usr/src/RPM/BUILD/kidletime-5.94.0/examples /usr/src/RPM/BUILD/kidletime-5.94.0/BUILD /usr/src/RPM/BUILD/kidletime-5.94.0/BUILD/examples /usr/src/RPM/BUILD/kidletime-5.94.0/BUILD/examples/CMakeFiles/kidletime_example.dir/DependInfo.cmake --color=
Consolidate compiler generated dependencies of target kidletime_example
make[2]: Leaving directory '/usr/src/RPM/BUILD/kidletime-5.94.0/BUILD'
make -f examples/CMakeFiles/kidletime_example.dir/build.make examples/CMakeFiles/kidletime_example.dir/build
make[2]: Entering directory '/usr/src/RPM/BUILD/kidletime-5.94.0/BUILD'
make[2]: Nothing to be done for 'examples/CMakeFiles/kidletime_example.dir/build'.
make[2]: Leaving directory '/usr/src/RPM/BUILD/kidletime-5.94.0/BUILD'
[100%] Built target kidletime_example
make[1]: Leaving directory '/usr/src/RPM/BUILD/kidletime-5.94.0/BUILD'
/usr/bin/cmake -E cmake_progress_start /usr/src/RPM/BUILD/kidletime-5.94.0/BUILD/CMakeFiles 0
make -f CMakeFiles/Makefile2 preinstall
make[1]: Entering directory '/usr/src/RPM/BUILD/kidletime-5.94.0/BUILD'
make[1]: Nothing to be done for 'preinstall'.
make[1]: Leaving directory '/usr/src/RPM/BUILD/kidletime-5.94.0/BUILD'
Install the project...
/usr/bin/cmake -P cmake_install.cmake
-- Install configuration: "Release"
-- Installing: /usr/src/tmp/kf5-kidletime-buildroot/usr/lib/qt5/plugins/kf5/org.kde.kidletime.platforms/KF5IdleTimeXcbPlugin1.so
-- Installing: /usr/src/tmp/kf5-kidletime-buildroot/usr/lib/qt5/plugins/kf5/org.kde.kidletime.platforms/KF5IdleTimeXcbPlugin0.so
-- Installing: /usr/src/tmp/kf5-kidletime-buildroot/usr/include/KF5/KIdleTime/kidletime_export.h
-- Installing: /usr/src/tmp/kf5-kidletime-buildroot/usr/include/KF5/KIdleTime/KIdleTime
-- Installing: /usr/src/tmp/kf5-kidletime-buildroot/usr/include/KF5/KIdleTime/kidletime.h
-- Installing: /usr/src/tmp/kf5-kidletime-buildroot/usr/include/KF5/KIdleTime/private/abstractsystempoller.h
-- Installing: /usr/src/tmp/kf5-kidletime-buildroot/usr/lib/libKF5IdleTime.so.5.94.0
-- Installing: /usr/src/tmp/kf5-kidletime-buildroot/usr/lib/libKF5IdleTime.so.5
-- Installing: /usr/src/tmp/kf5-kidletime-buildroot/usr/lib/libKF5IdleTime.so
-- Installing: /usr/src/tmp/kf5-kidletime-buildroot/usr/share/qlogging-categories5/kidletime.categories
-- Installing: /usr/src/tmp/kf5-kidletime-buildroot/usr/share/qlogging-categories5/kidletime.renamecategories
-- Installing: /usr/src/tmp/kf5-kidletime-buildroot/usr/lib/qt5/mkspecs/modules/qt_KIdleTime.pri
-- Installing: /usr/src/tmp/kf5-kidletime-buildroot/usr/lib/cmake/KF5IdleTime/KF5IdleTimeConfig.cmake
-- Installing: /usr/src/tmp/kf5-kidletime-buildroot/usr/lib/cmake/KF5IdleTime/KF5IdleTimeConfigVersion.cmake
-- Installing: /usr/src/tmp/kf5-kidletime-buildroot/usr/lib/cmake/KF5IdleTime/KF5IdleTimeTargets.cmake
-- Installing: /usr/src/tmp/kf5-kidletime-buildroot/usr/lib/cmake/KF5IdleTime/KF5IdleTimeTargets-release.cmake
-- Installing: /usr/src/tmp/kf5-kidletime-buildroot/usr/include/KF5/KIdleTime/kidletime_version.h
make: Leaving directory '/usr/src/RPM/BUILD/kidletime-5.94.0/BUILD'
+ '[' -d /usr/src/tmp/kf5-kidletime-buildroot//usr/share ']'
+ ls -1d '/usr/src/tmp/kf5-kidletime-buildroot//usr/share/kf5/k*5'
+ read d
ls: cannot access '/usr/src/tmp/kf5-kidletime-buildroot//usr/share/kf5/k*5': No such file or directory
+ '[' -d /usr/src/tmp/kf5-kidletime-buildroot//usr/share/kf5/lib64 ']'
+ '[' -d /usr/src/tmp/kf5-kidletime-buildroot//usr/share/kf5/lib ']'
+ ls -1 /usr/src/tmp/kf5-kidletime-buildroot//usr/lib/libKF5IdleTime.so
+ read p
+ '[' -L /usr/src/tmp/kf5-kidletime-buildroot//usr/lib/libKF5IdleTime.so ']'
+ mkdir -p /usr/src/tmp/kf5-kidletime-buildroot//usr/lib/kf5/devel
++ readlink /usr/src/tmp/kf5-kidletime-buildroot//usr/lib/libKF5IdleTime.so
+ f=libKF5IdleTime.so.5
++ basename /usr/src/tmp/kf5-kidletime-buildroot//usr/lib/libKF5IdleTime.so
+ l=libKF5IdleTime.so
++ relative /usr/src/tmp/kf5-kidletime-buildroot//usr/lib/libKF5IdleTime.so.5 /usr/src/tmp/kf5-kidletime-buildroot//usr/lib/kf5/devel/libKF5IdleTime.so.5
+ ln -sf ../../libKF5IdleTime.so.5 /usr/src/tmp/kf5-kidletime-buildroot//usr/lib/kf5/devel/libKF5IdleTime.so
+ rm -f /usr/src/tmp/kf5-kidletime-buildroot//usr/lib/libKF5IdleTime.so
+ read p
+ '[' -d /usr/src/tmp/kf5-kidletime-buildroot//usr/share/kf5/bin ']'
+ '[' -d /usr/src/tmp/kf5-kidletime-buildroot//usr/share/kf5/include ']'
+ '[' -d /usr/src/tmp/kf5-kidletime-buildroot//usr/lib/kf5/bin -a true == true ']'
+ ls -1 '/usr/src/tmp/kf5-kidletime-buildroot//usr/share/kf5/dbus-1/services/*5*.service'
+ read s
+ '[' -d /usr/src/tmp/kf5-kidletime-buildroot//usr/share/akonadi ']'
+ '[' -d /usr/src/tmp/kf5-kidletime-buildroot//usr/share/kf5/akonadi ']'
+ '[' -d /usr/src/tmp/kf5-kidletime-buildroot//usr/share/man -a remove == remove ']'
+ '[' -d /usr/src/tmp/kf5-kidletime-buildroot//usr/share/appdata -a keep == remove ']'
+ '[' -d /usr/src/tmp/kf5-kidletime-buildroot//usr/share/metainfo -a keep == remove ']'
+ '[' -d /usr/src/tmp/kf5-kidletime-buildroot//usr/lib/cmake/ ']'
+ find /usr/src/tmp/kf5-kidletime-buildroot//usr/lib/cmake/ -type f -name '*.cmake'
+ read f
+ sed -i -e 's|\(set(.*\)${PACKAGE_PREFIX_DIR}//usr/|\1${PACKAGE_PREFIX_DIR}/|' /usr/src/tmp/kf5-kidletime-buildroot//usr/lib/cmake/KF5IdleTime/KF5IdleTimeTargets-release.cmake
+ sed -i -e 's|/usr//usr/|/usr/|' /usr/src/tmp/kf5-kidletime-buildroot//usr/lib/cmake/KF5IdleTime/KF5IdleTimeTargets-release.cmake
+ read f
+ sed -i -e 's|\(set(.*\)${PACKAGE_PREFIX_DIR}//usr/|\1${PACKAGE_PREFIX_DIR}/|' /usr/src/tmp/kf5-kidletime-buildroot//usr/lib/cmake/KF5IdleTime/KF5IdleTimeTargets.cmake
+ sed -i -e 's|/usr//usr/|/usr/|' /usr/src/tmp/kf5-kidletime-buildroot//usr/lib/cmake/KF5IdleTime/KF5IdleTimeTargets.cmake
+ read f
+ sed -i -e 's|\(set(.*\)${PACKAGE_PREFIX_DIR}//usr/|\1${PACKAGE_PREFIX_DIR}/|' /usr/src/tmp/kf5-kidletime-buildroot//usr/lib/cmake/KF5IdleTime/KF5IdleTimeConfigVersion.cmake
+ sed -i -e 's|/usr//usr/|/usr/|' /usr/src/tmp/kf5-kidletime-buildroot//usr/lib/cmake/KF5IdleTime/KF5IdleTimeConfigVersion.cmake
+ read f
+ sed -i -e 's|\(set(.*\)${PACKAGE_PREFIX_DIR}//usr/|\1${PACKAGE_PREFIX_DIR}/|' /usr/src/tmp/kf5-kidletime-buildroot//usr/lib/cmake/KF5IdleTime/KF5IdleTimeConfig.cmake
+ sed -i -e 's|/usr//usr/|/usr/|' /usr/src/tmp/kf5-kidletime-buildroot//usr/lib/cmake/KF5IdleTime/KF5IdleTimeConfig.cmake
+ read f
+ /usr/lib/rpm/find-lang kf5-kidletime --all-name
+ rpm-build-kf5-find-qtlang kf5-kidletime --all-name
+ /usr/lib/rpm/brp-alt
Cleaning files in /usr/src/tmp/kf5-kidletime-buildroot (auto)
mode of './usr/lib/libKF5IdleTime.so.5.94.0' changed from 0755 (rwxr-xr-x) to 0644 (rw-r--r--)
mode of './usr/lib/qt5/plugins/kf5/org.kde.kidletime.platforms/KF5IdleTimeXcbPlugin0.so' changed from 0755 (rwxr-xr-x) to 0644 (rw-r--r--)
mode of './usr/lib/qt5/plugins/kf5/org.kde.kidletime.platforms/KF5IdleTimeXcbPlugin1.so' changed from 0755 (rwxr-xr-x) to 0644 (rw-r--r--)
Verifying and fixing files in /usr/src/tmp/kf5-kidletime-buildroot (binconfig,pkgconfig,libtool,desktop,gnuconfig)
Checking contents of files in /usr/src/tmp/kf5-kidletime-buildroot/ (default)
Compressing files in /usr/src/tmp/kf5-kidletime-buildroot (auto)
Adjusting library links in /usr/src/tmp/kf5-kidletime-buildroot
./usr/lib: (from :0)
libKF5IdleTime.so.5 -> libKF5IdleTime.so.5.94.0
Verifying ELF objects in /usr/src/tmp/kf5-kidletime-buildroot (arch=normal,fhs=normal,lfs=relaxed,lint=relaxed,rpath=normal,stack=normal,textrel=normal,unresolved=normal)
Processing files: kf5-kidletime-common-5.94.0-alt1
Executing(%doc): /bin/sh -e /usr/src/tmp/rpm-tmp.15447
+ umask 022
+ /bin/mkdir -p /usr/src/RPM/BUILD
+ cd /usr/src/RPM/BUILD
+ cd kidletime-5.94.0
+ DOCDIR=/usr/src/tmp/kf5-kidletime-buildroot/usr/share/doc/kf5-kidletime-common-5.94.0
+ export DOCDIR
+ rm -rf /usr/src/tmp/kf5-kidletime-buildroot/usr/share/doc/kf5-kidletime-common-5.94.0
+ /bin/mkdir -p /usr/src/tmp/kf5-kidletime-buildroot/usr/share/doc/kf5-kidletime-common-5.94.0
+ cp -prL LICENSES/CC0-1.0.txt LICENSES/GPL-2.0-or-later.txt LICENSES/LGPL-2.1-or-later.txt LICENSES/MIT.txt README.md /usr/src/tmp/kf5-kidletime-buildroot/usr/share/doc/kf5-kidletime-common-5.94.0
+ chmod -R go-w /usr/src/tmp/kf5-kidletime-buildroot/usr/share/doc/kf5-kidletime-common-5.94.0
+ chmod -R a+rX /usr/src/tmp/kf5-kidletime-buildroot/usr/share/doc/kf5-kidletime-common-5.94.0
+ exit 0
Finding Provides (using /usr/lib/rpm/find-provides)
Executing: /bin/sh -e /usr/src/tmp/rpm-tmp.nVDgKu
find-provides: running scripts (alternatives,debuginfo,gir,lib,pam,perl,pkgconfig,python,python3,qml,shell,typelib)
Finding Requires (using /usr/lib/rpm/find-requires)
Executing: /bin/sh -e /usr/src/tmp/rpm-tmp.jUeW69
find-requires: running scripts (cpp,debuginfo,files,gir-js,gir-python,gir,lib,pam,perl,pkgconfig,pkgconfiglib,python,python3,qml,rpmlib,shebang,shell,static,symlinks,systemd-services,typelib)
Requires: kf5-filesystem
Processing files: kf5-kidletime-devel-5.94.0-alt1
Finding Provides (using /usr/lib/rpm/find-provides)
Executing: /bin/sh -e /usr/src/tmp/rpm-tmp.3AJQvD
find-provides: running scripts (alternatives,debuginfo,gir,lib,pam,perl,pkgconfig,python,python3,qml,shell,typelib)
Finding Requires (using /usr/lib/rpm/find-requires)
Executing: /bin/sh -e /usr/src/tmp/rpm-tmp.opsW6V
find-requires: running scripts (cpp,debuginfo,files,gir-js,gir-python,gir,lib,pam,perl,pkgconfig,pkgconfiglib,python,python3,qml,rpmlib,shebang,shell,static,symlinks,systemd-services,typelib)
/usr/src/tmp/kf5-kidletime-buildroot/usr/include/KF5/KIdleTime/kidletime.h:11:10: fatal error: QHash: No such file or directory
11 | #include
| ^~~~~~~
compilation terminated.
cpp.req: /usr/src/tmp/kf5-kidletime-buildroot/usr/include/KF5/KIdleTime/kidletime.h: cpp failed, trying c++ mode
/usr/src/tmp/kf5-kidletime-buildroot/usr/include/KF5/KIdleTime/kidletime.h:11:10: fatal error: QHash: No such file or directory
11 | #include
| ^~~~~~~
compilation terminated.
cpp.req: WARNING: /usr/src/tmp/kf5-kidletime-buildroot/usr/include/KF5/KIdleTime/kidletime.h: cpp failed
/usr/src/tmp/kf5-kidletime-buildroot/usr/include/KF5/KIdleTime/private/abstractsystempoller.h:12:10: fatal error: QObject: No such file or directory
12 | #include
| ^~~~~~~~~
compilation terminated.
cpp.req: /usr/src/tmp/kf5-kidletime-buildroot/usr/include/KF5/KIdleTime/private/abstractsystempoller.h: cpp failed, trying c++ mode
/usr/src/tmp/kf5-kidletime-buildroot/usr/include/KF5/KIdleTime/private/abstractsystempoller.h:12:10: fatal error: QObject: No such file or directory
12 | #include
| ^~~~~~~~~
compilation terminated.
cpp.req: WARNING: /usr/src/tmp/kf5-kidletime-buildroot/usr/include/KF5/KIdleTime/private/abstractsystempoller.h: cpp failed
Requires: /usr/lib/libKF5IdleTime.so.5
Finding debuginfo files (using /usr/lib/rpm/find-debuginfo-files)
Executing: /bin/sh -e /usr/src/tmp/rpm-tmp.JtG78g
Processing files: libkf5idletime-5.94.0-alt1
Finding Provides (using /usr/lib/rpm/find-provides)
Executing: /bin/sh -e /usr/src/tmp/rpm-tmp.bvlJF7
find-provides: running scripts (alternatives,debuginfo,gir,lib,pam,perl,pkgconfig,python,python3,qml,shell,typelib)
lib.prov: /usr/src/tmp/kf5-kidletime-buildroot/usr/lib/libKF5IdleTime.so.5: 64 symbols, 16 bpp
Finding Requires (using /usr/lib/rpm/find-requires)
Executing: /bin/sh -e /usr/src/tmp/rpm-tmp.GU53hN
find-requires: running scripts (cpp,debuginfo,files,gir-js,gir-python,gir,lib,pam,perl,pkgconfig,pkgconfiglib,python,python3,qml,rpmlib,shebang,shell,static,symlinks,systemd-services,typelib)
Provides: libKF5IdleTime.so.5 = set:jc2zqqys70e5sHExqMYSFPqr7LEL3niX1s8KoIEo9FNO6yXa30pDH6W3P9DmUNJ0e1igeGZHQUkA7IJEDeHVVj9Z0cWgakQ6lK0J0g7G54cFIBsAn2WxdQOZcBipId1
Requires: kf5-kidletime-common = 5.94.0-alt1, libQt5Core.so.5 >= set:qjWAjoIrgM825WpkZzUawlYJjfn2puZhQEkYlHZhG0QBJgZL1TJRIqbK1sVOBogQ5shHVEsVWtLGYbY2TkV0GRcVuU10G3I2Zmi4FOsix21SfC2HD3EShtVo8RTQZsw4nwXywZDBhXtSZrqyJX8qOY8OQ2vmJZlnkqZvWNVLaxkk70Wv2ZBkNETUhOT9ZEjjLCvVZlGxoPJpgAewhKoWmuHh6Zmfou2pdEQKEYOC2ytwgATf4FOZe85txy1ubhrdxXhm2rm6c9UNSv130ZvZm0, libQt5Core.so.5(Qt_5), libQt5Core.so.5(Qt_5.15), libQt5DBus.so.5 >= set:mhL330UbxdTP30MgZbBEjJBF2YP7mn3doiZgKlK49Ec3Z8X0, libQt5DBus.so.5(Qt_5), libQt5Gui.so.5 >= set:rnZJa8grblYXrhZFdhxigFyIpqnjVZfp4, libQt5Gui.so.5(Qt_5), libQt5X11Extras.so.5 >= set:ihqAa, libQt5X11Extras.so.5(Qt_5), libX11-xcb.so.1 >= set:edp7, libX11.so.6 >= set:omNQNZ0EPrQf0, libXext.so.6 >= set:lhnnxLbmf0iijQ9ZKo0L2aHGORWyqn60, libXss.so.1 >= set:hfK9V87, libc.so.6(GLIBC_2.0), libc.so.6(GLIBC_2.1.3), libc.so.6(GLIBC_2.4), libstdc++.so.6(CXXABI_1.3), libstdc++.so.6(CXXABI_1.3.9), libstdc++.so.6(GLIBCXX_3.4), libxcb-sync.so.1 >= set:kjOcj, libxcb.so.1 >= set:nmCri2, rtld(GNU_HASH)
Requires(rpmlib): rpmlib(SetVersions)
Finding debuginfo files (using /usr/lib/rpm/find-debuginfo-files)
Executing: /bin/sh -e /usr/src/tmp/rpm-tmp.gHcNzE
Creating libkf5idletime-debuginfo package
Processing files: libkf5idletime-debuginfo-5.94.0-alt1
Finding Provides (using /usr/lib/rpm/find-provides)
Executing: /bin/sh -e /usr/src/tmp/rpm-tmp.R7ZGeB
find-provides: running scripts (debuginfo)
Finding Requires (using /usr/lib/rpm/find-requires)
Executing: /bin/sh -e /usr/src/tmp/rpm-tmp.GTkpVN
find-requires: running scripts (debuginfo)
Provides: debug(libKF5IdleTime.so.5)
Requires: libkf5idletime = 5.94.0-alt1, debug(libQt5Core.so.5), debug(libQt5DBus.so.5), debug(libQt5Gui.so.5), debug(libQt5X11Extras.so.5), debug(libX11-xcb.so.1), debug(libX11.so.6), debug(libXext.so.6), debug(libXss.so.1), debug(libc.so.6), debug(libstdc++.so.6), debug(libxcb-sync.so.1), debug(libxcb.so.1)
Adding to libkf5idletime a strict dependency on kf5-kidletime-common
Adding to libkf5idletime-debuginfo a strict dependency on libkf5idletime
Adding to kf5-kidletime-devel a strict dependency on libkf5idletime
Removing 1 extra deps from kf5-kidletime-devel due to dependency on libkf5idletime
Wrote: /usr/src/RPM/RPMS/noarch/kf5-kidletime-common-5.94.0-alt1.noarch.rpm (w2.lzdio)
Wrote: /usr/src/RPM/RPMS/i586/kf5-kidletime-devel-5.94.0-alt1.i586.rpm (w2.lzdio)
Wrote: /usr/src/RPM/RPMS/i586/libkf5idletime-5.94.0-alt1.i586.rpm (w2.lzdio)
Wrote: /usr/src/RPM/RPMS/i586/libkf5idletime-debuginfo-5.94.0-alt1.i586.rpm (w2.lzdio)
23.29user 4.77system 0:19.03elapsed 147%CPU (0avgtext+0avgdata 219388maxresident)k
0inputs+0outputs (0major+1765263minor)pagefaults 0swaps
/.out/kf5-kidletime-common-5.94.0-alt1.noarch.rpm: bad symbols in the license tag: /
/.out/kf5-kidletime-devel-5.94.0-alt1.i586.rpm: bad symbols in the license tag: /
/.out/libkf5idletime-5.94.0-alt1.i586.rpm: bad symbols in the license tag: /
/.out/libkf5idletime-debuginfo-5.94.0-alt1.i586.rpm: bad symbols in the license tag: /
34.58user 9.34system 0:35.14elapsed 124%CPU (0avgtext+0avgdata 219388maxresident)k
0inputs+0outputs (45483major+2299568minor)pagefaults 0swaps
--- libkf5idletime-5.94.0-alt1.i586.rpm.repo 2022-05-18 08:59:33.000000000 +0000
+++ libkf5idletime-5.94.0-alt1.i586.rpm.hasher 2022-06-11 05:11:29.306117638 +0000
@@ -33,6 +33,6 @@
File: /usr/lib/libKF5IdleTime.so.5 120777 root:root libKF5IdleTime.so.5.94.0
-File: /usr/lib/libKF5IdleTime.so.5.94.0 100644 root:root f83b625af68ed928dd4b094744d74701
+File: /usr/lib/libKF5IdleTime.so.5.94.0 100644 root:root 0b44f8d8e0fea345d9ebc50e96b587b1
File: /usr/lib/qt5/plugins/kf5/org.kde.kidletime.platforms 40755 root:root
-File: /usr/lib/qt5/plugins/kf5/org.kde.kidletime.platforms/KF5IdleTimeXcbPlugin0.so 100644 root:root 893d6dfdf304656216390f0f1980c104
-File: /usr/lib/qt5/plugins/kf5/org.kde.kidletime.platforms/KF5IdleTimeXcbPlugin1.so 100644 root:root 06a400222f83ae36c76bf32b6fe3b1d9
-RPMIdentity: 45a698ce3e8b20df40866100342e1f71cbea0fe070f019d27e1a86ea34d11f4a05662c4e310cc88583d5ac64bb3ca03fc75314b5cfbfee85e9dc9503ef9e247c
+File: /usr/lib/qt5/plugins/kf5/org.kde.kidletime.platforms/KF5IdleTimeXcbPlugin0.so 100644 root:root 89c999e75e621bb44e856d0c059173c8
+File: /usr/lib/qt5/plugins/kf5/org.kde.kidletime.platforms/KF5IdleTimeXcbPlugin1.so 100644 root:root 74b6283f33dddfc6997e3d8f904ab0c9
+RPMIdentity: f71a2f28a948a27c99f212c895069dd7ce2e0ba51d3ea25a1ab7d462c959328f76e08bfd0f3f0411800a6178921999353ca953964eb2b8f61dbc3d4ded96d87d
--- libkf5idletime-debuginfo-5.94.0-alt1.i586.rpm.repo 2022-05-18 08:59:33.000000000 +0000
+++ libkf5idletime-debuginfo-5.94.0-alt1.i586.rpm.hasher 2022-06-11 05:11:29.373118357 +0000
@@ -1,10 +1,10 @@
-/usr/lib/debug/.build-id/1b 40755 root:root
-/usr/lib/debug/.build-id/1b/aba2df3baa4dc7931d9c84d06bbe8c5ef66cec 120777 root:root ../../../qt5/plugins/kf5/org.kde.kidletime.platforms/KF5IdleTimeXcbPlugin1.so
-/usr/lib/debug/.build-id/1b/aba2df3baa4dc7931d9c84d06bbe8c5ef66cec.debug 120777 root:root ../../usr/lib/qt5/plugins/kf5/org.kde.kidletime.platforms/KF5IdleTimeXcbPlugin1.so.debug
-/usr/lib/debug/.build-id/66 40755 root:root
-/usr/lib/debug/.build-id/66/18d3d33d1351999e46e631d65c54a3dca9c8cd 120777 root:root ../../../qt5/plugins/kf5/org.kde.kidletime.platforms/KF5IdleTimeXcbPlugin0.so
-/usr/lib/debug/.build-id/66/18d3d33d1351999e46e631d65c54a3dca9c8cd.debug 120777 root:root ../../usr/lib/qt5/plugins/kf5/org.kde.kidletime.platforms/KF5IdleTimeXcbPlugin0.so.debug
-/usr/lib/debug/.build-id/f6 40755 root:root
-/usr/lib/debug/.build-id/f6/fdcccc4f2ee7453ea2ed1fdf94157d2a03a811 120777 root:root ../../../libKF5IdleTime.so.5.94.0
-/usr/lib/debug/.build-id/f6/fdcccc4f2ee7453ea2ed1fdf94157d2a03a811.debug 120777 root:root ../../usr/lib/libKF5IdleTime.so.5.94.0.debug
+/usr/lib/debug/.build-id/7d 40755 root:root
+/usr/lib/debug/.build-id/7d/ab6aff6e2c0d719ed3acd0b95db308fd565495 120777 root:root ../../../qt5/plugins/kf5/org.kde.kidletime.platforms/KF5IdleTimeXcbPlugin0.so
+/usr/lib/debug/.build-id/7d/ab6aff6e2c0d719ed3acd0b95db308fd565495.debug 120777 root:root ../../usr/lib/qt5/plugins/kf5/org.kde.kidletime.platforms/KF5IdleTimeXcbPlugin0.so.debug
+/usr/lib/debug/.build-id/8c 40755 root:root
+/usr/lib/debug/.build-id/8c/0ffb309d825e6116c9ee2dab2ccf7cd4fcb9b9 120777 root:root ../../../qt5/plugins/kf5/org.kde.kidletime.platforms/KF5IdleTimeXcbPlugin1.so
+/usr/lib/debug/.build-id/8c/0ffb309d825e6116c9ee2dab2ccf7cd4fcb9b9.debug 120777 root:root ../../usr/lib/qt5/plugins/kf5/org.kde.kidletime.platforms/KF5IdleTimeXcbPlugin1.so.debug
+/usr/lib/debug/.build-id/e9 40755 root:root
+/usr/lib/debug/.build-id/e9/3f54db5b54b2d85dc903bb664c73c7ab6c7f25 120777 root:root ../../../libKF5IdleTime.so.5.94.0
+/usr/lib/debug/.build-id/e9/3f54db5b54b2d85dc903bb664c73c7ab6c7f25.debug 120777 root:root ../../usr/lib/libKF5IdleTime.so.5.94.0.debug
/usr/lib/debug/usr/lib/libKF5IdleTime.so.5.94.0.debug 100644 root:root
@@ -76,12 +76,12 @@
Provides: libkf5idletime-debuginfo = 5.94.0-alt1:sisyphus+300088.1300.6.1
-File: /usr/lib/debug/.build-id/1b 40755 root:root
-File: /usr/lib/debug/.build-id/1b/aba2df3baa4dc7931d9c84d06bbe8c5ef66cec 120777 root:root ../../../qt5/plugins/kf5/org.kde.kidletime.platforms/KF5IdleTimeXcbPlugin1.so
-File: /usr/lib/debug/.build-id/1b/aba2df3baa4dc7931d9c84d06bbe8c5ef66cec.debug 120777 root:root ../../usr/lib/qt5/plugins/kf5/org.kde.kidletime.platforms/KF5IdleTimeXcbPlugin1.so.debug
-File: /usr/lib/debug/.build-id/66 40755 root:root
-File: /usr/lib/debug/.build-id/66/18d3d33d1351999e46e631d65c54a3dca9c8cd 120777 root:root ../../../qt5/plugins/kf5/org.kde.kidletime.platforms/KF5IdleTimeXcbPlugin0.so
-File: /usr/lib/debug/.build-id/66/18d3d33d1351999e46e631d65c54a3dca9c8cd.debug 120777 root:root ../../usr/lib/qt5/plugins/kf5/org.kde.kidletime.platforms/KF5IdleTimeXcbPlugin0.so.debug
-File: /usr/lib/debug/.build-id/f6 40755 root:root
-File: /usr/lib/debug/.build-id/f6/fdcccc4f2ee7453ea2ed1fdf94157d2a03a811 120777 root:root ../../../libKF5IdleTime.so.5.94.0
-File: /usr/lib/debug/.build-id/f6/fdcccc4f2ee7453ea2ed1fdf94157d2a03a811.debug 120777 root:root ../../usr/lib/libKF5IdleTime.so.5.94.0.debug
-File: /usr/lib/debug/usr/lib/libKF5IdleTime.so.5.94.0.debug 100644 root:root 2b225aa9df2486194a2a03f921898475
+File: /usr/lib/debug/.build-id/7d 40755 root:root
+File: /usr/lib/debug/.build-id/7d/ab6aff6e2c0d719ed3acd0b95db308fd565495 120777 root:root ../../../qt5/plugins/kf5/org.kde.kidletime.platforms/KF5IdleTimeXcbPlugin0.so
+File: /usr/lib/debug/.build-id/7d/ab6aff6e2c0d719ed3acd0b95db308fd565495.debug 120777 root:root ../../usr/lib/qt5/plugins/kf5/org.kde.kidletime.platforms/KF5IdleTimeXcbPlugin0.so.debug
+File: /usr/lib/debug/.build-id/8c 40755 root:root
+File: /usr/lib/debug/.build-id/8c/0ffb309d825e6116c9ee2dab2ccf7cd4fcb9b9 120777 root:root ../../../qt5/plugins/kf5/org.kde.kidletime.platforms/KF5IdleTimeXcbPlugin1.so
+File: /usr/lib/debug/.build-id/8c/0ffb309d825e6116c9ee2dab2ccf7cd4fcb9b9.debug 120777 root:root ../../usr/lib/qt5/plugins/kf5/org.kde.kidletime.platforms/KF5IdleTimeXcbPlugin1.so.debug
+File: /usr/lib/debug/.build-id/e9 40755 root:root
+File: /usr/lib/debug/.build-id/e9/3f54db5b54b2d85dc903bb664c73c7ab6c7f25 120777 root:root ../../../libKF5IdleTime.so.5.94.0
+File: /usr/lib/debug/.build-id/e9/3f54db5b54b2d85dc903bb664c73c7ab6c7f25.debug 120777 root:root ../../usr/lib/libKF5IdleTime.so.5.94.0.debug
+File: /usr/lib/debug/usr/lib/libKF5IdleTime.so.5.94.0.debug 100644 root:root 272af7dc0da728ee9f771a0f05f14dee
File: /usr/lib/debug/usr/lib/libKF5IdleTime.so.5.debug 120777 root:root libKF5IdleTime.so.5.94.0.debug
@@ -91,4 +91,4 @@
File: /usr/lib/debug/usr/lib/qt5/plugins/kf5/org.kde.kidletime.platforms 40755 root:root
-File: /usr/lib/debug/usr/lib/qt5/plugins/kf5/org.kde.kidletime.platforms/KF5IdleTimeXcbPlugin0.so.debug 100644 root:root f2f857db21f1e116cf294a1db10001e8
-File: /usr/lib/debug/usr/lib/qt5/plugins/kf5/org.kde.kidletime.platforms/KF5IdleTimeXcbPlugin1.so.debug 100644 root:root 7018dcd16b242098ca3d74ac21423c4e
+File: /usr/lib/debug/usr/lib/qt5/plugins/kf5/org.kde.kidletime.platforms/KF5IdleTimeXcbPlugin0.so.debug 100644 root:root aa104970b59976a9195d68dbe20c06de
+File: /usr/lib/debug/usr/lib/qt5/plugins/kf5/org.kde.kidletime.platforms/KF5IdleTimeXcbPlugin1.so.debug 100644 root:root 262d17b45c4105ddb3b8405dbb3d9293
File: /usr/src/debug/kidletime-5.94.0 40755 root:root
@@ -136,2 +136,2 @@
File: /usr/src/debug/kidletime-5.94.0/src/widgetbasedpoller.h 100644 root:root 33fb47ddf36b5edb011d51f33ffe374c
-RPMIdentity: c141528e907c56c58bb48437bed2cf72b667ea1af139a194957d1f7b5ffca009e35cffe89c18b779f315d6e98e61249681123e86828027c75a0c229a00c034aa
+RPMIdentity: ddf270f6cdadd76d8d16bdf5a7a7c610e7331166c5996be57e0231db71c426d36c1f44b875e31d667fb4d17b6571636e579637fa87337564ae35f5e908da00ed