<86>Jan  1 03:46:26 userdel[2468109]: delete user 'rooter'
<86>Jan  1 03:46:26 userdel[2468109]: removed group 'rooter' owned by 'rooter'
<86>Jan  1 03:46:26 userdel[2468109]: removed shadow group 'rooter' owned by 'rooter'
<86>Jan  1 03:46:26 groupadd[2468181]: group added to /etc/group: name=rooter, GID=939
<86>Jan  1 03:46:26 groupadd[2468181]: group added to /etc/gshadow: name=rooter
<86>Jan  1 03:46:26 groupadd[2468181]: new group: name=rooter, GID=939
<86>Jan  1 03:46:26 useradd[2468235]: new user: name=rooter, UID=939, GID=939, home=/root, shell=/bin/bash
<86>Jan  1 03:46:26 userdel[2468309]: delete user 'builder'
<86>Jan  1 03:46:26 userdel[2468309]: removed group 'builder' owned by 'builder'
<86>Jan  1 03:46:26 userdel[2468309]: removed shadow group 'builder' owned by 'builder'
<86>Jan  1 03:46:26 groupadd[2468350]: group added to /etc/group: name=builder, GID=940
<86>Jan  1 03:46:26 groupadd[2468350]: group added to /etc/gshadow: name=builder
<86>Jan  1 03:46:26 groupadd[2468350]: new group: name=builder, GID=940
<86>Jan  1 03:46:26 useradd[2468397]: new user: name=builder, UID=940, GID=940, home=/usr/src, shell=/bin/bash
warning: Macro %npm_build not found
warning: Macro %npm_install not found
warning: Macro %nodejs_sitelib not found
<13>Jan  1 03:46:28 rpmi: libuv-1.42.0-alt1 sisyphus+282690.100.1.1 1628973284 installed
<13>Jan  1 03:46:28 rpmi: libcares-1.18.1-alt1 sisyphus+290569.100.1.1 1637850385 installed
<13>Jan  1 03:46:28 rpmi: libexpat-2.4.1-alt2 sisyphus+291954.100.1.1 1639496334 installed
<13>Jan  1 03:46:28 rpmi: libnghttp2-1.46.0-alt1 sisyphus+292749.100.1.1 1640705824 installed
<13>Jan  1 03:46:28 rpmi: libidn2-2.3.2-alt1 sisyphus+281238.100.1.2 1627476328 installed
<13>Jan  1 03:46:28 rpmi: libcares-devel-1.18.1-alt1 sisyphus+290569.100.1.1 1637850385 installed
<13>Jan  1 03:46:28 rpmi: libuv-devel-1.42.0-alt1 sisyphus+282690.100.1.1 1628973284 installed
<13>Jan  1 03:46:28 rpmi: rpm-macros-nodejs-0.20.7-alt2 sisyphus+271817.100.1.1 1620976294 installed
<13>Jan  1 03:46:28 rpmi: zlib-devel-1.2.11-alt2 sisyphus+283721.100.1.1 1629847006 installed
<13>Jan  1 03:46:28 rpmi: zip-30000000:3.0-alt3 sisyphus+279370.100.1.1 1626479198 installed
<13>Jan  1 03:46:28 rpmi: libicu69-1:6.9.1-alt2 sisyphus+277632.100.1.1 1625726231 installed
<13>Jan  1 03:46:28 rpmi: libgdbm-1.8.3-alt10 sisyphus+278100.1600.1.1 1626059138 installed
<13>Jan  1 03:46:28 rpmi: rsync-3.1.3-alt2 sisyphus+278100.6000.1.1 1626060989 installed
<13>Jan  1 03:46:28 rpmi: libedit3-3.1.20191231-alt1 sisyphus+278505.100.1.1 1626106372 installed
<13>Jan  1 03:46:28 rpmi: less-590-alt1 sisyphus+290055.100.1.1 1637334436 installed
<13>Jan  1 03:46:28 rpmi: gcc-c++-common-1.4.27-alt1 sisyphus+278099.1300.1.1 1626028636 installed
<13>Jan  1 03:46:29 rpmi: libstdc++11-devel-11.2.1-alt2 sisyphus+291192.100.1.1 1638461765 installed
<13>Jan  1 03:46:29 rpmi: gcc11-c++-11.2.1-alt2 sisyphus+291192.100.1.1 1638461765 installed
<13>Jan  1 03:46:29 rpmi: gcc-c++-11-alt1 sisyphus+285602.400.1.1 1632239666 installed
<13>Jan  1 03:46:29 rpmi: diffstat-1.64-alt1 sisyphus+278100.700.1.1 1626056686 installed
<13>Jan  1 03:46:29 rpmi: publicsuffix-list-dafsa-20210929-alt1 sisyphus+286161.100.1.1 1632988273 installed
<13>Jan  1 03:46:29 rpmi: libpsl-0.21.1-alt2 sisyphus+279461.100.1.1 1626547555 installed
<13>Jan  1 03:46:29 rpmi: openldap-common-2.4.59-alt1 sisyphus+282933.100.1.1 1629124747 installed
<13>Jan  1 03:46:29 rpmi: libverto-0.3.2-alt1_1 sisyphus+279289.100.1.3 1626493872 installed
<13>Jan  1 03:46:29 rpmi: liblmdb-0.9.23-alt1 sisyphus+275369.100.1.2 1624493869 installed
<13>Jan  1 03:46:29 rpmi: libkeyutils-1.6.3-alt1 sisyphus+266061.100.1.1 1612919567 installed
<13>Jan  1 03:46:29 rpmi: libcom_err-1.46.4.0.5.4cda-alt1 sisyphus+283826.100.1.1 1629975361 installed
<13>Jan  1 03:46:29 rpmi: libbrotlicommon-1.0.9-alt2 sisyphus+278430.100.1.2 1626213212 installed
<13>Jan  1 03:46:29 rpmi: libbrotlidec-1.0.9-alt2 sisyphus+278430.100.1.2 1626213212 installed
<13>Jan  1 03:46:29 rpmi: libp11-kit-0.23.15-alt2 sisyphus+287552.300.2.1 1634541487 installed
<13>Jan  1 03:46:29 rpmi: libtasn1-4.17.0-alt2 sisyphus+285706.100.1.1 1632328570 installed
<13>Jan  1 03:46:29 rpmi: rpm-macros-alternatives-0.5.1-alt1 sisyphus+278157.100.2.1 1626055790 installed
<13>Jan  1 03:46:29 rpmi: alternatives-0.5.1-alt1 sisyphus+278157.100.2.1 1626055790 installed
<13>Jan  1 03:46:29 rpmi: ca-certificates-2021.10.06-alt1 sisyphus+286526.200.1.1 1633528578 installed
<13>Jan  1 03:46:29 rpmi: ca-trust-0.1.2-alt1 sisyphus+233348.100.1.1 1561653823 installed
<13>Jan  1 03:46:29 rpmi: p11-kit-trust-0.23.15-alt2 sisyphus+287552.300.2.1 1634541487 installed
<13>Jan  1 03:46:30 rpmi: libcrypto1.1-1.1.1l-alt2 sisyphus+287339.100.1.1 1634383658 installed
<13>Jan  1 03:46:30 rpmi: libssl1.1-1.1.1l-alt2 sisyphus+287339.100.1.1 1634383658 installed
<13>Jan  1 03:46:30 rpmi: python3-3.9.9-alt1 sisyphus+291125.100.2.1 1638385980 installed
<13>Jan  1 03:46:30 rpmi: python3-base-3.9.9-alt1 sisyphus+291125.100.2.1 1638385980 installed
<86>Jan  1 03:46:30 groupadd[2492966]: group added to /etc/group: name=_keytab, GID=499
<86>Jan  1 03:46:30 groupadd[2492966]: group added to /etc/gshadow: name=_keytab
<86>Jan  1 03:46:30 groupadd[2492966]: new group: name=_keytab, GID=499
<13>Jan  1 03:46:30 rpmi: libkrb5-1.19.2-alt2 sisyphus+281652.100.1.1 1627900477 installed
<86>Jan  1 03:46:30 groupadd[2493650]: group added to /etc/group: name=sasl, GID=498
<86>Jan  1 03:46:30 groupadd[2493650]: group added to /etc/gshadow: name=sasl
<86>Jan  1 03:46:30 groupadd[2493650]: new group: name=sasl, GID=498
<13>Jan  1 03:46:30 rpmi: libsasl2-3-2.1.27-alt2.2 sisyphus+282040.40.2.1 1628929849 installed
<13>Jan  1 03:46:30 rpmi: libldap-2.4.59-alt1 sisyphus+282933.100.1.1 1629124742 installed
<13>Jan  1 03:46:30 rpmi: libcurl-7.80.0-alt1 sisyphus+290333.100.1.1 1637428439 installed
<13>Jan  1 03:46:30 rpmi: curl-7.80.0-alt1 sisyphus+290333.100.1.1 1637428439 installed
<13>Jan  1 03:46:30 rpmi: gyp-0.10.0-alt1 sisyphus+292135.100.1.1 1639747714 installed
<13>Jan  1 03:46:30 rpmi: tests-for-installed-python3-pkgs-0.1.18-alt1 sisyphus+290420.100.1.1 1637593698 installed
<13>Jan  1 03:46:30 rpmi: rpm-build-python3-0.1.18-alt1 sisyphus+290420.100.1.1 1637593698 installed
<13>Jan  1 03:46:30 rpmi: libssl-devel-1.1.1l-alt2 sisyphus+287339.100.1.1 1634383658 installed
<13>Jan  1 03:46:30 rpmi: openssl-1.1.1l-alt2 sisyphus+287339.100.1.1 1634383658 installed
<13>Jan  1 03:46:30 rpmi: openssh-common-8.6p1-alt2 sisyphus+286003.100.1.1 1632744254 installed
<86>Jan  1 03:46:30 groupadd[2495254]: group added to /etc/group: name=sshagent, GID=497
<86>Jan  1 03:46:30 groupadd[2495254]: group added to /etc/gshadow: name=sshagent
<86>Jan  1 03:46:30 groupadd[2495254]: new group: name=sshagent, GID=497
<13>Jan  1 03:46:30 rpmi: openssh-clients-8.6p1-alt2 sisyphus+286003.100.1.1 1632744254 installed
<13>Jan  1 03:46:31 rpmi: git-core-2.33.1-alt1 sisyphus+288703.100.1.1 1635800063 installed
<13>Jan  1 03:46:31 rpmi: npm-6.14.15-alt1 sisyphus+286074.200.2.1 1632872511 installed
<13>Jan  1 03:46:31 rpmi: node-14.18.2-alt1 sisyphus+292114.100.1.1 1639724779 installed
<13>Jan  1 03:46:31 rpmi: node-devel-14.18.2-alt1 sisyphus+292114.100.1.1 1639724779 installed
<13>Jan  1 03:46:32 rpmi: node-gyp-8.3.0-alt1 sisyphus+292135.200.1.1 1639747730 installed
<13>Jan  1 03:46:32 rpmi: rpm-build-nodejs-0.20.7-alt2 sisyphus+271817.100.1.1 1620976294 installed
Building target platforms: i586
Building for target i586
Wrote: /usr/src/in/nosrpm/npmjs-fibers-4.0.3-alt2.nosrc.rpm (w1.gzdio)
Installing npmjs-fibers-4.0.3-alt2.src.rpm
Building target platforms: i586
Building for target i586
Executing(%prep): /bin/sh -e /usr/src/tmp/rpm-tmp.53219
+ umask 022
+ /bin/mkdir -p /usr/src/RPM/BUILD
+ cd /usr/src/RPM/BUILD
+ cd /usr/src/RPM/BUILD
+ rm -rf npmjs-fibers-4.0.3
+ echo 'Source #0 (npmjs-fibers-4.0.3.tar):'
Source #0 (npmjs-fibers-4.0.3.tar):
+ /bin/tar -xf /usr/src/RPM/SOURCES/npmjs-fibers-4.0.3.tar
+ cd npmjs-fibers-4.0.3
+ /bin/chmod -c -Rf u+rwX,go-w .
+ exit 0
Executing(%build): /bin/sh -e /usr/src/tmp/rpm-tmp.53219
+ umask 022
+ /bin/mkdir -p /usr/src/RPM/BUILD
+ cd /usr/src/RPM/BUILD
+ cd npmjs-fibers-4.0.3
+ [[ -f binding.gyp ]]
+ sed 's/\('\''cflags'\'': \[ \).*\( \].*\)/\1'\''-O2'\'', '\''-fpic'\''\2/' -i binding.gyp
+ node-gyp rebuild --release
gyp info it worked if it ends with ok
gyp info using node-gyp@8.3.0
gyp info using node@14.18.2 | linux | ia32
gyp info find Python using Python version 3.9.9 found at "/usr/bin/python3"
gyp info spawn /usr/bin/python3
gyp info spawn args [
gyp info spawn args   '/usr/bin/gyp',
gyp info spawn args   'binding.gyp',
gyp info spawn args   '-f',
gyp info spawn args   'make',
gyp info spawn args   '-I',
gyp info spawn args   '/usr/src/RPM/BUILD/npmjs-fibers-4.0.3/build/config.gypi',
gyp info spawn args   '-I',
gyp info spawn args   '/usr/lib/node_modules/node-gyp/addon.gypi',
gyp info spawn args   '-I',
gyp info spawn args   '/usr/include/node/common.gypi',
gyp info spawn args   '-Dlibrary=shared_library',
gyp info spawn args   '-Dvisibility=default',
gyp info spawn args   '-Dnode_root_dir=/usr',
gyp info spawn args   '-Dnode_gyp_dir=/usr/lib/node_modules/node-gyp',
gyp info spawn args   '-Dnode_lib_file=/usr/<(target_arch)/node.lib',
gyp info spawn args   '-Dmodule_root_dir=/usr/src/RPM/BUILD/npmjs-fibers-4.0.3',
gyp info spawn args   '-Dnode_engine=v8',
gyp info spawn args   '--depth=.',
gyp info spawn args   '--no-parallel',
gyp info spawn args   '--generator-output',
gyp info spawn args   'build',
gyp info spawn args   '-Goutput_dir=.'
gyp info spawn args ]
gyp info spawn make
gyp info spawn args [ 'BUILDTYPE=Release', '-C', 'build' ]
make: Entering directory '/usr/src/RPM/BUILD/npmjs-fibers-4.0.3/build'
  CXX(target) Release/obj.target/fibers/src/fibers.o
../src/fibers.cc: In function 'void uni::SetAccessor(v8::Isolate*, v8::Local<v8::Object>, v8::Local<v8::String>, uni::FunctionType (*)(v8::Local<v8::String>, const GetterCallbackInfo&), void (*)(v8::Local<v8::String>, v8::Local<v8::Value>, const SetterCallbackInfo&))':
../src/fibers.cc:355:73: warning: cast between incompatible function types from 'uni::FunctionType (*)(v8::Local<v8::String>, const GetterCallbackInfo&)' {aka 'void (*)(v8::Local<v8::String>, const v8::PropertyCallbackInfo<v8::Value>&)'} to 'v8::AccessorNameGetterCallback' {aka 'void (*)(v8::Local<v8::Name>, const v8::PropertyCallbackInfo<v8::Value>&)'} [-Wcast-function-type]
  355 |                 object->SetAccessor(isolate->GetCurrentContext(), name, (AccessorNameGetterCallback)getter, (AccessorNameSetterCallback)setter).ToChecked();
      |                                                                         ^~~~~~~~~~~~~~~~~~~~~~~~~~~~~~~~~~
../src/fibers.cc:355:109: warning: cast between incompatible function types from 'void (*)(v8::Local<v8::String>, v8::Local<v8::Value>, const SetterCallbackInfo&)' {aka 'void (*)(v8::Local<v8::String>, v8::Local<v8::Value>, const v8::PropertyCallbackInfo<void>&)'} to 'v8::AccessorNameSetterCallback' {aka 'void (*)(v8::Local<v8::Name>, v8::Local<v8::Value>, const v8::PropertyCallbackInfo<void>&)'} [-Wcast-function-type]
  355 |                 object->SetAccessor(isolate->GetCurrentContext(), name, (AccessorNameGetterCallback)getter, (AccessorNameSetterCallback)setter).ToChecked();
      |                                                                                                             ^~~~~~~~~~~~~~~~~~~~~~~~~~~~~~~~~~
In file included from ../src/coroutine.h:1,
                 from ../src/fibers.cc:1:
../src/fibers.cc: At global scope:
/usr/include/node/node.h:787:7: warning: cast between incompatible function types from 'void (*)(v8::Local<v8::Object>)' to 'node::addon_register_func' {aka 'void (*)(v8::Local<v8::Object>, v8::Local<v8::Value>, void*)'} [-Wcast-function-type]
  787 |       (node::addon_register_func) (regfunc),                          \
      |       ^~~~~~~~~~~~~~~~~~~~~~~~~~~~~~~~~~~~~
/usr/include/node/node.h:821:3: note: in expansion of macro 'NODE_MODULE_X'
  821 |   NODE_MODULE_X(modname, regfunc, NULL, 0)  // NOLINT (readability/null_usage)
      |   ^~~~~~~~~~~~~
../src/fibers.cc:930:1: note: in expansion of macro 'NODE_MODULE'
  930 | NODE_MODULE(fibers, init)
      | ^~~~~~~~~~~
  CXX(target) Release/obj.target/fibers/src/coroutine.o
  CC(target) Release/obj.target/fibers/src/libcoro/coro.o
  SOLINK_MODULE(target) Release/obj.target/fibers.node
  COPY Release/fibers.node
make: Leaving directory '/usr/src/RPM/BUILD/npmjs-fibers-4.0.3/build'
gyp info ok 
+ exit 0
Executing(%install): /bin/sh -e /usr/src/tmp/rpm-tmp.12572
+ umask 022
+ /bin/mkdir -p /usr/src/RPM/BUILD
+ cd /usr/src/RPM/BUILD
+ /bin/chmod -Rf u+rwX -- /usr/src/tmp/npmjs-fibers-buildroot
+ :
+ /bin/rm -rf -- /usr/src/tmp/npmjs-fibers-buildroot
+ PATH=/usr/libexec/rpm-build:/usr/src/bin:/bin:/usr/bin:/usr/X11R6/bin:/usr/games
+ cd npmjs-fibers-4.0.3
+ set +x
cat: .npmignore: No such file or directory
Installing ./binding.gyp -> /usr/src/tmp/npmjs-fibers-buildroot/usr/lib/node_modules/fibers/./
Installing ./test/unwind.js -> /usr/src/tmp/npmjs-fibers-buildroot/usr/lib/node_modules/fibers/./test/
Installing ./test/started.js -> /usr/src/tmp/npmjs-fibers-buildroot/usr/lib/node_modules/fibers/./test/
Installing ./test/stack-overflow2.js -> /usr/src/tmp/npmjs-fibers-buildroot/usr/lib/node_modules/fibers/./test/
Installing ./test/stack-overflow.js -> /usr/src/tmp/npmjs-fibers-buildroot/usr/lib/node_modules/fibers/./test/
Installing ./test/process-title.js -> /usr/src/tmp/npmjs-fibers-buildroot/usr/lib/node_modules/fibers/./test/
Installing ./test/pool.js -> /usr/src/tmp/npmjs-fibers-buildroot/usr/lib/node_modules/fibers/./test/
Installing ./test/illegal-yield.js -> /usr/src/tmp/npmjs-fibers-buildroot/usr/lib/node_modules/fibers/./test/
Installing ./test/future.js -> /usr/src/tmp/npmjs-fibers-buildroot/usr/lib/node_modules/fibers/./test/
Installing ./test/future-exception.js -> /usr/src/tmp/npmjs-fibers-buildroot/usr/lib/node_modules/fibers/./test/
Installing ./test/finish-multiple.js -> /usr/src/tmp/npmjs-fibers-buildroot/usr/lib/node_modules/fibers/./test/
Installing ./test/fibonacci.js -> /usr/src/tmp/npmjs-fibers-buildroot/usr/lib/node_modules/fibers/./test/
Installing ./test/exit.js -> /usr/src/tmp/npmjs-fibers-buildroot/usr/lib/node_modules/fibers/./test/
Installing ./test/exec.js -> /usr/src/tmp/npmjs-fibers-buildroot/usr/lib/node_modules/fibers/./test/
Installing ./test/current.js -> /usr/src/tmp/npmjs-fibers-buildroot/usr/lib/node_modules/fibers/./test/
Installing ./test/cleanup.js -> /usr/src/tmp/npmjs-fibers-buildroot/usr/lib/node_modules/fibers/./test/
Installing ./test/child-process.js -> /usr/src/tmp/npmjs-fibers-buildroot/usr/lib/node_modules/fibers/./test/
Installing ./test/bad-context.js -> /usr/src/tmp/npmjs-fibers-buildroot/usr/lib/node_modules/fibers/./test/
Installing ./test/async-hooks.js -> /usr/src/tmp/npmjs-fibers-buildroot/usr/lib/node_modules/fibers/./test/
Installing ./test/already-running.js -> /usr/src/tmp/npmjs-fibers-buildroot/usr/lib/node_modules/fibers/./test/
Installing ./test.js -> /usr/src/tmp/npmjs-fibers-buildroot/usr/lib/node_modules/fibers/./
Installing ./src/v8-version.h -> /usr/src/tmp/npmjs-fibers-buildroot/usr/lib/node_modules/fibers/./src/
Installing ./src/libcoro/coro.h -> /usr/src/tmp/npmjs-fibers-buildroot/usr/lib/node_modules/fibers/./src/libcoro/
Installing ./src/libcoro/coro.c -> /usr/src/tmp/npmjs-fibers-buildroot/usr/lib/node_modules/fibers/./src/libcoro/
Installing ./src/libcoro/conftest.c -> /usr/src/tmp/npmjs-fibers-buildroot/usr/lib/node_modules/fibers/./src/libcoro/
Installing ./src/libcoro/README -> /usr/src/tmp/npmjs-fibers-buildroot/usr/lib/node_modules/fibers/./src/libcoro/
Installing ./src/libcoro/LICENSE -> /usr/src/tmp/npmjs-fibers-buildroot/usr/lib/node_modules/fibers/./src/libcoro/
Installing ./src/fibers.cc -> /usr/src/tmp/npmjs-fibers-buildroot/usr/lib/node_modules/fibers/./src/
Installing ./src/coroutine.h -> /usr/src/tmp/npmjs-fibers-buildroot/usr/lib/node_modules/fibers/./src/
Installing ./src/coroutine.cc -> /usr/src/tmp/npmjs-fibers-buildroot/usr/lib/node_modules/fibers/./src/
Installing ./quick-test.js -> /usr/src/tmp/npmjs-fibers-buildroot/usr/lib/node_modules/fibers/./
Installing ./package.json -> /usr/src/tmp/npmjs-fibers-buildroot/usr/lib/node_modules/fibers/./
Installing ./package-lock.json -> /usr/src/tmp/npmjs-fibers-buildroot/usr/lib/node_modules/fibers/./
Installing ./future.js -> /usr/src/tmp/npmjs-fibers-buildroot/usr/lib/node_modules/fibers/./
Installing ./fibers.js -> /usr/src/tmp/npmjs-fibers-buildroot/usr/lib/node_modules/fibers/./
Installing ./build.js -> /usr/src/tmp/npmjs-fibers-buildroot/usr/lib/node_modules/fibers/./
Installing ./bin/repl -> /usr/src/tmp/npmjs-fibers-buildroot/usr/lib/node_modules/fibers/./bin/
Installing ./bin/.gitignore -> /usr/src/tmp/npmjs-fibers-buildroot/usr/lib/node_modules/fibers/./bin/
Installing ./README.md -> /usr/src/tmp/npmjs-fibers-buildroot/usr/lib/node_modules/fibers/./
Installing ./LICENSE -> /usr/src/tmp/npmjs-fibers-buildroot/usr/lib/node_modules/fibers/./
Installing ./ISSUE_TEMPLATE.md -> /usr/src/tmp/npmjs-fibers-buildroot/usr/lib/node_modules/fibers/./
+ /usr/lib/rpm/brp-alt
Cleaning files in /usr/src/tmp/npmjs-fibers-buildroot (auto)
removed './usr/lib/node_modules/fibers/bin/.gitignore'
mode of './usr/lib/node_modules/fibers/build/Release/fibers.node' changed from 0755 (rwxr-xr-x) to 0644 (rw-r--r--)
Verifying and fixing files in /usr/src/tmp/npmjs-fibers-buildroot (binconfig,pkgconfig,libtool,desktop,gnuconfig)
Checking contents of files in /usr/src/tmp/npmjs-fibers-buildroot/ (default)
Compressing files in /usr/src/tmp/npmjs-fibers-buildroot (auto)
Adjusting library links in /usr/src/tmp/npmjs-fibers-buildroot
./usr/lib: (from <cmdline>:0)
056-debuginfo.brp: WARNING: debuginfo without debug sources.
Verifying ELF objects in /usr/src/tmp/npmjs-fibers-buildroot (arch=normal,fhs=normal,lfs=relaxed,lint=relaxed,rpath=normal,stack=normal,textrel=normal,unresolved=normal)
verify-elf: WARNING: ./usr/lib/node_modules/fibers/build/Release/fibers.node: undefined symbol: _ZN2v87Isolate29DiscardThreadSpecificMetadataEv
verify-elf: WARNING: ./usr/lib/node_modules/fibers/build/Release/fibers.node: undefined symbol: _ZN2v89Exception9TypeErrorENS_5LocalINS_6StringEEE
verify-elf: WARNING: ./usr/lib/node_modules/fibers/build/Release/fibers.node: undefined symbol: _ZN2v87Context4ExitEv
verify-elf: WARNING: ./usr/lib/node_modules/fibers/build/Release/fibers.node: undefined symbol: _ZNK2v88TryCatch9ExceptionEv
verify-elf: WARNING: ./usr/lib/node_modules/fibers/build/Release/fibers.node: undefined symbol: _ZN2v87Isolate14ThrowExceptionENS_5LocalINS_5ValueEEE
verify-elf: WARNING: ./usr/lib/node_modules/fibers/build/Release/fibers.node: undefined symbol: _ZN2v89Signature3NewEPNS_7IsolateENS_5LocalINS_16FunctionTemplateEEE
verify-elf: WARNING: ./usr/lib/node_modules/fibers/build/Release/fibers.node: undefined symbol: _ZN2v86Script7CompileENS_5LocalINS_7ContextEEENS1_INS_6StringEEEPNS_12ScriptOriginE
verify-elf: WARNING: ./usr/lib/node_modules/fibers/build/Release/fibers.node: undefined symbol: _ZN2v86Object11SetAccessorENS_5LocalINS_7ContextEEENS1_INS_4NameEEEPFvS5_RKNS_20PropertyCallbackInfoINS_5ValueEEEEPFvS5_NS1_IS7_EERKNS6_IvEEENS_10MaybeLocalIS7_EENS_13AccessControlENS_17PropertyAttributeENS_14SideEffectTypeESN_
verify-elf: WARNING: ./usr/lib/node_modules/fibers/build/Release/fibers.node: undefined symbol: _ZN2v87Isolate10GetCurrentEv
verify-elf: WARNING: ./usr/lib/node_modules/fibers/build/Release/fibers.node: undefined symbol: _ZN2v87Isolate36ReportExternalAllocationLimitReachedEv
verify-elf: WARNING: ./usr/lib/node_modules/fibers/build/Release/fibers.node: undefined symbol: _ZN2v87Isolate13SetStackLimitEj
verify-elf: WARNING: ./usr/lib/node_modules/fibers/build/Release/fibers.node: undefined symbol: _ZN2v86String14NewFromOneByteEPNS_7IsolateEPKhNS_13NewStringTypeEi
verify-elf: WARNING: ./usr/lib/node_modules/fibers/build/Release/fibers.node: undefined symbol: _ZN2v88UnlockerD1Ev
verify-elf: WARNING: ./usr/lib/node_modules/fibers/build/Release/fibers.node: undefined symbol: _ZNK2v85Value10IsFunctionEv
verify-elf: WARNING: ./usr/lib/node_modules/fibers/build/Release/fibers.node: undefined symbol: _ZN2v87Isolate4ExitEv
verify-elf: WARNING: ./usr/lib/node_modules/fibers/build/Release/fibers.node: undefined symbol: _ZN2v89Exception5ErrorENS_5LocalINS_6StringEEE
verify-elf: WARNING: ./usr/lib/node_modules/fibers/build/Release/fibers.node: undefined symbol: _ZN2v816FunctionTemplate17PrototypeTemplateEv
verify-elf: WARNING: ./usr/lib/node_modules/fibers/build/Release/fibers.node: undefined symbol: _ZN2v811HandleScopeC1EPNS_7IsolateE
verify-elf: WARNING: ./usr/lib/node_modules/fibers/build/Release/fibers.node: undefined symbol: node_module_register
verify-elf: WARNING: ./usr/lib/node_modules/fibers/build/Release/fibers.node: undefined symbol: _ZNK2v88TryCatch10StackTraceENS_5LocalINS_7ContextEEE
verify-elf: WARNING: ./usr/lib/node_modules/fibers/build/Release/fibers.node: undefined symbol: _ZN2v816FunctionTemplate3NewEPNS_7IsolateEPFvRKNS_20FunctionCallbackInfoINS_5ValueEEEENS_5LocalIS4_EENSA_INS_9SignatureEEEiNS_19ConstructorBehaviorENS_14SideEffectTypeEPKNS_9CFunctionE
verify-elf: WARNING: ./usr/lib/node_modules/fibers/build/Release/fibers.node: undefined symbol: _ZN2v86Object3SetENS_5LocalINS_7ContextEEENS1_INS_5ValueEEES5_
verify-elf: WARNING: ./usr/lib/node_modules/fibers/build/Release/fibers.node: undefined symbol: _ZNK2v85Value8ToNumberENS_5LocalINS_7ContextEEE
verify-elf: WARNING: ./usr/lib/node_modules/fibers/build/Release/fibers.node: undefined symbol: _ZN2v82V817FromJustIsNothingEv
verify-elf: WARNING: ./usr/lib/node_modules/fibers/build/Release/fibers.node: undefined symbol: _ZN2v816FunctionTemplate12SetClassNameENS_5LocalINS_6StringEEE
verify-elf: WARNING: ./usr/lib/node_modules/fibers/build/Release/fibers.node: undefined symbol: _ZN2v86Number3NewEPNS_7IsolateEd
verify-elf: WARNING: ./usr/lib/node_modules/fibers/build/Release/fibers.node: undefined symbol: _ZN2v86Locker10InitializeEPNS_7IsolateE
verify-elf: WARNING: ./usr/lib/node_modules/fibers/build/Release/fibers.node: undefined symbol: _ZN2v86Object18InternalFieldCountEv
verify-elf: WARNING: ./usr/lib/node_modules/fibers/build/Release/fibers.node: undefined symbol: _ZN2v89Exception10RangeErrorENS_5LocalINS_6StringEEE
verify-elf: WARNING: ./usr/lib/node_modules/fibers/build/Release/fibers.node: undefined symbol: _ZN2v82V818GlobalizeReferenceEPNS_8internal7IsolateEPj
verify-elf: WARNING: ./usr/lib/node_modules/fibers/build/Release/fibers.node: undefined symbol: _ZN2v87Isolate5EnterEv
verify-elf: WARNING: ./usr/lib/node_modules/fibers/build/Release/fibers.node: undefined symbol: _ZN2v88TryCatchD2Ev
verify-elf: WARNING: ./usr/lib/node_modules/fibers/build/Release/fibers.node: undefined symbol: _ZN2v86Object32SetAlignedPointerInInternalFieldEiPv
verify-elf: WARNING: ./usr/lib/node_modules/fibers/build/Release/fibers.node: undefined symbol: _ZN2v88TryCatchC2EPNS_7IsolateE
verify-elf: WARNING: ./usr/lib/node_modules/fibers/build/Release/fibers.node: undefined symbol: _ZNK2v85Value12StrictEqualsENS_5LocalIS0_EE
verify-elf: WARNING: ./usr/lib/node_modules/fibers/build/Release/fibers.node: undefined symbol: _ZN2v86LockerD1Ev
verify-elf: WARNING: ./usr/lib/node_modules/fibers/build/Release/fibers.node: undefined symbol: _ZNK2v88TryCatch9HasCaughtEv
verify-elf: WARNING: ./usr/lib/node_modules/fibers/build/Release/fibers.node: undefined symbol: _ZN2v816FunctionTemplate16InstanceTemplateEv
verify-elf: WARNING: ./usr/lib/node_modules/fibers/build/Release/fibers.node: undefined symbol: _ZN2v816FunctionTemplate11GetFunctionENS_5LocalINS_7ContextEEE
verify-elf: WARNING: ./usr/lib/node_modules/fibers/build/Release/fibers.node: undefined symbol: _ZN2v82V88MakeWeakEPjPvPFvRKNS_16WeakCallbackInfoIvEEENS_16WeakCallbackTypeE
verify-elf: WARNING: ./usr/lib/node_modules/fibers/build/Release/fibers.node: undefined symbol: _ZN2v87Context6GlobalEv
verify-elf: WARNING: ./usr/lib/node_modules/fibers/build/Release/fibers.node: undefined symbol: _ZNK2v86Number5ValueEv
verify-elf: WARNING: ./usr/lib/node_modules/fibers/build/Release/fibers.node: undefined symbol: _ZN2v814ObjectTemplate11SetAccessorENS_5LocalINS_6StringEEEPFvS3_RKNS_20PropertyCallbackInfoINS_5ValueEEEEPFvS3_NS1_IS5_EERKNS4_IvEEESB_NS_13AccessControlENS_17PropertyAttributeENS1_INS_17AccessorSignatureEEENS_14SideEffectTypeESL_
verify-elf: WARNING: ./usr/lib/node_modules/fibers/build/Release/fibers.node: undefined symbol: _ZNK2v88Function11NewInstanceENS_5LocalINS_7ContextEEEiPNS1_INS_5ValueEEE
verify-elf: WARNING: ./usr/lib/node_modules/fibers/build/Release/fibers.node: undefined symbol: _ZN2v86Object38SlowGetAlignedPointerFromInternalFieldEi
verify-elf: WARNING: ./usr/lib/node_modules/fibers/build/Release/fibers.node: undefined symbol: _ZN2v88Unlocker10InitializeEPNS_7IsolateE
verify-elf: WARNING: ./usr/lib/node_modules/fibers/build/Release/fibers.node: undefined symbol: _ZN2v82V813DisposeGlobalEPj
verify-elf: WARNING: ./usr/lib/node_modules/fibers/build/Release/fibers.node: undefined symbol: _ZN2v811HandleScope12CreateHandleEPNS_8internal7IsolateEj
verify-elf: WARNING: ./usr/lib/node_modules/fibers/build/Release/fibers.node: undefined symbol: _ZN2v88Function4CallENS_5LocalINS_7ContextEEENS1_INS_5ValueEEEiPS5_
verify-elf: WARNING: ./usr/lib/node_modules/fibers/build/Release/fibers.node: undefined symbol: _ZN2v811HandleScopeD1Ev
verify-elf: WARNING: ./usr/lib/node_modules/fibers/build/Release/fibers.node: undefined symbol: _ZN2v82V89ClearWeakEPj
verify-elf: WARNING: ./usr/lib/node_modules/fibers/build/Release/fibers.node: undefined symbol: _ZN2v87Isolate17GetCurrentContextEv
verify-elf: WARNING: ./usr/lib/node_modules/fibers/build/Release/fibers.node: undefined symbol: _ZN2v814ObjectTemplate21SetInternalFieldCountEi
verify-elf: WARNING: ./usr/lib/node_modules/fibers/build/Release/fibers.node: undefined symbol: _ZN2v87Context5EnterEv
verify-elf: WARNING: ./usr/lib/node_modules/fibers/build/Release/fibers.node: undefined symbol: _ZN2v88Template3SetENS_5LocalINS_4NameEEENS1_INS_4DataEEENS_17PropertyAttributeE
verify-elf: WARNING: ./usr/lib/node_modules/fibers/build/Release/fibers.node: undefined symbol: _ZN2v82V812ToLocalEmptyEv
verify-elf: WARNING: ./usr/lib/node_modules/fibers/build/Release/fibers.node: undefined symbol: _ZN2v86Object3GetENS_5LocalINS_7ContextEEENS1_INS_5ValueEEE
Hardlinking identical .pyc and .opt-?.pyc files
Processing files: npmjs-fibers-4.0.3-alt2
Executing(%doc): /bin/sh -e /usr/src/tmp/rpm-tmp.12572
+ umask 022
+ /bin/mkdir -p /usr/src/RPM/BUILD
+ cd /usr/src/RPM/BUILD
+ cd npmjs-fibers-4.0.3
+ DOCDIR=/usr/src/tmp/npmjs-fibers-buildroot/usr/share/doc/npmjs-fibers-4.0.3
+ export DOCDIR
+ rm -rf /usr/src/tmp/npmjs-fibers-buildroot/usr/share/doc/npmjs-fibers-4.0.3
+ /bin/mkdir -p /usr/src/tmp/npmjs-fibers-buildroot/usr/share/doc/npmjs-fibers-4.0.3
+ cp -prL README.md /usr/src/tmp/npmjs-fibers-buildroot/usr/share/doc/npmjs-fibers-4.0.3
+ chmod -R go-w /usr/src/tmp/npmjs-fibers-buildroot/usr/share/doc/npmjs-fibers-4.0.3
+ chmod -R a+rX /usr/src/tmp/npmjs-fibers-buildroot/usr/share/doc/npmjs-fibers-4.0.3
+ exit 0
Finding Provides (using /usr/lib/rpm/find-provides)
Executing: /bin/sh -e /usr/src/tmp/rpm-tmp.4lwcXD
find-provides: running scripts (alternatives,debuginfo,lib,nodejs,pam,perl,pkgconfig,python,python3,shell)
Finding Requires (using /usr/lib/rpm/find-requires)
Executing: /bin/sh -e /usr/src/tmp/rpm-tmp.Nj4OiV
find-requires: running scripts (cpp,debuginfo,files,lib,nodejs,nodejs_native,pam,perl,pkgconfig,pkgconfiglib,python,python3,rpmlib,shebang,shell,static,symlinks,systemd-services)
/usr/src/tmp/npmjs-fibers-buildroot/usr/lib/node_modules/fibers/src/coroutine.h:1:10: fatal error: node.h: No such file or directory
    1 | #include <node.h>
      |          ^~~~~~~~
compilation terminated.
cpp.req: /usr/src/tmp/npmjs-fibers-buildroot/usr/lib/node_modules/fibers/src/coroutine.h: cpp failed, trying c++ mode
/usr/src/tmp/npmjs-fibers-buildroot/usr/lib/node_modules/fibers/src/coroutine.h:1:10: fatal error: node.h: No such file or directory
    1 | #include <node.h>
      |          ^~~~~~~~
compilation terminated.
cpp.req: WARNING: /usr/src/tmp/npmjs-fibers-buildroot/usr/lib/node_modules/fibers/src/coroutine.h: cpp failed
/usr/src/tmp/npmjs-fibers-buildroot/usr/lib/node_modules/fibers/src/libcoro/coro.h:302:25: error: missing ')' in expression
  302 | # if defined WINDOWS && (defined __i386 || (__x86_64 || defined _M_IX86 || defined _M_AMD64)
      |                         ^
cpp.req: /usr/src/tmp/npmjs-fibers-buildroot/usr/lib/node_modules/fibers/src/libcoro/coro.h: cpp failed, trying c++ mode
/usr/src/tmp/npmjs-fibers-buildroot/usr/lib/node_modules/fibers/src/libcoro/coro.h:302:25: error: missing ')' in expression
  302 | # if defined WINDOWS && (defined __i386 || (__x86_64 || defined _M_IX86 || defined _M_AMD64)
      |                         ^
cpp.req: WARNING: /usr/src/tmp/npmjs-fibers-buildroot/usr/lib/node_modules/fibers/src/libcoro/coro.h: cpp failed
find-requires: FINDPACKAGE-COMMANDS: node
Provides: npm(fibers) = 4.0.3
Requires: /usr/bin/env, libc.so.6(GLIBC_2.0), libc.so.6(GLIBC_2.1), libc.so.6(GLIBC_2.1.3), libc.so.6(GLIBC_2.34), libc.so.6(GLIBC_2.4), libstdc++.so.6(CXXABI_1.3.9), libstdc++.so.6(GLIBCXX_3.4), libstdc++.so.6(GLIBCXX_3.4.29), libstdc++.so.6(GLIBCXX_3.4.9), node, nodejs(abi) = 14, nodejs(engine) >= 10.0.0, nodejs(v8-abi) = 7.9, rtld(GNU_HASH)
Finding debuginfo files (using /usr/lib/rpm/find-debuginfo-files)
Executing: /bin/sh -e /usr/src/tmp/rpm-tmp.gHxWlm
Creating npmjs-fibers-debuginfo package
Processing files: npmjs-fibers-debuginfo-4.0.3-alt2
Finding Provides (using /usr/lib/rpm/find-provides)
Executing: /bin/sh -e /usr/src/tmp/rpm-tmp.BrzN6q
find-provides: running scripts (debuginfo)
Finding Requires (using /usr/lib/rpm/find-requires)
Executing: /bin/sh -e /usr/src/tmp/rpm-tmp.G4z9uQ
find-requires: running scripts (debuginfo)
Requires: npmjs-fibers = 4.0.3-alt2, debug(libc.so.6), debug(libstdc++.so.6)
Adding to npmjs-fibers-debuginfo a strict dependency on npmjs-fibers
Wrote: /usr/src/RPM/RPMS/i586/npmjs-fibers-4.0.3-alt2.i586.rpm (w2.lzdio)
Wrote: /usr/src/RPM/RPMS/i586/npmjs-fibers-debuginfo-4.0.3-alt2.i586.rpm (w2.lzdio)
2.64user 0.66system 0:07.45elapsed 44%CPU (0avgtext+0avgdata 74488maxresident)k
0inputs+0outputs (0major+286153minor)pagefaults 0swaps
8.86user 3.94system 0:16.17elapsed 79%CPU (0avgtext+0avgdata 103700maxresident)k
26656inputs+0outputs (30154major+580933minor)pagefaults 0swaps
--- npmjs-fibers-4.0.3-alt2.i586.rpm.repo	2020-05-07 14:25:03.000000000 +0000
+++ npmjs-fibers-4.0.3-alt2.i586.rpm.hasher	2022-01-01 03:46:41.430723552 +0000
@@ -1,3 +1,2 @@
 /usr/lib/node_modules/fibers	40755	root:root	
-/usr/lib/node_modules/fibers/.travis.yml	100644	root:root	
 /usr/lib/node_modules/fibers/ISSUE_TEMPLATE.md	100644	root:root	
@@ -55,7 +54,7 @@
 Requires: libc.so.6(GLIBC_2.1.3)  
+Requires: libc.so.6(GLIBC_2.34)  
 Requires: libc.so.6(GLIBC_2.4)  
-Requires: libpthread.so.0(GLIBC_2.0)  
-Requires: libpthread.so.0(GLIBC_2.1)  
 Requires: libstdc++.so.6(CXXABI_1.3.9)  
 Requires: libstdc++.so.6(GLIBCXX_3.4)  
+Requires: libstdc++.so.6(GLIBCXX_3.4.29)  
 Requires: libstdc++.so.6(GLIBCXX_3.4.9)  
@@ -70,3 +69,2 @@
 File: /usr/lib/node_modules/fibers	40755	root:root		
-File: /usr/lib/node_modules/fibers/.travis.yml	100644	root:root	78c66afb388693d45a810b15bf5b57d6	
 File: /usr/lib/node_modules/fibers/ISSUE_TEMPLATE.md	100644	root:root	f430e9c96902be99e353f2b274b4b0e6	
@@ -80,3 +78,3 @@
 File: /usr/lib/node_modules/fibers/build/Release	40755	root:root		
-File: /usr/lib/node_modules/fibers/build/Release/fibers.node	100644	root:root	607fc063881065a4c41ae9f88edd281e	
+File: /usr/lib/node_modules/fibers/build/Release/fibers.node	100644	root:root	0ffe83214cf6ef41fdec797454bff4fd	
 File: /usr/lib/node_modules/fibers/fibers.js	100644	root:root	9ef59b80485bd015527ebc96cf9748a8	
@@ -120,2 +118,2 @@
 File: /usr/share/doc/npmjs-fibers-4.0.3/README.md	100644	root:root	3c93527cd6866ac36c54859c1d079148	
-RPMIdentity: d869e71648e0ed253a1445332b61d99d2bd858a080a402fc6ed668a19accec43eb748002abf663e6c41449a76753a439ac7302f75d19c472e1e237cc4fb5a563
+RPMIdentity: 100545700dcb16cb79e7cb29467c77b2587fe7297fc5eb614bc33eb8e6cb3ba1365e97e7312ac2a9dc1fae1ab0e86b264af973bd77de930da4e2093ee1d48241
--- npmjs-fibers-debuginfo-4.0.3-alt2.i586.rpm.repo	2020-05-07 14:25:03.000000000 +0000
+++ npmjs-fibers-debuginfo-4.0.3-alt2.i586.rpm.hasher	2022-01-01 03:46:41.493724411 +0000
@@ -1,4 +1,4 @@
-/usr/lib/debug/.build-id/5f	40755	root:root	
-/usr/lib/debug/.build-id/5f/26c38d148268ea1395459e8bd6a4204080d317	120777	root:root	../../../node_modules/fibers/build/Release/fibers.node
-/usr/lib/debug/.build-id/5f/26c38d148268ea1395459e8bd6a4204080d317.debug	120777	root:root	../../usr/lib/node_modules/fibers/build/Release/fibers.node.debug
+/usr/lib/debug/.build-id/d4	40755	root:root	
+/usr/lib/debug/.build-id/d4/e08b20e46e0f41a3f7a985882ea6285d28e338	120777	root:root	../../../node_modules/fibers/build/Release/fibers.node
+/usr/lib/debug/.build-id/d4/e08b20e46e0f41a3f7a985882ea6285d28e338.debug	120777	root:root	../../usr/lib/node_modules/fibers/build/Release/fibers.node.debug
 /usr/lib/debug/usr/lib/node_modules	40755	root:root	
@@ -9,3 +9,2 @@
 Requires: debug(libc.so.6)  
-Requires: debug(libpthread.so.0)  
 Requires: debug(libstdc++.so.6)  
@@ -14,5 +13,5 @@
 Provides: npmjs-fibers-debuginfo = 4.0.3-alt2:sisyphus+251308.600.3.1
-File: /usr/lib/debug/.build-id/5f	40755	root:root		
-File: /usr/lib/debug/.build-id/5f/26c38d148268ea1395459e8bd6a4204080d317	120777	root:root		../../../node_modules/fibers/build/Release/fibers.node
-File: /usr/lib/debug/.build-id/5f/26c38d148268ea1395459e8bd6a4204080d317.debug	120777	root:root		../../usr/lib/node_modules/fibers/build/Release/fibers.node.debug
+File: /usr/lib/debug/.build-id/d4	40755	root:root		
+File: /usr/lib/debug/.build-id/d4/e08b20e46e0f41a3f7a985882ea6285d28e338	120777	root:root		../../../node_modules/fibers/build/Release/fibers.node
+File: /usr/lib/debug/.build-id/d4/e08b20e46e0f41a3f7a985882ea6285d28e338.debug	120777	root:root		../../usr/lib/node_modules/fibers/build/Release/fibers.node.debug
 File: /usr/lib/debug/usr/lib/node_modules	40755	root:root		
@@ -21,3 +20,3 @@
 File: /usr/lib/debug/usr/lib/node_modules/fibers/build/Release	40755	root:root		
-File: /usr/lib/debug/usr/lib/node_modules/fibers/build/Release/fibers.node.debug	100644	root:root	2c345b2bd1854cb58a40c91a3f66bbf6	
-RPMIdentity: f6ac8f2122365034fcc77cce60f793df320068e4db9548d340d338381fafb264a9b8d8a4b61797d93025c1c9f39378ca79c1e047ffccdb12b352e9f87e452d7a
+File: /usr/lib/debug/usr/lib/node_modules/fibers/build/Release/fibers.node.debug	100644	root:root	1f9cd06d72d01525184ba3690b3341ba	
+RPMIdentity: ce34d326f9b398873225bd4b58e3178987e3c4a19cdd0a821b0dc9935dc69dc0b64338409f9e4ee7a7c9fbf68df93dca79d1781f073e53794c471b136db178b5