86>Dec 25 03:59:39 userdel[834482]: delete user 'rooter'
<86>Dec 25 03:59:39 userdel[834482]: removed group 'rooter' owned by 'rooter'
<86>Dec 25 03:59:39 groupadd[834495]: group added to /etc/group: name=rooter, GID=966
<86>Dec 25 03:59:39 groupadd[834495]: group added to /etc/gshadow: name=rooter
<86>Dec 25 03:59:39 groupadd[834495]: new group: name=rooter, GID=966
<86>Dec 25 03:59:39 useradd[834503]: new user: name=rooter, UID=966, GID=966, home=/root, shell=/bin/bash
<86>Dec 25 03:59:39 userdel[834510]: delete user 'builder'
<86>Dec 25 03:59:39 userdel[834510]: removed group 'builder' owned by 'builder'
<86>Dec 25 03:59:39 groupadd[834515]: group added to /etc/group: name=builder, GID=967
<86>Dec 25 03:59:39 groupadd[834515]: group added to /etc/gshadow: name=builder
<86>Dec 25 03:59:39 groupadd[834515]: new group: name=builder, GID=967
<86>Dec 25 03:59:39 useradd[834519]: new user: name=builder, UID=967, GID=967, home=/usr/src, shell=/bin/bash
/usr/src/in/srpm/kde5-kpkpass-21.08.3-alt1.src.rpm: bad symbols in the license tag: /
<13>Dec 25 03:59:41 rpmi: libxkbcommon-1.3.1-alt1 sisyphus+285084.100.1.1 1631455232 installed
<13>Dec 25 03:59:41 rpmi: libexpat-2.4.1-alt2 sisyphus+291954.100.1.1 1639496334 installed
<13>Dec 25 03:59:41 rpmi: qt5-base-common-5.15.2-alt7 sisyphus+290451.100.3.2 1637673940 installed
<13>Dec 25 03:59:41 rpmi: qt5-declarative-common-5.15.2-alt5 sisyphus+291645.100.2.1 1639046286 installed
<13>Dec 25 03:59:41 rpmi: libts0-1.22-alt3 sisyphus+278442.100.1.2 1626216683 installed
<13>Dec 25 03:59:41 rpmi: libmtdev-1.1.6-alt1 sisyphus+278361.100.1.1 1626091636 installed
<13>Dec 25 03:59:41 rpmi: libpng16-1.6.37-alt1 sisyphus+275734.100.2.1 1624788812 installed
<13>Dec 25 03:59:41 rpmi: libICE-1.0.10-alt1 sisyphus+278827.100.1.1 1626220281 installed
<13>Dec 25 03:59:41 rpmi: libglvnd-7:1.3.4-alt1 sisyphus+286013.100.1.1 1632749270 installed
<13>Dec 25 03:59:41 rpmi: libwayland-server-1.20.0-alt1 sisyphus+290473.40.2.1 1639117746 installed
<13>Dec 25 03:59:41 rpmi: libSM-1.2.3-alt1 sisyphus+278820.100.1.1 1626219266 installed
<13>Dec 25 03:59:41 rpmi: rpm-macros-qt5-5.15.2-alt7 sisyphus+290451.100.3.2 1637673711 installed
<13>Dec 25 03:59:41 rpmi: rpm-macros-ubt-0.4-alt1 sisyphus+279939.100.1.1 1626950850 installed
<13>Dec 25 03:59:41 rpmi: rpm-build-xdg-0.2-alt1 1250461503 installed
<13>Dec 25 03:59:41 rpmi: libsqlite3-3.36.0-alt2 sisyphus+287712.100.2.1 1635827486 installed
<13>Dec 25 03:59:41 rpmi: libverto-0.3.2-alt1_1 sisyphus+279289.100.1.3 1626493872 installed
<13>Dec 25 03:59:41 rpmi: libproxy-0.4.17-alt1.1 sisyphus+279553.100.1.2 1626595616 installed
<13>Dec 25 03:59:41 rpmi: libpcre2-10.39-alt1 sisyphus+288621.100.1.1 1635693791 installed
<13>Dec 25 03:59:41 rpmi: liblmdb-0.9.23-alt1 sisyphus+275369.100.1.2 1624493869 installed
<13>Dec 25 03:59:41 rpmi: libkeyutils-1.6.3-alt1 sisyphus+266061.100.1.1 1612919567 installed
<13>Dec 25 03:59:41 rpmi: libjpeg-2:2.0.6-alt4 sisyphus+284191.100.1.1 1630330787 installed
<13>Dec 25 03:59:41 rpmi: libwacom-data-1.12-alt1 sisyphus+284319.100.1.1 1630480003 installed
<13>Dec 25 03:59:41 rpmi: libicu69-1:6.9.1-alt2 sisyphus+277632.100.1.1 1625726231 installed
<13>Dec 25 03:59:42 rpmi: libqt5-core-5.15.2-alt7 sisyphus+290451.100.3.2 1637673940 installed
<13>Dec 25 03:59:42 rpmi: libqt5-sql-5.15.2-alt7 sisyphus+290451.100.3.2 1637673940 installed
<13>Dec 25 03:59:42 rpmi: libgudev-1:237-alt1 sisyphus+282754.100.1.1 1629006690 installed
<13>Dec 25 03:59:42 rpmi: libgraphite2-1.3.14-alt2.1 sisyphus+279571.100.1.2 1626605157 installed
<13>Dec 25 03:59:42 rpmi: libgdbm-1.8.3-alt10 sisyphus+278100.1600.1.1 1626059138 installed
<13>Dec 25 03:59:42 rpmi: libevdev-1.12.0-alt1 sisyphus+289245.100.1.1 1636449056 installed
<13>Dec 25 03:59:42 rpmi: liblz4-1:1.9.3-alt1 sisyphus+278100.4000.1.1 1626060252 installed
<13>Dec 25 03:59:42 rpmi: libsystemd-1:249.7-alt5 sisyphus+292025.100.1.1 1639597707 installed
<13>Dec 25 03:59:42 rpmi: libdbus-1.12.20-alt1 sisyphus+281278.100.1.1 1627484268 installed
<13>Dec 25 03:59:42 rpmi: libqt5-dbus-5.15.2-alt7 sisyphus+290451.100.3.2 1637673940 installed
<13>Dec 25 03:59:42 rpmi: libcom_err-1.46.4.0.5.4cda-alt1 sisyphus+283826.100.1.1 1629975361 installed
<13>Dec 25 03:59:42 rpmi: libbrotlicommon-1.0.9-alt2 sisyphus+278430.100.1.2 1626213212 installed
<13>Dec 25 03:59:42 rpmi: libbrotlidec-1.0.9-alt2 sisyphus+278430.100.1.2 1626213212 installed
<13>Dec 25 03:59:42 rpmi: libharfbuzz-3.2.0-alt1 sisyphus+291977.100.2.1 1640010570 installed
<13>Dec 25 03:59:42 rpmi: libfreetype-2.11.0-alt1 sisyphus+281294.100.1.1 1627488674 installed
<13>Dec 25 03:59:42 rpmi: fontconfig-2.13.1-alt2 sisyphus+283256.100.1.1 1629274963 installed
Updating fonts cache: <29>Dec 25 03:59:43 fontconfig: Updating fonts cache: succeeded
[ DONE ]
<13>Dec 25 03:59:43 rpmi: libSDL2-2.0.18-alt2 sisyphus+292336.100.1.1 1639985711 installed
<13>Dec 25 03:59:43 rpmi: tslib-1.22-alt3 sisyphus+278442.100.1.2 1626216683 installed
<13>Dec 25 03:59:43 rpmi: libxshmfence-1.3-alt1 sisyphus+278248.100.1.1 1626080763 installed
<13>Dec 25 03:59:43 rpmi: libX11-locales-3:1.7.3-alt1 sisyphus+291550.100.1.1 1638859750 installed
<13>Dec 25 03:59:43 rpmi: libXdmcp-1.1.3-alt1 sisyphus+278816.100.1.1 1626219233 installed
<13>Dec 25 03:59:43 rpmi: libXau-1.0.9-alt1 sisyphus+278247.100.1.1 1626080738 installed
<13>Dec 25 03:59:43 rpmi: libxcb-1.14-alt1 sisyphus+277968.100.1.3 1625952333 installed
<13>Dec 25 03:59:43 rpmi: libX11-3:1.7.3-alt1 sisyphus+291550.100.1.1 1638859758 installed
<13>Dec 25 03:59:43 rpmi: libXext-1.3.4-alt1 sisyphus+278817.100.1.3 1626262589 installed
<13>Dec 25 03:59:43 rpmi: libXxf86vm-1.1.4-alt2 sisyphus+275334.100.2.2 1624577012 installed
<13>Dec 25 03:59:43 rpmi: libXfixes-6.0.0-alt1 sisyphus+284644.300.1.1 1630910333 installed
<13>Dec 25 03:59:43 rpmi: libxcbutil-icccm-0.4.1-alt2 sisyphus+278275.100.1.2 1626148617 installed
<13>Dec 25 03:59:43 rpmi: libxcbutil-1:0.4.0-alt1 sisyphus+275412.100.2.2 1624579109 installed
<13>Dec 25 03:59:43 rpmi: libxcbutil-image-0.4.0-alt1 sisyphus+275413.100.1.3 1624505806 installed
<13>Dec 25 03:59:43 rpmi: libxcbutil-keysyms-0.4.0-alt1 sisyphus+278187.100.1.1 1626075950 installed
<13>Dec 25 03:59:43 rpmi: libxcb-render-util-0.3.9-alt3 sisyphus+276916.100.1.2 1625275237 installed
<13>Dec 25 03:59:43 rpmi: libxkbcommon-x11-1.3.1-alt1 sisyphus+285084.100.1.1 1631455232 installed
<13>Dec 25 03:59:43 rpmi: libwayland-client-1.20.0-alt1 sisyphus+290473.40.2.1 1639117746 installed
<13>Dec 25 03:59:43 rpmi: libpciaccess-1:0.16-alt1 sisyphus+278288.100.1.1 1626084208 installed
<13>Dec 25 03:59:43 rpmi: libdrm-1:2.4.109-alt1 sisyphus+291482.100.1.1 1638787695 installed
<13>Dec 25 03:59:43 rpmi: libGLX-mesa-4:21.3.2-alt1 sisyphus+292363.100.1.1 1640011669 installed
<13>Dec 25 03:59:43 rpmi: libgbm-4:21.3.2-alt1 sisyphus+292363.100.1.1 1640011669 installed
<13>Dec 25 03:59:43 rpmi: libEGL-mesa-4:21.3.2-alt1 sisyphus+292363.100.1.1 1640011669 installed
<13>Dec 25 03:59:43 rpmi: libEGL-7:1.3.4-alt1 sisyphus+286013.100.1.1 1632749270 installed
<13>Dec 25 03:59:43 rpmi: libGLX-7:1.3.4-alt1 sisyphus+286013.100.1.1 1632749270 installed
<13>Dec 25 03:59:43 rpmi: libGL-7:1.3.4-alt1 sisyphus+286013.100.1.1 1632749270 installed
<13>Dec 25 03:59:43 rpmi: libdevmapper-1.02.179-alt2 sisyphus+287340.100.1.1 1634383917 installed
<13>Dec 25 03:59:43 rpmi: mount-2.37.2-alt2 sisyphus+284245.100.1.1 1630401233 installed
<13>Dec 25 03:59:43 rpmi: losetup-2.37.2-alt2 sisyphus+284245.100.1.1 1630401233 installed
<13>Dec 25 03:59:43 rpmi: lsblk-2.37.2-alt2 sisyphus+284245.100.1.1 1630401233 installed
<13>Dec 25 03:59:43 rpmi: libp11-kit-0.23.15-alt2 sisyphus+287552.300.2.1 1634541487 installed
<13>Dec 25 03:59:43 rpmi: libtasn1-4.17.0-alt2 sisyphus+285706.100.1.1 1632328570 installed
<13>Dec 25 03:59:43 rpmi: rpm-macros-alternatives-0.5.1-alt1 sisyphus+278157.100.2.1 1626055790 installed
<13>Dec 25 03:59:43 rpmi: alternatives-0.5.1-alt1 sisyphus+278157.100.2.1 1626055790 installed
<13>Dec 25 03:59:43 rpmi: ca-certificates-2021.10.06-alt1 sisyphus+286526.200.1.1 1633528578 installed
<13>Dec 25 03:59:43 rpmi: ca-trust-0.1.2-alt1 sisyphus+233348.100.1.1 1561653823 installed
<13>Dec 25 03:59:43 rpmi: p11-kit-trust-0.23.15-alt2 sisyphus+287552.300.2.1 1634541487 installed
<13>Dec 25 03:59:43 rpmi: libcrypto1.1-1.1.1l-alt2 sisyphus+287339.100.1.1 1634383658 installed
<13>Dec 25 03:59:43 rpmi: libssl1.1-1.1.1l-alt2 sisyphus+287339.100.1.1 1634383658 installed
<13>Dec 25 03:59:43 rpmi: python3-3.9.9-alt1 sisyphus+291125.100.2.1 1638385980 installed
<13>Dec 25 03:59:44 rpmi: python3-base-3.9.9-alt1 sisyphus+291125.100.2.1 1638385980 installed
<13>Dec 25 03:59:44 rpmi: libkmod-29-alt1 sisyphus+288763.100.1.1 1635886492 installed
<13>Dec 25 03:59:44 rpmi: kmod-29-alt1 sisyphus+288763.100.1.1 1635886492 installed
<13>Dec 25 03:59:44 rpmi: dmsetup-1.02.179-alt2 sisyphus+287340.100.1.1 1634383917 installed
<86>Dec 25 03:59:44 groupadd[844378]: group added to /etc/group: name=tape, GID=499
<86>Dec 25 03:59:44 groupadd[844378]: group added to /etc/gshadow: name=tape
<86>Dec 25 03:59:44 groupadd[844378]: new group: name=tape, GID=499
<86>Dec 25 03:59:44 groupadd[844385]: group added to /etc/group: name=dialout, GID=498
<86>Dec 25 03:59:44 groupadd[844385]: group added to /etc/gshadow: name=dialout
<86>Dec 25 03:59:44 groupadd[844385]: new group: name=dialout, GID=498
<86>Dec 25 03:59:44 groupadd[844389]: group added to /etc/group: name=input, GID=497
<86>Dec 25 03:59:44 groupadd[844389]: group added to /etc/gshadow: name=input
<86>Dec 25 03:59:44 groupadd[844389]: new group: name=input, GID=497
<86>Dec 25 03:59:44 groupadd[844397]: group added to /etc/group: name=video, GID=496
<86>Dec 25 03:59:44 groupadd[844397]: group added to /etc/gshadow: name=video
<86>Dec 25 03:59:44 groupadd[844397]: new group: name=video, GID=496
<86>Dec 25 03:59:44 groupadd[844411]: group added to /etc/group: name=render, GID=495
<86>Dec 25 03:59:44 groupadd[844411]: group added to /etc/gshadow: name=render
<86>Dec 25 03:59:44 groupadd[844411]: new group: name=render, GID=495
<13>Dec 25 03:59:44 rpmi: udev-1:249.7-alt5 sisyphus+292025.100.1.1 1639597707 installed
<13>Dec 25 03:59:44 rpmi: libwacom-1.12-alt1 sisyphus+284319.100.1.1 1630480005 installed
<13>Dec 25 03:59:44 rpmi: libinput-1.19.3-alt1 sisyphus+291904.100.1.1 1639408199 installed
<86>Dec 25 03:59:44 groupadd[845119]: group added to /etc/group: name=_keytab, GID=494
<86>Dec 25 03:59:44 groupadd[845119]: group added to /etc/gshadow: name=_keytab
<86>Dec 25 03:59:44 groupadd[845119]: new group: name=_keytab, GID=494
<13>Dec 25 03:59:44 rpmi: libkrb5-1.19.2-alt2 sisyphus+281652.100.1.1 1627900477 installed
<13>Dec 25 03:59:44 rpmi: libqt5-network-5.15.2-alt7 sisyphus+290451.100.3.2 1637673940 installed
<13>Dec 25 03:59:44 rpmi: libqt5-xcbqpa-5.15.2-alt7 sisyphus+290451.100.3.2 1637673940 installed
<13>Dec 25 03:59:44 rpmi: libqt5-eglfskmssupport-5.15.2-alt7 sisyphus+290451.100.3.2 1637673940 installed
<13>Dec 25 03:59:44 rpmi: libqt5-eglfsdeviceintegration-5.15.2-alt7 sisyphus+290451.100.3.2 1637673940 installed
<13>Dec 25 03:59:44 rpmi: libqt5-gui-5.15.2-alt7 sisyphus+290451.100.3.2 1637673940 installed
<13>Dec 25 03:59:44 rpmi: libqt5-qmlmodels-5.15.2-alt5 sisyphus+291645.100.2.1 1639046286 installed
<13>Dec 25 03:59:44 rpmi: libqt5-qmlworkerscript-5.15.2-alt5 sisyphus+291645.100.2.1 1639046286 installed
<13>Dec 25 03:59:45 rpmi: libqt5-quick-5.15.2-alt5 sisyphus+291645.100.2.1 1639046286 installed
<13>Dec 25 03:59:45 rpmi: libqt5-quickshapes-5.15.2-alt5 sisyphus+291645.100.2.1 1639046286 installed
<13>Dec 25 03:59:45 rpmi: libqt5-qml-5.15.2-alt5 sisyphus+291645.100.2.1 1639046286 installed
<13>Dec 25 03:59:45 rpmi: rpm-build-qml-5.15.2-alt5 sisyphus+291645.100.2.1 1639046286 installed
<13>Dec 25 03:59:45 rpmi: rpm-build-kf5-5.12.0-alt2 sisyphus+226903.100.1.1 1554799142 installed
<13>Dec 25 03:59:45 rpmi: rpm-build-ubt-0.3.1-alt3 sisyphus+277013.100.1.2 1625346631 installed
<13>Dec 25 03:59:47 rpmi: libidn2-2.3.2-alt1 sisyphus+281238.100.1.2 1627476328 installed
<13>Dec 25 03:59:47 rpmi: libqt5-widgets-5.15.2-alt7 sisyphus+290451.100.3.2 1637673940 installed
<13>Dec 25 03:59:47 rpmi: libnettle8-3.7.3-alt1 sisyphus+276723.100.1.2 1625211849 installed
<13>Dec 25 03:59:47 rpmi: xorg-proto-devel-2021.5-alt1 sisyphus+285490.100.1.1 1632124129 installed
<13>Dec 25 03:59:48 rpmi: libxcb-devel-1.14-alt1 sisyphus+277968.100.1.3 1625952333 installed
<13>Dec 25 03:59:48 rpmi: libX11-devel-3:1.7.3-alt1 sisyphus+291550.100.1.1 1638859758 installed
<13>Dec 25 03:59:48 rpmi: python3-module-six-1.16.0-alt1 sisyphus+283489.100.2.1 1629527308 installed
<13>Dec 25 03:59:48 rpmi: libhogweed6-3.7.3-alt1 sisyphus+276723.100.1.2 1625211849 installed
<13>Dec 25 03:59:48 rpmi: libgnutls30-3.6.16-alt1 sisyphus+273086.100.1.1 1622478374 installed
<13>Dec 25 03:59:48 rpmi: libqt5-opengl-5.15.2-alt7 sisyphus+290451.100.3.2 1637673940 installed
<13>Dec 25 03:59:48 rpmi: xxd-4:8.2.0011-alt3 sisyphus+279619.100.1.1 1626624960 installed
<13>Dec 25 03:59:48 rpmi: libxkbcommon-devel-1.3.1-alt1 sisyphus+285084.100.1.1 1631455232 installed
<13>Dec 25 03:59:48 rpmi: vulkan-filesystem-1.2.196-alt2 sisyphus+289859.1000.3.1 1637053226 installed
<13>Dec 25 03:59:48 rpmi: libvulkan1-1.2.196-alt2 sisyphus+289859.1000.3.1 1637053238 installed
<13>Dec 25 03:59:48 rpmi: libvulkan-devel-1.2.196-alt2 sisyphus+289859.1000.3.1 1637053238 installed
<13>Dec 25 03:59:48 rpmi: libudev-devel-1:249.7-alt5 sisyphus+292025.100.1.1 1639597707 installed
<13>Dec 25 03:59:48 rpmi: libssl-devel-1.1.1l-alt2 sisyphus+287339.100.1.1 1634383658 installed
<13>Dec 25 03:59:48 rpmi: libqt5-xml-5.15.2-alt7 sisyphus+290451.100.3.2 1637673940 installed
<13>Dec 25 03:59:48 rpmi: libqt5-test-5.15.2-alt7 sisyphus+290451.100.3.2 1637673940 installed
<13>Dec 25 03:59:48 rpmi: libqt5-concurrent-5.15.2-alt7 sisyphus+290451.100.3.2 1637673940 installed
<13>Dec 25 03:59:48 rpmi: libavahi-0.8-alt2 sisyphus+279391.100.1.2 1626530700 installed
<13>Dec 25 03:59:48 rpmi: libcups-2.3.3-alt7.op2 sisyphus+289457.100.2.1 1636771530 installed
<13>Dec 25 03:59:48 rpmi: libqt5-printsupport-5.15.2-alt7 sisyphus+290451.100.3.2 1637673940 installed
<13>Dec 25 03:59:48 rpmi: libOpenGL-7:1.3.4-alt1 sisyphus+286013.100.1.1 1632749270 installed
<13>Dec 25 03:59:48 rpmi: libGLES-7:1.3.4-alt1 sisyphus+286013.100.1.1 1632749270 installed
<13>Dec 25 03:59:48 rpmi: libglvnd-devel-7:1.3.4-alt1 sisyphus+286013.100.1.1 1632749270 installed
<13>Dec 25 03:59:48 rpmi: kf5-filesystem-5.60.0-alt1 sisyphus+234706.100.1.1 1563356908 installed
<13>Dec 25 03:59:48 rpmi: kf5-karchive-common-5.89.0-alt1 sisyphus+292102.2100.2.2 1639757929 installed
<13>Dec 25 03:59:48 rpmi: libkf5archive-5.89.0-alt1 sisyphus+292102.2100.2.2 1639757969 installed
<13>Dec 25 03:59:48 rpmi: icu-utils-1:6.9.1-alt2 sisyphus+277632.100.1.1 1625726231 installed
<13>Dec 25 03:59:48 rpmi: libicu-devel-1:6.9.1-alt2 sisyphus+277632.100.1.1 1625726231 installed
<13>Dec 25 03:59:48 rpmi: gcc-c++-common-1.4.27-alt1 sisyphus+278099.1300.1.1 1626028636 installed
<13>Dec 25 03:59:49 rpmi: libstdc++11-devel-11.2.1-alt2 sisyphus+291192.100.1.1 1638461765 installed
<13>Dec 25 03:59:49 rpmi: gcc11-c++-11.2.1-alt2 sisyphus+291192.100.1.1 1638461765 installed
<13>Dec 25 03:59:49 rpmi: gcc-c++-11-alt1 sisyphus+285602.400.1.1 1632239666 installed
<13>Dec 25 03:59:49 rpmi: libyaml2-0.2.5-alt1 sisyphus+278391.100.1.1 1626094932 installed
<13>Dec 25 03:59:49 rpmi: python3-module-yaml-5.4.1-alt2 sisyphus+281629.100.1.1 1627893013 installed
<13>Dec 25 03:59:49 rpmi: shared-mime-info-2.1-alt2 sisyphus+292072.100.1.1 1639655304 installed
<13>Dec 25 03:59:49 rpmi: python3-module-pyxdg-0.27-alt1 sisyphus+275990.100.1.1 1624810448 installed
<13>Dec 25 03:59:49 rpmi: python3-module-pycparser-2.20-alt2 sisyphus+278697.200.1.1 1626167452 installed
<13>Dec 25 03:59:49 rpmi: python3-module-cffi-1.15.0-alt1 sisyphus+292084.100.2.1 1639731640 installed
<13>Dec 25 03:59:49 rpmi: python3-module-cryptography-36.0.0-alt1 sisyphus+291184.200.1.1 1638452747 installed
<13>Dec 25 03:59:49 rpmi: python3-module-openssl-20.0.1-alt1 sisyphus+267607.100.2.1 1615475362 installed
<13>Dec 25 03:59:49 rpmi: python3-module-urllib3-2:1.26.6-alt3 sisyphus+283224.100.2.2 1629257365 installed
<13>Dec 25 03:59:49 rpmi: python3-module-idna-3.3-alt1 sisyphus+288800.100.1.1 1635936399 installed
<13>Dec 25 03:59:49 rpmi: python3-module-charset-normalizer-2.0.6-alt1 sisyphus+286375.600.1.1 1633362792 installed
<13>Dec 25 03:59:49 rpmi: python3-module-requests-2.26.0-alt2 sisyphus+286450.100.1.1 1633447383 installed
<13>Dec 25 03:59:49 rpmi: rpm-macros-cmake-3.22.1-alt1 sisyphus+291875.100.1.1 1639360659 installed
<13>Dec 25 03:59:49 rpmi: cmake-modules-3.22.1-alt1 sisyphus+291875.100.1.1 1639360661 installed
<13>Dec 25 03:59:49 rpmi: libuv-1.42.0-alt1 sisyphus+282690.100.1.1 1628973284 installed
<13>Dec 25 03:59:49 rpmi: librhash-1.3.5-alt3 sisyphus+286141.40.2.1 1632982456 installed
<13>Dec 25 03:59:49 rpmi: libjsoncpp24-1.9.4-alt2 sisyphus+286441.100.1.1 1633444234 installed
<13>Dec 25 03:59:49 rpmi: publicsuffix-list-dafsa-20210929-alt1 sisyphus+286161.100.1.1 1632988273 installed
<13>Dec 25 03:59:49 rpmi: libpsl-0.21.1-alt2 sisyphus+279461.100.1.1 1626547555 installed
<13>Dec 25 03:59:49 rpmi: libnghttp2-1.41.0-alt2 sisyphus+286786.100.1.1 1633940959 installed
<13>Dec 25 03:59:49 rpmi: openldap-common-2.4.59-alt1 sisyphus+282933.100.1.1 1629124747 installed
<86>Dec 25 03:59:49 groupadd[858498]: group added to /etc/group: name=sasl, GID=493
<86>Dec 25 03:59:49 groupadd[858498]: group added to /etc/gshadow: name=sasl
<86>Dec 25 03:59:49 groupadd[858498]: new group: name=sasl, GID=493
<13>Dec 25 03:59:49 rpmi: libsasl2-3-2.1.27-alt2.2 sisyphus+282040.40.2.1 1628929849 installed
<13>Dec 25 03:59:49 rpmi: libldap-2.4.59-alt1 sisyphus+282933.100.1.1 1629124742 installed
<13>Dec 25 03:59:50 rpmi: libcurl-7.80.0-alt1 sisyphus+290333.100.1.1 1637428439 installed
<13>Dec 25 03:59:50 rpmi: libarchive13-3.5.1-alt1 sisyphus+279480.100.1.1 1626549371 installed
<13>Dec 25 03:59:50 rpmi: cmake-3.22.1-alt1 sisyphus+291875.100.1.1 1639360659 installed
<13>Dec 25 03:59:50 rpmi: extra-cmake-modules-5.89.0-alt1 sisyphus+292102.100.2.2 1639757060 installed
<13>Dec 25 03:59:50 rpmi: qt5-base-devel-5.15.2-alt7 sisyphus+290451.100.3.2 1637673940 installed
<13>Dec 25 03:59:50 rpmi: kf5-karchive-devel-5.89.0-alt1 sisyphus+292102.2100.2.2 1639757969 installed
Building target platforms: i586
Building for target i586
Wrote: /usr/src/in/nosrpm/kde5-kpkpass-21.08.3-alt1.nosrc.rpm (w1.gzdio)
Installing kde5-kpkpass-21.08.3-alt1.src.rpm
Building target platforms: i586
Building for target i586
Executing(%prep): /bin/sh -e /usr/src/tmp/rpm-tmp.53216
+ umask 022
+ /bin/mkdir -p /usr/src/RPM/BUILD
+ cd /usr/src/RPM/BUILD
+ cd /usr/src/RPM/BUILD
+ rm -rf kpkpass-21.08.3
+ echo 'Source #0 (kpkpass-21.08.3.tar):'
Source #0 (kpkpass-21.08.3.tar):
+ /bin/tar -xf /usr/src/RPM/SOURCES/kpkpass-21.08.3.tar
+ cd kpkpass-21.08.3
+ /bin/chmod -c -Rf u+rwX,go-w .
+ exit 0
Executing(%build): /bin/sh -e /usr/src/tmp/rpm-tmp.53216
+ umask 022
+ /bin/mkdir -p /usr/src/RPM/BUILD
+ cd /usr/src/RPM/BUILD
+ cd kpkpass-21.08.3
+ __kf5_build -DKDE_INSTALL_INCLUDEDIR=/usr/include/KF5
+ mkdir -p BUILD
+ __kf5_cmake -DKDE_INSTALL_INCLUDEDIR=/usr/include/KF5
+ export PATH=/usr/lib/kf5/bin:/usr/src/bin:/bin:/usr/bin:/usr/X11R6/bin:/usr/games
+ PATH=/usr/lib/kf5/bin:/usr/src/bin:/bin:/usr/bin:/usr/X11R6/bin:/usr/games
+ export QTDIR=/usr/share/qt5
+ QTDIR=/usr/share/qt5
+ export 'CFLAGS=-pipe -frecord-gcc-switches -Wall -g -O2 -flto=auto -march=i586 -mtune=generic'
+ CFLAGS='-pipe -frecord-gcc-switches -Wall -g -O2 -flto=auto -march=i586 -mtune=generic'
+ export 'CXXFLAGS=-pipe -frecord-gcc-switches -Wall -g -O2 -flto=auto -march=i586 -mtune=generic'
+ CXXFLAGS='-pipe -frecord-gcc-switches -Wall -g -O2 -flto=auto -march=i586 -mtune=generic'
+ pushd BUILD
~/RPM/BUILD/kpkpass-21.08.3/BUILD ~/RPM/BUILD/kpkpass-21.08.3
+ cmake .. -DCMAKE_USE_RELATIVE_PATHS:BOOL=ON -DCMAKE_VERBOSE_MAKEFILE:BOOL=ON -DCMAKE_SKIP_RPATH:BOOL=ON -DBUILD_TESTING:BOOL=FALSE -DKDE_INSTALL_USE_QT_SYS_PATHS:BOOL=ON -DCMAKE_BUILD_TYPE=Release '-DCMAKE_EXE_LINKER_FLAGS:STRING=-L/usr/lib -L/usr/lib/kf5/devel' '-DCMAKE_MODULE_LINKER_FLAGS:STRING=-L/usr/lib -L/usr/lib/kf5/devel' '-DCMAKE_SHARED_LINKER_FLAGS:STRING=-L/usr/lib -L/usr/lib/kf5/devel' '-DCMAKE_LIBRARY_PATH=/usr/lib/kf5/devel;/usr/lib;/lib' '-DCMAKE_INCLUDE_PATH=/usr/include/KF5;/usr/include' -DCMAKE_INSTALL_PREFIX=/usr -DCMAKE_PREFIX_PATH=/usr -DCMAKE_INSTALL_BINDIR=/usr/lib/kf5/bin -DCMAKE_INSTALL_FULL_BINDIR=/usr/lib/kf5/bin -DBIN_INSTALL_DIR:PATH=/usr/lib/kf5/bin -DCMAKE_INSTALL_SBINDIR=/usr/lib/kf5/sbin -DCMAKE_INSTALL_FULL_SBINDIR=/usr/lib/kf5/sbin -DSBIN_INSTALL_DIR:PATH=/usr/lib/kf5/sbin -DLIBEXEC_INSTALL_DIR:PATH=/usr/libexec -DINCLUDE_INSTALL_DIR:PATH=/usr/include -DCMAKE_INSTALL_INCLUDEDIR_KF5=/usr/include/KF5 -DDATA_INSTALL_DIR:PATH=/usr/share -DCONFIG_INSTALL_DIR:PATH=/etc/kf5/xdg -DSERVICES_INSTALL_DIR:PATH=/usr/share/kservices5 -DSERVICETYPES_INSTALL_DIR:PATH=/usr/share/kservicetypes5 -DKNOTIFYRC_INSTALL_DIR:PATH=/usr/share/knotifications5 -DKXMLGUI_INSTALL_DIR:PATH=/usr/share/kxmlgui5 -DLIB_INSTALL_DIR:PATH=/usr/lib -DLIB_DESTINATION=lib -DLIB_SUFFIX= -DSYSCONF_INSTALL_DIR:PATH=/etc -DAUTOSTART_INSTALL_DIR=/etc/kf5/xdg/autostart -DHTML_INSTALL_DIR=/usr/share/kf5/doc/HTML -DICON_INSTALL_DIR=/usr/share/kf5/icons -DXDG_MIME_INSTALL_DIR=/usr/share/mime/packages -DXDG_APPS_INSTALL_DIR=/usr/share/kf5/applications/kf5 -DECM_MKSPECS_INSTALL_DIR:PATH=/usr/lib/qt5/mkspecs/modules -DKCFG_INSTALL_DIR:PATH=/usr/share/kf5/config.kcfg -DPLUGIN_INSTALL_DIR:PATH=/usr/lib/qt5/plugins -DQT_PLUGIN_INSTALL_DIR:PATH=/usr/lib/qt5/plugins -DQML_INSTALL_DIR:PATH=/usr/lib/qt5/qml -DIMPORTS_INSTALL_DIR:PATH=/usr/lib/qt5/imports -DDBUS_INTERFACES_INSTALL_DIR=/usr/share/kf5/dbus-1/interfaces -DDBUS_SERVICES_INSTALL_DIR=/usr/share/kf5/dbus-1/services -DDBUS_SYSTEM_SERVICES_INSTALL_DIR=/lib/dbus-1/system-services -DKDE_INSTALL_INCLUDEDIR=/usr/include/KF5
-- The C compiler identification is GNU 11.2.1
-- The CXX compiler identification is GNU 11.2.1
-- Detecting C compiler ABI info
-- Detecting C compiler ABI info - done
-- Check for working C compiler: /usr/bin/cc - skipped
-- Detecting C compile features
-- Detecting C compile features - done
-- Detecting CXX compiler ABI info
-- Detecting CXX compiler ABI info - done
-- Check for working CXX compiler: /usr/bin/c++ - skipped
-- Detecting CXX compile features
-- Detecting CXX compile features - done
-- Looking for __GLIBC__
-- Looking for __GLIBC__ - found
-- Performing Test _OFFT_IS_64BIT
-- Performing Test _OFFT_IS_64BIT - Failed
-- Performing Test HAVE_DATE_TIME
-- Performing Test HAVE_DATE_TIME - Success
CMake Deprecation Warning at /usr/share/ECM/kde-modules/KDEInstallDirsCommon.cmake:133 (message):
BIN_INSTALL_DIR is deprecated, use KDE_INSTALL_BINDIR instead.
Call Stack (most recent call first):
/usr/share/ECM/kde-modules/KDEInstallDirsCommon.cmake:233 (_define_relative)
/usr/share/ECM/kde-modules/KDEInstallDirs5.cmake:223 (include)
/usr/share/ECM/kde-modules/KDEInstallDirs.cmake:15 (include)
CMakeLists.txt:21 (include)
CMake Deprecation Warning at /usr/share/ECM/kde-modules/KDEInstallDirsCommon.cmake:133 (message):
SBIN_INSTALL_DIR is deprecated, use KDE_INSTALL_SBINDIR instead.
Call Stack (most recent call first):
/usr/share/ECM/kde-modules/KDEInstallDirsCommon.cmake:236 (_define_relative)
/usr/share/ECM/kde-modules/KDEInstallDirs5.cmake:223 (include)
/usr/share/ECM/kde-modules/KDEInstallDirs.cmake:15 (include)
CMakeLists.txt:21 (include)
CMake Deprecation Warning at /usr/share/ECM/kde-modules/KDEInstallDirsCommon.cmake:133 (message):
LIB_INSTALL_DIR is deprecated, use KDE_INSTALL_LIBDIR instead.
Call Stack (most recent call first):
/usr/share/ECM/kde-modules/KDEInstallDirsCommon.cmake:239 (_define_relative)
/usr/share/ECM/kde-modules/KDEInstallDirs5.cmake:223 (include)
/usr/share/ECM/kde-modules/KDEInstallDirs.cmake:15 (include)
CMakeLists.txt:21 (include)
CMake Deprecation Warning at /usr/share/ECM/kde-modules/KDEInstallDirsCommon.cmake:133 (message):
LIBEXEC_INSTALL_DIR is deprecated, use KDE_INSTALL_LIBEXECDIR instead.
Call Stack (most recent call first):
/usr/share/ECM/kde-modules/KDEInstallDirsCommon.cmake:248 (_define_relative)
/usr/share/ECM/kde-modules/KDEInstallDirs5.cmake:223 (include)
/usr/share/ECM/kde-modules/KDEInstallDirs.cmake:15 (include)
CMakeLists.txt:21 (include)
CMake Deprecation Warning at /usr/share/ECM/kde-modules/KDEInstallDirsCommon.cmake:133 (message):
DATA_INSTALL_DIR is deprecated, use KDE_INSTALL_DATADIR instead.
Call Stack (most recent call first):
/usr/share/ECM/kde-modules/KDEInstallDirsCommon.cmake:277 (_define_relative)
/usr/share/ECM/kde-modules/KDEInstallDirs5.cmake:223 (include)
/usr/share/ECM/kde-modules/KDEInstallDirs.cmake:15 (include)
CMakeLists.txt:21 (include)
CMake Deprecation Warning at /usr/share/ECM/kde-modules/KDEInstallDirsCommon.cmake:133 (message):
HTML_INSTALL_DIR is deprecated, use KDE_INSTALL_DOCBUNDLEDIR instead.
Call Stack (most recent call first):
/usr/share/ECM/kde-modules/KDEInstallDirsCommon.cmake:282 (_define_relative)
/usr/share/ECM/kde-modules/KDEInstallDirs5.cmake:223 (include)
/usr/share/ECM/kde-modules/KDEInstallDirs.cmake:15 (include)
CMakeLists.txt:21 (include)
CMake Deprecation Warning at /usr/share/ECM/kde-modules/KDEInstallDirsCommon.cmake:133 (message):
KCFG_INSTALL_DIR is deprecated, use KDE_INSTALL_KCFGDIR instead.
Call Stack (most recent call first):
/usr/share/ECM/kde-modules/KDEInstallDirsCommon.cmake:285 (_define_relative)
/usr/share/ECM/kde-modules/KDEInstallDirs5.cmake:223 (include)
/usr/share/ECM/kde-modules/KDEInstallDirs.cmake:15 (include)
CMakeLists.txt:21 (include)
CMake Deprecation Warning at /usr/share/ECM/kde-modules/KDEInstallDirsCommon.cmake:133 (message):
ICON_INSTALL_DIR is deprecated, use KDE_INSTALL_ICONDIR instead.
Call Stack (most recent call first):
/usr/share/ECM/kde-modules/KDEInstallDirsCommon.cmake:302 (_define_relative)
/usr/share/ECM/kde-modules/KDEInstallDirs5.cmake:223 (include)
/usr/share/ECM/kde-modules/KDEInstallDirs.cmake:15 (include)
CMakeLists.txt:21 (include)
CMake Deprecation Warning at /usr/share/ECM/kde-modules/KDEInstallDirsCommon.cmake:133 (message):
XDG_APPS_INSTALL_DIR is deprecated, use KDE_INSTALL_APPDIR instead.
Call Stack (most recent call first):
/usr/share/ECM/kde-modules/KDEInstallDirsCommon.cmake:317 (_define_relative)
/usr/share/ECM/kde-modules/KDEInstallDirs5.cmake:223 (include)
/usr/share/ECM/kde-modules/KDEInstallDirs.cmake:15 (include)
CMakeLists.txt:21 (include)
CMake Deprecation Warning at /usr/share/ECM/kde-modules/KDEInstallDirsCommon.cmake:133 (message):
XDG_MIME_INSTALL_DIR is deprecated, use KDE_INSTALL_MIMEDIR instead.
Call Stack (most recent call first):
/usr/share/ECM/kde-modules/KDEInstallDirsCommon.cmake:323 (_define_relative)
/usr/share/ECM/kde-modules/KDEInstallDirs5.cmake:223 (include)
/usr/share/ECM/kde-modules/KDEInstallDirs.cmake:15 (include)
CMakeLists.txt:21 (include)
CMake Deprecation Warning at /usr/share/ECM/kde-modules/KDEInstallDirsCommon.cmake:133 (message):
DBUS_INTERFACES_INSTALL_DIR is deprecated, use KDE_INSTALL_DBUSINTERFACEDIR
instead.
Call Stack (most recent call first):
/usr/share/ECM/kde-modules/KDEInstallDirsCommon.cmake:337 (_define_relative)
/usr/share/ECM/kde-modules/KDEInstallDirs5.cmake:223 (include)
/usr/share/ECM/kde-modules/KDEInstallDirs.cmake:15 (include)
CMakeLists.txt:21 (include)
CMake Deprecation Warning at /usr/share/ECM/kde-modules/KDEInstallDirsCommon.cmake:133 (message):
DBUS_SERVICES_INSTALL_DIR is deprecated, use KDE_INSTALL_DBUSSERVICEDIR
instead.
Call Stack (most recent call first):
/usr/share/ECM/kde-modules/KDEInstallDirsCommon.cmake:340 (_define_relative)
/usr/share/ECM/kde-modules/KDEInstallDirs5.cmake:223 (include)
/usr/share/ECM/kde-modules/KDEInstallDirs.cmake:15 (include)
CMakeLists.txt:21 (include)
CMake Deprecation Warning at /usr/share/ECM/kde-modules/KDEInstallDirsCommon.cmake:133 (message):
DBUS_SYSTEM_SERVICES_INSTALL_DIR is deprecated, use
KDE_INSTALL_DBUSSYSTEMSERVICEDIR instead.
Call Stack (most recent call first):
/usr/share/ECM/kde-modules/KDEInstallDirsCommon.cmake:343 (_define_relative)
/usr/share/ECM/kde-modules/KDEInstallDirs5.cmake:223 (include)
/usr/share/ECM/kde-modules/KDEInstallDirs.cmake:15 (include)
CMakeLists.txt:21 (include)
CMake Deprecation Warning at /usr/share/ECM/kde-modules/KDEInstallDirsCommon.cmake:133 (message):
SYSCONF_INSTALL_DIR is deprecated, use KDE_INSTALL_SYSCONFDIR instead.
Call Stack (most recent call first):
/usr/share/ECM/kde-modules/KDEInstallDirsCommon.cmake:197 (_define_relative)
/usr/share/ECM/kde-modules/KDEInstallDirsCommon.cmake:359 (_define_absolute)
/usr/share/ECM/kde-modules/KDEInstallDirs5.cmake:223 (include)
/usr/share/ECM/kde-modules/KDEInstallDirs.cmake:15 (include)
CMakeLists.txt:21 (include)
CMake Deprecation Warning at /usr/share/ECM/kde-modules/KDEInstallDirsCommon.cmake:133 (message):
CONFIG_INSTALL_DIR is deprecated, use KDE_INSTALL_CONFDIR instead.
Call Stack (most recent call first):
/usr/share/ECM/kde-modules/KDEInstallDirsCommon.cmake:362 (_define_relative)
/usr/share/ECM/kde-modules/KDEInstallDirs5.cmake:223 (include)
/usr/share/ECM/kde-modules/KDEInstallDirs.cmake:15 (include)
CMakeLists.txt:21 (include)
CMake Deprecation Warning at /usr/share/ECM/kde-modules/KDEInstallDirsCommon.cmake:133 (message):
AUTOSTART_INSTALL_DIR is deprecated, use KDE_INSTALL_AUTOSTARTDIR instead.
Call Stack (most recent call first):
/usr/share/ECM/kde-modules/KDEInstallDirsCommon.cmake:365 (_define_relative)
/usr/share/ECM/kde-modules/KDEInstallDirs5.cmake:223 (include)
/usr/share/ECM/kde-modules/KDEInstallDirs.cmake:15 (include)
CMakeLists.txt:21 (include)
CMake Deprecation Warning at /usr/share/ECM/kde-modules/KDEInstallDirsCommon.cmake:133 (message):
QT_PLUGIN_INSTALL_DIR is deprecated, use KDE_INSTALL_QTPLUGINDIR instead.
Call Stack (most recent call first):
/usr/share/ECM/kde-modules/KDEInstallDirsCommon.cmake:197 (_define_relative)
/usr/share/ECM/kde-modules/KDEInstallDirs5.cmake:254 (_define_absolute)
/usr/share/ECM/kde-modules/KDEInstallDirs.cmake:15 (include)
CMakeLists.txt:21 (include)
CMake Deprecation Warning at /usr/share/ECM/kde-modules/KDEInstallDirsCommon.cmake:133 (message):
IMPORTS_INSTALL_DIR is deprecated, use KDE_INSTALL_QTQUICKIMPORTSDIR
instead.
Call Stack (most recent call first):
/usr/share/ECM/kde-modules/KDEInstallDirsCommon.cmake:197 (_define_relative)
/usr/share/ECM/kde-modules/KDEInstallDirs5.cmake:263 (_define_absolute)
/usr/share/ECM/kde-modules/KDEInstallDirs.cmake:15 (include)
CMakeLists.txt:21 (include)
CMake Deprecation Warning at /usr/share/ECM/kde-modules/KDEInstallDirsCommon.cmake:133 (message):
QML_INSTALL_DIR is deprecated, use KDE_INSTALL_QMLDIR instead.
Call Stack (most recent call first):
/usr/share/ECM/kde-modules/KDEInstallDirsCommon.cmake:197 (_define_relative)
/usr/share/ECM/kde-modules/KDEInstallDirs5.cmake:272 (_define_absolute)
/usr/share/ECM/kde-modules/KDEInstallDirs.cmake:15 (include)
CMakeLists.txt:21 (include)
CMake Deprecation Warning at /usr/share/ECM/kde-modules/KDEInstallDirsCommon.cmake:133 (message):
PLUGIN_INSTALL_DIR is deprecated, use KDE_INSTALL_PLUGINDIR instead.
Call Stack (most recent call first):
/usr/share/ECM/kde-modules/KDEInstallDirs5.cmake:294 (_define_relative)
/usr/share/ECM/kde-modules/KDEInstallDirs.cmake:15 (include)
CMakeLists.txt:21 (include)
CMake Deprecation Warning at /usr/share/ECM/kde-modules/KDEInstallDirsCommon.cmake:133 (message):
SERVICES_INSTALL_DIR is deprecated, use KDE_INSTALL_KSERVICES5DIR instead.
Call Stack (most recent call first):
/usr/share/ECM/kde-modules/KDEInstallDirs5.cmake:322 (_define_relative)
/usr/share/ECM/kde-modules/KDEInstallDirs.cmake:15 (include)
CMakeLists.txt:21 (include)
CMake Deprecation Warning at /usr/share/ECM/kde-modules/KDEInstallDirsCommon.cmake:133 (message):
SERVICETYPES_INSTALL_DIR is deprecated, use KDE_INSTALL_KSERVICETYPES5DIR
instead.
Call Stack (most recent call first):
/usr/share/ECM/kde-modules/KDEInstallDirs5.cmake:325 (_define_relative)
/usr/share/ECM/kde-modules/KDEInstallDirs.cmake:15 (include)
CMakeLists.txt:21 (include)
CMake Deprecation Warning at /usr/share/ECM/kde-modules/KDEInstallDirsCommon.cmake:133 (message):
KNOTIFYRC_INSTALL_DIR is deprecated, use KDE_INSTALL_KNOTIFY5RCDIR instead.
Call Stack (most recent call first):
/usr/share/ECM/kde-modules/KDEInstallDirs5.cmake:328 (_define_relative)
/usr/share/ECM/kde-modules/KDEInstallDirs.cmake:15 (include)
CMakeLists.txt:21 (include)
CMake Deprecation Warning at /usr/share/ECM/kde-modules/KDEInstallDirsCommon.cmake:133 (message):
KXMLGUI_INSTALL_DIR is deprecated, use KDE_INSTALL_KXMLGUI5DIR instead.
Call Stack (most recent call first):
/usr/share/ECM/kde-modules/KDEInstallDirs5.cmake:331 (_define_relative)
/usr/share/ECM/kde-modules/KDEInstallDirs.cmake:15 (include)
CMakeLists.txt:21 (include)
-- Found KF5Archive: /usr/lib/cmake/KF5Archive/KF5ArchiveConfig.cmake (found version "5.89.0")
-- Found KF5: success (found suitable version "5.89.0", minimum required is "5.83.0") found components: Archive
-- Found SharedMimeInfo: /usr/bin/update-mime-database (found suitable version "2.1", minimum required is "1.3")
-- Performing Test COMPILER_HAS_HIDDEN_VISIBILITY
-- Performing Test COMPILER_HAS_HIDDEN_VISIBILITY - Success
-- Performing Test COMPILER_HAS_HIDDEN_INLINE_VISIBILITY
-- Performing Test COMPILER_HAS_HIDDEN_INLINE_VISIBILITY - Success
-- Performing Test COMPILER_HAS_DEPRECATED_ATTR
-- Performing Test COMPILER_HAS_DEPRECATED_ATTR - Success
-- The following OPTIONAL packages have been found:
* Qt5Core (required version >= 5.15.2)
-- The following REQUIRED packages have been found:
* ECM (required version >= 5.83.0)
* Qt5Gui
* Qt5 (required version >= 5.15.0)
* KF5Archive (required version >= 5.83.0)
* KF5 (required version >= 5.83.0)
* SharedMimeInfo (required version >= 1.3), A database of common MIME types,
-- Configuring done
-- Generating done
CMake Warning:
Manually-specified variables were not used by the project:
CMAKE_INCLUDE_PATH
CMAKE_USE_RELATIVE_PATHS
ECM_MKSPECS_INSTALL_DIR
LIB_DESTINATION
LIB_SUFFIX
-- Build files have been written to: /usr/src/RPM/BUILD/kpkpass-21.08.3/BUILD
+ popd
~/RPM/BUILD/kpkpass-21.08.3
+ __kf5_make
+ pushd BUILD
~/RPM/BUILD/kpkpass-21.08.3/BUILD ~/RPM/BUILD/kpkpass-21.08.3
+ make -j16
make: Entering directory '/usr/src/RPM/BUILD/kpkpass-21.08.3/BUILD'
/usr/bin/cmake -S/usr/src/RPM/BUILD/kpkpass-21.08.3 -B/usr/src/RPM/BUILD/kpkpass-21.08.3/BUILD --check-build-system CMakeFiles/Makefile.cmake 0
make: Leaving directory '/usr/src/RPM/BUILD/kpkpass-21.08.3/BUILD'
make: Entering directory '/usr/src/RPM/BUILD/kpkpass-21.08.3/BUILD'
/usr/bin/cmake -E cmake_progress_start /usr/src/RPM/BUILD/kpkpass-21.08.3/BUILD/CMakeFiles /usr/src/RPM/BUILD/kpkpass-21.08.3/BUILD//CMakeFiles/progress.marks
make: Leaving directory '/usr/src/RPM/BUILD/kpkpass-21.08.3/BUILD'
make -f CMakeFiles/Makefile2 all
make -f src/CMakeFiles/KPimPkPass_autogen.dir/build.make src/CMakeFiles/KPimPkPass_autogen.dir/depend
make[2]: Entering directory '/usr/src/RPM/BUILD/kpkpass-21.08.3/BUILD'
cd /usr/src/RPM/BUILD/kpkpass-21.08.3/BUILD && /usr/bin/cmake -E cmake_depends "Unix Makefiles" /usr/src/RPM/BUILD/kpkpass-21.08.3 /usr/src/RPM/BUILD/kpkpass-21.08.3/src /usr/src/RPM/BUILD/kpkpass-21.08.3/BUILD /usr/src/RPM/BUILD/kpkpass-21.08.3/BUILD/src /usr/src/RPM/BUILD/kpkpass-21.08.3/BUILD/src/CMakeFiles/KPimPkPass_autogen.dir/DependInfo.cmake --color=
make[2]: Leaving directory '/usr/src/RPM/BUILD/kpkpass-21.08.3/BUILD'
make -f src/CMakeFiles/KPimPkPass_autogen.dir/build.make src/CMakeFiles/KPimPkPass_autogen.dir/build
make[2]: Entering directory '/usr/src/RPM/BUILD/kpkpass-21.08.3/BUILD'
[ 11%] Automatic MOC for target KPimPkPass
cd /usr/src/RPM/BUILD/kpkpass-21.08.3/BUILD/src && /usr/bin/cmake -E cmake_autogen /usr/src/RPM/BUILD/kpkpass-21.08.3/BUILD/src/CMakeFiles/KPimPkPass_autogen.dir/AutogenInfo.json Release
make[2]: Leaving directory '/usr/src/RPM/BUILD/kpkpass-21.08.3/BUILD'
make[1]: Entering directory '/usr/src/RPM/BUILD/kpkpass-21.08.3/BUILD'
[ 11%] Built target KPimPkPass_autogen
make[1]: Leaving directory '/usr/src/RPM/BUILD/kpkpass-21.08.3/BUILD'
make -f src/CMakeFiles/KPimPkPass.dir/build.make src/CMakeFiles/KPimPkPass.dir/depend
make[2]: Entering directory '/usr/src/RPM/BUILD/kpkpass-21.08.3/BUILD'
cd /usr/src/RPM/BUILD/kpkpass-21.08.3/BUILD && /usr/bin/cmake -E cmake_depends "Unix Makefiles" /usr/src/RPM/BUILD/kpkpass-21.08.3 /usr/src/RPM/BUILD/kpkpass-21.08.3/src /usr/src/RPM/BUILD/kpkpass-21.08.3/BUILD /usr/src/RPM/BUILD/kpkpass-21.08.3/BUILD/src /usr/src/RPM/BUILD/kpkpass-21.08.3/BUILD/src/CMakeFiles/KPimPkPass.dir/DependInfo.cmake --color=
make[2]: Leaving directory '/usr/src/RPM/BUILD/kpkpass-21.08.3/BUILD'
make -f src/CMakeFiles/KPimPkPass.dir/build.make src/CMakeFiles/KPimPkPass.dir/build
make[2]: Entering directory '/usr/src/RPM/BUILD/kpkpass-21.08.3/BUILD'
[ 22%] Building CXX object src/CMakeFiles/KPimPkPass.dir/KPimPkPass_autogen/mocs_compilation.cpp.o
cd /usr/src/RPM/BUILD/kpkpass-21.08.3/BUILD/src && /usr/bin/c++ -DKF_DEPRECATED_WARNINGS_SINCE=0x060000 -DKF_DISABLE_DEPRECATED_BEFORE_AND_AT=0x055400 -DKPimPkPass_EXPORTS -DQT_CORE_LIB -DQT_DEPRECATED_WARNINGS_SINCE=0x060000 -DQT_DISABLE_DEPRECATED_BEFORE=0x050f00 -DQT_GUI_LIB -DQT_NO_CAST_FROM_ASCII -DQT_NO_CAST_FROM_BYTEARRAY -DQT_NO_CAST_TO_ASCII -DQT_NO_DEBUG -DQT_NO_FOREACH -DQT_NO_KEYWORDS -DQT_NO_NARROWING_CONVERSIONS_IN_CONNECT -DQT_NO_URL_CAST_FROM_STRING -DQT_STRICT_ITERATORS -DQT_USE_QSTRINGBUILDER -D_FILE_OFFSET_BITS=64 -D_GNU_SOURCE -D_LARGEFILE64_SOURCE -I/usr/src/RPM/BUILD/kpkpass-21.08.3/BUILD/src -I/usr/src/RPM/BUILD/kpkpass-21.08.3/src -I/usr/src/RPM/BUILD/kpkpass-21.08.3/BUILD/src/KPimPkPass_autogen/include -isystem /usr/include/qt5 -isystem /usr/include/qt5/QtGui -isystem /usr/include/qt5/QtCore -isystem /usr/share/qt5/../../lib/qt5/mkspecs/linux-g++ -isystem /usr/include/KF5/KArchive -isystem /usr/include/KF5 -pipe -frecord-gcc-switches -Wall -g -O2 -flto=auto -march=i586 -mtune=generic -fno-operator-names -fno-exceptions -Wall -Wextra -Wcast-align -Wchar-subscripts -Wformat-security -Wno-long-long -Wpointer-arith -Wundef -Wnon-virtual-dtor -Woverloaded-virtual -Werror=return-type -Werror=init-self -Wvla -Wdate-time -Wsuggest-override -Wlogical-op -pedantic -Wzero-as-null-pointer-constant -O2 -DNDEBUG -fPIC -fvisibility=hidden -fvisibility-inlines-hidden -fPIC -std=gnu++17 -MD -MT src/CMakeFiles/KPimPkPass.dir/KPimPkPass_autogen/mocs_compilation.cpp.o -MF CMakeFiles/KPimPkPass.dir/KPimPkPass_autogen/mocs_compilation.cpp.o.d -o CMakeFiles/KPimPkPass.dir/KPimPkPass_autogen/mocs_compilation.cpp.o -c /usr/src/RPM/BUILD/kpkpass-21.08.3/BUILD/src/KPimPkPass_autogen/mocs_compilation.cpp
make[2]: Leaving directory '/usr/src/RPM/BUILD/kpkpass-21.08.3/BUILD'
make[2]: Entering directory '/usr/src/RPM/BUILD/kpkpass-21.08.3/BUILD'
[ 88%] Building CXX object src/CMakeFiles/KPimPkPass.dir/logging.cpp.o
cd /usr/src/RPM/BUILD/kpkpass-21.08.3/BUILD/src && /usr/bin/c++ -DKF_DEPRECATED_WARNINGS_SINCE=0x060000 -DKF_DISABLE_DEPRECATED_BEFORE_AND_AT=0x055400 -DKPimPkPass_EXPORTS -DQT_CORE_LIB -DQT_DEPRECATED_WARNINGS_SINCE=0x060000 -DQT_DISABLE_DEPRECATED_BEFORE=0x050f00 -DQT_GUI_LIB -DQT_NO_CAST_FROM_ASCII -DQT_NO_CAST_FROM_BYTEARRAY -DQT_NO_CAST_TO_ASCII -DQT_NO_DEBUG -DQT_NO_FOREACH -DQT_NO_KEYWORDS -DQT_NO_NARROWING_CONVERSIONS_IN_CONNECT -DQT_NO_URL_CAST_FROM_STRING -DQT_STRICT_ITERATORS -DQT_USE_QSTRINGBUILDER -D_FILE_OFFSET_BITS=64 -D_GNU_SOURCE -D_LARGEFILE64_SOURCE -I/usr/src/RPM/BUILD/kpkpass-21.08.3/BUILD/src -I/usr/src/RPM/BUILD/kpkpass-21.08.3/src -I/usr/src/RPM/BUILD/kpkpass-21.08.3/BUILD/src/KPimPkPass_autogen/include -isystem /usr/include/qt5 -isystem /usr/include/qt5/QtGui -isystem /usr/include/qt5/QtCore -isystem /usr/share/qt5/../../lib/qt5/mkspecs/linux-g++ -isystem /usr/include/KF5/KArchive -isystem /usr/include/KF5 -pipe -frecord-gcc-switches -Wall -g -O2 -flto=auto -march=i586 -mtune=generic -fno-operator-names -fno-exceptions -Wall -Wextra -Wcast-align -Wchar-subscripts -Wformat-security -Wno-long-long -Wpointer-arith -Wundef -Wnon-virtual-dtor -Woverloaded-virtual -Werror=return-type -Werror=init-self -Wvla -Wdate-time -Wsuggest-override -Wlogical-op -pedantic -Wzero-as-null-pointer-constant -O2 -DNDEBUG -fPIC -fvisibility=hidden -fvisibility-inlines-hidden -fPIC -std=gnu++17 -MD -MT src/CMakeFiles/KPimPkPass.dir/logging.cpp.o -MF CMakeFiles/KPimPkPass.dir/logging.cpp.o.d -o CMakeFiles/KPimPkPass.dir/logging.cpp.o -c /usr/src/RPM/BUILD/kpkpass-21.08.3/BUILD/src/logging.cpp
make[2]: Leaving directory '/usr/src/RPM/BUILD/kpkpass-21.08.3/BUILD'
make[2]: Entering directory '/usr/src/RPM/BUILD/kpkpass-21.08.3/BUILD'
[ 66%] Building CXX object src/CMakeFiles/KPimPkPass.dir/boardingpass.cpp.o
cd /usr/src/RPM/BUILD/kpkpass-21.08.3/BUILD/src && /usr/bin/c++ -DKF_DEPRECATED_WARNINGS_SINCE=0x060000 -DKF_DISABLE_DEPRECATED_BEFORE_AND_AT=0x055400 -DKPimPkPass_EXPORTS -DQT_CORE_LIB -DQT_DEPRECATED_WARNINGS_SINCE=0x060000 -DQT_DISABLE_DEPRECATED_BEFORE=0x050f00 -DQT_GUI_LIB -DQT_NO_CAST_FROM_ASCII -DQT_NO_CAST_FROM_BYTEARRAY -DQT_NO_CAST_TO_ASCII -DQT_NO_DEBUG -DQT_NO_FOREACH -DQT_NO_KEYWORDS -DQT_NO_NARROWING_CONVERSIONS_IN_CONNECT -DQT_NO_URL_CAST_FROM_STRING -DQT_STRICT_ITERATORS -DQT_USE_QSTRINGBUILDER -D_FILE_OFFSET_BITS=64 -D_GNU_SOURCE -D_LARGEFILE64_SOURCE -I/usr/src/RPM/BUILD/kpkpass-21.08.3/BUILD/src -I/usr/src/RPM/BUILD/kpkpass-21.08.3/src -I/usr/src/RPM/BUILD/kpkpass-21.08.3/BUILD/src/KPimPkPass_autogen/include -isystem /usr/include/qt5 -isystem /usr/include/qt5/QtGui -isystem /usr/include/qt5/QtCore -isystem /usr/share/qt5/../../lib/qt5/mkspecs/linux-g++ -isystem /usr/include/KF5/KArchive -isystem /usr/include/KF5 -pipe -frecord-gcc-switches -Wall -g -O2 -flto=auto -march=i586 -mtune=generic -fno-operator-names -fno-exceptions -Wall -Wextra -Wcast-align -Wchar-subscripts -Wformat-security -Wno-long-long -Wpointer-arith -Wundef -Wnon-virtual-dtor -Woverloaded-virtual -Werror=return-type -Werror=init-self -Wvla -Wdate-time -Wsuggest-override -Wlogical-op -pedantic -Wzero-as-null-pointer-constant -O2 -DNDEBUG -fPIC -fvisibility=hidden -fvisibility-inlines-hidden -fPIC -std=gnu++17 -MD -MT src/CMakeFiles/KPimPkPass.dir/boardingpass.cpp.o -MF CMakeFiles/KPimPkPass.dir/boardingpass.cpp.o.d -o CMakeFiles/KPimPkPass.dir/boardingpass.cpp.o -c /usr/src/RPM/BUILD/kpkpass-21.08.3/src/boardingpass.cpp
make[2]: Leaving directory '/usr/src/RPM/BUILD/kpkpass-21.08.3/BUILD'
make[2]: Entering directory '/usr/src/RPM/BUILD/kpkpass-21.08.3/BUILD'
[ 55%] Building CXX object src/CMakeFiles/KPimPkPass.dir/barcode.cpp.o
cd /usr/src/RPM/BUILD/kpkpass-21.08.3/BUILD/src && /usr/bin/c++ -DKF_DEPRECATED_WARNINGS_SINCE=0x060000 -DKF_DISABLE_DEPRECATED_BEFORE_AND_AT=0x055400 -DKPimPkPass_EXPORTS -DQT_CORE_LIB -DQT_DEPRECATED_WARNINGS_SINCE=0x060000 -DQT_DISABLE_DEPRECATED_BEFORE=0x050f00 -DQT_GUI_LIB -DQT_NO_CAST_FROM_ASCII -DQT_NO_CAST_FROM_BYTEARRAY -DQT_NO_CAST_TO_ASCII -DQT_NO_DEBUG -DQT_NO_FOREACH -DQT_NO_KEYWORDS -DQT_NO_NARROWING_CONVERSIONS_IN_CONNECT -DQT_NO_URL_CAST_FROM_STRING -DQT_STRICT_ITERATORS -DQT_USE_QSTRINGBUILDER -D_FILE_OFFSET_BITS=64 -D_GNU_SOURCE -D_LARGEFILE64_SOURCE -I/usr/src/RPM/BUILD/kpkpass-21.08.3/BUILD/src -I/usr/src/RPM/BUILD/kpkpass-21.08.3/src -I/usr/src/RPM/BUILD/kpkpass-21.08.3/BUILD/src/KPimPkPass_autogen/include -isystem /usr/include/qt5 -isystem /usr/include/qt5/QtGui -isystem /usr/include/qt5/QtCore -isystem /usr/share/qt5/../../lib/qt5/mkspecs/linux-g++ -isystem /usr/include/KF5/KArchive -isystem /usr/include/KF5 -pipe -frecord-gcc-switches -Wall -g -O2 -flto=auto -march=i586 -mtune=generic -fno-operator-names -fno-exceptions -Wall -Wextra -Wcast-align -Wchar-subscripts -Wformat-security -Wno-long-long -Wpointer-arith -Wundef -Wnon-virtual-dtor -Woverloaded-virtual -Werror=return-type -Werror=init-self -Wvla -Wdate-time -Wsuggest-override -Wlogical-op -pedantic -Wzero-as-null-pointer-constant -O2 -DNDEBUG -fPIC -fvisibility=hidden -fvisibility-inlines-hidden -fPIC -std=gnu++17 -MD -MT src/CMakeFiles/KPimPkPass.dir/barcode.cpp.o -MF CMakeFiles/KPimPkPass.dir/barcode.cpp.o.d -o CMakeFiles/KPimPkPass.dir/barcode.cpp.o -c /usr/src/RPM/BUILD/kpkpass-21.08.3/src/barcode.cpp
make[2]: Leaving directory '/usr/src/RPM/BUILD/kpkpass-21.08.3/BUILD'
make[2]: Entering directory '/usr/src/RPM/BUILD/kpkpass-21.08.3/BUILD'
[ 55%] Building CXX object src/CMakeFiles/KPimPkPass.dir/location.cpp.o
cd /usr/src/RPM/BUILD/kpkpass-21.08.3/BUILD/src && /usr/bin/c++ -DKF_DEPRECATED_WARNINGS_SINCE=0x060000 -DKF_DISABLE_DEPRECATED_BEFORE_AND_AT=0x055400 -DKPimPkPass_EXPORTS -DQT_CORE_LIB -DQT_DEPRECATED_WARNINGS_SINCE=0x060000 -DQT_DISABLE_DEPRECATED_BEFORE=0x050f00 -DQT_GUI_LIB -DQT_NO_CAST_FROM_ASCII -DQT_NO_CAST_FROM_BYTEARRAY -DQT_NO_CAST_TO_ASCII -DQT_NO_DEBUG -DQT_NO_FOREACH -DQT_NO_KEYWORDS -DQT_NO_NARROWING_CONVERSIONS_IN_CONNECT -DQT_NO_URL_CAST_FROM_STRING -DQT_STRICT_ITERATORS -DQT_USE_QSTRINGBUILDER -D_FILE_OFFSET_BITS=64 -D_GNU_SOURCE -D_LARGEFILE64_SOURCE -I/usr/src/RPM/BUILD/kpkpass-21.08.3/BUILD/src -I/usr/src/RPM/BUILD/kpkpass-21.08.3/src -I/usr/src/RPM/BUILD/kpkpass-21.08.3/BUILD/src/KPimPkPass_autogen/include -isystem /usr/include/qt5 -isystem /usr/include/qt5/QtGui -isystem /usr/include/qt5/QtCore -isystem /usr/share/qt5/../../lib/qt5/mkspecs/linux-g++ -isystem /usr/include/KF5/KArchive -isystem /usr/include/KF5 -pipe -frecord-gcc-switches -Wall -g -O2 -flto=auto -march=i586 -mtune=generic -fno-operator-names -fno-exceptions -Wall -Wextra -Wcast-align -Wchar-subscripts -Wformat-security -Wno-long-long -Wpointer-arith -Wundef -Wnon-virtual-dtor -Woverloaded-virtual -Werror=return-type -Werror=init-self -Wvla -Wdate-time -Wsuggest-override -Wlogical-op -pedantic -Wzero-as-null-pointer-constant -O2 -DNDEBUG -fPIC -fvisibility=hidden -fvisibility-inlines-hidden -fPIC -std=gnu++17 -MD -MT src/CMakeFiles/KPimPkPass.dir/location.cpp.o -MF CMakeFiles/KPimPkPass.dir/location.cpp.o.d -o CMakeFiles/KPimPkPass.dir/location.cpp.o -c /usr/src/RPM/BUILD/kpkpass-21.08.3/src/location.cpp
make[2]: Leaving directory '/usr/src/RPM/BUILD/kpkpass-21.08.3/BUILD'
make[2]: Entering directory '/usr/src/RPM/BUILD/kpkpass-21.08.3/BUILD'
[ 55%] Building CXX object src/CMakeFiles/KPimPkPass.dir/field.cpp.o
cd /usr/src/RPM/BUILD/kpkpass-21.08.3/BUILD/src && /usr/bin/c++ -DKF_DEPRECATED_WARNINGS_SINCE=0x060000 -DKF_DISABLE_DEPRECATED_BEFORE_AND_AT=0x055400 -DKPimPkPass_EXPORTS -DQT_CORE_LIB -DQT_DEPRECATED_WARNINGS_SINCE=0x060000 -DQT_DISABLE_DEPRECATED_BEFORE=0x050f00 -DQT_GUI_LIB -DQT_NO_CAST_FROM_ASCII -DQT_NO_CAST_FROM_BYTEARRAY -DQT_NO_CAST_TO_ASCII -DQT_NO_DEBUG -DQT_NO_FOREACH -DQT_NO_KEYWORDS -DQT_NO_NARROWING_CONVERSIONS_IN_CONNECT -DQT_NO_URL_CAST_FROM_STRING -DQT_STRICT_ITERATORS -DQT_USE_QSTRINGBUILDER -D_FILE_OFFSET_BITS=64 -D_GNU_SOURCE -D_LARGEFILE64_SOURCE -I/usr/src/RPM/BUILD/kpkpass-21.08.3/BUILD/src -I/usr/src/RPM/BUILD/kpkpass-21.08.3/src -I/usr/src/RPM/BUILD/kpkpass-21.08.3/BUILD/src/KPimPkPass_autogen/include -isystem /usr/include/qt5 -isystem /usr/include/qt5/QtGui -isystem /usr/include/qt5/QtCore -isystem /usr/share/qt5/../../lib/qt5/mkspecs/linux-g++ -isystem /usr/include/KF5/KArchive -isystem /usr/include/KF5 -pipe -frecord-gcc-switches -Wall -g -O2 -flto=auto -march=i586 -mtune=generic -fno-operator-names -fno-exceptions -Wall -Wextra -Wcast-align -Wchar-subscripts -Wformat-security -Wno-long-long -Wpointer-arith -Wundef -Wnon-virtual-dtor -Woverloaded-virtual -Werror=return-type -Werror=init-self -Wvla -Wdate-time -Wsuggest-override -Wlogical-op -pedantic -Wzero-as-null-pointer-constant -O2 -DNDEBUG -fPIC -fvisibility=hidden -fvisibility-inlines-hidden -fPIC -std=gnu++17 -MD -MT src/CMakeFiles/KPimPkPass.dir/field.cpp.o -MF CMakeFiles/KPimPkPass.dir/field.cpp.o.d -o CMakeFiles/KPimPkPass.dir/field.cpp.o -c /usr/src/RPM/BUILD/kpkpass-21.08.3/src/field.cpp
make[2]: Leaving directory '/usr/src/RPM/BUILD/kpkpass-21.08.3/BUILD'
make[2]: Entering directory '/usr/src/RPM/BUILD/kpkpass-21.08.3/BUILD'
[ 77%] Building CXX object src/CMakeFiles/KPimPkPass.dir/pass.cpp.o
cd /usr/src/RPM/BUILD/kpkpass-21.08.3/BUILD/src && /usr/bin/c++ -DKF_DEPRECATED_WARNINGS_SINCE=0x060000 -DKF_DISABLE_DEPRECATED_BEFORE_AND_AT=0x055400 -DKPimPkPass_EXPORTS -DQT_CORE_LIB -DQT_DEPRECATED_WARNINGS_SINCE=0x060000 -DQT_DISABLE_DEPRECATED_BEFORE=0x050f00 -DQT_GUI_LIB -DQT_NO_CAST_FROM_ASCII -DQT_NO_CAST_FROM_BYTEARRAY -DQT_NO_CAST_TO_ASCII -DQT_NO_DEBUG -DQT_NO_FOREACH -DQT_NO_KEYWORDS -DQT_NO_NARROWING_CONVERSIONS_IN_CONNECT -DQT_NO_URL_CAST_FROM_STRING -DQT_STRICT_ITERATORS -DQT_USE_QSTRINGBUILDER -D_FILE_OFFSET_BITS=64 -D_GNU_SOURCE -D_LARGEFILE64_SOURCE -I/usr/src/RPM/BUILD/kpkpass-21.08.3/BUILD/src -I/usr/src/RPM/BUILD/kpkpass-21.08.3/src -I/usr/src/RPM/BUILD/kpkpass-21.08.3/BUILD/src/KPimPkPass_autogen/include -isystem /usr/include/qt5 -isystem /usr/include/qt5/QtGui -isystem /usr/include/qt5/QtCore -isystem /usr/share/qt5/../../lib/qt5/mkspecs/linux-g++ -isystem /usr/include/KF5/KArchive -isystem /usr/include/KF5 -pipe -frecord-gcc-switches -Wall -g -O2 -flto=auto -march=i586 -mtune=generic -fno-operator-names -fno-exceptions -Wall -Wextra -Wcast-align -Wchar-subscripts -Wformat-security -Wno-long-long -Wpointer-arith -Wundef -Wnon-virtual-dtor -Woverloaded-virtual -Werror=return-type -Werror=init-self -Wvla -Wdate-time -Wsuggest-override -Wlogical-op -pedantic -Wzero-as-null-pointer-constant -O2 -DNDEBUG -fPIC -fvisibility=hidden -fvisibility-inlines-hidden -fPIC -std=gnu++17 -MD -MT src/CMakeFiles/KPimPkPass.dir/pass.cpp.o -MF CMakeFiles/KPimPkPass.dir/pass.cpp.o.d -o CMakeFiles/KPimPkPass.dir/pass.cpp.o -c /usr/src/RPM/BUILD/kpkpass-21.08.3/src/pass.cpp
make[2]: Leaving directory '/usr/src/RPM/BUILD/kpkpass-21.08.3/BUILD'
make[2]: Entering directory '/usr/src/RPM/BUILD/kpkpass-21.08.3/BUILD'
[100%] Linking CXX shared library ../bin/libKPimPkPass.so
cd /usr/src/RPM/BUILD/kpkpass-21.08.3/BUILD/src && /usr/bin/cmake -E cmake_link_script CMakeFiles/KPimPkPass.dir/link.txt --verbose=1
/usr/bin/c++ -fPIC -pipe -frecord-gcc-switches -Wall -g -O2 -flto=auto -march=i586 -mtune=generic -fno-operator-names -fno-exceptions -Wall -Wextra -Wcast-align -Wchar-subscripts -Wformat-security -Wno-long-long -Wpointer-arith -Wundef -Wnon-virtual-dtor -Woverloaded-virtual -Werror=return-type -Werror=init-self -Wvla -Wdate-time -Wsuggest-override -Wlogical-op -pedantic -Wzero-as-null-pointer-constant -O2 -DNDEBUG -Wl,--no-undefined -Wl,--fatal-warnings -Wl,--enable-new-dtags -L/usr/lib -L/usr/lib/kf5/devel -shared -Wl,-soname,libKPimPkPass.so.5 -o ../bin/libKPimPkPass.so.5.18.3 CMakeFiles/KPimPkPass.dir/KPimPkPass_autogen/mocs_compilation.cpp.o CMakeFiles/KPimPkPass.dir/barcode.cpp.o CMakeFiles/KPimPkPass.dir/boardingpass.cpp.o CMakeFiles/KPimPkPass.dir/field.cpp.o CMakeFiles/KPimPkPass.dir/location.cpp.o CMakeFiles/KPimPkPass.dir/pass.cpp.o CMakeFiles/KPimPkPass.dir/logging.cpp.o /usr/lib/libKF5Archive.so.5.89.0 /usr/lib/libQt5Gui.so.5.15.2 /usr/lib/libQt5Core.so.5.15.2
cd /usr/src/RPM/BUILD/kpkpass-21.08.3/BUILD/src && /usr/bin/cmake -E cmake_symlink_library ../bin/libKPimPkPass.so.5.18.3 ../bin/libKPimPkPass.so.5 ../bin/libKPimPkPass.so
make[2]: Leaving directory '/usr/src/RPM/BUILD/kpkpass-21.08.3/BUILD'
make[1]: Entering directory '/usr/src/RPM/BUILD/kpkpass-21.08.3/BUILD'
[100%] Built target KPimPkPass
make[1]: Leaving directory '/usr/src/RPM/BUILD/kpkpass-21.08.3/BUILD'
make: Entering directory '/usr/src/RPM/BUILD/kpkpass-21.08.3/BUILD'
/usr/bin/cmake -E cmake_progress_start /usr/src/RPM/BUILD/kpkpass-21.08.3/BUILD/CMakeFiles 0
make: Leaving directory '/usr/src/RPM/BUILD/kpkpass-21.08.3/BUILD'
+ popd
~/RPM/BUILD/kpkpass-21.08.3
+ exit 0
Executing(%install): /bin/sh -e /usr/src/tmp/rpm-tmp.8979
+ umask 022
+ /bin/mkdir -p /usr/src/RPM/BUILD
+ cd /usr/src/RPM/BUILD
+ /bin/chmod -Rf u+rwX -- /usr/src/tmp/kde5-kpkpass-buildroot
+ :
+ /bin/rm -rf -- /usr/src/tmp/kde5-kpkpass-buildroot
+ PATH=/usr/libexec/rpm-build:/usr/src/bin:/bin:/usr/bin:/usr/X11R6/bin:/usr/games
+ cd kpkpass-21.08.3
+ __kf5_install
+ make -C BUILD DESTDIR=/usr/src/tmp/kde5-kpkpass-buildroot install
make: Entering directory '/usr/src/RPM/BUILD/kpkpass-21.08.3/BUILD'
/usr/bin/cmake -S/usr/src/RPM/BUILD/kpkpass-21.08.3 -B/usr/src/RPM/BUILD/kpkpass-21.08.3/BUILD --check-build-system CMakeFiles/Makefile.cmake 0
/usr/bin/cmake -E cmake_progress_start /usr/src/RPM/BUILD/kpkpass-21.08.3/BUILD/CMakeFiles /usr/src/RPM/BUILD/kpkpass-21.08.3/BUILD//CMakeFiles/progress.marks
make -f CMakeFiles/Makefile2 all
make[1]: Entering directory '/usr/src/RPM/BUILD/kpkpass-21.08.3/BUILD'
make -f src/CMakeFiles/KPimPkPass_autogen.dir/build.make src/CMakeFiles/KPimPkPass_autogen.dir/depend
make[2]: Entering directory '/usr/src/RPM/BUILD/kpkpass-21.08.3/BUILD'
cd /usr/src/RPM/BUILD/kpkpass-21.08.3/BUILD && /usr/bin/cmake -E cmake_depends "Unix Makefiles" /usr/src/RPM/BUILD/kpkpass-21.08.3 /usr/src/RPM/BUILD/kpkpass-21.08.3/src /usr/src/RPM/BUILD/kpkpass-21.08.3/BUILD /usr/src/RPM/BUILD/kpkpass-21.08.3/BUILD/src /usr/src/RPM/BUILD/kpkpass-21.08.3/BUILD/src/CMakeFiles/KPimPkPass_autogen.dir/DependInfo.cmake --color=
make[2]: Leaving directory '/usr/src/RPM/BUILD/kpkpass-21.08.3/BUILD'
make -f src/CMakeFiles/KPimPkPass_autogen.dir/build.make src/CMakeFiles/KPimPkPass_autogen.dir/build
make[2]: Entering directory '/usr/src/RPM/BUILD/kpkpass-21.08.3/BUILD'
[ 11%] Automatic MOC for target KPimPkPass
cd /usr/src/RPM/BUILD/kpkpass-21.08.3/BUILD/src && /usr/bin/cmake -E cmake_autogen /usr/src/RPM/BUILD/kpkpass-21.08.3/BUILD/src/CMakeFiles/KPimPkPass_autogen.dir/AutogenInfo.json Release
make[2]: Leaving directory '/usr/src/RPM/BUILD/kpkpass-21.08.3/BUILD'
[ 11%] Built target KPimPkPass_autogen
make -f src/CMakeFiles/KPimPkPass.dir/build.make src/CMakeFiles/KPimPkPass.dir/depend
make[2]: Entering directory '/usr/src/RPM/BUILD/kpkpass-21.08.3/BUILD'
cd /usr/src/RPM/BUILD/kpkpass-21.08.3/BUILD && /usr/bin/cmake -E cmake_depends "Unix Makefiles" /usr/src/RPM/BUILD/kpkpass-21.08.3 /usr/src/RPM/BUILD/kpkpass-21.08.3/src /usr/src/RPM/BUILD/kpkpass-21.08.3/BUILD /usr/src/RPM/BUILD/kpkpass-21.08.3/BUILD/src /usr/src/RPM/BUILD/kpkpass-21.08.3/BUILD/src/CMakeFiles/KPimPkPass.dir/DependInfo.cmake --color=
Consolidate compiler generated dependencies of target KPimPkPass
make[2]: Leaving directory '/usr/src/RPM/BUILD/kpkpass-21.08.3/BUILD'
make -f src/CMakeFiles/KPimPkPass.dir/build.make src/CMakeFiles/KPimPkPass.dir/build
make[2]: Entering directory '/usr/src/RPM/BUILD/kpkpass-21.08.3/BUILD'
make[2]: Nothing to be done for 'src/CMakeFiles/KPimPkPass.dir/build'.
make[2]: Leaving directory '/usr/src/RPM/BUILD/kpkpass-21.08.3/BUILD'
[100%] Built target KPimPkPass
make[1]: Leaving directory '/usr/src/RPM/BUILD/kpkpass-21.08.3/BUILD'
/usr/bin/cmake -E cmake_progress_start /usr/src/RPM/BUILD/kpkpass-21.08.3/BUILD/CMakeFiles 0
make -f CMakeFiles/Makefile2 preinstall
make[1]: Entering directory '/usr/src/RPM/BUILD/kpkpass-21.08.3/BUILD'
make[1]: Nothing to be done for 'preinstall'.
make[1]: Leaving directory '/usr/src/RPM/BUILD/kpkpass-21.08.3/BUILD'
Install the project...
/usr/bin/cmake -P cmake_install.cmake
-- Install configuration: "Release"
-- Installing: /usr/src/tmp/kde5-kpkpass-buildroot/usr/lib/libKPimPkPass.so.5.18.3
-- Installing: /usr/src/tmp/kde5-kpkpass-buildroot/usr/lib/libKPimPkPass.so.5
-- Installing: /usr/src/tmp/kde5-kpkpass-buildroot/usr/lib/libKPimPkPass.so
-- Installing: /usr/src/tmp/kde5-kpkpass-buildroot/usr/include/KF5/KPim/KPkPass/Barcode
-- Installing: /usr/src/tmp/kde5-kpkpass-buildroot/usr/include/KF5/KPim/KPkPass/BoardingPass
-- Installing: /usr/src/tmp/kde5-kpkpass-buildroot/usr/include/KF5/KPim/KPkPass/Field
-- Installing: /usr/src/tmp/kde5-kpkpass-buildroot/usr/include/KF5/KPim/KPkPass/Location
-- Installing: /usr/src/tmp/kde5-kpkpass-buildroot/usr/include/KF5/KPim/KPkPass/Pass
-- Installing: /usr/src/tmp/kde5-kpkpass-buildroot/usr/include/KF5/KPim/KPkPass/barcode.h
-- Installing: /usr/src/tmp/kde5-kpkpass-buildroot/usr/include/KF5/KPim/KPkPass/boardingpass.h
-- Installing: /usr/src/tmp/kde5-kpkpass-buildroot/usr/include/KF5/KPim/KPkPass/field.h
-- Installing: /usr/src/tmp/kde5-kpkpass-buildroot/usr/include/KF5/KPim/KPkPass/location.h
-- Installing: /usr/src/tmp/kde5-kpkpass-buildroot/usr/include/KF5/KPim/KPkPass/pass.h
-- Installing: /usr/src/tmp/kde5-kpkpass-buildroot/usr/include/KF5/KPim/KPkPass/kpkpass_export.h
-- Installing: /usr/src/tmp/kde5-kpkpass-buildroot/usr/share/mime/packages/application-vnd-apple-pkpass.xml
-- Installing: /usr/src/tmp/kde5-kpkpass-buildroot/usr/share/qlogging-categories5/org_kde_kpkpass.categories
-- Installing: /usr/src/tmp/kde5-kpkpass-buildroot/usr/lib/cmake/KPimPkPass/KPimPkPassConfig.cmake
-- Installing: /usr/src/tmp/kde5-kpkpass-buildroot/usr/lib/cmake/KPimPkPass/KPimPkPassConfigVersion.cmake
-- Installing: /usr/src/tmp/kde5-kpkpass-buildroot/usr/lib/cmake/KPimPkPass/KPimPkPassTargets.cmake
-- Installing: /usr/src/tmp/kde5-kpkpass-buildroot/usr/lib/cmake/KPimPkPass/KPimPkPassTargets-release.cmake
make: Leaving directory '/usr/src/RPM/BUILD/kpkpass-21.08.3/BUILD'
+ '[' -d /usr/src/tmp/kde5-kpkpass-buildroot//usr/share ']'
+ ls -1d '/usr/src/tmp/kde5-kpkpass-buildroot//usr/share/kf5/k*5'
+ read d
ls: cannot access '/usr/src/tmp/kde5-kpkpass-buildroot//usr/share/kf5/k*5': No such file or directory
+ '[' -d /usr/src/tmp/kde5-kpkpass-buildroot//usr/share/kf5/lib64 ']'
+ '[' -d /usr/src/tmp/kde5-kpkpass-buildroot//usr/share/kf5/lib ']'
+ ls -1 /usr/src/tmp/kde5-kpkpass-buildroot//usr/lib/libKPimPkPass.so
+ read p
+ '[' -L /usr/src/tmp/kde5-kpkpass-buildroot//usr/lib/libKPimPkPass.so ']'
+ mkdir -p /usr/src/tmp/kde5-kpkpass-buildroot//usr/lib/kf5/devel
++ readlink /usr/src/tmp/kde5-kpkpass-buildroot//usr/lib/libKPimPkPass.so
+ f=libKPimPkPass.so.5
++ basename /usr/src/tmp/kde5-kpkpass-buildroot//usr/lib/libKPimPkPass.so
+ l=libKPimPkPass.so
++ relative /usr/src/tmp/kde5-kpkpass-buildroot//usr/lib/libKPimPkPass.so.5 /usr/src/tmp/kde5-kpkpass-buildroot//usr/lib/kf5/devel/libKPimPkPass.so.5
+ ln -sf ../../libKPimPkPass.so.5 /usr/src/tmp/kde5-kpkpass-buildroot//usr/lib/kf5/devel/libKPimPkPass.so
+ rm -f /usr/src/tmp/kde5-kpkpass-buildroot//usr/lib/libKPimPkPass.so
+ read p
+ '[' -d /usr/src/tmp/kde5-kpkpass-buildroot//usr/share/kf5/bin ']'
+ '[' -d /usr/src/tmp/kde5-kpkpass-buildroot//usr/share/kf5/include ']'
+ '[' -d /usr/src/tmp/kde5-kpkpass-buildroot//usr/lib/kf5/bin -a true == true ']'
+ ls -1 '/usr/src/tmp/kde5-kpkpass-buildroot//usr/share/kf5/dbus-1/services/*5*.service'
+ read s
+ '[' -d /usr/src/tmp/kde5-kpkpass-buildroot//usr/share/akonadi ']'
+ '[' -d /usr/src/tmp/kde5-kpkpass-buildroot//usr/share/kf5/akonadi ']'
+ '[' -d /usr/src/tmp/kde5-kpkpass-buildroot//usr/share/man -a remove == remove ']'
+ '[' -d /usr/src/tmp/kde5-kpkpass-buildroot//usr/share/appdata -a keep == remove ']'
+ '[' -d /usr/src/tmp/kde5-kpkpass-buildroot//usr/share/metainfo -a keep == remove ']'
+ '[' -d /usr/src/tmp/kde5-kpkpass-buildroot//usr/lib/cmake/ ']'
+ find /usr/src/tmp/kde5-kpkpass-buildroot//usr/lib/cmake/ -type f -name '*.cmake'
+ read f
+ sed -i -e 's|\(set(.*\)${PACKAGE_PREFIX_DIR}//usr/|\1${PACKAGE_PREFIX_DIR}/|' /usr/src/tmp/kde5-kpkpass-buildroot//usr/lib/cmake/KPimPkPass/KPimPkPassTargets-release.cmake
+ sed -i -e 's|/usr//usr/|/usr/|' /usr/src/tmp/kde5-kpkpass-buildroot//usr/lib/cmake/KPimPkPass/KPimPkPassTargets-release.cmake
+ read f
+ sed -i -e 's|\(set(.*\)${PACKAGE_PREFIX_DIR}//usr/|\1${PACKAGE_PREFIX_DIR}/|' /usr/src/tmp/kde5-kpkpass-buildroot//usr/lib/cmake/KPimPkPass/KPimPkPassTargets.cmake
+ sed -i -e 's|/usr//usr/|/usr/|' /usr/src/tmp/kde5-kpkpass-buildroot//usr/lib/cmake/KPimPkPass/KPimPkPassTargets.cmake
+ read f
+ sed -i -e 's|\(set(.*\)${PACKAGE_PREFIX_DIR}//usr/|\1${PACKAGE_PREFIX_DIR}/|' /usr/src/tmp/kde5-kpkpass-buildroot//usr/lib/cmake/KPimPkPass/KPimPkPassConfigVersion.cmake
+ sed -i -e 's|/usr//usr/|/usr/|' /usr/src/tmp/kde5-kpkpass-buildroot//usr/lib/cmake/KPimPkPass/KPimPkPassConfigVersion.cmake
+ read f
+ sed -i -e 's|\(set(.*\)${PACKAGE_PREFIX_DIR}//usr/|\1${PACKAGE_PREFIX_DIR}/|' /usr/src/tmp/kde5-kpkpass-buildroot//usr/lib/cmake/KPimPkPass/KPimPkPassConfig.cmake
+ sed -i -e 's|/usr//usr/|/usr/|' /usr/src/tmp/kde5-kpkpass-buildroot//usr/lib/cmake/KPimPkPass/KPimPkPassConfig.cmake
+ read f
+ mv /usr/src/tmp/kde5-kpkpass-buildroot//usr/share/mime/packages/application-vnd-apple-pkpass.xml /usr/src/tmp/kde5-kpkpass-buildroot//usr/share/mime/packages/kde5-application-vnd-apple-pkpass.xml
+ /usr/lib/rpm/find-lang kde5-kpkpass --all-name
+ /usr/lib/rpm/brp-alt
Cleaning files in /usr/src/tmp/kde5-kpkpass-buildroot (auto)
mode of './usr/lib/libKPimPkPass.so.5.18.3' changed from 0755 (rwxr-xr-x) to 0644 (rw-r--r--)
Verifying and fixing files in /usr/src/tmp/kde5-kpkpass-buildroot (binconfig,pkgconfig,libtool,desktop,gnuconfig)
Checking contents of files in /usr/src/tmp/kde5-kpkpass-buildroot/ (default)
Compressing files in /usr/src/tmp/kde5-kpkpass-buildroot (auto)
Adjusting library links in /usr/src/tmp/kde5-kpkpass-buildroot
./usr/lib: (from :0)
libKPimPkPass.so.5 -> libKPimPkPass.so.5.18.3
Verifying ELF objects in /usr/src/tmp/kde5-kpkpass-buildroot (arch=normal,fhs=normal,lfs=relaxed,lint=relaxed,rpath=normal,stack=normal,textrel=normal,unresolved=normal)
Processing files: kde5-kpkpass-common-21.08.3-alt1
Executing(%doc): /bin/sh -e /usr/src/tmp/rpm-tmp.8979
+ umask 022
+ /bin/mkdir -p /usr/src/RPM/BUILD
+ cd /usr/src/RPM/BUILD
+ cd kpkpass-21.08.3
+ DOCDIR=/usr/src/tmp/kde5-kpkpass-buildroot/usr/share/doc/kde5-kpkpass-common-21.08.3
+ export DOCDIR
+ rm -rf /usr/src/tmp/kde5-kpkpass-buildroot/usr/share/doc/kde5-kpkpass-common-21.08.3
+ /bin/mkdir -p /usr/src/tmp/kde5-kpkpass-buildroot/usr/share/doc/kde5-kpkpass-common-21.08.3
+ cp -prL LICENSES/BSD-3-Clause.txt LICENSES/CC0-1.0.txt LICENSES/LGPL-2.0-or-later.txt README.md /usr/src/tmp/kde5-kpkpass-buildroot/usr/share/doc/kde5-kpkpass-common-21.08.3
+ chmod -R go-w /usr/src/tmp/kde5-kpkpass-buildroot/usr/share/doc/kde5-kpkpass-common-21.08.3
+ chmod -R a+rX /usr/src/tmp/kde5-kpkpass-buildroot/usr/share/doc/kde5-kpkpass-common-21.08.3
+ exit 0
Finding Provides (using /usr/lib/rpm/find-provides)
Executing: /bin/sh -e /usr/src/tmp/rpm-tmp.hSx3cu
find-provides: running scripts (alternatives,debuginfo,lib,pam,perl,pkgconfig,python,python3,qml,shell)
Finding Requires (using /usr/lib/rpm/find-requires)
Executing: /bin/sh -e /usr/src/tmp/rpm-tmp.vaBXL2
find-requires: running scripts (cpp,debuginfo,files,lib,pam,perl,pkgconfig,pkgconfiglib,python,python3,qml,rpmlib,shebang,shell,static,symlinks,systemd-services)
Requires: kf5-filesystem
Processing files: kde5-kpkpass-devel-21.08.3-alt1
Finding Provides (using /usr/lib/rpm/find-provides)
Executing: /bin/sh -e /usr/src/tmp/rpm-tmp.babZqo
find-provides: running scripts (alternatives,debuginfo,lib,pam,perl,pkgconfig,python,python3,qml,shell)
Finding Requires (using /usr/lib/rpm/find-requires)
Executing: /bin/sh -e /usr/src/tmp/rpm-tmp.C3nVin
find-requires: running scripts (cpp,debuginfo,files,lib,pam,perl,pkgconfig,pkgconfiglib,python,python3,qml,rpmlib,shebang,shell,static,symlinks,systemd-services)
In file included from /usr/src/tmp/kde5-kpkpass-buildroot/usr/include/KF5/KPim/KPkPass/pass.h:9:
/usr/src/tmp/kde5-kpkpass-buildroot/usr/include/KF5/KPim/KPkPass/field.h:11:10: fatal error: QMetaType: No such file or directory
11 | #include
| ^~~~~~~~~~~
compilation terminated.
cpp.req: /usr/src/tmp/kde5-kpkpass-buildroot/usr/include/KF5/KPim/KPkPass/pass.h: cpp failed, trying c++ mode
In file included from /usr/src/tmp/kde5-kpkpass-buildroot/usr/include/KF5/KPim/KPkPass/pass.h:9:
/usr/src/tmp/kde5-kpkpass-buildroot/usr/include/KF5/KPim/KPkPass/field.h:11:10: fatal error: QMetaType: No such file or directory
11 | #include
| ^~~~~~~~~~~
compilation terminated.
cpp.req: WARNING: /usr/src/tmp/kde5-kpkpass-buildroot/usr/include/KF5/KPim/KPkPass/pass.h: cpp failed
/usr/src/tmp/kde5-kpkpass-buildroot/usr/include/KF5/KPim/KPkPass/field.h:11:10: fatal error: QMetaType: No such file or directory
11 | #include
| ^~~~~~~~~~~
compilation terminated.
cpp.req: /usr/src/tmp/kde5-kpkpass-buildroot/usr/include/KF5/KPim/KPkPass/field.h: cpp failed, trying c++ mode
/usr/src/tmp/kde5-kpkpass-buildroot/usr/include/KF5/KPim/KPkPass/field.h:11:10: fatal error: QMetaType: No such file or directory
11 | #include
| ^~~~~~~~~~~
compilation terminated.
cpp.req: WARNING: /usr/src/tmp/kde5-kpkpass-buildroot/usr/include/KF5/KPim/KPkPass/field.h: cpp failed
/usr/src/tmp/kde5-kpkpass-buildroot/usr/include/KF5/KPim/KPkPass/barcode.h:11:10: fatal error: QMetaType: No such file or directory
11 | #include
| ^~~~~~~~~~~
compilation terminated.
cpp.req: /usr/src/tmp/kde5-kpkpass-buildroot/usr/include/KF5/KPim/KPkPass/barcode.h: cpp failed, trying c++ mode
/usr/src/tmp/kde5-kpkpass-buildroot/usr/include/KF5/KPim/KPkPass/barcode.h:11:10: fatal error: QMetaType: No such file or directory
11 | #include
| ^~~~~~~~~~~
compilation terminated.
cpp.req: WARNING: /usr/src/tmp/kde5-kpkpass-buildroot/usr/include/KF5/KPim/KPkPass/barcode.h: cpp failed
/usr/src/tmp/kde5-kpkpass-buildroot/usr/include/KF5/KPim/KPkPass/location.h:11:10: fatal error: QMetaType: No such file or directory
11 | #include
| ^~~~~~~~~~~
compilation terminated.
cpp.req: /usr/src/tmp/kde5-kpkpass-buildroot/usr/include/KF5/KPim/KPkPass/location.h: cpp failed, trying c++ mode
/usr/src/tmp/kde5-kpkpass-buildroot/usr/include/KF5/KPim/KPkPass/location.h:11:10: fatal error: QMetaType: No such file or directory
11 | #include
| ^~~~~~~~~~~
compilation terminated.
cpp.req: WARNING: /usr/src/tmp/kde5-kpkpass-buildroot/usr/include/KF5/KPim/KPkPass/location.h: cpp failed
In file included from /usr/src/tmp/kde5-kpkpass-buildroot/usr/include/KF5/KPim/KPkPass/pass.h:9,
from /usr/src/tmp/kde5-kpkpass-buildroot/usr/include/KF5/KPim/KPkPass/boardingpass.h:9:
/usr/src/tmp/kde5-kpkpass-buildroot/usr/include/KF5/KPim/KPkPass/field.h:11:10: fatal error: QMetaType: No such file or directory
11 | #include
| ^~~~~~~~~~~
compilation terminated.
cpp.req: /usr/src/tmp/kde5-kpkpass-buildroot/usr/include/KF5/KPim/KPkPass/boardingpass.h: cpp failed, trying c++ mode
In file included from /usr/src/tmp/kde5-kpkpass-buildroot/usr/include/KF5/KPim/KPkPass/pass.h:9,
from /usr/src/tmp/kde5-kpkpass-buildroot/usr/include/KF5/KPim/KPkPass/boardingpass.h:9:
/usr/src/tmp/kde5-kpkpass-buildroot/usr/include/KF5/KPim/KPkPass/field.h:11:10: fatal error: QMetaType: No such file or directory
11 | #include
| ^~~~~~~~~~~
compilation terminated.
cpp.req: WARNING: /usr/src/tmp/kde5-kpkpass-buildroot/usr/include/KF5/KPim/KPkPass/boardingpass.h: cpp failed
Requires: /usr/lib/libKPimPkPass.so.5
Finding debuginfo files (using /usr/lib/rpm/find-debuginfo-files)
Executing: /bin/sh -e /usr/src/tmp/rpm-tmp.VaiSrX
Processing files: libkpimpkpass5-21.08.3-alt1
warning: File listed twice: /usr/lib/libKPimPkPass.so.5
Finding Provides (using /usr/lib/rpm/find-provides)
Executing: /bin/sh -e /usr/src/tmp/rpm-tmp.Wr7MG0
find-provides: running scripts (alternatives,debuginfo,lib,pam,perl,pkgconfig,python,python3,qml,shell)
lib.prov: /usr/src/tmp/kde5-kpkpass-buildroot/usr/lib/libKPimPkPass.so.5: 112 symbols, 17 bpp
warning: hash collision: _ZN7KPkPass12BoardingPassC1EP7QObject _ZN7KPkPass4Pass11qt_metacallEN11QMetaObject4CallEiPPv
Finding Requires (using /usr/lib/rpm/find-requires)
Executing: /bin/sh -e /usr/src/tmp/rpm-tmp.JXEwv5
find-requires: running scripts (cpp,debuginfo,files,lib,pam,perl,pkgconfig,pkgconfiglib,python,python3,qml,rpmlib,shebang,shell,static,symlinks,systemd-services)
Provides: libkpimpkpass = 21.08.3-alt1, libKPimPkPass.so.5 = set:kdwicdqTy9j8XwIm66PuniRhrEcFsbccBerh6MXbZ1npZykJYdedgk8Nqu9ZsLUHxYrLZ9JZx1MD1zIm43afKtIJhxVYM398GfYdQojU6DSijKVkcphGXC2eKthj9Zjc1WoGobwUCrxP52TPlRyVgUqbYBGkM3bA8Cs1YfrzHZv1Zuq9pjVN13oHIN5DvcsiE9lBHwhN5R973m8RBpARqaUhZ9fWPX0
Requires: kde5-kpkpass-common = 21.08.3-alt1, libKF5Archive.so.5 >= set:liW8iZbYKJFPhifv1, libQt5Core.so.5 >= set:qjJ4jzqbBEs35ibCEiEMgJIG7IJW6szoi4N9faJ19dNJKLC0ERT2bF3yz6FXbK4SPbyw7ODhO0wEBHNojoTmPGJU6MBbnerabj3F8GZIIVmBe4qn8iZxyjFVbsj0On2m6vjy2SAPvjP4VRIvBPGsJr5aBJ2ZqICpvKscSNoJ4kQiKWuFz0ZoSXjhWT8gC9OsUVijcN8ird9l0XqH8Zoc4jsfsFMeZlnkqZvWqnwbFCvIU2G7dtxqTG3gyKZicVfZe9amJrqABZEifjrxBOkCZAQGzuv4Gx31tQZbkZAKmqXmZEa4PSV6CzA7CCcYZzhF3yfQ684DVg4KN2ID5sMHpazMGG7FC8ougt3Jo9IppMAw7rZBoOx9eeZtT0, libQt5Core.so.5(Qt_5), libQt5Core.so.5(Qt_5.15), libQt5Gui.so.5 >= set:rnSHCTdRvkzOwfSxIIELdZFd0TyixfZ8a, libQt5Gui.so.5(Qt_5), libc.so.6(GLIBC_2.0), libc.so.6(GLIBC_2.1.3), libc.so.6(GLIBC_2.32), libc.so.6(GLIBC_2.4), libstdc++.so.6(CXXABI_1.3), libstdc++.so.6(CXXABI_1.3.9), libstdc++.so.6(GLIBCXX_3.4), rtld(GNU_HASH)
Requires(rpmlib): rpmlib(SetVersions)
Obsoletes: libkpimpkpass < 21.08.3-alt1
Finding debuginfo files (using /usr/lib/rpm/find-debuginfo-files)
Executing: /bin/sh -e /usr/src/tmp/rpm-tmp.FXV42G
Creating libkpimpkpass5-debuginfo package
Processing files: libkpimpkpass5-debuginfo-21.08.3-alt1
Finding Provides (using /usr/lib/rpm/find-provides)
Executing: /bin/sh -e /usr/src/tmp/rpm-tmp.aZVtto
find-provides: running scripts (debuginfo)
Finding Requires (using /usr/lib/rpm/find-requires)
Executing: /bin/sh -e /usr/src/tmp/rpm-tmp.DCWRhH
find-requires: running scripts (debuginfo)
Provides: debug(libKPimPkPass.so.5)
Requires: libkpimpkpass5 = 21.08.3-alt1, debug(libKF5Archive.so.5), debug(libQt5Core.so.5), debug(libQt5Gui.so.5), debug(libc.so.6), debug(libstdc++.so.6)
Adding to libkpimpkpass5 a strict dependency on kde5-kpkpass-common
Adding to libkpimpkpass5-debuginfo a strict dependency on libkpimpkpass5
Adding to kde5-kpkpass-devel a strict dependency on libkpimpkpass5
Removing 1 extra deps from kde5-kpkpass-devel due to dependency on libkpimpkpass5
Wrote: /usr/src/RPM/RPMS/noarch/kde5-kpkpass-common-21.08.3-alt1.noarch.rpm (w2.lzdio)
Wrote: /usr/src/RPM/RPMS/i586/kde5-kpkpass-devel-21.08.3-alt1.i586.rpm (w2.lzdio)
Wrote: /usr/src/RPM/RPMS/i586/libkpimpkpass5-21.08.3-alt1.i586.rpm (w2.lzdio)
Wrote: /usr/src/RPM/RPMS/i586/libkpimpkpass5-debuginfo-21.08.3-alt1.i586.rpm (w2.lzdio)
11.89user 1.88system 0:15.19elapsed 90%CPU (0avgtext+0avgdata 173800maxresident)k
0inputs+0outputs (0major+953933minor)pagefaults 0swaps
/.out/kde5-kpkpass-common-21.08.3-alt1.noarch.rpm: bad symbols in the license tag: /
/.out/kde5-kpkpass-devel-21.08.3-alt1.i586.rpm: bad symbols in the license tag: /
/.out/libkpimpkpass5-21.08.3-alt1.i586.rpm: bad symbols in the license tag: /
/.out/libkpimpkpass5-debuginfo-21.08.3-alt1.i586.rpm: bad symbols in the license tag: /
22.33user 5.52system 0:29.58elapsed 94%CPU (0avgtext+0avgdata 173800maxresident)k
0inputs+0outputs (45027major+1477673minor)pagefaults 0swaps
--- kde5-kpkpass-devel-21.08.3-alt1.i586.rpm.repo 2021-11-09 10:20:33.000000000 +0000
+++ kde5-kpkpass-devel-21.08.3-alt1.i586.rpm.hasher 2021-12-25 04:00:08.204267185 +0000
@@ -37,4 +37,4 @@
File: /usr/lib/cmake/KPimPkPass/KPimPkPassTargets-release.cmake 100644 root:root 33224e34aa63a23ec651d053e3c0451d
-File: /usr/lib/cmake/KPimPkPass/KPimPkPassTargets.cmake 100644 root:root 1762226168bc86717fbb1be225a60d1e
+File: /usr/lib/cmake/KPimPkPass/KPimPkPassTargets.cmake 100644 root:root 8fd74e2e19935b57abfdd91173699105
File: /usr/lib/kf5/devel/libKPimPkPass.so 120777 root:root ../../libKPimPkPass.so.5
-RPMIdentity: 63ebfe47d00c761a31a3f9bfc9c266468b3f601c84a73ba70bcd18c8f07869bd5b1090c61fc09f28d8ad0a00df834898620e60b41086b9e77c126aa8a1be44b0
+RPMIdentity: df1a8d905fadec68b1a27b2abc9f3f981009954b8bf232206237b40e66f272d8f50cde6e4626b3ae0429a753a08173e7d5e20d23b0ad26727c1731f6bbd6bd6b
--- libkpimpkpass5-21.08.3-alt1.i586.rpm.repo 2021-11-09 10:20:32.000000000 +0000
+++ libkpimpkpass5-21.08.3-alt1.i586.rpm.hasher 2021-12-25 04:00:08.248267777 +0000
@@ -24,3 +24,3 @@
File: /usr/lib/libKPimPkPass.so.5 120777 root:root libKPimPkPass.so.5.18.3
-File: /usr/lib/libKPimPkPass.so.5.18.3 100644 root:root dddff8418be832f8d067705edb2c2bfa
-RPMIdentity: 535255c476ceaf06379fd88a515fdf91241013a2e424c4cbff71ba4d7bbef8fa4061a41defe4ca54178ad780df60f6e89ad966c2c82457ac54a1b91e35112513
+File: /usr/lib/libKPimPkPass.so.5.18.3 100644 root:root 3b746cf92dd32c9d51b7351d9bf0b26a
+RPMIdentity: a8b9e057854b9f475217ecb139125ed08f1b5dc0a1e941c56718ddcdae454a46140e403dd7022f1c6345d373f7d17765b6868c77aa7929d5d8f8e3f5ef991716
--- libkpimpkpass5-debuginfo-21.08.3-alt1.i586.rpm.repo 2021-11-09 10:20:32.000000000 +0000
+++ libkpimpkpass5-debuginfo-21.08.3-alt1.i586.rpm.hasher 2021-12-25 04:00:08.304268531 +0000
@@ -1,4 +1,4 @@
-/usr/lib/debug/.build-id/6b 40755 root:root
-/usr/lib/debug/.build-id/6b/1c5fff2e0dd780e253a77ad394944cb5369c2d 120777 root:root ../../../libKPimPkPass.so.5.18.3
-/usr/lib/debug/.build-id/6b/1c5fff2e0dd780e253a77ad394944cb5369c2d.debug 120777 root:root ../../usr/lib/libKPimPkPass.so.5.18.3.debug
+/usr/lib/debug/.build-id/35 40755 root:root
+/usr/lib/debug/.build-id/35/f88a57a8a11d628114b820084572c93423cd42 120777 root:root ../../../libKPimPkPass.so.5.18.3
+/usr/lib/debug/.build-id/35/f88a57a8a11d628114b820084572c93423cd42.debug 120777 root:root ../../usr/lib/libKPimPkPass.so.5.18.3.debug
/usr/lib/debug/usr/lib/libKPimPkPass.so.5.18.3.debug 100644 root:root
@@ -40,6 +40,6 @@
Provides: libkpimpkpass5-debuginfo = 21.08.3-alt1:sisyphus+289188.100.2.2
-File: /usr/lib/debug/.build-id/6b 40755 root:root
-File: /usr/lib/debug/.build-id/6b/1c5fff2e0dd780e253a77ad394944cb5369c2d 120777 root:root ../../../libKPimPkPass.so.5.18.3
-File: /usr/lib/debug/.build-id/6b/1c5fff2e0dd780e253a77ad394944cb5369c2d.debug 120777 root:root ../../usr/lib/libKPimPkPass.so.5.18.3.debug
-File: /usr/lib/debug/usr/lib/libKPimPkPass.so.5.18.3.debug 100644 root:root 3148d7b484883062ea4a10b1d352f9d4
+File: /usr/lib/debug/.build-id/35 40755 root:root
+File: /usr/lib/debug/.build-id/35/f88a57a8a11d628114b820084572c93423cd42 120777 root:root ../../../libKPimPkPass.so.5.18.3
+File: /usr/lib/debug/.build-id/35/f88a57a8a11d628114b820084572c93423cd42.debug 120777 root:root ../../usr/lib/libKPimPkPass.so.5.18.3.debug
+File: /usr/lib/debug/usr/lib/libKPimPkPass.so.5.18.3.debug 100644 root:root dbfc44438345188eb613d945391c0fad
File: /usr/lib/debug/usr/lib/libKPimPkPass.so.5.debug 120777 root:root libKPimPkPass.so.5.18.3.debug
@@ -71,2 +71,2 @@
File: /usr/src/debug/kpkpass-21.08.3/src/pass_p.h 100644 root:root 2e1301dea3a32d93a37a2e9267bdc3dd
-RPMIdentity: 1e99f5c67e8911b487f59f0f617c5c7397eebef7e280a63c69f4ff745f69963fae6543ae5aa510a305d67ef63926254888941f8795a7ce5c9604d9159f1874ae
+RPMIdentity: 90f7ab3b039972656f744d97365c69f3e42afa4b7e5b85a665d43484f09d3ab740f8fd25f7d6544b2cbe8942bd51763d348e86dedf3ce6afdfc3cd44b9d9b034