86>Jul 26 13:41:39 userdel[209361]: delete user 'rooter'
<86>Jul 26 13:41:39 userdel[209361]: removed group 'rooter' owned by 'rooter'
<86>Jul 26 13:41:39 userdel[209361]: removed shadow group 'rooter' owned by 'rooter'
<86>Jul 26 13:41:39 groupadd[209375]: group added to /etc/group: name=rooter, GID=654
<86>Jul 26 13:41:39 groupadd[209375]: group added to /etc/gshadow: name=rooter
<86>Jul 26 13:41:39 groupadd[209375]: new group: name=rooter, GID=654
<86>Jul 26 13:41:39 useradd[209386]: new user: name=rooter, UID=654, GID=654, home=/root, shell=/bin/bash
<86>Jul 26 13:41:39 userdel[209400]: delete user 'builder'
<86>Jul 26 13:41:39 userdel[209400]: removed group 'builder' owned by 'builder'
<86>Jul 26 13:41:39 userdel[209400]: removed shadow group 'builder' owned by 'builder'
<86>Jul 26 13:41:39 groupadd[209414]: group added to /etc/group: name=builder, GID=655
<86>Jul 26 13:41:39 groupadd[209414]: group added to /etc/gshadow: name=builder
<86>Jul 26 13:41:39 groupadd[209414]: new group: name=builder, GID=655
<86>Jul 26 13:41:39 useradd[209424]: new user: name=builder, UID=655, GID=655, home=/usr/src, shell=/bin/bash
/usr/src/in/srpm/kf5-kidletime-5.84.0-alt1.src.rpm: bad symbols in the license tag: /
<13>Jul 26 13:41:43 rpmi: libxkbcommon-1.3.0-alt1 sisyphus+279463.100.1.1 1626547650 installed
<13>Jul 26 13:41:43 rpmi: libexpat-2.2.10-alt1 sisyphus+276608.100.1.2 1625153360 installed
<13>Jul 26 13:41:43 rpmi: qt5-base-common-5.15.2-alt4 sisyphus+279826.100.1.1 1626773284 installed
<13>Jul 26 13:41:43 rpmi: qt5-declarative-common-5.15.2-alt3 sisyphus+279790.100.1.1 1626722599 installed
<13>Jul 26 13:41:43 rpmi: libts0-1.22-alt3 sisyphus+278442.100.1.2 1626216683 installed
<13>Jul 26 13:41:43 rpmi: libmtdev-1.1.6-alt1 sisyphus+278361.100.1.1 1626091636 installed
<13>Jul 26 13:41:43 rpmi: libpng16-1.6.37-alt1 sisyphus+275734.100.2.1 1624788812 installed
<13>Jul 26 13:41:43 rpmi: libICE-1.0.10-alt1 sisyphus+278827.100.1.1 1626220281 installed
<13>Jul 26 13:41:43 rpmi: libglvnd-7:1.3.3-alt1 sisyphus+279467.100.1.1 1626548124 installed
<13>Jul 26 13:41:43 rpmi: libwayland-server-1.19.0-alt1 sisyphus+279023.100.1.1 1626353903 installed
<13>Jul 26 13:41:43 rpmi: libSM-1.2.3-alt1 sisyphus+278820.100.1.1 1626219266 installed
<13>Jul 26 13:41:43 rpmi: rpm-macros-qt5-5.15.2-alt4 sisyphus+279826.100.1.1 1626773219 installed
<13>Jul 26 13:41:43 rpmi: rpm-macros-ubt-0.4-alt1 sisyphus+279939.100.1.1 1626950850 installed
<13>Jul 26 13:41:43 rpmi: rpm-build-xdg-0.2-alt1 1250461503 installed
<13>Jul 26 13:41:43 rpmi: libsqlite3-3.35.5-alt1 sisyphus+279365.100.1.1 1626479643 installed
<13>Jul 26 13:41:43 rpmi: libverto-0.3.2-alt1_1 sisyphus+279289.100.1.3 1626493872 installed
<13>Jul 26 13:41:43 rpmi: libproxy-0.4.17-alt1.1 sisyphus+279553.100.1.2 1626595616 installed
<13>Jul 26 13:41:43 rpmi: libpcre2-10.37-alt1 sisyphus+279542.100.1.1 1626557452 installed
<13>Jul 26 13:41:43 rpmi: liblmdb-0.9.23-alt1 sisyphus+275369.100.1.2 1624493869 installed
<13>Jul 26 13:41:43 rpmi: libkeyutils-1.6.3-alt1 sisyphus+266061.100.1.1 1612919567 installed
<13>Jul 26 13:41:43 rpmi: libjpeg-2:2.0.6-alt3 sisyphus+276287.100.3.1 1625270467 installed
<13>Jul 26 13:41:43 rpmi: libwacom-data-1.11-alt1 sisyphus+279217.100.1.1 1626437005 installed
<13>Jul 26 13:41:44 rpmi: libicu69-1:6.9.1-alt2 sisyphus+277632.100.1.1 1625726231 installed
<13>Jul 26 13:41:45 rpmi: libqt5-core-5.15.2-alt4 sisyphus+279826.100.1.1 1626773284 installed
<13>Jul 26 13:41:45 rpmi: libqt5-sql-5.15.2-alt4 sisyphus+279826.100.1.1 1626773284 installed
<13>Jul 26 13:41:45 rpmi: libgudev-1:236-alt1 sisyphus+279257.100.1.1 1626461217 installed
<13>Jul 26 13:41:45 rpmi: libgraphite2-1.3.14-alt2.1 sisyphus+279571.100.1.2 1626605157 installed
<13>Jul 26 13:41:45 rpmi: libgdbm-1.8.3-alt10 sisyphus+278100.1600.1.1 1626059138 installed
<13>Jul 26 13:41:45 rpmi: libevdev-1.11.0-alt1 sisyphus+279029.100.1.1 1626354595 installed
<13>Jul 26 13:41:45 rpmi: liblz4-1:1.9.3-alt1 sisyphus+278100.4000.1.1 1626060252 installed
<13>Jul 26 13:41:45 rpmi: libgpg-error-1.42-alt1 sisyphus+275524.40.1.1 1624455836 installed
<13>Jul 26 13:41:45 rpmi: libgcrypt20-1.9.3-alt1 sisyphus+275524.100.1.1 1624456196 installed
<13>Jul 26 13:41:45 rpmi: libsystemd-1:249.1-alt2 sisyphus+279897.200.2.1 1626880725 installed
<13>Jul 26 13:41:45 rpmi: libdbus-1.12.18-alt1 sisyphus+275285.100.2.2 1624573331 installed
<13>Jul 26 13:41:45 rpmi: libqt5-dbus-5.15.2-alt4 sisyphus+279826.100.1.1 1626773284 installed
<13>Jul 26 13:41:45 rpmi: libcom_err-1.46.2.0.16.f114-alt1 sisyphus+278100.1000.1.1 1626056819 installed
<13>Jul 26 13:41:45 rpmi: libbrotlicommon-1.0.9-alt2 sisyphus+278430.100.1.2 1626213212 installed
<13>Jul 26 13:41:45 rpmi: libbrotlidec-1.0.9-alt2 sisyphus+278430.100.1.2 1626213212 installed
<13>Jul 26 13:41:45 rpmi: libharfbuzz-2.8.1-alt1 sisyphus+279641.100.1.1 1626639637 installed
<13>Jul 26 13:41:45 rpmi: libfreetype-2.10.4-alt2 sisyphus+278003.100.1.2 1625973065 installed
<13>Jul 26 13:41:45 rpmi: fontconfig-2.13.1-alt1 sisyphus+278837.100.1.3 1626287494 installed
Updating fonts cache: <29>Jul 26 13:41:46 fontconfig: Updating fonts cache: succeeded
[ DONE ]
<13>Jul 26 13:41:46 rpmi: libSDL2-2.0.14-alt4 sisyphus+279293.100.1.3 1626495242 installed
<13>Jul 26 13:41:46 rpmi: tslib-1.22-alt3 sisyphus+278442.100.1.2 1626216683 installed
<13>Jul 26 13:41:46 rpmi: libxshmfence-1.3-alt1 sisyphus+278248.100.1.1 1626080763 installed
<13>Jul 26 13:41:46 rpmi: libX11-locales-3:1.7.2-alt1 sisyphus+279629.100.1.1 1626637383 installed
<13>Jul 26 13:41:46 rpmi: libXdmcp-1.1.3-alt1 sisyphus+278816.100.1.1 1626219233 installed
<13>Jul 26 13:41:46 rpmi: libXau-1.0.9-alt1 sisyphus+278247.100.1.1 1626080738 installed
<13>Jul 26 13:41:46 rpmi: libxcb-1.14-alt1 sisyphus+277968.100.1.3 1625952333 installed
<13>Jul 26 13:41:46 rpmi: libX11-3:1.7.2-alt1 sisyphus+279629.100.1.1 1626637391 installed
<13>Jul 26 13:41:46 rpmi: libXext-1.3.4-alt1 sisyphus+278817.100.1.3 1626262589 installed
<13>Jul 26 13:41:46 rpmi: libXxf86vm-1.1.4-alt2 sisyphus+275334.100.2.2 1624577012 installed
<13>Jul 26 13:41:46 rpmi: libXfixes-5.0.3-alt1 sisyphus+275326.100.2.2 1624573639 installed
<13>Jul 26 13:41:46 rpmi: libxcbutil-icccm-0.4.1-alt2 sisyphus+278275.100.1.2 1626148617 installed
<13>Jul 26 13:41:46 rpmi: libxcbutil-1:0.4.0-alt1 sisyphus+275412.100.2.2 1624579109 installed
<13>Jul 26 13:41:46 rpmi: libxcbutil-image-0.4.0-alt1 sisyphus+275413.100.1.3 1624505806 installed
<13>Jul 26 13:41:46 rpmi: libxcbutil-keysyms-0.4.0-alt1 sisyphus+278187.100.1.1 1626075950 installed
<13>Jul 26 13:41:46 rpmi: libxcb-render-util-0.3.9-alt3 sisyphus+276916.100.1.2 1625275237 installed
<13>Jul 26 13:41:46 rpmi: libxkbcommon-x11-1.3.0-alt1 sisyphus+279463.100.1.1 1626547650 installed
<13>Jul 26 13:41:46 rpmi: libwayland-client-1.19.0-alt1 sisyphus+279023.100.1.1 1626353903 installed
<13>Jul 26 13:41:46 rpmi: libpciaccess-1:0.16-alt1 sisyphus+278288.100.1.1 1626084208 installed
<13>Jul 26 13:41:46 rpmi: libdrm-1:2.4.107-alt1 sisyphus+278970.100.1.1 1626340427 installed
<13>Jul 26 13:41:46 rpmi: libGLX-mesa-4:21.1.5-alt1 sisyphus+278970.200.1.1 1626340871 installed
<13>Jul 26 13:41:46 rpmi: libgbm-4:21.1.5-alt1 sisyphus+278970.200.1.1 1626340871 installed
<13>Jul 26 13:41:46 rpmi: libEGL-mesa-4:21.1.5-alt1 sisyphus+278970.200.1.1 1626340871 installed
<13>Jul 26 13:41:46 rpmi: libEGL-7:1.3.3-alt1 sisyphus+279467.100.1.1 1626548124 installed
<13>Jul 26 13:41:46 rpmi: libGLX-7:1.3.3-alt1 sisyphus+279467.100.1.1 1626548124 installed
<13>Jul 26 13:41:46 rpmi: libGL-7:1.3.3-alt1 sisyphus+279467.100.1.1 1626548124 installed
<13>Jul 26 13:41:46 rpmi: libdevmapper-1.02.177-alt1 sisyphus+279489.100.1.1 1626550184 installed
<13>Jul 26 13:41:46 rpmi: mount-2.36.1-alt2 sisyphus+278158.1600.1.1 1626051520 installed
<13>Jul 26 13:41:46 rpmi: hashalot-0.3-alt1.qa1 sisyphus+276065.100.2.3 1624921317 installed
<13>Jul 26 13:41:46 rpmi: losetup-2.36.1-alt2 sisyphus+278158.1600.1.1 1626051520 installed
<13>Jul 26 13:41:46 rpmi: lsblk-2.36.1-alt2 sisyphus+278158.1600.1.1 1626051520 installed
<13>Jul 26 13:41:47 rpmi: libp11-kit-0.23.15-alt2 sisyphus+278382.100.1.2 1626190687 installed
<13>Jul 26 13:41:47 rpmi: libtasn1-4.17.0-alt1 sisyphus+276722.100.1.1 1625211286 installed
<13>Jul 26 13:41:47 rpmi: rpm-macros-alternatives-0.5.1-alt1 sisyphus+278157.100.2.1 1626055790 installed
<13>Jul 26 13:41:47 rpmi: alternatives-0.5.1-alt1 sisyphus+278157.100.2.1 1626055790 installed
<13>Jul 26 13:41:47 rpmi: ca-certificates-2021.06.03-alt1 sisyphus+273509.400.1.1 1622736045 installed
<13>Jul 26 13:41:47 rpmi: ca-trust-0.1.2-alt1 sisyphus+233348.100.1.1 1561653823 installed
<13>Jul 26 13:41:47 rpmi: p11-kit-trust-0.23.15-alt2 sisyphus+278382.100.1.2 1626190687 installed
<13>Jul 26 13:41:47 rpmi: libcrypto1.1-1.1.1k-alt1 sisyphus+279286.100.1.1 1626469643 installed
<13>Jul 26 13:41:47 rpmi: libssl1.1-1.1.1k-alt1 sisyphus+279286.100.1.1 1626469643 installed
<13>Jul 26 13:41:47 rpmi: libpython3-3.9.6-alt1 sisyphus+276295.100.1.1 1624964545 installed
<13>Jul 26 13:41:47 rpmi: python3-3.9.6-alt1 sisyphus+276295.100.1.1 1624964545 installed
<13>Jul 26 13:41:48 rpmi: python3-base-3.9.6-alt1 sisyphus+276295.100.1.1 1624964545 installed
<13>Jul 26 13:41:48 rpmi: libkmod-27.0.9.f5434cf-alt1 sisyphus+278393.100.1.2 1626199724 installed
<13>Jul 26 13:41:48 rpmi: kmod-27.0.9.f5434cf-alt1 sisyphus+278393.100.1.2 1626199724 installed
<13>Jul 26 13:41:48 rpmi: dmsetup-1.02.177-alt1 sisyphus+279489.100.1.1 1626550184 installed
<86>Jul 26 13:41:48 groupadd[219913]: group added to /etc/group: name=tape, GID=499
<86>Jul 26 13:41:48 groupadd[219913]: group added to /etc/gshadow: name=tape
<86>Jul 26 13:41:48 groupadd[219913]: new group: name=tape, GID=499
<86>Jul 26 13:41:48 groupadd[219921]: group added to /etc/group: name=dialout, GID=498
<86>Jul 26 13:41:48 groupadd[219921]: group added to /etc/gshadow: name=dialout
<86>Jul 26 13:41:48 groupadd[219921]: new group: name=dialout, GID=498
<86>Jul 26 13:41:48 groupadd[219930]: group added to /etc/group: name=input, GID=497
<86>Jul 26 13:41:48 groupadd[219930]: group added to /etc/gshadow: name=input
<86>Jul 26 13:41:48 groupadd[219930]: new group: name=input, GID=497
<86>Jul 26 13:41:48 groupadd[219936]: group added to /etc/group: name=video, GID=496
<86>Jul 26 13:41:48 groupadd[219936]: group added to /etc/gshadow: name=video
<86>Jul 26 13:41:48 groupadd[219936]: new group: name=video, GID=496
<86>Jul 26 13:41:48 groupadd[219940]: group added to /etc/group: name=render, GID=495
<86>Jul 26 13:41:48 groupadd[219940]: group added to /etc/gshadow: name=render
<86>Jul 26 13:41:48 groupadd[219940]: new group: name=render, GID=495
<13>Jul 26 13:41:48 rpmi: udev-1:249.1-alt2 sisyphus+279897.200.2.1 1626880725 installed
<13>Jul 26 13:41:49 rpmi: libwacom-1.11-alt1 sisyphus+279217.100.1.1 1626436997 installed
<13>Jul 26 13:41:49 rpmi: libinput-1.18.0-alt1 sisyphus+279585.100.1.2 1626610056 installed
<86>Jul 26 13:41:49 groupadd[220509]: group added to /etc/group: name=_keytab, GID=494
<86>Jul 26 13:41:49 groupadd[220509]: group added to /etc/gshadow: name=_keytab
<86>Jul 26 13:41:49 groupadd[220509]: new group: name=_keytab, GID=494
<13>Jul 26 13:41:49 rpmi: libkrb5-1.19.2-alt1 sisyphus+280682.100.1.1 1627189724 installed
<13>Jul 26 13:41:50 rpmi: libqt5-network-5.15.2-alt4 sisyphus+279826.100.1.1 1626773284 installed
<13>Jul 26 13:41:50 rpmi: libqt5-xcbqpa-5.15.2-alt4 sisyphus+279826.100.1.1 1626773284 installed
<13>Jul 26 13:41:50 rpmi: libqt5-eglfskmssupport-5.15.2-alt4 sisyphus+279826.100.1.1 1626773284 installed
<13>Jul 26 13:41:50 rpmi: libqt5-eglfsdeviceintegration-5.15.2-alt4 sisyphus+279826.100.1.1 1626773284 installed
<13>Jul 26 13:41:50 rpmi: libqt5-gui-5.15.2-alt4 sisyphus+279826.100.1.1 1626773284 installed
<13>Jul 26 13:41:50 rpmi: libqt5-qmlmodels-5.15.2-alt3 sisyphus+279790.100.1.1 1626722599 installed
<13>Jul 26 13:41:50 rpmi: libqt5-qmlworkerscript-5.15.2-alt3 sisyphus+279790.100.1.1 1626722599 installed
<13>Jul 26 13:41:50 rpmi: libqt5-quick-5.15.2-alt3 sisyphus+279790.100.1.1 1626722599 installed
<13>Jul 26 13:41:50 rpmi: libqt5-quickshapes-5.15.2-alt3 sisyphus+279790.100.1.1 1626722599 installed
<13>Jul 26 13:41:51 rpmi: libqt5-qml-5.15.2-alt3 sisyphus+279790.100.1.1 1626722599 installed
<13>Jul 26 13:41:51 rpmi: rpm-build-qml-5.15.2-alt3 sisyphus+279790.100.1.1 1626722599 installed
<13>Jul 26 13:41:51 rpmi: rpm-build-kf5-5.12.0-alt2 sisyphus+226903.100.1.1 1554799142 installed
<13>Jul 26 13:41:51 rpmi: rpm-build-ubt-0.3.1-alt3 sisyphus+277013.100.1.2 1625346631 installed
<13>Jul 26 13:41:56 rpmi: xorg-proto-devel-2021.4-alt1 sisyphus+272146.100.1.1 1621424691 installed
<13>Jul 26 13:41:56 rpmi: libXrender-0.9.10-alt1 sisyphus+278480.100.1.2 1626227741 installed
<13>Jul 26 13:41:59 rpmi: libxcb-devel-1.14-alt1 sisyphus+277968.100.1.3 1625952333 installed
<13>Jul 26 13:41:59 rpmi: libX11-devel-3:1.7.2-alt1 sisyphus+279629.100.1.1 1626637391 installed
<13>Jul 26 13:41:59 rpmi: libXfixes-devel-5.0.3-alt1 sisyphus+275326.100.2.2 1624573639 installed
<13>Jul 26 13:41:59 rpmi: libXt-1.2.1-alt1 sisyphus+265202.200.1.1 1611565459 installed
<13>Jul 26 13:41:59 rpmi: libidn2-2.3.1-alt1 sisyphus+279536.100.1.2 1626591505 installed
<13>Jul 26 13:41:59 rpmi: libXrender-devel-0.9.10-alt1 sisyphus+278480.100.1.2 1626227741 installed
<13>Jul 26 13:42:00 rpmi: libqt5-widgets-5.15.2-alt4 sisyphus+279826.100.1.1 1626773284 installed
<13>Jul 26 13:42:00 rpmi: libnettle8-3.7.3-alt1 sisyphus+276723.100.1.2 1625211849 installed
<13>Jul 26 13:42:00 rpmi: python3-module-six-1.15.0-alt2 sisyphus+270533.5100.6.1 1619685463 installed
<13>Jul 26 13:42:00 rpmi: libhogweed6-3.7.3-alt1 sisyphus+276723.100.1.2 1625211849 installed
<13>Jul 26 13:42:00 rpmi: libgnutls30-3.6.16-alt1 sisyphus+273086.100.1.1 1622478374 installed
<13>Jul 26 13:42:00 rpmi: libqt5-opengl-5.15.2-alt4 sisyphus+279826.100.1.1 1626773284 installed
<13>Jul 26 13:42:00 rpmi: libXmu-1.1.3-alt1 sisyphus+278818.100.1.3 1626263299 installed
<13>Jul 26 13:42:00 rpmi: libXpm-3.5.13-alt1 sisyphus+278339.100.1.2 1626171703 installed
<13>Jul 26 13:42:00 rpmi: libXpm-devel-3.5.13-alt1 sisyphus+278339.100.1.2 1626171703 installed
<13>Jul 26 13:42:00 rpmi: libxcbutil-keysyms-devel-0.4.0-alt1 sisyphus+278187.100.1.1 1626075950 installed
<13>Jul 26 13:42:00 rpmi: libXcursor-1.2.0-alt1 sisyphus+278256.100.1.2 1626134584 installed
<13>Jul 26 13:42:00 rpmi: libXcursor-devel-1.2.0-alt1 sisyphus+278256.100.1.2 1626134584 installed
<13>Jul 26 13:42:00 rpmi: libXft-2.3.3-alt1 sisyphus+278258.100.1.2 1626135738 installed
<13>Jul 26 13:42:00 rpmi: libXrandr-1.5.2-alt1 sisyphus+275330.100.2.2 1624575560 installed
<13>Jul 26 13:42:00 rpmi: libXrandr-devel-1.5.2-alt1 sisyphus+275330.100.2.2 1624575560 installed
<13>Jul 26 13:42:00 rpmi: libICE-devel-1.0.10-alt1 sisyphus+278827.100.1.1 1626220281 installed
<13>Jul 26 13:42:00 rpmi: libSM-devel-1.2.3-alt1 sisyphus+278820.100.1.1 1626219266 installed
<13>Jul 26 13:42:00 rpmi: libXt-devel-1.2.1-alt1 sisyphus+265202.200.1.1 1611565459 installed
<13>Jul 26 13:42:00 rpmi: libXmu-devel-1.1.3-alt1 sisyphus+278818.100.1.3 1626263299 installed
<13>Jul 26 13:42:00 rpmi: libXau-devel-1.0.9-alt1 sisyphus+278247.100.1.1 1626080738 installed
<13>Jul 26 13:42:00 rpmi: libXext-devel-1.3.4-alt1 sisyphus+278817.100.1.3 1626262589 installed
<13>Jul 26 13:42:00 rpmi: libXdmcp-devel-1.1.3-alt1 sisyphus+278816.100.1.1 1626219233 installed
<13>Jul 26 13:42:00 rpmi: libXxf86vm-devel-1.1.4-alt2 sisyphus+275334.100.2.2 1624577012 installed
<13>Jul 26 13:42:00 rpmi: xxd-4:8.2.0011-alt3 sisyphus+279619.100.1.1 1626624960 installed
<13>Jul 26 13:42:00 rpmi: libxkbfile-1.1.0-alt1 sisyphus+278257.100.1.2 1626134575 installed
<13>Jul 26 13:42:00 rpmi: libxkbfile-devel-1.1.0-alt1 sisyphus+278257.100.1.2 1626134575 installed
<13>Jul 26 13:42:00 rpmi: libxkbcommon-devel-1.3.0-alt1 sisyphus+279463.100.1.1 1626547650 installed
<13>Jul 26 13:42:00 rpmi: vulkan-filesystem-1.2.182-alt1 sisyphus+276128.400.2.2 1624869942 installed
<13>Jul 26 13:42:00 rpmi: libvulkan1-1.2.182-alt1 sisyphus+276128.400.2.2 1624869988 installed
<13>Jul 26 13:42:00 rpmi: libvulkan-devel-1.2.182-alt1 sisyphus+276128.400.2.2 1624869988 installed
<13>Jul 26 13:42:00 rpmi: libudev-devel-1:249.1-alt2 sisyphus+279897.200.2.1 1626880725 installed
<13>Jul 26 13:42:00 rpmi: libssl-devel-1.1.1k-alt1 sisyphus+279286.100.1.1 1626469643 installed
<13>Jul 26 13:42:00 rpmi: libqt5-xml-5.15.2-alt4 sisyphus+279826.100.1.1 1626773284 installed
<13>Jul 26 13:42:00 rpmi: qt5-x11extras-common-5.15.2-alt1 sisyphus+279083.100.1.1 1626376026 installed
<13>Jul 26 13:42:00 rpmi: libqt5-x11extras-5.15.2-alt1 sisyphus+279083.100.1.1 1626376030 installed
<13>Jul 26 13:42:00 rpmi: libqt5-test-5.15.2-alt4 sisyphus+279826.100.1.1 1626773284 installed
<13>Jul 26 13:42:00 rpmi: libqt5-concurrent-5.15.2-alt4 sisyphus+279826.100.1.1 1626773284 installed
<13>Jul 26 13:42:00 rpmi: libavahi-0.8-alt2 sisyphus+279391.100.1.2 1626530700 installed
<13>Jul 26 13:42:01 rpmi: libcups-2.3.3-alt6.op2 sisyphus+274028.100.1.1 1623149062 installed
<13>Jul 26 13:42:01 rpmi: libqt5-printsupport-5.15.2-alt4 sisyphus+279826.100.1.1 1626773284 installed
<13>Jul 26 13:42:01 rpmi: xorg-xf86miscproto-devel-0.9.3-alt1 sisyphus+277136.100.1.1 1625405239 installed
<13>Jul 26 13:42:01 rpmi: libXxf86misc-1.0.4-alt1 sisyphus+275333.100.2.2 1624577011 installed
<13>Jul 26 13:42:01 rpmi: libXxf86misc-devel-1.0.4-alt1 sisyphus+275333.100.2.2 1624577011 installed
<13>Jul 26 13:42:01 rpmi: libXv-1.0.11-alt1 sisyphus+278228.100.1.1 1626079280 installed
<13>Jul 26 13:42:01 rpmi: libXv-devel-1.0.11-alt1 sisyphus+278228.100.1.1 1626079280 installed
<13>Jul 26 13:42:01 rpmi: libXtst-1.2.3-alt1 sisyphus+278848.100.1.2 1626298057 installed
<13>Jul 26 13:42:01 rpmi: libXinerama-1.1.4-alt1 sisyphus+275328.100.2.2 1624575558 installed
<13>Jul 26 13:42:01 rpmi: libXinerama-devel-1.1.4-alt1 sisyphus+275328.100.2.2 1624575558 installed
<13>Jul 26 13:42:01 rpmi: libXi-1.7.10-alt1 sisyphus+278284.100.1.2 1626151193 installed
<13>Jul 26 13:42:01 rpmi: libXi-devel-1.7.10-alt1 sisyphus+278284.100.1.2 1626151193 installed
<13>Jul 26 13:42:01 rpmi: libXtst-devel-1.2.3-alt1 sisyphus+278848.100.1.2 1626298057 installed
<13>Jul 26 13:42:01 rpmi: libXdamage-1.1.5-alt1 sisyphus+275324.100.2.2 1624573270 installed
<13>Jul 26 13:42:01 rpmi: libXdamage-devel-1.1.5-alt1 sisyphus+275324.100.2.2 1624573270 installed
<13>Jul 26 13:42:01 rpmi: libXcomposite-0.4.5-alt1 sisyphus+275323.100.2.2 1624573270 installed
<13>Jul 26 13:42:01 rpmi: libXcomposite-devel-0.4.5-alt1 sisyphus+275323.100.2.2 1624573270 installed
<13>Jul 26 13:42:01 rpmi: libXScrnSaver-1.2.3-alt1 sisyphus+275322.100.2.2 1624573270 installed
<13>Jul 26 13:42:01 rpmi: libXScrnSaver-devel-1.2.3-alt1 sisyphus+275322.100.2.2 1624573270 installed
<13>Jul 26 13:42:01 rpmi: libOpenGL-7:1.3.3-alt1 sisyphus+279467.100.1.1 1626548124 installed
<13>Jul 26 13:42:01 rpmi: libGLES-7:1.3.3-alt1 sisyphus+279467.100.1.1 1626548124 installed
<13>Jul 26 13:42:01 rpmi: libglvnd-devel-7:1.3.3-alt1 sisyphus+279467.100.1.1 1626548124 installed
<13>Jul 26 13:42:01 rpmi: gcc-c++-common-1.4.27-alt1 sisyphus+278099.1300.1.1 1626028636 installed
<13>Jul 26 13:42:01 rpmi: libstdc++10-devel-10.3.1-alt2 sisyphus+277353.100.2.1 1625526466 installed
<13>Jul 26 13:42:03 rpmi: gcc10-c++-10.3.1-alt2 sisyphus+277353.100.2.1 1625526466 installed
<13>Jul 26 13:42:03 rpmi: gcc-c++-10-alt1 sisyphus+263054.200.3.1 1607516810 installed
<13>Jul 26 13:42:03 rpmi: libharfbuzz-gobject-2.8.1-alt1 sisyphus+279641.100.1.1 1626639637 installed
<13>Jul 26 13:42:03 rpmi: libharfbuzz-icu-2.8.1-alt1 sisyphus+279641.100.1.1 1626639637 installed
<13>Jul 26 13:42:03 rpmi: icu-utils-1:6.9.1-alt2 sisyphus+277632.100.1.1 1625726231 installed
<13>Jul 26 13:42:03 rpmi: libicu-devel-1:6.9.1-alt2 sisyphus+277632.100.1.1 1625726231 installed
<13>Jul 26 13:42:04 rpmi: qt5-base-devel-5.15.2-alt4 sisyphus+279826.100.1.1 1626773284 installed
<13>Jul 26 13:42:04 rpmi: libgraphite2-devel-1.3.14-alt2.1 sisyphus+279571.100.1.2 1626605157 installed
<13>Jul 26 13:42:04 rpmi: xml-utils-1:2.9.12-alt1 sisyphus+279621.1100.1.1 1626630532 installed
<13>Jul 26 13:42:04 rpmi: rpm-build-gir-0.7.3-alt3 sisyphus+242150.100.1.1 1575312005 installed
<13>Jul 26 13:42:04 rpmi: glib2-devel-2.68.3-alt1 sisyphus+278158.100.1.1 1626049671 installed
<13>Jul 26 13:42:04 rpmi: libfreetype-devel-2.10.4-alt2 sisyphus+278003.100.1.2 1625973065 installed
<13>Jul 26 13:42:04 rpmi: libharfbuzz-devel-2.8.1-alt1 sisyphus+279641.100.1.1 1626639637 installed
<13>Jul 26 13:42:04 rpmi: fontconfig-devel-2.13.1-alt1 sisyphus+278837.100.1.3 1626287494 installed
<13>Jul 26 13:42:04 rpmi: libXft-devel-2.3.3-alt1 sisyphus+278258.100.1.2 1626135738 installed
<13>Jul 26 13:42:04 rpmi: libyaml2-0.2.5-alt1 sisyphus+278391.100.1.1 1626094932 installed
<13>Jul 26 13:42:04 rpmi: python3-module-yaml-5.4.1-alt1 sisyphus+279145.100.1.2 1626452687 installed
<13>Jul 26 13:42:04 rpmi: shared-mime-info-2.1-alt1 sisyphus+278982.100.1.1 1626350327 installed
<13>Jul 26 13:42:04 rpmi: python3-module-pyxdg-0.27-alt1 sisyphus+275990.100.1.1 1624810448 installed
<13>Jul 26 13:42:04 rpmi: python3-module-ntlm-1.1.0-alt1.2 sisyphus+275841.100.1.1 1624797814 installed
<13>Jul 26 13:42:04 rpmi: python3-module-ndg-0.4.2-alt1.qa1 sisyphus+275837.100.1.2 1624808490 installed
<13>Jul 26 13:42:04 rpmi: python3-module-pycparser-2.20-alt2 sisyphus+278697.200.1.1 1626167452 installed
<13>Jul 26 13:42:04 rpmi: python3-module-cffi-1.14.5-alt2 sisyphus+279395.100.1.2 1626532823 installed
<13>Jul 26 13:42:04 rpmi: python3-module-cryptography-3.4.7-alt1 sisyphus+270667.100.1.1 1619307697 installed
<13>Jul 26 13:42:05 rpmi: python3-module-openssl-20.0.1-alt1 sisyphus+267607.100.2.1 1615475362 installed
<13>Jul 26 13:42:05 rpmi: python3-module-ndg-httpsclient-0.4.2-alt1.qa1 sisyphus+275837.100.1.2 1624808490 installed
<13>Jul 26 13:42:05 rpmi: python3-module-urllib3-2:1.26.6-alt1 sisyphus+276579.100.1.1 1625137436 installed
<13>Jul 26 13:42:05 rpmi: python3-module-idna-3.2-alt1 sisyphus+274748.100.1.1 1624021080 installed
<13>Jul 26 13:42:05 rpmi: python3-module-chardet-1:3.0.4-alt2 sisyphus+275804.100.1.1 1624794263 installed
<13>Jul 26 13:42:05 rpmi: python3-module-requests-2.25.1-alt2 sisyphus+267359.100.1.1 1614881487 installed
<13>Jul 26 13:42:05 rpmi: rpm-macros-cmake-3.21.0-alt3 sisyphus+280691.100.1.1 1627227187 installed
<13>Jul 26 13:42:05 rpmi: cmake-modules-3.21.0-alt3 sisyphus+280691.100.1.1 1627227156 installed
<13>Jul 26 13:42:05 rpmi: libuv-1.41.1-alt2 sisyphus+279518.100.1.1 1626552320 installed
<13>Jul 26 13:42:05 rpmi: librhash-1.3.5-alt2 sisyphus+278212.100.1.1 1626077689 installed
<13>Jul 26 13:42:05 rpmi: libjsoncpp19-1.8.4-alt5 sisyphus+277640.100.1.1 1625728461 installed
<13>Jul 26 13:42:05 rpmi: publicsuffix-list-dafsa-20210419-alt1 sisyphus+270358.100.1.1 1618924010 installed
<13>Jul 26 13:42:05 rpmi: libpsl-0.21.1-alt2 sisyphus+279461.100.1.1 1626547555 installed
<13>Jul 26 13:42:05 rpmi: libnghttp2-1.41.0-alt1 sisyphus+275115.100.1.1 1624405485 installed
<13>Jul 26 13:42:05 rpmi: openldap-common-2.4.57-alt1 sisyphus+279665.100.1.1 1626645830 installed
<86>Jul 26 13:42:05 groupadd[232826]: group added to /etc/group: name=sasl, GID=493
<86>Jul 26 13:42:05 groupadd[232826]: group added to /etc/gshadow: name=sasl
<86>Jul 26 13:42:05 groupadd[232826]: new group: name=sasl, GID=493
<13>Jul 26 13:42:05 rpmi: libsasl2-3-2.1.27-alt2.1 sisyphus+278407.100.1.3 1626205820 installed
<13>Jul 26 13:42:05 rpmi: libldap-2.4.57-alt1 sisyphus+279665.100.1.1 1626645925 installed
<13>Jul 26 13:42:05 rpmi: libcurl-7.77.0-alt1 sisyphus+272616.100.1.1 1622105648 installed
<13>Jul 26 13:42:05 rpmi: libarchive13-3.5.1-alt1 sisyphus+279480.100.1.1 1626549371 installed
<13>Jul 26 13:42:06 rpmi: cmake-3.21.0-alt3 sisyphus+280691.100.1.1 1627227187 installed
<13>Jul 26 13:42:06 rpmi: extra-cmake-modules-5.84.0-alt2 sisyphus+278874.100.1.1 1626337952 installed
<13>Jul 26 13:42:06 rpmi: qt5-x11extras-devel-5.15.2-alt1 sisyphus+279083.100.1.1 1626376030 installed
Building target platforms: i586
Building for target i586
Wrote: /usr/src/in/nosrpm/kf5-kidletime-5.84.0-alt1.nosrc.rpm (w1.gzdio)
Installing kf5-kidletime-5.84.0-alt1.src.rpm
Building target platforms: i586
Building for target i586
Executing(%prep): /bin/sh -e /usr/src/tmp/rpm-tmp.25702
+ umask 022
+ /bin/mkdir -p /usr/src/RPM/BUILD
+ cd /usr/src/RPM/BUILD
+ cd /usr/src/RPM/BUILD
+ rm -rf kidletime-5.84.0
+ echo 'Source #0 (kidletime-5.84.0.tar):'
Source #0 (kidletime-5.84.0.tar):
+ /bin/tar -xf /usr/src/RPM/SOURCES/kidletime-5.84.0.tar
+ cd kidletime-5.84.0
+ /bin/chmod -c -Rf u+rwX,go-w .
+ exit 0
Executing(%build): /bin/sh -e /usr/src/tmp/rpm-tmp.25702
+ umask 022
+ /bin/mkdir -p /usr/src/RPM/BUILD
+ cd /usr/src/RPM/BUILD
+ cd kidletime-5.84.0
+ __kf5_build
+ mkdir -p BUILD
+ __kf5_cmake
+ export PATH=/usr/lib/kf5/bin:/usr/src/bin:/bin:/usr/bin:/usr/X11R6/bin:/usr/games
+ PATH=/usr/lib/kf5/bin:/usr/src/bin:/bin:/usr/bin:/usr/X11R6/bin:/usr/games
+ export QTDIR=/usr/share/qt5
+ QTDIR=/usr/share/qt5
+ export 'CFLAGS=-pipe -frecord-gcc-switches -Wall -g -O2 -march=i586 -mtune=generic'
+ CFLAGS='-pipe -frecord-gcc-switches -Wall -g -O2 -march=i586 -mtune=generic'
+ export 'CXXFLAGS=-pipe -frecord-gcc-switches -Wall -g -O2 -march=i586 -mtune=generic'
+ CXXFLAGS='-pipe -frecord-gcc-switches -Wall -g -O2 -march=i586 -mtune=generic'
+ pushd BUILD
~/RPM/BUILD/kidletime-5.84.0/BUILD ~/RPM/BUILD/kidletime-5.84.0
+ cmake .. -DCMAKE_USE_RELATIVE_PATHS:BOOL=ON -DCMAKE_VERBOSE_MAKEFILE:BOOL=ON -DCMAKE_SKIP_RPATH:BOOL=ON -DBUILD_TESTING:BOOL=FALSE -DKDE_INSTALL_USE_QT_SYS_PATHS:BOOL=ON -DCMAKE_BUILD_TYPE=Release '-DCMAKE_EXE_LINKER_FLAGS:STRING=-L/usr/lib -L/usr/lib/kf5/devel' '-DCMAKE_MODULE_LINKER_FLAGS:STRING=-L/usr/lib -L/usr/lib/kf5/devel' '-DCMAKE_SHARED_LINKER_FLAGS:STRING=-L/usr/lib -L/usr/lib/kf5/devel' '-DCMAKE_LIBRARY_PATH=/usr/lib/kf5/devel;/usr/lib;/lib' '-DCMAKE_INCLUDE_PATH=/usr/include/KF5;/usr/include' -DCMAKE_INSTALL_PREFIX=/usr -DCMAKE_PREFIX_PATH=/usr -DCMAKE_INSTALL_BINDIR=/usr/lib/kf5/bin -DCMAKE_INSTALL_FULL_BINDIR=/usr/lib/kf5/bin -DBIN_INSTALL_DIR:PATH=/usr/lib/kf5/bin -DCMAKE_INSTALL_SBINDIR=/usr/lib/kf5/sbin -DCMAKE_INSTALL_FULL_SBINDIR=/usr/lib/kf5/sbin -DSBIN_INSTALL_DIR:PATH=/usr/lib/kf5/sbin -DLIBEXEC_INSTALL_DIR:PATH=/usr/libexec -DINCLUDE_INSTALL_DIR:PATH=/usr/include -DCMAKE_INSTALL_INCLUDEDIR_KF5=/usr/include/KF5 -DDATA_INSTALL_DIR:PATH=/usr/share -DCONFIG_INSTALL_DIR:PATH=/etc/kf5/xdg -DSERVICES_INSTALL_DIR:PATH=/usr/share/kservices5 -DSERVICETYPES_INSTALL_DIR:PATH=/usr/share/kservicetypes5 -DKNOTIFYRC_INSTALL_DIR:PATH=/usr/share/knotifications5 -DKXMLGUI_INSTALL_DIR:PATH=/usr/share/kxmlgui5 -DLIB_INSTALL_DIR:PATH=/usr/lib -DLIB_DESTINATION=lib -DLIB_SUFFIX= -DSYSCONF_INSTALL_DIR:PATH=/etc -DAUTOSTART_INSTALL_DIR=/etc/kf5/xdg/autostart -DHTML_INSTALL_DIR=/usr/share/kf5/doc/HTML -DICON_INSTALL_DIR=/usr/share/kf5/icons -DXDG_MIME_INSTALL_DIR=/usr/share/mime/packages -DXDG_APPS_INSTALL_DIR=/usr/share/kf5/applications/kf5 -DECM_MKSPECS_INSTALL_DIR:PATH=/usr/lib/qt5/mkspecs/modules -DKCFG_INSTALL_DIR:PATH=/usr/share/kf5/config.kcfg -DPLUGIN_INSTALL_DIR:PATH=/usr/lib/qt5/plugins -DQT_PLUGIN_INSTALL_DIR:PATH=/usr/lib/qt5/plugins -DQML_INSTALL_DIR:PATH=/usr/lib/qt5/qml -DIMPORTS_INSTALL_DIR:PATH=/usr/lib/qt5/imports -DDBUS_INTERFACES_INSTALL_DIR=/usr/share/kf5/dbus-1/interfaces -DDBUS_SERVICES_INSTALL_DIR=/usr/share/kf5/dbus-1/services -DDBUS_SYSTEM_SERVICES_INSTALL_DIR=/lib/dbus-1/system-services
-- The C compiler identification is GNU 10.3.1
-- The CXX compiler identification is GNU 10.3.1
-- Detecting C compiler ABI info
-- Detecting C compiler ABI info - done
-- Check for working C compiler: /usr/bin/cc - skipped
-- Detecting C compile features
-- Detecting C compile features - done
-- Detecting CXX compiler ABI info
-- Detecting CXX compiler ABI info - done
-- Check for working CXX compiler: /usr/bin/c++ - skipped
-- Detecting CXX compile features
-- Detecting CXX compile features - done
--
CMake Deprecation Warning at /usr/share/ECM/kde-modules/KDEInstallDirs.cmake:337 (message):
BIN_INSTALL_DIR is deprecated, use KDE_INSTALL_BINDIR instead.
Call Stack (most recent call first):
/usr/share/ECM/kde-modules/KDEInstallDirs.cmake:426 (_define_relative)
CMakeLists.txt:29 (include)
CMake Deprecation Warning at /usr/share/ECM/kde-modules/KDEInstallDirs.cmake:337 (message):
SBIN_INSTALL_DIR is deprecated, use KDE_INSTALL_SBINDIR instead.
Call Stack (most recent call first):
/usr/share/ECM/kde-modules/KDEInstallDirs.cmake:429 (_define_relative)
CMakeLists.txt:29 (include)
CMake Deprecation Warning at /usr/share/ECM/kde-modules/KDEInstallDirs.cmake:337 (message):
LIB_INSTALL_DIR is deprecated, use KDE_INSTALL_LIBDIR instead.
Call Stack (most recent call first):
/usr/share/ECM/kde-modules/KDEInstallDirs.cmake:432 (_define_relative)
CMakeLists.txt:29 (include)
CMake Deprecation Warning at /usr/share/ECM/kde-modules/KDEInstallDirs.cmake:337 (message):
LIBEXEC_INSTALL_DIR is deprecated, use KDE_INSTALL_LIBEXECDIR instead.
Call Stack (most recent call first):
/usr/share/ECM/kde-modules/KDEInstallDirs.cmake:442 (_define_relative)
CMakeLists.txt:29 (include)
CMake Deprecation Warning at /usr/share/ECM/kde-modules/KDEInstallDirs.cmake:337 (message):
QT_PLUGIN_INSTALL_DIR is deprecated, use KDE_INSTALL_QTPLUGINDIR instead.
Call Stack (most recent call first):
/usr/share/ECM/kde-modules/KDEInstallDirs.cmake:391 (_define_relative)
/usr/share/ECM/kde-modules/KDEInstallDirs.cmake:474 (_define_absolute)
CMakeLists.txt:29 (include)
CMake Deprecation Warning at /usr/share/ECM/kde-modules/KDEInstallDirs.cmake:337 (message):
IMPORTS_INSTALL_DIR is deprecated, use KDE_INSTALL_QTQUICKIMPORTSDIR
instead.
Call Stack (most recent call first):
/usr/share/ECM/kde-modules/KDEInstallDirs.cmake:391 (_define_relative)
/usr/share/ECM/kde-modules/KDEInstallDirs.cmake:483 (_define_absolute)
CMakeLists.txt:29 (include)
CMake Deprecation Warning at /usr/share/ECM/kde-modules/KDEInstallDirs.cmake:337 (message):
QML_INSTALL_DIR is deprecated, use KDE_INSTALL_QMLDIR instead.
Call Stack (most recent call first):
/usr/share/ECM/kde-modules/KDEInstallDirs.cmake:391 (_define_relative)
/usr/share/ECM/kde-modules/KDEInstallDirs.cmake:492 (_define_absolute)
CMakeLists.txt:29 (include)
CMake Deprecation Warning at /usr/share/ECM/kde-modules/KDEInstallDirs.cmake:337 (message):
PLUGIN_INSTALL_DIR is deprecated, use KDE_INSTALL_PLUGINDIR instead.
Call Stack (most recent call first):
/usr/share/ECM/kde-modules/KDEInstallDirs.cmake:514 (_define_relative)
CMakeLists.txt:29 (include)
CMake Deprecation Warning at /usr/share/ECM/kde-modules/KDEInstallDirs.cmake:337 (message):
INCLUDE_INSTALL_DIR is deprecated, use KDE_INSTALL_INCLUDEDIR instead.
Call Stack (most recent call first):
/usr/share/ECM/kde-modules/KDEInstallDirs.cmake:391 (_define_relative)
/usr/share/ECM/kde-modules/KDEInstallDirs.cmake:518 (_define_absolute)
CMakeLists.txt:29 (include)
CMake Deprecation Warning at /usr/share/ECM/kde-modules/KDEInstallDirs.cmake:337 (message):
DATA_INSTALL_DIR is deprecated, use KDE_INSTALL_DATADIR instead.
Call Stack (most recent call first):
/usr/share/ECM/kde-modules/KDEInstallDirs.cmake:544 (_define_relative)
CMakeLists.txt:29 (include)
CMake Deprecation Warning at /usr/share/ECM/kde-modules/KDEInstallDirs.cmake:337 (message):
HTML_INSTALL_DIR is deprecated, use KDE_INSTALL_DOCBUNDLEDIR instead.
Call Stack (most recent call first):
/usr/share/ECM/kde-modules/KDEInstallDirs.cmake:565 (_define_relative)
CMakeLists.txt:29 (include)
CMake Deprecation Warning at /usr/share/ECM/kde-modules/KDEInstallDirs.cmake:337 (message):
KCFG_INSTALL_DIR is deprecated, use KDE_INSTALL_KCFGDIR instead.
Call Stack (most recent call first):
/usr/share/ECM/kde-modules/KDEInstallDirs.cmake:568 (_define_relative)
CMakeLists.txt:29 (include)
CMake Deprecation Warning at /usr/share/ECM/kde-modules/KDEInstallDirs.cmake:337 (message):
SERVICES_INSTALL_DIR is deprecated, use KDE_INSTALL_KSERVICES5DIR instead.
Call Stack (most recent call first):
/usr/share/ECM/kde-modules/KDEInstallDirs.cmake:574 (_define_relative)
CMakeLists.txt:29 (include)
CMake Deprecation Warning at /usr/share/ECM/kde-modules/KDEInstallDirs.cmake:337 (message):
SERVICETYPES_INSTALL_DIR is deprecated, use KDE_INSTALL_KSERVICETYPES5DIR
instead.
Call Stack (most recent call first):
/usr/share/ECM/kde-modules/KDEInstallDirs.cmake:577 (_define_relative)
CMakeLists.txt:29 (include)
CMake Deprecation Warning at /usr/share/ECM/kde-modules/KDEInstallDirs.cmake:337 (message):
KNOTIFYRC_INSTALL_DIR is deprecated, use KDE_INSTALL_KNOTIFY5RCDIR instead.
Call Stack (most recent call first):
/usr/share/ECM/kde-modules/KDEInstallDirs.cmake:580 (_define_relative)
CMakeLists.txt:29 (include)
CMake Deprecation Warning at /usr/share/ECM/kde-modules/KDEInstallDirs.cmake:337 (message):
KXMLGUI_INSTALL_DIR is deprecated, use KDE_INSTALL_KXMLGUI5DIR instead.
Call Stack (most recent call first):
/usr/share/ECM/kde-modules/KDEInstallDirs.cmake:583 (_define_relative)
CMakeLists.txt:29 (include)
CMake Deprecation Warning at /usr/share/ECM/kde-modules/KDEInstallDirs.cmake:337 (message):
ICON_INSTALL_DIR is deprecated, use KDE_INSTALL_ICONDIR instead.
Call Stack (most recent call first):
/usr/share/ECM/kde-modules/KDEInstallDirs.cmake:598 (_define_relative)
CMakeLists.txt:29 (include)
CMake Deprecation Warning at /usr/share/ECM/kde-modules/KDEInstallDirs.cmake:337 (message):
XDG_APPS_INSTALL_DIR is deprecated, use KDE_INSTALL_APPDIR instead.
Call Stack (most recent call first):
/usr/share/ECM/kde-modules/KDEInstallDirs.cmake:613 (_define_relative)
CMakeLists.txt:29 (include)
CMake Deprecation Warning at /usr/share/ECM/kde-modules/KDEInstallDirs.cmake:337 (message):
XDG_MIME_INSTALL_DIR is deprecated, use KDE_INSTALL_MIMEDIR instead.
Call Stack (most recent call first):
/usr/share/ECM/kde-modules/KDEInstallDirs.cmake:619 (_define_relative)
CMakeLists.txt:29 (include)
CMake Deprecation Warning at /usr/share/ECM/kde-modules/KDEInstallDirs.cmake:337 (message):
DBUS_INTERFACES_INSTALL_DIR is deprecated, use KDE_INSTALL_DBUSINTERFACEDIR
instead.
Call Stack (most recent call first):
/usr/share/ECM/kde-modules/KDEInstallDirs.cmake:633 (_define_relative)
CMakeLists.txt:29 (include)
CMake Deprecation Warning at /usr/share/ECM/kde-modules/KDEInstallDirs.cmake:337 (message):
DBUS_SERVICES_INSTALL_DIR is deprecated, use KDE_INSTALL_DBUSSERVICEDIR
instead.
Call Stack (most recent call first):
/usr/share/ECM/kde-modules/KDEInstallDirs.cmake:636 (_define_relative)
CMakeLists.txt:29 (include)
CMake Deprecation Warning at /usr/share/ECM/kde-modules/KDEInstallDirs.cmake:337 (message):
DBUS_SYSTEM_SERVICES_INSTALL_DIR is deprecated, use
KDE_INSTALL_DBUSSYSTEMSERVICEDIR instead.
Call Stack (most recent call first):
/usr/share/ECM/kde-modules/KDEInstallDirs.cmake:639 (_define_relative)
CMakeLists.txt:29 (include)
CMake Deprecation Warning at /usr/share/ECM/kde-modules/KDEInstallDirs.cmake:337 (message):
SYSCONF_INSTALL_DIR is deprecated, use KDE_INSTALL_SYSCONFDIR instead.
Call Stack (most recent call first):
/usr/share/ECM/kde-modules/KDEInstallDirs.cmake:391 (_define_relative)
/usr/share/ECM/kde-modules/KDEInstallDirs.cmake:656 (_define_absolute)
CMakeLists.txt:29 (include)
CMake Deprecation Warning at /usr/share/ECM/kde-modules/KDEInstallDirs.cmake:337 (message):
CONFIG_INSTALL_DIR is deprecated, use KDE_INSTALL_CONFDIR instead.
Call Stack (most recent call first):
/usr/share/ECM/kde-modules/KDEInstallDirs.cmake:659 (_define_relative)
CMakeLists.txt:29 (include)
CMake Deprecation Warning at /usr/share/ECM/kde-modules/KDEInstallDirs.cmake:337 (message):
AUTOSTART_INSTALL_DIR is deprecated, use KDE_INSTALL_AUTOSTARTDIR instead.
Call Stack (most recent call first):
/usr/share/ECM/kde-modules/KDEInstallDirs.cmake:662 (_define_relative)
CMakeLists.txt:29 (include)
-- Looking for __GLIBC__
-- Looking for __GLIBC__ - found
-- Performing Test _OFFT_IS_64BIT
-- Performing Test _OFFT_IS_64BIT - Failed
-- Performing Test HAVE_DATE_TIME
-- Performing Test HAVE_DATE_TIME - Success
Package zlib was not found in the pkg-config search path.
Perhaps you should add the directory containing `zlib.pc'
to the PKG_CONFIG_PATH environment variable
Package 'zlib', required by 'freetype2', not found
Package zlib was not found in the pkg-config search path.
Perhaps you should add the directory containing `zlib.pc'
to the PKG_CONFIG_PATH environment variable
Package 'zlib', required by 'freetype2', not found
Package zlib was not found in the pkg-config search path.
Perhaps you should add the directory containing `zlib.pc'
to the PKG_CONFIG_PATH environment variable
Package 'zlib', required by 'freetype2', not found
Package zlib was not found in the pkg-config search path.
Perhaps you should add the directory containing `zlib.pc'
to the PKG_CONFIG_PATH environment variable
Package 'zlib', required by 'freetype2', not found
-- Found X11: /usr/include
-- Looking for XOpenDisplay in /usr/lib/libX11.so;/usr/lib/libXext.so
-- Looking for XOpenDisplay in /usr/lib/libX11.so;/usr/lib/libXext.so - found
-- Looking for gethostbyname
-- Looking for gethostbyname - found
-- Looking for connect
-- Looking for connect - found
-- Looking for remove
-- Looking for remove - found
-- Looking for shmat
-- Looking for shmat - found
-- Looking for IceConnectionNumber in ICE
-- Looking for IceConnectionNumber in ICE - found
-- Found XCB_XCB: /usr/lib/libxcb.so (found version "1.14")
-- Found XCB: /usr/lib/libxcb.so (found version "1.14") found components: XCB
-- Found XCB_SYNC: /usr/lib/libxcb-sync.so (found version "1.14")
-- Found XCB: /usr/lib/libxcb.so;/usr/lib/libxcb-sync.so (found version "1.14") found components: XCB SYNC
-- Found X11_XCB: /usr/lib/libX11-xcb.so (found version "1.7.2")
-- Performing Test COMPILER_HAS_HIDDEN_VISIBILITY
-- Performing Test COMPILER_HAS_HIDDEN_VISIBILITY - Success
-- Performing Test COMPILER_HAS_HIDDEN_INLINE_VISIBILITY
-- Performing Test COMPILER_HAS_HIDDEN_INLINE_VISIBILITY - Success
-- Performing Test COMPILER_HAS_DEPRECATED_ATTR
-- Performing Test COMPILER_HAS_DEPRECATED_ATTR - Success
-- The following features have been enabled:
* libXext, required for X-Sync based poller
* libX11-xcb, required for X-Sync based poller
* libxcb, required for X-Sync based poller
* libxcb-sync, required for X-Sync based poller
* X-Sync based poller, efficient operation of KIdleTime. STRONGLY RECOMMENDED (requires libXext, libX11-xcb, libxcb and libxcb-sync)
* X-Screensaver based poller, KIdleTime fallback mode (libXss)
-- The following OPTIONAL packages have been found:
* X11
* XCB, X protocol C-language Binding,
* X11_XCB, A compatibility library for code that translates Xlib API calls into XCB calls,
-- The following REQUIRED packages have been found:
* ECM (required version >= 5.84.0), Extra CMake Modules.,
* Qt5Gui
* Qt5X11Extras
* Qt5DBus
* Qt5 (required version >= 5.15.0)
-- The following features have been disabled:
* QCH, API documentation in QCH format (for e.g. Qt Assistant, Qt Creator & KDevelop)
-- Configuring done
-- Generating done
CMake Warning:
Manually-specified variables were not used by the project:
CMAKE_USE_RELATIVE_PATHS
LIB_DESTINATION
LIB_SUFFIX
-- Build files have been written to: /usr/src/RPM/BUILD/kidletime-5.84.0/BUILD
+ popd
~/RPM/BUILD/kidletime-5.84.0
+ __kf5_make
+ pushd BUILD
~/RPM/BUILD/kidletime-5.84.0/BUILD ~/RPM/BUILD/kidletime-5.84.0
+ make -j8
make: Entering directory '/usr/src/RPM/BUILD/kidletime-5.84.0/BUILD'
/usr/bin/cmake -S/usr/src/RPM/BUILD/kidletime-5.84.0 -B/usr/src/RPM/BUILD/kidletime-5.84.0/BUILD --check-build-system CMakeFiles/Makefile.cmake 0
make: Leaving directory '/usr/src/RPM/BUILD/kidletime-5.84.0/BUILD'
make: Entering directory '/usr/src/RPM/BUILD/kidletime-5.84.0/BUILD'
/usr/bin/cmake -E cmake_progress_start /usr/src/RPM/BUILD/kidletime-5.84.0/BUILD/CMakeFiles /usr/src/RPM/BUILD/kidletime-5.84.0/BUILD//CMakeFiles/progress.marks
make: Leaving directory '/usr/src/RPM/BUILD/kidletime-5.84.0/BUILD'
make -f CMakeFiles/Makefile2 all
make -f src/CMakeFiles/KF5IdleTime_autogen.dir/build.make src/CMakeFiles/KF5IdleTime_autogen.dir/depend
make[2]: Entering directory '/usr/src/RPM/BUILD/kidletime-5.84.0/BUILD'
cd /usr/src/RPM/BUILD/kidletime-5.84.0/BUILD && /usr/bin/cmake -E cmake_depends "Unix Makefiles" /usr/src/RPM/BUILD/kidletime-5.84.0 /usr/src/RPM/BUILD/kidletime-5.84.0/src /usr/src/RPM/BUILD/kidletime-5.84.0/BUILD /usr/src/RPM/BUILD/kidletime-5.84.0/BUILD/src /usr/src/RPM/BUILD/kidletime-5.84.0/BUILD/src/CMakeFiles/KF5IdleTime_autogen.dir/DependInfo.cmake --color=
make[2]: Leaving directory '/usr/src/RPM/BUILD/kidletime-5.84.0/BUILD'
make -f src/CMakeFiles/KF5IdleTime_autogen.dir/build.make src/CMakeFiles/KF5IdleTime_autogen.dir/build
make[2]: Entering directory '/usr/src/RPM/BUILD/kidletime-5.84.0/BUILD'
[ 4%] Automatic MOC for target KF5IdleTime
cd /usr/src/RPM/BUILD/kidletime-5.84.0/BUILD/src && /usr/bin/cmake -E cmake_autogen /usr/src/RPM/BUILD/kidletime-5.84.0/BUILD/src/CMakeFiles/KF5IdleTime_autogen.dir/AutogenInfo.json Release
make[2]: Leaving directory '/usr/src/RPM/BUILD/kidletime-5.84.0/BUILD'
make[1]: Entering directory '/usr/src/RPM/BUILD/kidletime-5.84.0/BUILD'
[ 4%] Built target KF5IdleTime_autogen
make[1]: Leaving directory '/usr/src/RPM/BUILD/kidletime-5.84.0/BUILD'
make -f src/CMakeFiles/KF5IdleTime.dir/build.make src/CMakeFiles/KF5IdleTime.dir/depend
make[2]: Entering directory '/usr/src/RPM/BUILD/kidletime-5.84.0/BUILD'
cd /usr/src/RPM/BUILD/kidletime-5.84.0/BUILD && /usr/bin/cmake -E cmake_depends "Unix Makefiles" /usr/src/RPM/BUILD/kidletime-5.84.0 /usr/src/RPM/BUILD/kidletime-5.84.0/src /usr/src/RPM/BUILD/kidletime-5.84.0/BUILD /usr/src/RPM/BUILD/kidletime-5.84.0/BUILD/src /usr/src/RPM/BUILD/kidletime-5.84.0/BUILD/src/CMakeFiles/KF5IdleTime.dir/DependInfo.cmake --color=
make[2]: Leaving directory '/usr/src/RPM/BUILD/kidletime-5.84.0/BUILD'
make -f src/CMakeFiles/KF5IdleTime.dir/build.make src/CMakeFiles/KF5IdleTime.dir/build
make[2]: Entering directory '/usr/src/RPM/BUILD/kidletime-5.84.0/BUILD'
[ 16%] Building CXX object src/CMakeFiles/KF5IdleTime.dir/abstractsystempoller.cpp.o
cd /usr/src/RPM/BUILD/kidletime-5.84.0/BUILD/src && /usr/bin/c++ -DKF5IdleTime_EXPORTS -DKF_DEPRECATED_WARNINGS_SINCE=0x060000 -DKIDLETIME_DEPRECATED_WARNINGS_SINCE=0x0 -DKIDLETIME_DISABLE_DEPRECATED_BEFORE_AND_AT=0x0 -DQT_CORE_LIB -DQT_DEPRECATED_WARNINGS_SINCE=0x060000 -DQT_DISABLE_DEPRECATED_BEFORE=0x050f00 -DQT_GUI_LIB -DQT_NO_CAST_FROM_ASCII -DQT_NO_CAST_FROM_BYTEARRAY -DQT_NO_CAST_TO_ASCII -DQT_NO_DEBUG -DQT_NO_FOREACH -DQT_NO_KEYWORDS -DQT_NO_NARROWING_CONVERSIONS_IN_CONNECT -DQT_NO_URL_CAST_FROM_STRING -DQT_STRICT_ITERATORS -DQT_USE_QSTRINGBUILDER -D_FILE_OFFSET_BITS=64 -D_GNU_SOURCE -D_LARGEFILE64_SOURCE -I/usr/src/RPM/BUILD/kidletime-5.84.0/BUILD/src -I/usr/src/RPM/BUILD/kidletime-5.84.0/src -I/usr/src/RPM/BUILD/kidletime-5.84.0/BUILD/src/KF5IdleTime_autogen/include -isystem /usr/include/qt5 -isystem /usr/include/qt5/QtCore -isystem /usr/share/qt5/../../lib/qt5/mkspecs/linux-g++ -isystem /usr/include/qt5/QtGui -pipe -frecord-gcc-switches -Wall -g -O2 -march=i586 -mtune=generic -fno-operator-names -fno-exceptions -Wall -Wextra -Wcast-align -Wchar-subscripts -Wformat-security -Wno-long-long -Wpointer-arith -Wundef -Wnon-virtual-dtor -Woverloaded-virtual -Werror=return-type -Wvla -Wdate-time -Wsuggest-override -Wlogical-op -pedantic -Wzero-as-null-pointer-constant -O2 -DNDEBUG -fPIC -fvisibility=hidden -fvisibility-inlines-hidden -fPIC -std=c++17 -MD -MT src/CMakeFiles/KF5IdleTime.dir/abstractsystempoller.cpp.o -MF CMakeFiles/KF5IdleTime.dir/abstractsystempoller.cpp.o.d -o CMakeFiles/KF5IdleTime.dir/abstractsystempoller.cpp.o -c /usr/src/RPM/BUILD/kidletime-5.84.0/src/abstractsystempoller.cpp
make[2]: Leaving directory '/usr/src/RPM/BUILD/kidletime-5.84.0/BUILD'
make[2]: Entering directory '/usr/src/RPM/BUILD/kidletime-5.84.0/BUILD'
[ 8%] Building CXX object src/CMakeFiles/KF5IdleTime.dir/KF5IdleTime_autogen/mocs_compilation.cpp.o
cd /usr/src/RPM/BUILD/kidletime-5.84.0/BUILD/src && /usr/bin/c++ -DKF5IdleTime_EXPORTS -DKF_DEPRECATED_WARNINGS_SINCE=0x060000 -DKIDLETIME_DEPRECATED_WARNINGS_SINCE=0x0 -DKIDLETIME_DISABLE_DEPRECATED_BEFORE_AND_AT=0x0 -DQT_CORE_LIB -DQT_DEPRECATED_WARNINGS_SINCE=0x060000 -DQT_DISABLE_DEPRECATED_BEFORE=0x050f00 -DQT_GUI_LIB -DQT_NO_CAST_FROM_ASCII -DQT_NO_CAST_FROM_BYTEARRAY -DQT_NO_CAST_TO_ASCII -DQT_NO_DEBUG -DQT_NO_FOREACH -DQT_NO_KEYWORDS -DQT_NO_NARROWING_CONVERSIONS_IN_CONNECT -DQT_NO_URL_CAST_FROM_STRING -DQT_STRICT_ITERATORS -DQT_USE_QSTRINGBUILDER -D_FILE_OFFSET_BITS=64 -D_GNU_SOURCE -D_LARGEFILE64_SOURCE -I/usr/src/RPM/BUILD/kidletime-5.84.0/BUILD/src -I/usr/src/RPM/BUILD/kidletime-5.84.0/src -I/usr/src/RPM/BUILD/kidletime-5.84.0/BUILD/src/KF5IdleTime_autogen/include -isystem /usr/include/qt5 -isystem /usr/include/qt5/QtCore -isystem /usr/share/qt5/../../lib/qt5/mkspecs/linux-g++ -isystem /usr/include/qt5/QtGui -pipe -frecord-gcc-switches -Wall -g -O2 -march=i586 -mtune=generic -fno-operator-names -fno-exceptions -Wall -Wextra -Wcast-align -Wchar-subscripts -Wformat-security -Wno-long-long -Wpointer-arith -Wundef -Wnon-virtual-dtor -Woverloaded-virtual -Werror=return-type -Wvla -Wdate-time -Wsuggest-override -Wlogical-op -pedantic -Wzero-as-null-pointer-constant -O2 -DNDEBUG -fPIC -fvisibility=hidden -fvisibility-inlines-hidden -fPIC -std=c++17 -MD -MT src/CMakeFiles/KF5IdleTime.dir/KF5IdleTime_autogen/mocs_compilation.cpp.o -MF CMakeFiles/KF5IdleTime.dir/KF5IdleTime_autogen/mocs_compilation.cpp.o.d -o CMakeFiles/KF5IdleTime.dir/KF5IdleTime_autogen/mocs_compilation.cpp.o -c /usr/src/RPM/BUILD/kidletime-5.84.0/BUILD/src/KF5IdleTime_autogen/mocs_compilation.cpp
make[2]: Leaving directory '/usr/src/RPM/BUILD/kidletime-5.84.0/BUILD'
make[2]: Entering directory '/usr/src/RPM/BUILD/kidletime-5.84.0/BUILD'
[ 24%] Building CXX object src/CMakeFiles/KF5IdleTime.dir/logging.cpp.o
cd /usr/src/RPM/BUILD/kidletime-5.84.0/BUILD/src && /usr/bin/c++ -DKF5IdleTime_EXPORTS -DKF_DEPRECATED_WARNINGS_SINCE=0x060000 -DKIDLETIME_DEPRECATED_WARNINGS_SINCE=0x0 -DKIDLETIME_DISABLE_DEPRECATED_BEFORE_AND_AT=0x0 -DQT_CORE_LIB -DQT_DEPRECATED_WARNINGS_SINCE=0x060000 -DQT_DISABLE_DEPRECATED_BEFORE=0x050f00 -DQT_GUI_LIB -DQT_NO_CAST_FROM_ASCII -DQT_NO_CAST_FROM_BYTEARRAY -DQT_NO_CAST_TO_ASCII -DQT_NO_DEBUG -DQT_NO_FOREACH -DQT_NO_KEYWORDS -DQT_NO_NARROWING_CONVERSIONS_IN_CONNECT -DQT_NO_URL_CAST_FROM_STRING -DQT_STRICT_ITERATORS -DQT_USE_QSTRINGBUILDER -D_FILE_OFFSET_BITS=64 -D_GNU_SOURCE -D_LARGEFILE64_SOURCE -I/usr/src/RPM/BUILD/kidletime-5.84.0/BUILD/src -I/usr/src/RPM/BUILD/kidletime-5.84.0/src -I/usr/src/RPM/BUILD/kidletime-5.84.0/BUILD/src/KF5IdleTime_autogen/include -isystem /usr/include/qt5 -isystem /usr/include/qt5/QtCore -isystem /usr/share/qt5/../../lib/qt5/mkspecs/linux-g++ -isystem /usr/include/qt5/QtGui -pipe -frecord-gcc-switches -Wall -g -O2 -march=i586 -mtune=generic -fno-operator-names -fno-exceptions -Wall -Wextra -Wcast-align -Wchar-subscripts -Wformat-security -Wno-long-long -Wpointer-arith -Wundef -Wnon-virtual-dtor -Woverloaded-virtual -Werror=return-type -Wvla -Wdate-time -Wsuggest-override -Wlogical-op -pedantic -Wzero-as-null-pointer-constant -O2 -DNDEBUG -fPIC -fvisibility=hidden -fvisibility-inlines-hidden -fPIC -std=c++17 -MD -MT src/CMakeFiles/KF5IdleTime.dir/logging.cpp.o -MF CMakeFiles/KF5IdleTime.dir/logging.cpp.o.d -o CMakeFiles/KF5IdleTime.dir/logging.cpp.o -c /usr/src/RPM/BUILD/kidletime-5.84.0/BUILD/src/logging.cpp
make[2]: Leaving directory '/usr/src/RPM/BUILD/kidletime-5.84.0/BUILD'
make[2]: Entering directory '/usr/src/RPM/BUILD/kidletime-5.84.0/BUILD'
[ 20%] Building CXX object src/CMakeFiles/KF5IdleTime.dir/widgetbasedpoller.cpp.o
cd /usr/src/RPM/BUILD/kidletime-5.84.0/BUILD/src && /usr/bin/c++ -DKF5IdleTime_EXPORTS -DKF_DEPRECATED_WARNINGS_SINCE=0x060000 -DKIDLETIME_DEPRECATED_WARNINGS_SINCE=0x0 -DKIDLETIME_DISABLE_DEPRECATED_BEFORE_AND_AT=0x0 -DQT_CORE_LIB -DQT_DEPRECATED_WARNINGS_SINCE=0x060000 -DQT_DISABLE_DEPRECATED_BEFORE=0x050f00 -DQT_GUI_LIB -DQT_NO_CAST_FROM_ASCII -DQT_NO_CAST_FROM_BYTEARRAY -DQT_NO_CAST_TO_ASCII -DQT_NO_DEBUG -DQT_NO_FOREACH -DQT_NO_KEYWORDS -DQT_NO_NARROWING_CONVERSIONS_IN_CONNECT -DQT_NO_URL_CAST_FROM_STRING -DQT_STRICT_ITERATORS -DQT_USE_QSTRINGBUILDER -D_FILE_OFFSET_BITS=64 -D_GNU_SOURCE -D_LARGEFILE64_SOURCE -I/usr/src/RPM/BUILD/kidletime-5.84.0/BUILD/src -I/usr/src/RPM/BUILD/kidletime-5.84.0/src -I/usr/src/RPM/BUILD/kidletime-5.84.0/BUILD/src/KF5IdleTime_autogen/include -isystem /usr/include/qt5 -isystem /usr/include/qt5/QtCore -isystem /usr/share/qt5/../../lib/qt5/mkspecs/linux-g++ -isystem /usr/include/qt5/QtGui -pipe -frecord-gcc-switches -Wall -g -O2 -march=i586 -mtune=generic -fno-operator-names -fno-exceptions -Wall -Wextra -Wcast-align -Wchar-subscripts -Wformat-security -Wno-long-long -Wpointer-arith -Wundef -Wnon-virtual-dtor -Woverloaded-virtual -Werror=return-type -Wvla -Wdate-time -Wsuggest-override -Wlogical-op -pedantic -Wzero-as-null-pointer-constant -O2 -DNDEBUG -fPIC -fvisibility=hidden -fvisibility-inlines-hidden -fPIC -std=c++17 -MD -MT src/CMakeFiles/KF5IdleTime.dir/widgetbasedpoller.cpp.o -MF CMakeFiles/KF5IdleTime.dir/widgetbasedpoller.cpp.o.d -o CMakeFiles/KF5IdleTime.dir/widgetbasedpoller.cpp.o -c /usr/src/RPM/BUILD/kidletime-5.84.0/src/widgetbasedpoller.cpp
make[2]: Leaving directory '/usr/src/RPM/BUILD/kidletime-5.84.0/BUILD'
make[2]: Entering directory '/usr/src/RPM/BUILD/kidletime-5.84.0/BUILD'
[ 12%] Building CXX object src/CMakeFiles/KF5IdleTime.dir/kidletime.cpp.o
cd /usr/src/RPM/BUILD/kidletime-5.84.0/BUILD/src && /usr/bin/c++ -DKF5IdleTime_EXPORTS -DKF_DEPRECATED_WARNINGS_SINCE=0x060000 -DKIDLETIME_DEPRECATED_WARNINGS_SINCE=0x0 -DKIDLETIME_DISABLE_DEPRECATED_BEFORE_AND_AT=0x0 -DQT_CORE_LIB -DQT_DEPRECATED_WARNINGS_SINCE=0x060000 -DQT_DISABLE_DEPRECATED_BEFORE=0x050f00 -DQT_GUI_LIB -DQT_NO_CAST_FROM_ASCII -DQT_NO_CAST_FROM_BYTEARRAY -DQT_NO_CAST_TO_ASCII -DQT_NO_DEBUG -DQT_NO_FOREACH -DQT_NO_KEYWORDS -DQT_NO_NARROWING_CONVERSIONS_IN_CONNECT -DQT_NO_URL_CAST_FROM_STRING -DQT_STRICT_ITERATORS -DQT_USE_QSTRINGBUILDER -D_FILE_OFFSET_BITS=64 -D_GNU_SOURCE -D_LARGEFILE64_SOURCE -I/usr/src/RPM/BUILD/kidletime-5.84.0/BUILD/src -I/usr/src/RPM/BUILD/kidletime-5.84.0/src -I/usr/src/RPM/BUILD/kidletime-5.84.0/BUILD/src/KF5IdleTime_autogen/include -isystem /usr/include/qt5 -isystem /usr/include/qt5/QtCore -isystem /usr/share/qt5/../../lib/qt5/mkspecs/linux-g++ -isystem /usr/include/qt5/QtGui -pipe -frecord-gcc-switches -Wall -g -O2 -march=i586 -mtune=generic -fno-operator-names -fno-exceptions -Wall -Wextra -Wcast-align -Wchar-subscripts -Wformat-security -Wno-long-long -Wpointer-arith -Wundef -Wnon-virtual-dtor -Woverloaded-virtual -Werror=return-type -Wvla -Wdate-time -Wsuggest-override -Wlogical-op -pedantic -Wzero-as-null-pointer-constant -O2 -DNDEBUG -fPIC -fvisibility=hidden -fvisibility-inlines-hidden -fPIC -std=c++17 -MD -MT src/CMakeFiles/KF5IdleTime.dir/kidletime.cpp.o -MF CMakeFiles/KF5IdleTime.dir/kidletime.cpp.o.d -o CMakeFiles/KF5IdleTime.dir/kidletime.cpp.o -c /usr/src/RPM/BUILD/kidletime-5.84.0/src/kidletime.cpp
make[2]: Leaving directory '/usr/src/RPM/BUILD/kidletime-5.84.0/BUILD'
make[2]: Entering directory '/usr/src/RPM/BUILD/kidletime-5.84.0/BUILD'
[ 28%] Linking CXX shared library ../bin/libKF5IdleTime.so
cd /usr/src/RPM/BUILD/kidletime-5.84.0/BUILD/src && /usr/bin/cmake -E cmake_link_script CMakeFiles/KF5IdleTime.dir/link.txt --verbose=1
/usr/bin/c++ -fPIC -pipe -frecord-gcc-switches -Wall -g -O2 -march=i586 -mtune=generic -fno-operator-names -fno-exceptions -Wall -Wextra -Wcast-align -Wchar-subscripts -Wformat-security -Wno-long-long -Wpointer-arith -Wundef -Wnon-virtual-dtor -Woverloaded-virtual -Werror=return-type -Wvla -Wdate-time -Wsuggest-override -Wlogical-op -pedantic -Wzero-as-null-pointer-constant -O2 -DNDEBUG -Wl,--no-undefined -Wl,--fatal-warnings -Wl,--enable-new-dtags -L/usr/lib -L/usr/lib/kf5/devel -shared -Wl,-soname,libKF5IdleTime.so.5 -o ../bin/libKF5IdleTime.so.5.84.0 CMakeFiles/KF5IdleTime.dir/KF5IdleTime_autogen/mocs_compilation.cpp.o CMakeFiles/KF5IdleTime.dir/kidletime.cpp.o CMakeFiles/KF5IdleTime.dir/abstractsystempoller.cpp.o CMakeFiles/KF5IdleTime.dir/widgetbasedpoller.cpp.o CMakeFiles/KF5IdleTime.dir/logging.cpp.o /usr/lib/libQt5Gui.so.5.15.2 /usr/lib/libQt5Core.so.5.15.2
cd /usr/src/RPM/BUILD/kidletime-5.84.0/BUILD/src && /usr/bin/cmake -E cmake_symlink_library ../bin/libKF5IdleTime.so.5.84.0 ../bin/libKF5IdleTime.so.5 ../bin/libKF5IdleTime.so
make[2]: Leaving directory '/usr/src/RPM/BUILD/kidletime-5.84.0/BUILD'
make[1]: Entering directory '/usr/src/RPM/BUILD/kidletime-5.84.0/BUILD'
[ 28%] Built target KF5IdleTime
make[1]: Leaving directory '/usr/src/RPM/BUILD/kidletime-5.84.0/BUILD'
make -f src/plugins/xscreensaver/CMakeFiles/KF5IdleTimeXcbPlugin1_autogen.dir/build.make src/plugins/xscreensaver/CMakeFiles/KF5IdleTimeXcbPlugin1_autogen.dir/depend
make -f src/plugins/xsync/CMakeFiles/KF5IdleTimeXcbPlugin0_autogen.dir/build.make src/plugins/xsync/CMakeFiles/KF5IdleTimeXcbPlugin0_autogen.dir/depend
make -f examples/CMakeFiles/kidletime_example_autogen.dir/build.make examples/CMakeFiles/kidletime_example_autogen.dir/depend
make[2]: Entering directory '/usr/src/RPM/BUILD/kidletime-5.84.0/BUILD'
cd /usr/src/RPM/BUILD/kidletime-5.84.0/BUILD && /usr/bin/cmake -E cmake_depends "Unix Makefiles" /usr/src/RPM/BUILD/kidletime-5.84.0 /usr/src/RPM/BUILD/kidletime-5.84.0/src/plugins/xscreensaver /usr/src/RPM/BUILD/kidletime-5.84.0/BUILD /usr/src/RPM/BUILD/kidletime-5.84.0/BUILD/src/plugins/xscreensaver /usr/src/RPM/BUILD/kidletime-5.84.0/BUILD/src/plugins/xscreensaver/CMakeFiles/KF5IdleTimeXcbPlugin1_autogen.dir/DependInfo.cmake --color=
make[2]: Leaving directory '/usr/src/RPM/BUILD/kidletime-5.84.0/BUILD'
make -f src/plugins/xscreensaver/CMakeFiles/KF5IdleTimeXcbPlugin1_autogen.dir/build.make src/plugins/xscreensaver/CMakeFiles/KF5IdleTimeXcbPlugin1_autogen.dir/build
make[2]: Entering directory '/usr/src/RPM/BUILD/kidletime-5.84.0/BUILD'
cd /usr/src/RPM/BUILD/kidletime-5.84.0/BUILD && /usr/bin/cmake -E cmake_depends "Unix Makefiles" /usr/src/RPM/BUILD/kidletime-5.84.0 /usr/src/RPM/BUILD/kidletime-5.84.0/examples /usr/src/RPM/BUILD/kidletime-5.84.0/BUILD /usr/src/RPM/BUILD/kidletime-5.84.0/BUILD/examples /usr/src/RPM/BUILD/kidletime-5.84.0/BUILD/examples/CMakeFiles/kidletime_example_autogen.dir/DependInfo.cmake --color=
make[2]: Leaving directory '/usr/src/RPM/BUILD/kidletime-5.84.0/BUILD'
make -f examples/CMakeFiles/kidletime_example_autogen.dir/build.make examples/CMakeFiles/kidletime_example_autogen.dir/build
make[2]: Entering directory '/usr/src/RPM/BUILD/kidletime-5.84.0/BUILD'
cd /usr/src/RPM/BUILD/kidletime-5.84.0/BUILD && /usr/bin/cmake -E cmake_depends "Unix Makefiles" /usr/src/RPM/BUILD/kidletime-5.84.0 /usr/src/RPM/BUILD/kidletime-5.84.0/src/plugins/xsync /usr/src/RPM/BUILD/kidletime-5.84.0/BUILD /usr/src/RPM/BUILD/kidletime-5.84.0/BUILD/src/plugins/xsync /usr/src/RPM/BUILD/kidletime-5.84.0/BUILD/src/plugins/xsync/CMakeFiles/KF5IdleTimeXcbPlugin0_autogen.dir/DependInfo.cmake --color=
make[2]: Leaving directory '/usr/src/RPM/BUILD/kidletime-5.84.0/BUILD'
make -f src/plugins/xsync/CMakeFiles/KF5IdleTimeXcbPlugin0_autogen.dir/build.make src/plugins/xsync/CMakeFiles/KF5IdleTimeXcbPlugin0_autogen.dir/build
make[2]: Entering directory '/usr/src/RPM/BUILD/kidletime-5.84.0/BUILD'
[ 36%] Automatic MOC for target kidletime_example
cd /usr/src/RPM/BUILD/kidletime-5.84.0/BUILD/examples && /usr/bin/cmake -E cmake_autogen /usr/src/RPM/BUILD/kidletime-5.84.0/BUILD/examples/CMakeFiles/kidletime_example_autogen.dir/AutogenInfo.json Release
make[2]: Leaving directory '/usr/src/RPM/BUILD/kidletime-5.84.0/BUILD'
make[2]: Entering directory '/usr/src/RPM/BUILD/kidletime-5.84.0/BUILD'
[ 32%] Automatic MOC for target KF5IdleTimeXcbPlugin1
cd /usr/src/RPM/BUILD/kidletime-5.84.0/BUILD/src/plugins/xscreensaver && /usr/bin/cmake -E cmake_autogen /usr/src/RPM/BUILD/kidletime-5.84.0/BUILD/src/plugins/xscreensaver/CMakeFiles/KF5IdleTimeXcbPlugin1_autogen.dir/AutogenInfo.json Release
make[2]: Leaving directory '/usr/src/RPM/BUILD/kidletime-5.84.0/BUILD'
make[1]: Entering directory '/usr/src/RPM/BUILD/kidletime-5.84.0/BUILD'
[ 40%] Built target kidletime_example_autogen
make[1]: Leaving directory '/usr/src/RPM/BUILD/kidletime-5.84.0/BUILD'
make -f examples/CMakeFiles/kidletime_example.dir/build.make examples/CMakeFiles/kidletime_example.dir/depend
make[1]: Entering directory '/usr/src/RPM/BUILD/kidletime-5.84.0/BUILD'
[ 40%] Built target KF5IdleTimeXcbPlugin1_autogen
make[1]: Leaving directory '/usr/src/RPM/BUILD/kidletime-5.84.0/BUILD'
make -f src/plugins/xscreensaver/CMakeFiles/KF5IdleTimeXcbPlugin1.dir/build.make src/plugins/xscreensaver/CMakeFiles/KF5IdleTimeXcbPlugin1.dir/depend
make[2]: Entering directory '/usr/src/RPM/BUILD/kidletime-5.84.0/BUILD'
cd /usr/src/RPM/BUILD/kidletime-5.84.0/BUILD && /usr/bin/cmake -E cmake_depends "Unix Makefiles" /usr/src/RPM/BUILD/kidletime-5.84.0 /usr/src/RPM/BUILD/kidletime-5.84.0/examples /usr/src/RPM/BUILD/kidletime-5.84.0/BUILD /usr/src/RPM/BUILD/kidletime-5.84.0/BUILD/examples /usr/src/RPM/BUILD/kidletime-5.84.0/BUILD/examples/CMakeFiles/kidletime_example.dir/DependInfo.cmake --color=
make[2]: Leaving directory '/usr/src/RPM/BUILD/kidletime-5.84.0/BUILD'
make -f examples/CMakeFiles/kidletime_example.dir/build.make examples/CMakeFiles/kidletime_example.dir/build
make[2]: Entering directory '/usr/src/RPM/BUILD/kidletime-5.84.0/BUILD'
[ 40%] Automatic MOC for target KF5IdleTimeXcbPlugin0
cd /usr/src/RPM/BUILD/kidletime-5.84.0/BUILD/src/plugins/xsync && /usr/bin/cmake -E cmake_autogen /usr/src/RPM/BUILD/kidletime-5.84.0/BUILD/src/plugins/xsync/CMakeFiles/KF5IdleTimeXcbPlugin0_autogen.dir/AutogenInfo.json Release
make[2]: Leaving directory '/usr/src/RPM/BUILD/kidletime-5.84.0/BUILD'
make[2]: Entering directory '/usr/src/RPM/BUILD/kidletime-5.84.0/BUILD'
[ 44%] Generating screensaver_interface.cpp, screensaver_interface.h
cd /usr/src/RPM/BUILD/kidletime-5.84.0/BUILD/src/plugins/xscreensaver && /usr/share/qt5/bin/qdbusxml2cpp -m -p screensaver_interface /usr/src/RPM/BUILD/kidletime-5.84.0/src/plugins/xscreensaver/org.freedesktop.ScreenSaver.xml
make[2]: Leaving directory '/usr/src/RPM/BUILD/kidletime-5.84.0/BUILD'
make[1]: Entering directory '/usr/src/RPM/BUILD/kidletime-5.84.0/BUILD'
[ 56%] Built target KF5IdleTimeXcbPlugin0_autogen
make[1]: Leaving directory '/usr/src/RPM/BUILD/kidletime-5.84.0/BUILD'
make -f src/plugins/xsync/CMakeFiles/KF5IdleTimeXcbPlugin0.dir/build.make src/plugins/xsync/CMakeFiles/KF5IdleTimeXcbPlugin0.dir/depend
make[2]: Entering directory '/usr/src/RPM/BUILD/kidletime-5.84.0/BUILD'
cd /usr/src/RPM/BUILD/kidletime-5.84.0/BUILD && /usr/bin/cmake -E cmake_depends "Unix Makefiles" /usr/src/RPM/BUILD/kidletime-5.84.0 /usr/src/RPM/BUILD/kidletime-5.84.0/src/plugins/xsync /usr/src/RPM/BUILD/kidletime-5.84.0/BUILD /usr/src/RPM/BUILD/kidletime-5.84.0/BUILD/src/plugins/xsync /usr/src/RPM/BUILD/kidletime-5.84.0/BUILD/src/plugins/xsync/CMakeFiles/KF5IdleTimeXcbPlugin0.dir/DependInfo.cmake --color=
make[2]: Leaving directory '/usr/src/RPM/BUILD/kidletime-5.84.0/BUILD'
make -f src/plugins/xsync/CMakeFiles/KF5IdleTimeXcbPlugin0.dir/build.make src/plugins/xsync/CMakeFiles/KF5IdleTimeXcbPlugin0.dir/build
make[2]: Entering directory '/usr/src/RPM/BUILD/kidletime-5.84.0/BUILD'
[ 60%] Generating screensaver_interface.moc
cd /usr/src/RPM/BUILD/kidletime-5.84.0/BUILD/src/plugins/xscreensaver && /usr/share/qt5/bin/moc @/usr/src/RPM/BUILD/kidletime-5.84.0/BUILD/src/plugins/xscreensaver/screensaver_interface.moc_parameters
make[2]: Leaving directory '/usr/src/RPM/BUILD/kidletime-5.84.0/BUILD'
make[2]: Entering directory '/usr/src/RPM/BUILD/kidletime-5.84.0/BUILD'
cd /usr/src/RPM/BUILD/kidletime-5.84.0/BUILD && /usr/bin/cmake -E cmake_depends "Unix Makefiles" /usr/src/RPM/BUILD/kidletime-5.84.0 /usr/src/RPM/BUILD/kidletime-5.84.0/src/plugins/xscreensaver /usr/src/RPM/BUILD/kidletime-5.84.0/BUILD /usr/src/RPM/BUILD/kidletime-5.84.0/BUILD/src/plugins/xscreensaver /usr/src/RPM/BUILD/kidletime-5.84.0/BUILD/src/plugins/xscreensaver/CMakeFiles/KF5IdleTimeXcbPlugin1.dir/DependInfo.cmake --color=
make[2]: Leaving directory '/usr/src/RPM/BUILD/kidletime-5.84.0/BUILD'
make -f src/plugins/xscreensaver/CMakeFiles/KF5IdleTimeXcbPlugin1.dir/build.make src/plugins/xscreensaver/CMakeFiles/KF5IdleTimeXcbPlugin1.dir/build
make[2]: Entering directory '/usr/src/RPM/BUILD/kidletime-5.84.0/BUILD'
[ 52%] Building CXX object examples/CMakeFiles/kidletime_example.dir/main.cpp.o
cd /usr/src/RPM/BUILD/kidletime-5.84.0/BUILD/examples && /usr/bin/c++ -DKF_DEPRECATED_WARNINGS_SINCE=0x060000 -DKIDLETIME_DEPRECATED_WARNINGS_SINCE=0x0 -DKIDLETIME_DISABLE_DEPRECATED_BEFORE_AND_AT=0x0 -DQT_CORE_LIB -DQT_DEPRECATED_WARNINGS_SINCE=0x060000 -DQT_DISABLE_DEPRECATED_BEFORE=0x050f00 -DQT_GUI_LIB -DQT_NO_CAST_FROM_ASCII -DQT_NO_CAST_FROM_BYTEARRAY -DQT_NO_CAST_TO_ASCII -DQT_NO_DEBUG -DQT_NO_FOREACH -DQT_NO_KEYWORDS -DQT_NO_NARROWING_CONVERSIONS_IN_CONNECT -DQT_NO_URL_CAST_FROM_STRING -DQT_STRICT_ITERATORS -DQT_USE_QSTRINGBUILDER -D_FILE_OFFSET_BITS=64 -D_GNU_SOURCE -D_LARGEFILE64_SOURCE -I/usr/src/RPM/BUILD/kidletime-5.84.0/BUILD/examples -I/usr/src/RPM/BUILD/kidletime-5.84.0/examples -I/usr/src/RPM/BUILD/kidletime-5.84.0/BUILD/examples/kidletime_example_autogen/include -I/usr/src/RPM/BUILD/kidletime-5.84.0/BUILD/src -I/usr/src/RPM/BUILD/kidletime-5.84.0/src -isystem /usr/include/qt5 -isystem /usr/include/qt5/QtCore -isystem /usr/share/qt5/../../lib/qt5/mkspecs/linux-g++ -isystem /usr/include/qt5/QtGui -pipe -frecord-gcc-switches -Wall -g -O2 -march=i586 -mtune=generic -fno-operator-names -fno-exceptions -Wall -Wextra -Wcast-align -Wchar-subscripts -Wformat-security -Wno-long-long -Wpointer-arith -Wundef -Wnon-virtual-dtor -Woverloaded-virtual -Werror=return-type -Wvla -Wdate-time -Wsuggest-override -Wlogical-op -pedantic -Wzero-as-null-pointer-constant -O2 -DNDEBUG -fvisibility=hidden -fvisibility-inlines-hidden -fPIC -std=c++17 -MD -MT examples/CMakeFiles/kidletime_example.dir/main.cpp.o -MF CMakeFiles/kidletime_example.dir/main.cpp.o.d -o CMakeFiles/kidletime_example.dir/main.cpp.o -c /usr/src/RPM/BUILD/kidletime-5.84.0/examples/main.cpp
make[2]: Leaving directory '/usr/src/RPM/BUILD/kidletime-5.84.0/BUILD'
make[2]: Entering directory '/usr/src/RPM/BUILD/kidletime-5.84.0/BUILD'
[ 72%] Building CXX object src/plugins/xsync/CMakeFiles/KF5IdleTimeXcbPlugin0.dir/__/__/logging.cpp.o
cd /usr/src/RPM/BUILD/kidletime-5.84.0/BUILD/src/plugins/xsync && /usr/bin/c++ -DKF5IdleTimeXcbPlugin0_EXPORTS -DKF_DEPRECATED_WARNINGS_SINCE=0x060000 -DKIDLETIME_DEPRECATED_WARNINGS_SINCE=0x0 -DKIDLETIME_DISABLE_DEPRECATED_BEFORE_AND_AT=0x0 -DQT_CORE_LIB -DQT_DEPRECATED_WARNINGS_SINCE=0x060000 -DQT_DISABLE_DEPRECATED_BEFORE=0x050f00 -DQT_GUI_LIB -DQT_NO_CAST_FROM_ASCII -DQT_NO_CAST_FROM_BYTEARRAY -DQT_NO_CAST_TO_ASCII -DQT_NO_DEBUG -DQT_NO_FOREACH -DQT_NO_KEYWORDS -DQT_NO_NARROWING_CONVERSIONS_IN_CONNECT -DQT_NO_URL_CAST_FROM_STRING -DQT_STRICT_ITERATORS -DQT_USE_QSTRINGBUILDER -DQT_X11EXTRAS_LIB -D_FILE_OFFSET_BITS=64 -D_GNU_SOURCE -D_LARGEFILE64_SOURCE -I/usr/src/RPM/BUILD/kidletime-5.84.0/BUILD/src/plugins/xsync -I/usr/src/RPM/BUILD/kidletime-5.84.0/src/plugins/xsync -I/usr/src/RPM/BUILD/kidletime-5.84.0/BUILD/src/plugins/xsync/KF5IdleTimeXcbPlugin0_autogen/include -I/usr/src/RPM/BUILD/kidletime-5.84.0/BUILD/src -I/usr/src/RPM/BUILD/kidletime-5.84.0/src -isystem /usr/include/qt5 -isystem /usr/include/qt5/QtCore -isystem /usr/share/qt5/../../lib/qt5/mkspecs/linux-g++ -isystem /usr/include/qt5/QtX11Extras -isystem /usr/include/qt5/QtGui -pipe -frecord-gcc-switches -Wall -g -O2 -march=i586 -mtune=generic -fno-operator-names -fno-exceptions -Wall -Wextra -Wcast-align -Wchar-subscripts -Wformat-security -Wno-long-long -Wpointer-arith -Wundef -Wnon-virtual-dtor -Woverloaded-virtual -Werror=return-type -Wvla -Wdate-time -Wsuggest-override -Wlogical-op -pedantic -Wzero-as-null-pointer-constant -O2 -DNDEBUG -fPIC -fvisibility=hidden -fvisibility-inlines-hidden -fPIC -std=c++17 -MD -MT src/plugins/xsync/CMakeFiles/KF5IdleTimeXcbPlugin0.dir/__/__/logging.cpp.o -MF CMakeFiles/KF5IdleTimeXcbPlugin0.dir/__/__/logging.cpp.o.d -o CMakeFiles/KF5IdleTimeXcbPlugin0.dir/__/__/logging.cpp.o -c /usr/src/RPM/BUILD/kidletime-5.84.0/BUILD/src/logging.cpp
make[2]: Leaving directory '/usr/src/RPM/BUILD/kidletime-5.84.0/BUILD'
make[2]: Entering directory '/usr/src/RPM/BUILD/kidletime-5.84.0/BUILD'
[ 52%] Building CXX object examples/CMakeFiles/kidletime_example.dir/kidletime_example_autogen/mocs_compilation.cpp.o
cd /usr/src/RPM/BUILD/kidletime-5.84.0/BUILD/examples && /usr/bin/c++ -DKF_DEPRECATED_WARNINGS_SINCE=0x060000 -DKIDLETIME_DEPRECATED_WARNINGS_SINCE=0x0 -DKIDLETIME_DISABLE_DEPRECATED_BEFORE_AND_AT=0x0 -DQT_CORE_LIB -DQT_DEPRECATED_WARNINGS_SINCE=0x060000 -DQT_DISABLE_DEPRECATED_BEFORE=0x050f00 -DQT_GUI_LIB -DQT_NO_CAST_FROM_ASCII -DQT_NO_CAST_FROM_BYTEARRAY -DQT_NO_CAST_TO_ASCII -DQT_NO_DEBUG -DQT_NO_FOREACH -DQT_NO_KEYWORDS -DQT_NO_NARROWING_CONVERSIONS_IN_CONNECT -DQT_NO_URL_CAST_FROM_STRING -DQT_STRICT_ITERATORS -DQT_USE_QSTRINGBUILDER -D_FILE_OFFSET_BITS=64 -D_GNU_SOURCE -D_LARGEFILE64_SOURCE -I/usr/src/RPM/BUILD/kidletime-5.84.0/BUILD/examples -I/usr/src/RPM/BUILD/kidletime-5.84.0/examples -I/usr/src/RPM/BUILD/kidletime-5.84.0/BUILD/examples/kidletime_example_autogen/include -I/usr/src/RPM/BUILD/kidletime-5.84.0/BUILD/src -I/usr/src/RPM/BUILD/kidletime-5.84.0/src -isystem /usr/include/qt5 -isystem /usr/include/qt5/QtCore -isystem /usr/share/qt5/../../lib/qt5/mkspecs/linux-g++ -isystem /usr/include/qt5/QtGui -pipe -frecord-gcc-switches -Wall -g -O2 -march=i586 -mtune=generic -fno-operator-names -fno-exceptions -Wall -Wextra -Wcast-align -Wchar-subscripts -Wformat-security -Wno-long-long -Wpointer-arith -Wundef -Wnon-virtual-dtor -Woverloaded-virtual -Werror=return-type -Wvla -Wdate-time -Wsuggest-override -Wlogical-op -pedantic -Wzero-as-null-pointer-constant -O2 -DNDEBUG -fvisibility=hidden -fvisibility-inlines-hidden -fPIC -std=c++17 -MD -MT examples/CMakeFiles/kidletime_example.dir/kidletime_example_autogen/mocs_compilation.cpp.o -MF CMakeFiles/kidletime_example.dir/kidletime_example_autogen/mocs_compilation.cpp.o.d -o CMakeFiles/kidletime_example.dir/kidletime_example_autogen/mocs_compilation.cpp.o -c /usr/src/RPM/BUILD/kidletime-5.84.0/BUILD/examples/kidletime_example_autogen/mocs_compilation.cpp
make[2]: Leaving directory '/usr/src/RPM/BUILD/kidletime-5.84.0/BUILD'
make[2]: Entering directory '/usr/src/RPM/BUILD/kidletime-5.84.0/BUILD'
[ 56%] Building CXX object examples/CMakeFiles/kidletime_example.dir/KIdleTest.cpp.o
cd /usr/src/RPM/BUILD/kidletime-5.84.0/BUILD/examples && /usr/bin/c++ -DKF_DEPRECATED_WARNINGS_SINCE=0x060000 -DKIDLETIME_DEPRECATED_WARNINGS_SINCE=0x0 -DKIDLETIME_DISABLE_DEPRECATED_BEFORE_AND_AT=0x0 -DQT_CORE_LIB -DQT_DEPRECATED_WARNINGS_SINCE=0x060000 -DQT_DISABLE_DEPRECATED_BEFORE=0x050f00 -DQT_GUI_LIB -DQT_NO_CAST_FROM_ASCII -DQT_NO_CAST_FROM_BYTEARRAY -DQT_NO_CAST_TO_ASCII -DQT_NO_DEBUG -DQT_NO_FOREACH -DQT_NO_KEYWORDS -DQT_NO_NARROWING_CONVERSIONS_IN_CONNECT -DQT_NO_URL_CAST_FROM_STRING -DQT_STRICT_ITERATORS -DQT_USE_QSTRINGBUILDER -D_FILE_OFFSET_BITS=64 -D_GNU_SOURCE -D_LARGEFILE64_SOURCE -I/usr/src/RPM/BUILD/kidletime-5.84.0/BUILD/examples -I/usr/src/RPM/BUILD/kidletime-5.84.0/examples -I/usr/src/RPM/BUILD/kidletime-5.84.0/BUILD/examples/kidletime_example_autogen/include -I/usr/src/RPM/BUILD/kidletime-5.84.0/BUILD/src -I/usr/src/RPM/BUILD/kidletime-5.84.0/src -isystem /usr/include/qt5 -isystem /usr/include/qt5/QtCore -isystem /usr/share/qt5/../../lib/qt5/mkspecs/linux-g++ -isystem /usr/include/qt5/QtGui -pipe -frecord-gcc-switches -Wall -g -O2 -march=i586 -mtune=generic -fno-operator-names -fno-exceptions -Wall -Wextra -Wcast-align -Wchar-subscripts -Wformat-security -Wno-long-long -Wpointer-arith -Wundef -Wnon-virtual-dtor -Woverloaded-virtual -Werror=return-type -Wvla -Wdate-time -Wsuggest-override -Wlogical-op -pedantic -Wzero-as-null-pointer-constant -O2 -DNDEBUG -fvisibility=hidden -fvisibility-inlines-hidden -fPIC -std=c++17 -MD -MT examples/CMakeFiles/kidletime_example.dir/KIdleTest.cpp.o -MF CMakeFiles/kidletime_example.dir/KIdleTest.cpp.o.d -o CMakeFiles/kidletime_example.dir/KIdleTest.cpp.o -c /usr/src/RPM/BUILD/kidletime-5.84.0/examples/KIdleTest.cpp
make[2]: Leaving directory '/usr/src/RPM/BUILD/kidletime-5.84.0/BUILD'
make[2]: Entering directory '/usr/src/RPM/BUILD/kidletime-5.84.0/BUILD'
[ 76%] Building CXX object src/plugins/xsync/CMakeFiles/KF5IdleTimeXcbPlugin0.dir/xsync_logging.cpp.o
cd /usr/src/RPM/BUILD/kidletime-5.84.0/BUILD/src/plugins/xsync && /usr/bin/c++ -DKF5IdleTimeXcbPlugin0_EXPORTS -DKF_DEPRECATED_WARNINGS_SINCE=0x060000 -DKIDLETIME_DEPRECATED_WARNINGS_SINCE=0x0 -DKIDLETIME_DISABLE_DEPRECATED_BEFORE_AND_AT=0x0 -DQT_CORE_LIB -DQT_DEPRECATED_WARNINGS_SINCE=0x060000 -DQT_DISABLE_DEPRECATED_BEFORE=0x050f00 -DQT_GUI_LIB -DQT_NO_CAST_FROM_ASCII -DQT_NO_CAST_FROM_BYTEARRAY -DQT_NO_CAST_TO_ASCII -DQT_NO_DEBUG -DQT_NO_FOREACH -DQT_NO_KEYWORDS -DQT_NO_NARROWING_CONVERSIONS_IN_CONNECT -DQT_NO_URL_CAST_FROM_STRING -DQT_STRICT_ITERATORS -DQT_USE_QSTRINGBUILDER -DQT_X11EXTRAS_LIB -D_FILE_OFFSET_BITS=64 -D_GNU_SOURCE -D_LARGEFILE64_SOURCE -I/usr/src/RPM/BUILD/kidletime-5.84.0/BUILD/src/plugins/xsync -I/usr/src/RPM/BUILD/kidletime-5.84.0/src/plugins/xsync -I/usr/src/RPM/BUILD/kidletime-5.84.0/BUILD/src/plugins/xsync/KF5IdleTimeXcbPlugin0_autogen/include -I/usr/src/RPM/BUILD/kidletime-5.84.0/BUILD/src -I/usr/src/RPM/BUILD/kidletime-5.84.0/src -isystem /usr/include/qt5 -isystem /usr/include/qt5/QtCore -isystem /usr/share/qt5/../../lib/qt5/mkspecs/linux-g++ -isystem /usr/include/qt5/QtX11Extras -isystem /usr/include/qt5/QtGui -pipe -frecord-gcc-switches -Wall -g -O2 -march=i586 -mtune=generic -fno-operator-names -fno-exceptions -Wall -Wextra -Wcast-align -Wchar-subscripts -Wformat-security -Wno-long-long -Wpointer-arith -Wundef -Wnon-virtual-dtor -Woverloaded-virtual -Werror=return-type -Wvla -Wdate-time -Wsuggest-override -Wlogical-op -pedantic -Wzero-as-null-pointer-constant -O2 -DNDEBUG -fPIC -fvisibility=hidden -fvisibility-inlines-hidden -fPIC -std=c++17 -MD -MT src/plugins/xsync/CMakeFiles/KF5IdleTimeXcbPlugin0.dir/xsync_logging.cpp.o -MF CMakeFiles/KF5IdleTimeXcbPlugin0.dir/xsync_logging.cpp.o.d -o CMakeFiles/KF5IdleTimeXcbPlugin0.dir/xsync_logging.cpp.o -c /usr/src/RPM/BUILD/kidletime-5.84.0/BUILD/src/plugins/xsync/xsync_logging.cpp
make[2]: Leaving directory '/usr/src/RPM/BUILD/kidletime-5.84.0/BUILD'
make[2]: Entering directory '/usr/src/RPM/BUILD/kidletime-5.84.0/BUILD'
[ 92%] Linking CXX executable ../bin/kidletime_example
cd /usr/src/RPM/BUILD/kidletime-5.84.0/BUILD/examples && /usr/bin/cmake -E cmake_link_script CMakeFiles/kidletime_example.dir/link.txt --verbose=1
/usr/bin/c++ -pipe -frecord-gcc-switches -Wall -g -O2 -march=i586 -mtune=generic -fno-operator-names -fno-exceptions -Wall -Wextra -Wcast-align -Wchar-subscripts -Wformat-security -Wno-long-long -Wpointer-arith -Wundef -Wnon-virtual-dtor -Woverloaded-virtual -Werror=return-type -Wvla -Wdate-time -Wsuggest-override -Wlogical-op -pedantic -Wzero-as-null-pointer-constant -O2 -DNDEBUG -Wl,--enable-new-dtags -L/usr/lib -L/usr/lib/kf5/devel CMakeFiles/kidletime_example.dir/kidletime_example_autogen/mocs_compilation.cpp.o CMakeFiles/kidletime_example.dir/main.cpp.o CMakeFiles/kidletime_example.dir/KIdleTest.cpp.o -o ../bin/kidletime_example ../bin/libKF5IdleTime.so.5.84.0 /usr/lib/libQt5Gui.so.5.15.2 /usr/lib/libQt5Core.so.5.15.2
make[2]: Leaving directory '/usr/src/RPM/BUILD/kidletime-5.84.0/BUILD'
make[1]: Entering directory '/usr/src/RPM/BUILD/kidletime-5.84.0/BUILD'
[ 92%] Built target kidletime_example
make[1]: Leaving directory '/usr/src/RPM/BUILD/kidletime-5.84.0/BUILD'
make[2]: Entering directory '/usr/src/RPM/BUILD/kidletime-5.84.0/BUILD'
[ 64%] Building CXX object src/plugins/xsync/CMakeFiles/KF5IdleTimeXcbPlugin0.dir/xsyncbasedpoller.cpp.o
cd /usr/src/RPM/BUILD/kidletime-5.84.0/BUILD/src/plugins/xsync && /usr/bin/c++ -DKF5IdleTimeXcbPlugin0_EXPORTS -DKF_DEPRECATED_WARNINGS_SINCE=0x060000 -DKIDLETIME_DEPRECATED_WARNINGS_SINCE=0x0 -DKIDLETIME_DISABLE_DEPRECATED_BEFORE_AND_AT=0x0 -DQT_CORE_LIB -DQT_DEPRECATED_WARNINGS_SINCE=0x060000 -DQT_DISABLE_DEPRECATED_BEFORE=0x050f00 -DQT_GUI_LIB -DQT_NO_CAST_FROM_ASCII -DQT_NO_CAST_FROM_BYTEARRAY -DQT_NO_CAST_TO_ASCII -DQT_NO_DEBUG -DQT_NO_FOREACH -DQT_NO_KEYWORDS -DQT_NO_NARROWING_CONVERSIONS_IN_CONNECT -DQT_NO_URL_CAST_FROM_STRING -DQT_STRICT_ITERATORS -DQT_USE_QSTRINGBUILDER -DQT_X11EXTRAS_LIB -D_FILE_OFFSET_BITS=64 -D_GNU_SOURCE -D_LARGEFILE64_SOURCE -I/usr/src/RPM/BUILD/kidletime-5.84.0/BUILD/src/plugins/xsync -I/usr/src/RPM/BUILD/kidletime-5.84.0/src/plugins/xsync -I/usr/src/RPM/BUILD/kidletime-5.84.0/BUILD/src/plugins/xsync/KF5IdleTimeXcbPlugin0_autogen/include -I/usr/src/RPM/BUILD/kidletime-5.84.0/BUILD/src -I/usr/src/RPM/BUILD/kidletime-5.84.0/src -isystem /usr/include/qt5 -isystem /usr/include/qt5/QtCore -isystem /usr/share/qt5/../../lib/qt5/mkspecs/linux-g++ -isystem /usr/include/qt5/QtX11Extras -isystem /usr/include/qt5/QtGui -pipe -frecord-gcc-switches -Wall -g -O2 -march=i586 -mtune=generic -fno-operator-names -fno-exceptions -Wall -Wextra -Wcast-align -Wchar-subscripts -Wformat-security -Wno-long-long -Wpointer-arith -Wundef -Wnon-virtual-dtor -Woverloaded-virtual -Werror=return-type -Wvla -Wdate-time -Wsuggest-override -Wlogical-op -pedantic -Wzero-as-null-pointer-constant -O2 -DNDEBUG -fPIC -fvisibility=hidden -fvisibility-inlines-hidden -fPIC -std=c++17 -MD -MT src/plugins/xsync/CMakeFiles/KF5IdleTimeXcbPlugin0.dir/xsyncbasedpoller.cpp.o -MF CMakeFiles/KF5IdleTimeXcbPlugin0.dir/xsyncbasedpoller.cpp.o.d -o CMakeFiles/KF5IdleTimeXcbPlugin0.dir/xsyncbasedpoller.cpp.o -c /usr/src/RPM/BUILD/kidletime-5.84.0/src/plugins/xsync/xsyncbasedpoller.cpp
make[2]: Leaving directory '/usr/src/RPM/BUILD/kidletime-5.84.0/BUILD'
make[2]: Entering directory '/usr/src/RPM/BUILD/kidletime-5.84.0/BUILD'
[ 68%] Building CXX object src/plugins/xsync/CMakeFiles/KF5IdleTimeXcbPlugin0.dir/KF5IdleTimeXcbPlugin0_autogen/mocs_compilation.cpp.o
cd /usr/src/RPM/BUILD/kidletime-5.84.0/BUILD/src/plugins/xsync && /usr/bin/c++ -DKF5IdleTimeXcbPlugin0_EXPORTS -DKF_DEPRECATED_WARNINGS_SINCE=0x060000 -DKIDLETIME_DEPRECATED_WARNINGS_SINCE=0x0 -DKIDLETIME_DISABLE_DEPRECATED_BEFORE_AND_AT=0x0 -DQT_CORE_LIB -DQT_DEPRECATED_WARNINGS_SINCE=0x060000 -DQT_DISABLE_DEPRECATED_BEFORE=0x050f00 -DQT_GUI_LIB -DQT_NO_CAST_FROM_ASCII -DQT_NO_CAST_FROM_BYTEARRAY -DQT_NO_CAST_TO_ASCII -DQT_NO_DEBUG -DQT_NO_FOREACH -DQT_NO_KEYWORDS -DQT_NO_NARROWING_CONVERSIONS_IN_CONNECT -DQT_NO_URL_CAST_FROM_STRING -DQT_STRICT_ITERATORS -DQT_USE_QSTRINGBUILDER -DQT_X11EXTRAS_LIB -D_FILE_OFFSET_BITS=64 -D_GNU_SOURCE -D_LARGEFILE64_SOURCE -I/usr/src/RPM/BUILD/kidletime-5.84.0/BUILD/src/plugins/xsync -I/usr/src/RPM/BUILD/kidletime-5.84.0/src/plugins/xsync -I/usr/src/RPM/BUILD/kidletime-5.84.0/BUILD/src/plugins/xsync/KF5IdleTimeXcbPlugin0_autogen/include -I/usr/src/RPM/BUILD/kidletime-5.84.0/BUILD/src -I/usr/src/RPM/BUILD/kidletime-5.84.0/src -isystem /usr/include/qt5 -isystem /usr/include/qt5/QtCore -isystem /usr/share/qt5/../../lib/qt5/mkspecs/linux-g++ -isystem /usr/include/qt5/QtX11Extras -isystem /usr/include/qt5/QtGui -pipe -frecord-gcc-switches -Wall -g -O2 -march=i586 -mtune=generic -fno-operator-names -fno-exceptions -Wall -Wextra -Wcast-align -Wchar-subscripts -Wformat-security -Wno-long-long -Wpointer-arith -Wundef -Wnon-virtual-dtor -Woverloaded-virtual -Werror=return-type -Wvla -Wdate-time -Wsuggest-override -Wlogical-op -pedantic -Wzero-as-null-pointer-constant -O2 -DNDEBUG -fPIC -fvisibility=hidden -fvisibility-inlines-hidden -fPIC -std=c++17 -MD -MT src/plugins/xsync/CMakeFiles/KF5IdleTimeXcbPlugin0.dir/KF5IdleTimeXcbPlugin0_autogen/mocs_compilation.cpp.o -MF CMakeFiles/KF5IdleTimeXcbPlugin0.dir/KF5IdleTimeXcbPlugin0_autogen/mocs_compilation.cpp.o.d -o CMakeFiles/KF5IdleTimeXcbPlugin0.dir/KF5IdleTimeXcbPlugin0_autogen/mocs_compilation.cpp.o -c /usr/src/RPM/BUILD/kidletime-5.84.0/BUILD/src/plugins/xsync/KF5IdleTimeXcbPlugin0_autogen/mocs_compilation.cpp
make[2]: Leaving directory '/usr/src/RPM/BUILD/kidletime-5.84.0/BUILD'
make[2]: Entering directory '/usr/src/RPM/BUILD/kidletime-5.84.0/BUILD'
[ 96%] Linking CXX shared module ../../../bin/KF5IdleTimeXcbPlugin0.so
cd /usr/src/RPM/BUILD/kidletime-5.84.0/BUILD/src/plugins/xsync && /usr/bin/cmake -E cmake_link_script CMakeFiles/KF5IdleTimeXcbPlugin0.dir/link.txt --verbose=1
/usr/bin/c++ -fPIC -pipe -frecord-gcc-switches -Wall -g -O2 -march=i586 -mtune=generic -fno-operator-names -fno-exceptions -Wall -Wextra -Wcast-align -Wchar-subscripts -Wformat-security -Wno-long-long -Wpointer-arith -Wundef -Wnon-virtual-dtor -Woverloaded-virtual -Werror=return-type -Wvla -Wdate-time -Wsuggest-override -Wlogical-op -pedantic -Wzero-as-null-pointer-constant -O2 -DNDEBUG -Wl,--no-undefined -Wl,--fatal-warnings -Wl,--enable-new-dtags -L/usr/lib -L/usr/lib/kf5/devel -shared -o ../../../bin/KF5IdleTimeXcbPlugin0.so CMakeFiles/KF5IdleTimeXcbPlugin0.dir/KF5IdleTimeXcbPlugin0_autogen/mocs_compilation.cpp.o CMakeFiles/KF5IdleTimeXcbPlugin0.dir/xsyncbasedpoller.cpp.o CMakeFiles/KF5IdleTimeXcbPlugin0.dir/__/__/logging.cpp.o CMakeFiles/KF5IdleTimeXcbPlugin0.dir/xsync_logging.cpp.o ../../../bin/libKF5IdleTime.so.5.84.0 /usr/lib/libQt5X11Extras.so.5.15.2 /usr/lib/libxcb.so /usr/lib/libxcb-sync.so /usr/lib/libX11-xcb.so /usr/lib/libSM.so /usr/lib/libICE.so /usr/lib/libX11.so /usr/lib/libXext.so /usr/lib/libXext.so /usr/lib/libQt5Gui.so.5.15.2 /usr/lib/libQt5Core.so.5.15.2 /usr/lib/libxcb.so
make[2]: Leaving directory '/usr/src/RPM/BUILD/kidletime-5.84.0/BUILD'
make[1]: Entering directory '/usr/src/RPM/BUILD/kidletime-5.84.0/BUILD'
[ 96%] Built target KF5IdleTimeXcbPlugin0
make[1]: Leaving directory '/usr/src/RPM/BUILD/kidletime-5.84.0/BUILD'
make[2]: Entering directory '/usr/src/RPM/BUILD/kidletime-5.84.0/BUILD'
[ 80%] Building CXX object src/plugins/xscreensaver/CMakeFiles/KF5IdleTimeXcbPlugin1.dir/KF5IdleTimeXcbPlugin1_autogen/mocs_compilation.cpp.o
cd /usr/src/RPM/BUILD/kidletime-5.84.0/BUILD/src/plugins/xscreensaver && /usr/bin/c++ -DKF5IdleTimeXcbPlugin1_EXPORTS -DKF_DEPRECATED_WARNINGS_SINCE=0x060000 -DKIDLETIME_DEPRECATED_WARNINGS_SINCE=0x0 -DKIDLETIME_DISABLE_DEPRECATED_BEFORE_AND_AT=0x0 -DQT_CORE_LIB -DQT_DBUS_LIB -DQT_DEPRECATED_WARNINGS_SINCE=0x060000 -DQT_DISABLE_DEPRECATED_BEFORE=0x050f00 -DQT_GUI_LIB -DQT_NO_CAST_FROM_ASCII -DQT_NO_CAST_FROM_BYTEARRAY -DQT_NO_CAST_TO_ASCII -DQT_NO_DEBUG -DQT_NO_FOREACH -DQT_NO_KEYWORDS -DQT_NO_NARROWING_CONVERSIONS_IN_CONNECT -DQT_NO_URL_CAST_FROM_STRING -DQT_STRICT_ITERATORS -DQT_USE_QSTRINGBUILDER -DQT_X11EXTRAS_LIB -D_FILE_OFFSET_BITS=64 -D_GNU_SOURCE -D_LARGEFILE64_SOURCE -I/usr/src/RPM/BUILD/kidletime-5.84.0/BUILD/src/plugins/xscreensaver -I/usr/src/RPM/BUILD/kidletime-5.84.0/src/plugins/xscreensaver -I/usr/src/RPM/BUILD/kidletime-5.84.0/BUILD/src/plugins/xscreensaver/KF5IdleTimeXcbPlugin1_autogen/include -I/usr/src/RPM/BUILD/kidletime-5.84.0/BUILD/src -I/usr/src/RPM/BUILD/kidletime-5.84.0/src -isystem /usr/include/qt5 -isystem /usr/include/qt5/QtCore -isystem /usr/share/qt5/../../lib/qt5/mkspecs/linux-g++ -isystem /usr/include/qt5/QtDBus -isystem /usr/include/qt5/QtX11Extras -isystem /usr/include/qt5/QtGui -pipe -frecord-gcc-switches -Wall -g -O2 -march=i586 -mtune=generic -fno-operator-names -fno-exceptions -Wall -Wextra -Wcast-align -Wchar-subscripts -Wformat-security -Wno-long-long -Wpointer-arith -Wundef -Wnon-virtual-dtor -Woverloaded-virtual -Werror=return-type -Wvla -Wdate-time -Wsuggest-override -Wlogical-op -pedantic -Wzero-as-null-pointer-constant -O2 -DNDEBUG -fPIC -fvisibility=hidden -fvisibility-inlines-hidden -fPIC -std=c++17 -MD -MT src/plugins/xscreensaver/CMakeFiles/KF5IdleTimeXcbPlugin1.dir/KF5IdleTimeXcbPlugin1_autogen/mocs_compilation.cpp.o -MF CMakeFiles/KF5IdleTimeXcbPlugin1.dir/KF5IdleTimeXcbPlugin1_autogen/mocs_compilation.cpp.o.d -o CMakeFiles/KF5IdleTimeXcbPlugin1.dir/KF5IdleTimeXcbPlugin1_autogen/mocs_compilation.cpp.o -c /usr/src/RPM/BUILD/kidletime-5.84.0/BUILD/src/plugins/xscreensaver/KF5IdleTimeXcbPlugin1_autogen/mocs_compilation.cpp
make[2]: Leaving directory '/usr/src/RPM/BUILD/kidletime-5.84.0/BUILD'
make[2]: Entering directory '/usr/src/RPM/BUILD/kidletime-5.84.0/BUILD'
[ 84%] Building CXX object src/plugins/xscreensaver/CMakeFiles/KF5IdleTimeXcbPlugin1.dir/xscreensaverbasedpoller.cpp.o
cd /usr/src/RPM/BUILD/kidletime-5.84.0/BUILD/src/plugins/xscreensaver && /usr/bin/c++ -DKF5IdleTimeXcbPlugin1_EXPORTS -DKF_DEPRECATED_WARNINGS_SINCE=0x060000 -DKIDLETIME_DEPRECATED_WARNINGS_SINCE=0x0 -DKIDLETIME_DISABLE_DEPRECATED_BEFORE_AND_AT=0x0 -DQT_CORE_LIB -DQT_DBUS_LIB -DQT_DEPRECATED_WARNINGS_SINCE=0x060000 -DQT_DISABLE_DEPRECATED_BEFORE=0x050f00 -DQT_GUI_LIB -DQT_NO_CAST_FROM_ASCII -DQT_NO_CAST_FROM_BYTEARRAY -DQT_NO_CAST_TO_ASCII -DQT_NO_DEBUG -DQT_NO_FOREACH -DQT_NO_KEYWORDS -DQT_NO_NARROWING_CONVERSIONS_IN_CONNECT -DQT_NO_URL_CAST_FROM_STRING -DQT_STRICT_ITERATORS -DQT_USE_QSTRINGBUILDER -DQT_X11EXTRAS_LIB -D_FILE_OFFSET_BITS=64 -D_GNU_SOURCE -D_LARGEFILE64_SOURCE -I/usr/src/RPM/BUILD/kidletime-5.84.0/BUILD/src/plugins/xscreensaver -I/usr/src/RPM/BUILD/kidletime-5.84.0/src/plugins/xscreensaver -I/usr/src/RPM/BUILD/kidletime-5.84.0/BUILD/src/plugins/xscreensaver/KF5IdleTimeXcbPlugin1_autogen/include -I/usr/src/RPM/BUILD/kidletime-5.84.0/BUILD/src -I/usr/src/RPM/BUILD/kidletime-5.84.0/src -isystem /usr/include/qt5 -isystem /usr/include/qt5/QtCore -isystem /usr/share/qt5/../../lib/qt5/mkspecs/linux-g++ -isystem /usr/include/qt5/QtDBus -isystem /usr/include/qt5/QtX11Extras -isystem /usr/include/qt5/QtGui -pipe -frecord-gcc-switches -Wall -g -O2 -march=i586 -mtune=generic -fno-operator-names -fno-exceptions -Wall -Wextra -Wcast-align -Wchar-subscripts -Wformat-security -Wno-long-long -Wpointer-arith -Wundef -Wnon-virtual-dtor -Woverloaded-virtual -Werror=return-type -Wvla -Wdate-time -Wsuggest-override -Wlogical-op -pedantic -Wzero-as-null-pointer-constant -O2 -DNDEBUG -fPIC -fvisibility=hidden -fvisibility-inlines-hidden -fPIC -std=c++17 -MD -MT src/plugins/xscreensaver/CMakeFiles/KF5IdleTimeXcbPlugin1.dir/xscreensaverbasedpoller.cpp.o -MF CMakeFiles/KF5IdleTimeXcbPlugin1.dir/xscreensaverbasedpoller.cpp.o.d -o CMakeFiles/KF5IdleTimeXcbPlugin1.dir/xscreensaverbasedpoller.cpp.o -c /usr/src/RPM/BUILD/kidletime-5.84.0/src/plugins/xscreensaver/xscreensaverbasedpoller.cpp
make[2]: Leaving directory '/usr/src/RPM/BUILD/kidletime-5.84.0/BUILD'
make[2]: Entering directory '/usr/src/RPM/BUILD/kidletime-5.84.0/BUILD'
[ 88%] Building CXX object src/plugins/xscreensaver/CMakeFiles/KF5IdleTimeXcbPlugin1.dir/screensaver_interface.cpp.o
cd /usr/src/RPM/BUILD/kidletime-5.84.0/BUILD/src/plugins/xscreensaver && /usr/bin/c++ -DKF5IdleTimeXcbPlugin1_EXPORTS -DKF_DEPRECATED_WARNINGS_SINCE=0x060000 -DKIDLETIME_DEPRECATED_WARNINGS_SINCE=0x0 -DKIDLETIME_DISABLE_DEPRECATED_BEFORE_AND_AT=0x0 -DQT_CORE_LIB -DQT_DBUS_LIB -DQT_DEPRECATED_WARNINGS_SINCE=0x060000 -DQT_DISABLE_DEPRECATED_BEFORE=0x050f00 -DQT_GUI_LIB -DQT_NO_CAST_FROM_ASCII -DQT_NO_CAST_FROM_BYTEARRAY -DQT_NO_CAST_TO_ASCII -DQT_NO_DEBUG -DQT_NO_FOREACH -DQT_NO_KEYWORDS -DQT_NO_NARROWING_CONVERSIONS_IN_CONNECT -DQT_NO_URL_CAST_FROM_STRING -DQT_STRICT_ITERATORS -DQT_USE_QSTRINGBUILDER -DQT_X11EXTRAS_LIB -D_FILE_OFFSET_BITS=64 -D_GNU_SOURCE -D_LARGEFILE64_SOURCE -I/usr/src/RPM/BUILD/kidletime-5.84.0/BUILD/src/plugins/xscreensaver -I/usr/src/RPM/BUILD/kidletime-5.84.0/src/plugins/xscreensaver -I/usr/src/RPM/BUILD/kidletime-5.84.0/BUILD/src/plugins/xscreensaver/KF5IdleTimeXcbPlugin1_autogen/include -I/usr/src/RPM/BUILD/kidletime-5.84.0/BUILD/src -I/usr/src/RPM/BUILD/kidletime-5.84.0/src -isystem /usr/include/qt5 -isystem /usr/include/qt5/QtCore -isystem /usr/share/qt5/../../lib/qt5/mkspecs/linux-g++ -isystem /usr/include/qt5/QtDBus -isystem /usr/include/qt5/QtX11Extras -isystem /usr/include/qt5/QtGui -pipe -frecord-gcc-switches -Wall -g -O2 -march=i586 -mtune=generic -fno-operator-names -fno-exceptions -Wall -Wextra -Wcast-align -Wchar-subscripts -Wformat-security -Wno-long-long -Wpointer-arith -Wundef -Wnon-virtual-dtor -Woverloaded-virtual -Werror=return-type -Wvla -Wdate-time -Wsuggest-override -Wlogical-op -pedantic -Wzero-as-null-pointer-constant -O2 -DNDEBUG -fPIC -fvisibility=hidden -fvisibility-inlines-hidden -fPIC -std=c++17 -MD -MT src/plugins/xscreensaver/CMakeFiles/KF5IdleTimeXcbPlugin1.dir/screensaver_interface.cpp.o -MF CMakeFiles/KF5IdleTimeXcbPlugin1.dir/screensaver_interface.cpp.o.d -o CMakeFiles/KF5IdleTimeXcbPlugin1.dir/screensaver_interface.cpp.o -c /usr/src/RPM/BUILD/kidletime-5.84.0/BUILD/src/plugins/xscreensaver/screensaver_interface.cpp
make[2]: Leaving directory '/usr/src/RPM/BUILD/kidletime-5.84.0/BUILD'
make[2]: Entering directory '/usr/src/RPM/BUILD/kidletime-5.84.0/BUILD'
[100%] Linking CXX shared module ../../../bin/KF5IdleTimeXcbPlugin1.so
cd /usr/src/RPM/BUILD/kidletime-5.84.0/BUILD/src/plugins/xscreensaver && /usr/bin/cmake -E cmake_link_script CMakeFiles/KF5IdleTimeXcbPlugin1.dir/link.txt --verbose=1
/usr/bin/c++ -fPIC -pipe -frecord-gcc-switches -Wall -g -O2 -march=i586 -mtune=generic -fno-operator-names -fno-exceptions -Wall -Wextra -Wcast-align -Wchar-subscripts -Wformat-security -Wno-long-long -Wpointer-arith -Wundef -Wnon-virtual-dtor -Woverloaded-virtual -Werror=return-type -Wvla -Wdate-time -Wsuggest-override -Wlogical-op -pedantic -Wzero-as-null-pointer-constant -O2 -DNDEBUG -Wl,--no-undefined -Wl,--fatal-warnings -Wl,--enable-new-dtags -L/usr/lib -L/usr/lib/kf5/devel -shared -o ../../../bin/KF5IdleTimeXcbPlugin1.so CMakeFiles/KF5IdleTimeXcbPlugin1.dir/KF5IdleTimeXcbPlugin1_autogen/mocs_compilation.cpp.o CMakeFiles/KF5IdleTimeXcbPlugin1.dir/xscreensaverbasedpoller.cpp.o CMakeFiles/KF5IdleTimeXcbPlugin1.dir/screensaver_interface.cpp.o ../../../bin/libKF5IdleTime.so.5.84.0 /usr/lib/libQt5DBus.so.5.15.2 /usr/lib/libQt5X11Extras.so.5.15.2 /usr/lib/libSM.so /usr/lib/libICE.so /usr/lib/libX11.so /usr/lib/libXext.so /usr/lib/libXss.so /usr/lib/libQt5Gui.so.5.15.2 /usr/lib/libQt5Core.so.5.15.2
make[2]: Leaving directory '/usr/src/RPM/BUILD/kidletime-5.84.0/BUILD'
make[1]: Entering directory '/usr/src/RPM/BUILD/kidletime-5.84.0/BUILD'
[100%] Built target KF5IdleTimeXcbPlugin1
make[1]: Leaving directory '/usr/src/RPM/BUILD/kidletime-5.84.0/BUILD'
make: Entering directory '/usr/src/RPM/BUILD/kidletime-5.84.0/BUILD'
/usr/bin/cmake -E cmake_progress_start /usr/src/RPM/BUILD/kidletime-5.84.0/BUILD/CMakeFiles 0
make: Leaving directory '/usr/src/RPM/BUILD/kidletime-5.84.0/BUILD'
+ popd
~/RPM/BUILD/kidletime-5.84.0
+ exit 0
Executing(%install): /bin/sh -e /usr/src/tmp/rpm-tmp.85138
+ umask 022
+ /bin/mkdir -p /usr/src/RPM/BUILD
+ cd /usr/src/RPM/BUILD
+ /bin/chmod -Rf u+rwX -- /usr/src/tmp/kf5-kidletime-buildroot
+ :
+ /bin/rm -rf -- /usr/src/tmp/kf5-kidletime-buildroot
+ PATH=/usr/libexec/rpm-build:/usr/src/bin:/bin:/usr/bin:/usr/X11R6/bin:/usr/games
+ cd kidletime-5.84.0
+ __kf5_install
+ make -C BUILD DESTDIR=/usr/src/tmp/kf5-kidletime-buildroot install
make: Entering directory '/usr/src/RPM/BUILD/kidletime-5.84.0/BUILD'
/usr/bin/cmake -S/usr/src/RPM/BUILD/kidletime-5.84.0 -B/usr/src/RPM/BUILD/kidletime-5.84.0/BUILD --check-build-system CMakeFiles/Makefile.cmake 0
/usr/bin/cmake -E cmake_progress_start /usr/src/RPM/BUILD/kidletime-5.84.0/BUILD/CMakeFiles /usr/src/RPM/BUILD/kidletime-5.84.0/BUILD//CMakeFiles/progress.marks
make -f CMakeFiles/Makefile2 all
make[1]: Entering directory '/usr/src/RPM/BUILD/kidletime-5.84.0/BUILD'
make -f src/CMakeFiles/KF5IdleTime_autogen.dir/build.make src/CMakeFiles/KF5IdleTime_autogen.dir/depend
make[2]: Entering directory '/usr/src/RPM/BUILD/kidletime-5.84.0/BUILD'
cd /usr/src/RPM/BUILD/kidletime-5.84.0/BUILD && /usr/bin/cmake -E cmake_depends "Unix Makefiles" /usr/src/RPM/BUILD/kidletime-5.84.0 /usr/src/RPM/BUILD/kidletime-5.84.0/src /usr/src/RPM/BUILD/kidletime-5.84.0/BUILD /usr/src/RPM/BUILD/kidletime-5.84.0/BUILD/src /usr/src/RPM/BUILD/kidletime-5.84.0/BUILD/src/CMakeFiles/KF5IdleTime_autogen.dir/DependInfo.cmake --color=
make[2]: Leaving directory '/usr/src/RPM/BUILD/kidletime-5.84.0/BUILD'
make -f src/CMakeFiles/KF5IdleTime_autogen.dir/build.make src/CMakeFiles/KF5IdleTime_autogen.dir/build
make[2]: Entering directory '/usr/src/RPM/BUILD/kidletime-5.84.0/BUILD'
[ 4%] Automatic MOC for target KF5IdleTime
cd /usr/src/RPM/BUILD/kidletime-5.84.0/BUILD/src && /usr/bin/cmake -E cmake_autogen /usr/src/RPM/BUILD/kidletime-5.84.0/BUILD/src/CMakeFiles/KF5IdleTime_autogen.dir/AutogenInfo.json Release
make[2]: Leaving directory '/usr/src/RPM/BUILD/kidletime-5.84.0/BUILD'
[ 4%] Built target KF5IdleTime_autogen
make -f src/CMakeFiles/KF5IdleTime.dir/build.make src/CMakeFiles/KF5IdleTime.dir/depend
make[2]: Entering directory '/usr/src/RPM/BUILD/kidletime-5.84.0/BUILD'
cd /usr/src/RPM/BUILD/kidletime-5.84.0/BUILD && /usr/bin/cmake -E cmake_depends "Unix Makefiles" /usr/src/RPM/BUILD/kidletime-5.84.0 /usr/src/RPM/BUILD/kidletime-5.84.0/src /usr/src/RPM/BUILD/kidletime-5.84.0/BUILD /usr/src/RPM/BUILD/kidletime-5.84.0/BUILD/src /usr/src/RPM/BUILD/kidletime-5.84.0/BUILD/src/CMakeFiles/KF5IdleTime.dir/DependInfo.cmake --color=
Consolidate compiler generated dependencies of target KF5IdleTime
make[2]: Leaving directory '/usr/src/RPM/BUILD/kidletime-5.84.0/BUILD'
make -f src/CMakeFiles/KF5IdleTime.dir/build.make src/CMakeFiles/KF5IdleTime.dir/build
make[2]: Entering directory '/usr/src/RPM/BUILD/kidletime-5.84.0/BUILD'
make[2]: Nothing to be done for 'src/CMakeFiles/KF5IdleTime.dir/build'.
make[2]: Leaving directory '/usr/src/RPM/BUILD/kidletime-5.84.0/BUILD'
[ 28%] Built target KF5IdleTime
make -f src/plugins/xscreensaver/CMakeFiles/KF5IdleTimeXcbPlugin1_autogen.dir/build.make src/plugins/xscreensaver/CMakeFiles/KF5IdleTimeXcbPlugin1_autogen.dir/depend
make[2]: Entering directory '/usr/src/RPM/BUILD/kidletime-5.84.0/BUILD'
cd /usr/src/RPM/BUILD/kidletime-5.84.0/BUILD && /usr/bin/cmake -E cmake_depends "Unix Makefiles" /usr/src/RPM/BUILD/kidletime-5.84.0 /usr/src/RPM/BUILD/kidletime-5.84.0/src/plugins/xscreensaver /usr/src/RPM/BUILD/kidletime-5.84.0/BUILD /usr/src/RPM/BUILD/kidletime-5.84.0/BUILD/src/plugins/xscreensaver /usr/src/RPM/BUILD/kidletime-5.84.0/BUILD/src/plugins/xscreensaver/CMakeFiles/KF5IdleTimeXcbPlugin1_autogen.dir/DependInfo.cmake --color=
make[2]: Leaving directory '/usr/src/RPM/BUILD/kidletime-5.84.0/BUILD'
make -f src/plugins/xscreensaver/CMakeFiles/KF5IdleTimeXcbPlugin1_autogen.dir/build.make src/plugins/xscreensaver/CMakeFiles/KF5IdleTimeXcbPlugin1_autogen.dir/build
make[2]: Entering directory '/usr/src/RPM/BUILD/kidletime-5.84.0/BUILD'
[ 32%] Automatic MOC for target KF5IdleTimeXcbPlugin1
cd /usr/src/RPM/BUILD/kidletime-5.84.0/BUILD/src/plugins/xscreensaver && /usr/bin/cmake -E cmake_autogen /usr/src/RPM/BUILD/kidletime-5.84.0/BUILD/src/plugins/xscreensaver/CMakeFiles/KF5IdleTimeXcbPlugin1_autogen.dir/AutogenInfo.json Release
make[2]: Leaving directory '/usr/src/RPM/BUILD/kidletime-5.84.0/BUILD'
[ 32%] Built target KF5IdleTimeXcbPlugin1_autogen
make -f src/plugins/xscreensaver/CMakeFiles/KF5IdleTimeXcbPlugin1.dir/build.make src/plugins/xscreensaver/CMakeFiles/KF5IdleTimeXcbPlugin1.dir/depend
make[2]: Entering directory '/usr/src/RPM/BUILD/kidletime-5.84.0/BUILD'
cd /usr/src/RPM/BUILD/kidletime-5.84.0/BUILD && /usr/bin/cmake -E cmake_depends "Unix Makefiles" /usr/src/RPM/BUILD/kidletime-5.84.0 /usr/src/RPM/BUILD/kidletime-5.84.0/src/plugins/xscreensaver /usr/src/RPM/BUILD/kidletime-5.84.0/BUILD /usr/src/RPM/BUILD/kidletime-5.84.0/BUILD/src/plugins/xscreensaver /usr/src/RPM/BUILD/kidletime-5.84.0/BUILD/src/plugins/xscreensaver/CMakeFiles/KF5IdleTimeXcbPlugin1.dir/DependInfo.cmake --color=
Consolidate compiler generated dependencies of target KF5IdleTimeXcbPlugin1
make[2]: Leaving directory '/usr/src/RPM/BUILD/kidletime-5.84.0/BUILD'
make -f src/plugins/xscreensaver/CMakeFiles/KF5IdleTimeXcbPlugin1.dir/build.make src/plugins/xscreensaver/CMakeFiles/KF5IdleTimeXcbPlugin1.dir/build
make[2]: Entering directory '/usr/src/RPM/BUILD/kidletime-5.84.0/BUILD'
make[2]: Nothing to be done for 'src/plugins/xscreensaver/CMakeFiles/KF5IdleTimeXcbPlugin1.dir/build'.
make[2]: Leaving directory '/usr/src/RPM/BUILD/kidletime-5.84.0/BUILD'
[ 56%] Built target KF5IdleTimeXcbPlugin1
make -f src/plugins/xsync/CMakeFiles/KF5IdleTimeXcbPlugin0_autogen.dir/build.make src/plugins/xsync/CMakeFiles/KF5IdleTimeXcbPlugin0_autogen.dir/depend
make[2]: Entering directory '/usr/src/RPM/BUILD/kidletime-5.84.0/BUILD'
cd /usr/src/RPM/BUILD/kidletime-5.84.0/BUILD && /usr/bin/cmake -E cmake_depends "Unix Makefiles" /usr/src/RPM/BUILD/kidletime-5.84.0 /usr/src/RPM/BUILD/kidletime-5.84.0/src/plugins/xsync /usr/src/RPM/BUILD/kidletime-5.84.0/BUILD /usr/src/RPM/BUILD/kidletime-5.84.0/BUILD/src/plugins/xsync /usr/src/RPM/BUILD/kidletime-5.84.0/BUILD/src/plugins/xsync/CMakeFiles/KF5IdleTimeXcbPlugin0_autogen.dir/DependInfo.cmake --color=
make[2]: Leaving directory '/usr/src/RPM/BUILD/kidletime-5.84.0/BUILD'
make -f src/plugins/xsync/CMakeFiles/KF5IdleTimeXcbPlugin0_autogen.dir/build.make src/plugins/xsync/CMakeFiles/KF5IdleTimeXcbPlugin0_autogen.dir/build
make[2]: Entering directory '/usr/src/RPM/BUILD/kidletime-5.84.0/BUILD'
[ 60%] Automatic MOC for target KF5IdleTimeXcbPlugin0
cd /usr/src/RPM/BUILD/kidletime-5.84.0/BUILD/src/plugins/xsync && /usr/bin/cmake -E cmake_autogen /usr/src/RPM/BUILD/kidletime-5.84.0/BUILD/src/plugins/xsync/CMakeFiles/KF5IdleTimeXcbPlugin0_autogen.dir/AutogenInfo.json Release
make[2]: Leaving directory '/usr/src/RPM/BUILD/kidletime-5.84.0/BUILD'
[ 60%] Built target KF5IdleTimeXcbPlugin0_autogen
make -f src/plugins/xsync/CMakeFiles/KF5IdleTimeXcbPlugin0.dir/build.make src/plugins/xsync/CMakeFiles/KF5IdleTimeXcbPlugin0.dir/depend
make[2]: Entering directory '/usr/src/RPM/BUILD/kidletime-5.84.0/BUILD'
cd /usr/src/RPM/BUILD/kidletime-5.84.0/BUILD && /usr/bin/cmake -E cmake_depends "Unix Makefiles" /usr/src/RPM/BUILD/kidletime-5.84.0 /usr/src/RPM/BUILD/kidletime-5.84.0/src/plugins/xsync /usr/src/RPM/BUILD/kidletime-5.84.0/BUILD /usr/src/RPM/BUILD/kidletime-5.84.0/BUILD/src/plugins/xsync /usr/src/RPM/BUILD/kidletime-5.84.0/BUILD/src/plugins/xsync/CMakeFiles/KF5IdleTimeXcbPlugin0.dir/DependInfo.cmake --color=
Consolidate compiler generated dependencies of target KF5IdleTimeXcbPlugin0
make[2]: Leaving directory '/usr/src/RPM/BUILD/kidletime-5.84.0/BUILD'
make -f src/plugins/xsync/CMakeFiles/KF5IdleTimeXcbPlugin0.dir/build.make src/plugins/xsync/CMakeFiles/KF5IdleTimeXcbPlugin0.dir/build
make[2]: Entering directory '/usr/src/RPM/BUILD/kidletime-5.84.0/BUILD'
make[2]: Nothing to be done for 'src/plugins/xsync/CMakeFiles/KF5IdleTimeXcbPlugin0.dir/build'.
make[2]: Leaving directory '/usr/src/RPM/BUILD/kidletime-5.84.0/BUILD'
[ 80%] Built target KF5IdleTimeXcbPlugin0
make -f examples/CMakeFiles/kidletime_example_autogen.dir/build.make examples/CMakeFiles/kidletime_example_autogen.dir/depend
make[2]: Entering directory '/usr/src/RPM/BUILD/kidletime-5.84.0/BUILD'
cd /usr/src/RPM/BUILD/kidletime-5.84.0/BUILD && /usr/bin/cmake -E cmake_depends "Unix Makefiles" /usr/src/RPM/BUILD/kidletime-5.84.0 /usr/src/RPM/BUILD/kidletime-5.84.0/examples /usr/src/RPM/BUILD/kidletime-5.84.0/BUILD /usr/src/RPM/BUILD/kidletime-5.84.0/BUILD/examples /usr/src/RPM/BUILD/kidletime-5.84.0/BUILD/examples/CMakeFiles/kidletime_example_autogen.dir/DependInfo.cmake --color=
make[2]: Leaving directory '/usr/src/RPM/BUILD/kidletime-5.84.0/BUILD'
make -f examples/CMakeFiles/kidletime_example_autogen.dir/build.make examples/CMakeFiles/kidletime_example_autogen.dir/build
make[2]: Entering directory '/usr/src/RPM/BUILD/kidletime-5.84.0/BUILD'
[ 84%] Automatic MOC for target kidletime_example
cd /usr/src/RPM/BUILD/kidletime-5.84.0/BUILD/examples && /usr/bin/cmake -E cmake_autogen /usr/src/RPM/BUILD/kidletime-5.84.0/BUILD/examples/CMakeFiles/kidletime_example_autogen.dir/AutogenInfo.json Release
make[2]: Leaving directory '/usr/src/RPM/BUILD/kidletime-5.84.0/BUILD'
[ 84%] Built target kidletime_example_autogen
make -f examples/CMakeFiles/kidletime_example.dir/build.make examples/CMakeFiles/kidletime_example.dir/depend
make[2]: Entering directory '/usr/src/RPM/BUILD/kidletime-5.84.0/BUILD'
cd /usr/src/RPM/BUILD/kidletime-5.84.0/BUILD && /usr/bin/cmake -E cmake_depends "Unix Makefiles" /usr/src/RPM/BUILD/kidletime-5.84.0 /usr/src/RPM/BUILD/kidletime-5.84.0/examples /usr/src/RPM/BUILD/kidletime-5.84.0/BUILD /usr/src/RPM/BUILD/kidletime-5.84.0/BUILD/examples /usr/src/RPM/BUILD/kidletime-5.84.0/BUILD/examples/CMakeFiles/kidletime_example.dir/DependInfo.cmake --color=
Consolidate compiler generated dependencies of target kidletime_example
make[2]: Leaving directory '/usr/src/RPM/BUILD/kidletime-5.84.0/BUILD'
make -f examples/CMakeFiles/kidletime_example.dir/build.make examples/CMakeFiles/kidletime_example.dir/build
make[2]: Entering directory '/usr/src/RPM/BUILD/kidletime-5.84.0/BUILD'
make[2]: Nothing to be done for 'examples/CMakeFiles/kidletime_example.dir/build'.
make[2]: Leaving directory '/usr/src/RPM/BUILD/kidletime-5.84.0/BUILD'
[100%] Built target kidletime_example
make[1]: Leaving directory '/usr/src/RPM/BUILD/kidletime-5.84.0/BUILD'
/usr/bin/cmake -E cmake_progress_start /usr/src/RPM/BUILD/kidletime-5.84.0/BUILD/CMakeFiles 0
make -f CMakeFiles/Makefile2 preinstall
make[1]: Entering directory '/usr/src/RPM/BUILD/kidletime-5.84.0/BUILD'
make[1]: Nothing to be done for 'preinstall'.
make[1]: Leaving directory '/usr/src/RPM/BUILD/kidletime-5.84.0/BUILD'
Install the project...
/usr/bin/cmake -P cmake_install.cmake
-- Install configuration: "Release"
-- Installing: /usr/src/tmp/kf5-kidletime-buildroot/usr/lib/qt5/plugins/kf5/org.kde.kidletime.platforms/KF5IdleTimeXcbPlugin1.so
-- Installing: /usr/src/tmp/kf5-kidletime-buildroot/usr/lib/qt5/plugins/kf5/org.kde.kidletime.platforms/KF5IdleTimeXcbPlugin0.so
-- Installing: /usr/src/tmp/kf5-kidletime-buildroot/usr/include/KF5/KIdleTime/kidletime_export.h
-- Installing: /usr/src/tmp/kf5-kidletime-buildroot/usr/include/KF5/KIdleTime/KIdleTime
-- Installing: /usr/src/tmp/kf5-kidletime-buildroot/usr/include/KF5/KIdleTime/kidletime.h
-- Installing: /usr/src/tmp/kf5-kidletime-buildroot/usr/include/KF5/KIdleTime/private/abstractsystempoller.h
-- Installing: /usr/src/tmp/kf5-kidletime-buildroot/usr/lib/libKF5IdleTime.so.5.84.0
-- Installing: /usr/src/tmp/kf5-kidletime-buildroot/usr/lib/libKF5IdleTime.so.5
-- Installing: /usr/src/tmp/kf5-kidletime-buildroot/usr/lib/libKF5IdleTime.so
-- Installing: /usr/src/tmp/kf5-kidletime-buildroot/usr/share/qlogging-categories5/kidletime.categories
-- Installing: /usr/src/tmp/kf5-kidletime-buildroot/usr/share/qlogging-categories5/kidletime.renamecategories
-- Installing: /usr/src/tmp/kf5-kidletime-buildroot/usr/lib/qt5/mkspecs/modules/qt_KIdleTime.pri
-- Installing: /usr/src/tmp/kf5-kidletime-buildroot/usr/lib/cmake/KF5IdleTime/KF5IdleTimeConfig.cmake
-- Installing: /usr/src/tmp/kf5-kidletime-buildroot/usr/lib/cmake/KF5IdleTime/KF5IdleTimeConfigVersion.cmake
-- Installing: /usr/src/tmp/kf5-kidletime-buildroot/usr/lib/cmake/KF5IdleTime/KF5IdleTimeTargets.cmake
-- Installing: /usr/src/tmp/kf5-kidletime-buildroot/usr/lib/cmake/KF5IdleTime/KF5IdleTimeTargets-release.cmake
-- Installing: /usr/src/tmp/kf5-kidletime-buildroot/usr/include/KF5/kidletime_version.h
make: Leaving directory '/usr/src/RPM/BUILD/kidletime-5.84.0/BUILD'
+ '[' -d /usr/src/tmp/kf5-kidletime-buildroot//usr/share ']'
+ ls -1d '/usr/src/tmp/kf5-kidletime-buildroot//usr/share/kf5/k*5'
+ read d
ls: cannot access '/usr/src/tmp/kf5-kidletime-buildroot//usr/share/kf5/k*5': No such file or directory
+ '[' -d /usr/src/tmp/kf5-kidletime-buildroot//usr/share/kf5/lib64 ']'
+ '[' -d /usr/src/tmp/kf5-kidletime-buildroot//usr/share/kf5/lib ']'
+ ls -1 /usr/src/tmp/kf5-kidletime-buildroot//usr/lib/libKF5IdleTime.so
+ read p
+ '[' -L /usr/src/tmp/kf5-kidletime-buildroot//usr/lib/libKF5IdleTime.so ']'
+ mkdir -p /usr/src/tmp/kf5-kidletime-buildroot//usr/lib/kf5/devel
++ readlink /usr/src/tmp/kf5-kidletime-buildroot//usr/lib/libKF5IdleTime.so
+ f=libKF5IdleTime.so.5
++ basename /usr/src/tmp/kf5-kidletime-buildroot//usr/lib/libKF5IdleTime.so
+ l=libKF5IdleTime.so
++ relative /usr/src/tmp/kf5-kidletime-buildroot//usr/lib/libKF5IdleTime.so.5 /usr/src/tmp/kf5-kidletime-buildroot//usr/lib/kf5/devel/libKF5IdleTime.so.5
+ ln -sf ../../libKF5IdleTime.so.5 /usr/src/tmp/kf5-kidletime-buildroot//usr/lib/kf5/devel/libKF5IdleTime.so
+ rm -f /usr/src/tmp/kf5-kidletime-buildroot//usr/lib/libKF5IdleTime.so
+ read p
+ '[' -d /usr/src/tmp/kf5-kidletime-buildroot//usr/share/kf5/bin ']'
+ '[' -d /usr/src/tmp/kf5-kidletime-buildroot//usr/share/kf5/include ']'
+ '[' -d /usr/src/tmp/kf5-kidletime-buildroot//usr/lib/kf5/bin -a true == true ']'
+ ls -1 '/usr/src/tmp/kf5-kidletime-buildroot//usr/share/kf5/dbus-1/services/*5*.service'
+ read s
+ '[' -d /usr/src/tmp/kf5-kidletime-buildroot//usr/share/akonadi ']'
+ '[' -d /usr/src/tmp/kf5-kidletime-buildroot//usr/share/kf5/akonadi ']'
+ '[' -d /usr/src/tmp/kf5-kidletime-buildroot//usr/share/man -a remove == remove ']'
+ '[' -d /usr/src/tmp/kf5-kidletime-buildroot//usr/share/appdata -a keep == remove ']'
+ '[' -d /usr/src/tmp/kf5-kidletime-buildroot//usr/share/metainfo -a keep == remove ']'
+ '[' -d /usr/src/tmp/kf5-kidletime-buildroot//usr/lib/cmake/ ']'
+ find /usr/src/tmp/kf5-kidletime-buildroot//usr/lib/cmake/ -type f -name '*.cmake'
+ read f
+ sed -i -e 's|\(set(.*\)${PACKAGE_PREFIX_DIR}//usr/|\1${PACKAGE_PREFIX_DIR}/|' /usr/src/tmp/kf5-kidletime-buildroot//usr/lib/cmake/KF5IdleTime/KF5IdleTimeTargets-release.cmake
+ sed -i -e 's|/usr//usr/|/usr/|' /usr/src/tmp/kf5-kidletime-buildroot//usr/lib/cmake/KF5IdleTime/KF5IdleTimeTargets-release.cmake
+ read f
+ sed -i -e 's|\(set(.*\)${PACKAGE_PREFIX_DIR}//usr/|\1${PACKAGE_PREFIX_DIR}/|' /usr/src/tmp/kf5-kidletime-buildroot//usr/lib/cmake/KF5IdleTime/KF5IdleTimeTargets.cmake
+ sed -i -e 's|/usr//usr/|/usr/|' /usr/src/tmp/kf5-kidletime-buildroot//usr/lib/cmake/KF5IdleTime/KF5IdleTimeTargets.cmake
+ read f
+ sed -i -e 's|\(set(.*\)${PACKAGE_PREFIX_DIR}//usr/|\1${PACKAGE_PREFIX_DIR}/|' /usr/src/tmp/kf5-kidletime-buildroot//usr/lib/cmake/KF5IdleTime/KF5IdleTimeConfigVersion.cmake
+ sed -i -e 's|/usr//usr/|/usr/|' /usr/src/tmp/kf5-kidletime-buildroot//usr/lib/cmake/KF5IdleTime/KF5IdleTimeConfigVersion.cmake
+ read f
+ sed -i -e 's|\(set(.*\)${PACKAGE_PREFIX_DIR}//usr/|\1${PACKAGE_PREFIX_DIR}/|' /usr/src/tmp/kf5-kidletime-buildroot//usr/lib/cmake/KF5IdleTime/KF5IdleTimeConfig.cmake
+ sed -i -e 's|/usr//usr/|/usr/|' /usr/src/tmp/kf5-kidletime-buildroot//usr/lib/cmake/KF5IdleTime/KF5IdleTimeConfig.cmake
+ read f
+ /usr/lib/rpm/find-lang kf5-kidletime --all-name
+ rpm-build-kf5-find-qtlang kf5-kidletime --all-name
+ /usr/lib/rpm/brp-alt
Cleaning files in /usr/src/tmp/kf5-kidletime-buildroot (auto)
mode of './usr/lib/libKF5IdleTime.so.5.84.0' changed from 0755 (rwxr-xr-x) to 0644 (rw-r--r--)
mode of './usr/lib/qt5/plugins/kf5/org.kde.kidletime.platforms/KF5IdleTimeXcbPlugin0.so' changed from 0755 (rwxr-xr-x) to 0644 (rw-r--r--)
mode of './usr/lib/qt5/plugins/kf5/org.kde.kidletime.platforms/KF5IdleTimeXcbPlugin1.so' changed from 0755 (rwxr-xr-x) to 0644 (rw-r--r--)
Verifying and fixing files in /usr/src/tmp/kf5-kidletime-buildroot (binconfig,pkgconfig,libtool,desktop,gnuconfig)
Checking contents of files in /usr/src/tmp/kf5-kidletime-buildroot/ (default)
Compressing files in /usr/src/tmp/kf5-kidletime-buildroot (auto)
Adjusting library links in /usr/src/tmp/kf5-kidletime-buildroot
./usr/lib: (from :0)
libKF5IdleTime.so.5 -> libKF5IdleTime.so.5.84.0
Verifying ELF objects in /usr/src/tmp/kf5-kidletime-buildroot (arch=normal,fhs=normal,lfs=relaxed,lint=relaxed,rpath=normal,stack=normal,textrel=normal,unresolved=normal)
Processing files: kf5-kidletime-common-5.84.0-alt1
Executing(%doc): /bin/sh -e /usr/src/tmp/rpm-tmp.21653
+ umask 022
+ /bin/mkdir -p /usr/src/RPM/BUILD
+ cd /usr/src/RPM/BUILD
+ cd kidletime-5.84.0
+ DOCDIR=/usr/src/tmp/kf5-kidletime-buildroot/usr/share/doc/kf5-kidletime-common-5.84.0
+ export DOCDIR
+ rm -rf /usr/src/tmp/kf5-kidletime-buildroot/usr/share/doc/kf5-kidletime-common-5.84.0
+ /bin/mkdir -p /usr/src/tmp/kf5-kidletime-buildroot/usr/share/doc/kf5-kidletime-common-5.84.0
+ cp -prL LICENSES/GPL-2.0-or-later.txt LICENSES/LGPL-2.0-only.txt LICENSES/MIT.txt README.md /usr/src/tmp/kf5-kidletime-buildroot/usr/share/doc/kf5-kidletime-common-5.84.0
+ chmod -R go-w /usr/src/tmp/kf5-kidletime-buildroot/usr/share/doc/kf5-kidletime-common-5.84.0
+ chmod -R a+rX /usr/src/tmp/kf5-kidletime-buildroot/usr/share/doc/kf5-kidletime-common-5.84.0
+ exit 0
Finding Provides (using /usr/lib/rpm/find-provides)
Executing: /bin/sh -e /usr/src/tmp/rpm-tmp.XfnNrD
find-provides: running scripts (alternatives,debuginfo,gir,lib,pam,perl,pkgconfig,python,python3,qml,shell,typelib)
Finding Requires (using /usr/lib/rpm/find-requires)
Executing: /bin/sh -e /usr/src/tmp/rpm-tmp.SoZPcC
find-requires: running scripts (cpp,debuginfo,files,gir-js,gir-python,gir,lib,pam,perl,pkgconfig,pkgconfiglib,python,python3,qml,rpmlib,shebang,shell,static,symlinks,systemd-services,typelib)
Requires: kf5-filesystem
Processing files: kf5-kidletime-devel-5.84.0-alt1
Finding Provides (using /usr/lib/rpm/find-provides)
Executing: /bin/sh -e /usr/src/tmp/rpm-tmp.Xu8eLC
find-provides: running scripts (alternatives,debuginfo,gir,lib,pam,perl,pkgconfig,python,python3,qml,shell,typelib)
Finding Requires (using /usr/lib/rpm/find-requires)
Executing: /bin/sh -e /usr/src/tmp/rpm-tmp.PedDHF
find-requires: running scripts (cpp,debuginfo,files,gir-js,gir-python,gir,lib,pam,perl,pkgconfig,pkgconfiglib,python,python3,qml,rpmlib,shebang,shell,static,symlinks,systemd-services,typelib)
/usr/src/tmp/kf5-kidletime-buildroot/usr/include/KF5/KIdleTime/kidletime.h:11:10: fatal error: QHash: No such file or directory
11 | #include
| ^~~~~~~
compilation terminated.
cpp.req: /usr/src/tmp/kf5-kidletime-buildroot/usr/include/KF5/KIdleTime/kidletime.h: cpp failed, trying c++ mode
/usr/src/tmp/kf5-kidletime-buildroot/usr/include/KF5/KIdleTime/kidletime.h:11:10: fatal error: QHash: No such file or directory
11 | #include
| ^~~~~~~
compilation terminated.
cpp.req: WARNING: /usr/src/tmp/kf5-kidletime-buildroot/usr/include/KF5/KIdleTime/kidletime.h: cpp failed
/usr/src/tmp/kf5-kidletime-buildroot/usr/include/KF5/KIdleTime/private/abstractsystempoller.h:12:10: fatal error: QObject: No such file or directory
12 | #include
| ^~~~~~~~~
compilation terminated.
cpp.req: /usr/src/tmp/kf5-kidletime-buildroot/usr/include/KF5/KIdleTime/private/abstractsystempoller.h: cpp failed, trying c++ mode
/usr/src/tmp/kf5-kidletime-buildroot/usr/include/KF5/KIdleTime/private/abstractsystempoller.h:12:10: fatal error: QObject: No such file or directory
12 | #include
| ^~~~~~~~~
compilation terminated.
cpp.req: WARNING: /usr/src/tmp/kf5-kidletime-buildroot/usr/include/KF5/KIdleTime/private/abstractsystempoller.h: cpp failed
Requires: /usr/lib/libKF5IdleTime.so.5
Finding debuginfo files (using /usr/lib/rpm/find-debuginfo-files)
Executing: /bin/sh -e /usr/src/tmp/rpm-tmp.ZPLWyC
Processing files: libkf5idletime-5.84.0-alt1
Finding Provides (using /usr/lib/rpm/find-provides)
Executing: /bin/sh -e /usr/src/tmp/rpm-tmp.fru8QD
find-provides: running scripts (alternatives,debuginfo,gir,lib,pam,perl,pkgconfig,python,python3,qml,shell,typelib)
lib.prov: /usr/src/tmp/kf5-kidletime-buildroot/usr/lib/libKF5IdleTime.so.5: 64 symbols, 16 bpp
Finding Requires (using /usr/lib/rpm/find-requires)
Executing: /bin/sh -e /usr/src/tmp/rpm-tmp.tUMJPE
find-requires: running scripts (cpp,debuginfo,files,gir-js,gir-python,gir,lib,pam,perl,pkgconfig,pkgconfiglib,python,python3,qml,rpmlib,shebang,shell,static,symlinks,systemd-services,typelib)
Provides: libKF5IdleTime.so.5 = set:jc2zqqys70e5sHExqMYSFPqr7LEL3niX1s8KoIEo9FNO6yXa30pDH6W3P9DmUNJ0e1igeGZHQUkA7IJEDeHVVj9Z0cWgakQ6lK0J0g7G54cFIBsAn2WxdQOZcBipId1
Requires: kf5-kidletime-common = 5.84.0-alt1, libQt5Core.so.5 >= set:qjWAjoIrgM825WpkZzUawlYJjfn2puZhQEkYlHZhG0QBJgZL1TJRIqbK1sVOBogQ5shHVEsVOQSZ5UCa7gJC9T3f0gtwlMTA8iBVA252Ivc5mf7gJzWONo7zZ6FKZ919K0T51ZLazSXIZ7R4rThQAVhAF5ZsGRLKEQYvZ8Pvl2FEeMpg4neMZyGoQrY8VXAvsqWRYbTLk3NCrPw8t0zsNQJYmzcYJ7cfxI6kqnkupj1Neg8OX7ykVu7FEbkcMr9qH9sfOioPOw91fSZrw10ZDv3, libQt5Core.so.5(Qt_5), libQt5Core.so.5(Qt_5.15), libQt5DBus.so.5 >= set:mhL330UbxdTP30MgZbBEjJBF2YP7mn3doiZgKlK49Ec3Z8X0, libQt5DBus.so.5(Qt_5), libQt5Gui.so.5 >= set:rnZJa8grblYXrhZFdhxigFyIpqnjVZfp4, libQt5Gui.so.5(Qt_5), libQt5X11Extras.so.5 >= set:ihqAa, libQt5X11Extras.so.5(Qt_5), libX11-xcb.so.1 >= set:edp7, libX11.so.6 >= set:omNQNZ0EPrQf0, libXext.so.6 >= set:lhnnxLbmf0iijQ9ZKo0L2aHGORWyqn60, libXss.so.1 >= set:hfK9V87, libc.so.6(GLIBC_2.0), libc.so.6(GLIBC_2.1.3), libc.so.6(GLIBC_2.4), libstdc++.so.6(CXXABI_1.3), libstdc++.so.6(CXXABI_1.3.9), libstdc++.so.6(GLIBCXX_3.4), libxcb-sync.so.1 >= set:kjOcj, libxcb.so.1 >= set:nmCri2, rtld(GNU_HASH)
Requires(rpmlib): rpmlib(SetVersions)
Finding debuginfo files (using /usr/lib/rpm/find-debuginfo-files)
Executing: /bin/sh -e /usr/src/tmp/rpm-tmp.qmIlTF
Creating libkf5idletime-debuginfo package
Processing files: libkf5idletime-debuginfo-5.84.0-alt1
Finding Provides (using /usr/lib/rpm/find-provides)
Executing: /bin/sh -e /usr/src/tmp/rpm-tmp.sYDfzE
find-provides: running scripts (debuginfo)
Finding Requires (using /usr/lib/rpm/find-requires)
Executing: /bin/sh -e /usr/src/tmp/rpm-tmp.4EyRbC
find-requires: running scripts (debuginfo)
Provides: debug(libKF5IdleTime.so.5)
Requires: libkf5idletime = 5.84.0-alt1, debug(libQt5Core.so.5), debug(libQt5DBus.so.5), debug(libQt5Gui.so.5), debug(libQt5X11Extras.so.5), debug(libX11-xcb.so.1), debug(libX11.so.6), debug(libXext.so.6), debug(libXss.so.1), debug(libc.so.6), debug(libstdc++.so.6), debug(libxcb-sync.so.1), debug(libxcb.so.1)
Adding to libkf5idletime a strict dependency on kf5-kidletime-common
Adding to libkf5idletime-debuginfo a strict dependency on libkf5idletime
Adding to kf5-kidletime-devel a strict dependency on libkf5idletime
Removing 1 extra deps from kf5-kidletime-devel due to dependency on libkf5idletime
Wrote: /usr/src/RPM/RPMS/noarch/kf5-kidletime-common-5.84.0-alt1.noarch.rpm (w2.lzdio)
Wrote: /usr/src/RPM/RPMS/i586/kf5-kidletime-devel-5.84.0-alt1.i586.rpm (w2.lzdio)
Wrote: /usr/src/RPM/RPMS/i586/libkf5idletime-5.84.0-alt1.i586.rpm (w2.lzdio)
Wrote: /usr/src/RPM/RPMS/i586/libkf5idletime-debuginfo-5.84.0-alt1.i586.rpm (w2.lzdio)
71.13user 11.11system 0:38.21elapsed 215%CPU (0avgtext+0avgdata 223104maxresident)k
0inputs+0outputs (0major+1614947minor)pagefaults 0swaps
/.out/kf5-kidletime-common-5.84.0-alt1.noarch.rpm: bad symbols in the license tag: /
/.out/kf5-kidletime-devel-5.84.0-alt1.i586.rpm: bad symbols in the license tag: /
/.out/libkf5idletime-5.84.0-alt1.i586.rpm: bad symbols in the license tag: /
/.out/libkf5idletime-debuginfo-5.84.0-alt1.i586.rpm: bad symbols in the license tag: /
97.67user 22.17system 1:15.56elapsed 158%CPU (0avgtext+0avgdata 223104maxresident)k
38752inputs+0outputs (0major+2218646minor)pagefaults 0swaps
--- kf5-kidletime-devel-5.84.0-alt1.i586.rpm.repo 2021-07-15 00:15:14.000000000 +0000
+++ kf5-kidletime-devel-5.84.0-alt1.i586.rpm.hasher 2021-07-26 13:42:51.159268382 +0000
@@ -28,5 +28,5 @@
File: /usr/lib/cmake/KF5IdleTime/KF5IdleTimeTargets-release.cmake 100644 root:root fcfdd748c66367c1705e4706d88e7c4b
-File: /usr/lib/cmake/KF5IdleTime/KF5IdleTimeTargets.cmake 100644 root:root c7c7d9b431deabfdb20082b1c2a2d2d5
+File: /usr/lib/cmake/KF5IdleTime/KF5IdleTimeTargets.cmake 100644 root:root 7b00d9d05ca761a39ef488379835491a
File: /usr/lib/kf5/devel/libKF5IdleTime.so 120777 root:root ../../libKF5IdleTime.so.5
File: /usr/lib/qt5/mkspecs/modules/qt_KIdleTime.pri 100644 root:root 1a41e7caf73b8c959fbc3db1e7ebde62
-RPMIdentity: b9e70d65c93c252477be26c14d8c3279
+RPMIdentity: 4870fd1d2bd0e4be80c74ca7cec36878
--- libkf5idletime-5.84.0-alt1.i586.rpm.repo 2021-07-15 00:15:14.000000000 +0000
+++ libkf5idletime-5.84.0-alt1.i586.rpm.hasher 2021-07-26 13:42:51.287263752 +0000
@@ -33,6 +33,6 @@
File: /usr/lib/libKF5IdleTime.so.5 120777 root:root libKF5IdleTime.so.5.84.0
-File: /usr/lib/libKF5IdleTime.so.5.84.0 100644 root:root 2eba82bc75b9803aaea49f3172e02f84
+File: /usr/lib/libKF5IdleTime.so.5.84.0 100644 root:root dc16c5c96176532d9f8ee8171acc7408
File: /usr/lib/qt5/plugins/kf5/org.kde.kidletime.platforms 40755 root:root
-File: /usr/lib/qt5/plugins/kf5/org.kde.kidletime.platforms/KF5IdleTimeXcbPlugin0.so 100644 root:root 4ca14db48fca137baedf3facdcf48279
-File: /usr/lib/qt5/plugins/kf5/org.kde.kidletime.platforms/KF5IdleTimeXcbPlugin1.so 100644 root:root 43b984e1525c7ff777efd1df32079468
-RPMIdentity: 1af2a103a854a09486870c157539a273
+File: /usr/lib/qt5/plugins/kf5/org.kde.kidletime.platforms/KF5IdleTimeXcbPlugin0.so 100644 root:root 329afce99b453c0c2316f0c0903d52d5
+File: /usr/lib/qt5/plugins/kf5/org.kde.kidletime.platforms/KF5IdleTimeXcbPlugin1.so 100644 root:root 1735d49ca740e1da994a79b06ccb3843
+RPMIdentity: 7ef6a800060b8b5a7b262070a5670d21
--- libkf5idletime-debuginfo-5.84.0-alt1.i586.rpm.repo 2021-07-15 00:15:14.000000000 +0000
+++ libkf5idletime-debuginfo-5.84.0-alt1.i586.rpm.hasher 2021-07-26 13:42:51.416259086 +0000
@@ -1,10 +1,10 @@
-/usr/lib/debug/.build-id/25 40755 root:root
-/usr/lib/debug/.build-id/25/6d79c149f210b4ae33d269d67f1b5bcdc0e562 120777 root:root ../../../qt5/plugins/kf5/org.kde.kidletime.platforms/KF5IdleTimeXcbPlugin0.so
-/usr/lib/debug/.build-id/25/6d79c149f210b4ae33d269d67f1b5bcdc0e562.debug 120777 root:root ../../usr/lib/qt5/plugins/kf5/org.kde.kidletime.platforms/KF5IdleTimeXcbPlugin0.so.debug
-/usr/lib/debug/.build-id/a1 40755 root:root
-/usr/lib/debug/.build-id/a1/ce29d2a8164246be637da169275e1409577ace 120777 root:root ../../../qt5/plugins/kf5/org.kde.kidletime.platforms/KF5IdleTimeXcbPlugin1.so
-/usr/lib/debug/.build-id/a1/ce29d2a8164246be637da169275e1409577ace.debug 120777 root:root ../../usr/lib/qt5/plugins/kf5/org.kde.kidletime.platforms/KF5IdleTimeXcbPlugin1.so.debug
-/usr/lib/debug/.build-id/b3 40755 root:root
-/usr/lib/debug/.build-id/b3/6fa702f7b98d4c4dd8367d64e414948012d150 120777 root:root ../../../libKF5IdleTime.so.5.84.0
-/usr/lib/debug/.build-id/b3/6fa702f7b98d4c4dd8367d64e414948012d150.debug 120777 root:root ../../usr/lib/libKF5IdleTime.so.5.84.0.debug
+/usr/lib/debug/.build-id/46 40755 root:root
+/usr/lib/debug/.build-id/46/ed4bc1fbbe335c0de6434dd2213e6e8fb3508e 120777 root:root ../../../libKF5IdleTime.so.5.84.0
+/usr/lib/debug/.build-id/46/ed4bc1fbbe335c0de6434dd2213e6e8fb3508e.debug 120777 root:root ../../usr/lib/libKF5IdleTime.so.5.84.0.debug
+/usr/lib/debug/.build-id/ac 40755 root:root
+/usr/lib/debug/.build-id/ac/43d01d2a56166e483b48e8a5df789175a8ac4f 120777 root:root ../../../qt5/plugins/kf5/org.kde.kidletime.platforms/KF5IdleTimeXcbPlugin0.so
+/usr/lib/debug/.build-id/ac/43d01d2a56166e483b48e8a5df789175a8ac4f.debug 120777 root:root ../../usr/lib/qt5/plugins/kf5/org.kde.kidletime.platforms/KF5IdleTimeXcbPlugin0.so.debug
+/usr/lib/debug/.build-id/b2 40755 root:root
+/usr/lib/debug/.build-id/b2/0564e1c41fcc5cf0a34ba698d90009570506ff 120777 root:root ../../../qt5/plugins/kf5/org.kde.kidletime.platforms/KF5IdleTimeXcbPlugin1.so
+/usr/lib/debug/.build-id/b2/0564e1c41fcc5cf0a34ba698d90009570506ff.debug 120777 root:root ../../usr/lib/qt5/plugins/kf5/org.kde.kidletime.platforms/KF5IdleTimeXcbPlugin1.so.debug
/usr/lib/debug/usr/lib/libKF5IdleTime.so.5.84.0.debug 100644 root:root
@@ -73,12 +73,12 @@
Provides: libkf5idletime-debuginfo = 5.84.0-alt1:sisyphus+278761.1300.1.3
-File: /usr/lib/debug/.build-id/25 40755 root:root
-File: /usr/lib/debug/.build-id/25/6d79c149f210b4ae33d269d67f1b5bcdc0e562 120777 root:root ../../../qt5/plugins/kf5/org.kde.kidletime.platforms/KF5IdleTimeXcbPlugin0.so
-File: /usr/lib/debug/.build-id/25/6d79c149f210b4ae33d269d67f1b5bcdc0e562.debug 120777 root:root ../../usr/lib/qt5/plugins/kf5/org.kde.kidletime.platforms/KF5IdleTimeXcbPlugin0.so.debug
-File: /usr/lib/debug/.build-id/a1 40755 root:root
-File: /usr/lib/debug/.build-id/a1/ce29d2a8164246be637da169275e1409577ace 120777 root:root ../../../qt5/plugins/kf5/org.kde.kidletime.platforms/KF5IdleTimeXcbPlugin1.so
-File: /usr/lib/debug/.build-id/a1/ce29d2a8164246be637da169275e1409577ace.debug 120777 root:root ../../usr/lib/qt5/plugins/kf5/org.kde.kidletime.platforms/KF5IdleTimeXcbPlugin1.so.debug
-File: /usr/lib/debug/.build-id/b3 40755 root:root
-File: /usr/lib/debug/.build-id/b3/6fa702f7b98d4c4dd8367d64e414948012d150 120777 root:root ../../../libKF5IdleTime.so.5.84.0
-File: /usr/lib/debug/.build-id/b3/6fa702f7b98d4c4dd8367d64e414948012d150.debug 120777 root:root ../../usr/lib/libKF5IdleTime.so.5.84.0.debug
-File: /usr/lib/debug/usr/lib/libKF5IdleTime.so.5.84.0.debug 100644 root:root b91067bd04c0a154d856c0359ef2d1c7
+File: /usr/lib/debug/.build-id/46 40755 root:root
+File: /usr/lib/debug/.build-id/46/ed4bc1fbbe335c0de6434dd2213e6e8fb3508e 120777 root:root ../../../libKF5IdleTime.so.5.84.0
+File: /usr/lib/debug/.build-id/46/ed4bc1fbbe335c0de6434dd2213e6e8fb3508e.debug 120777 root:root ../../usr/lib/libKF5IdleTime.so.5.84.0.debug
+File: /usr/lib/debug/.build-id/ac 40755 root:root
+File: /usr/lib/debug/.build-id/ac/43d01d2a56166e483b48e8a5df789175a8ac4f 120777 root:root ../../../qt5/plugins/kf5/org.kde.kidletime.platforms/KF5IdleTimeXcbPlugin0.so
+File: /usr/lib/debug/.build-id/ac/43d01d2a56166e483b48e8a5df789175a8ac4f.debug 120777 root:root ../../usr/lib/qt5/plugins/kf5/org.kde.kidletime.platforms/KF5IdleTimeXcbPlugin0.so.debug
+File: /usr/lib/debug/.build-id/b2 40755 root:root
+File: /usr/lib/debug/.build-id/b2/0564e1c41fcc5cf0a34ba698d90009570506ff 120777 root:root ../../../qt5/plugins/kf5/org.kde.kidletime.platforms/KF5IdleTimeXcbPlugin1.so
+File: /usr/lib/debug/.build-id/b2/0564e1c41fcc5cf0a34ba698d90009570506ff.debug 120777 root:root ../../usr/lib/qt5/plugins/kf5/org.kde.kidletime.platforms/KF5IdleTimeXcbPlugin1.so.debug
+File: /usr/lib/debug/usr/lib/libKF5IdleTime.so.5.84.0.debug 100644 root:root 001535ed1f93e5f9c2419ca4d290dabd
File: /usr/lib/debug/usr/lib/libKF5IdleTime.so.5.debug 120777 root:root libKF5IdleTime.so.5.84.0.debug
@@ -88,4 +88,4 @@
File: /usr/lib/debug/usr/lib/qt5/plugins/kf5/org.kde.kidletime.platforms 40755 root:root
-File: /usr/lib/debug/usr/lib/qt5/plugins/kf5/org.kde.kidletime.platforms/KF5IdleTimeXcbPlugin0.so.debug 100644 root:root 02dbc1f0b544a21fe2e2c0ec1befea26
-File: /usr/lib/debug/usr/lib/qt5/plugins/kf5/org.kde.kidletime.platforms/KF5IdleTimeXcbPlugin1.so.debug 100644 root:root 00e741a79a9e7bb263d3df3be3ce04f9
+File: /usr/lib/debug/usr/lib/qt5/plugins/kf5/org.kde.kidletime.platforms/KF5IdleTimeXcbPlugin0.so.debug 100644 root:root 77724c2bbe21fce27a30ebcf58af6838
+File: /usr/lib/debug/usr/lib/qt5/plugins/kf5/org.kde.kidletime.platforms/KF5IdleTimeXcbPlugin1.so.debug 100644 root:root c96996275afa20388d56ef2c46a81a10
File: /usr/src/debug/kidletime-5.84.0 40755 root:root
@@ -95,6 +95,6 @@
File: /usr/src/debug/kidletime-5.84.0/BUILD/src/KF5IdleTime_autogen/EWIEGA46WW 40755 root:root
-File: /usr/src/debug/kidletime-5.84.0/BUILD/src/KF5IdleTime_autogen/EWIEGA46WW/moc_abstractsystempoller.cpp 100644 root:root c8ae88b8125a709408479381c6c85851
-File: /usr/src/debug/kidletime-5.84.0/BUILD/src/KF5IdleTime_autogen/EWIEGA46WW/moc_widgetbasedpoller.cpp 100644 root:root c9487ac4ecdd5094be336f1aa07d0d3e
+File: /usr/src/debug/kidletime-5.84.0/BUILD/src/KF5IdleTime_autogen/EWIEGA46WW/moc_abstractsystempoller.cpp 100644 root:root cd01ca0f39791b8f9992b041d1301562
+File: /usr/src/debug/kidletime-5.84.0/BUILD/src/KF5IdleTime_autogen/EWIEGA46WW/moc_widgetbasedpoller.cpp 100644 root:root 916bce947a3d498490e0794ed1447432
File: /usr/src/debug/kidletime-5.84.0/BUILD/src/KF5IdleTime_autogen/include 40755 root:root
-File: /usr/src/debug/kidletime-5.84.0/BUILD/src/KF5IdleTime_autogen/include/moc_kidletime.cpp 100644 root:root dd6a12e11a502808a4c5cdd5bd0368ef
+File: /usr/src/debug/kidletime-5.84.0/BUILD/src/KF5IdleTime_autogen/include/moc_kidletime.cpp 100644 root:root a33758c183736b638f8677ac1aba0a54
File: /usr/src/debug/kidletime-5.84.0/BUILD/src/logging.cpp 100644 root:root d1f483f794f27ff79cceb66fb19bf64a
@@ -105,6 +105,6 @@
File: /usr/src/debug/kidletime-5.84.0/BUILD/src/plugins/xscreensaver/KF5IdleTimeXcbPlugin1_autogen/EWIEGA46WW 40755 root:root
-File: /usr/src/debug/kidletime-5.84.0/BUILD/src/plugins/xscreensaver/KF5IdleTimeXcbPlugin1_autogen/EWIEGA46WW/moc_xscreensaverbasedpoller.cpp 100644 root:root e256e229a4e0a4a76e875c284d061f67
+File: /usr/src/debug/kidletime-5.84.0/BUILD/src/plugins/xscreensaver/KF5IdleTimeXcbPlugin1_autogen/EWIEGA46WW/moc_xscreensaverbasedpoller.cpp 100644 root:root e1e55f30ec6d4d7f9b3e5d239addf531
File: /usr/src/debug/kidletime-5.84.0/BUILD/src/plugins/xscreensaver/screensaver_interface.cpp 100644 root:root cc1f33ebb8c5025ad3be71ce64879408
File: /usr/src/debug/kidletime-5.84.0/BUILD/src/plugins/xscreensaver/screensaver_interface.h 100644 root:root 6c336cf77520e8df8b3330867728d270
-File: /usr/src/debug/kidletime-5.84.0/BUILD/src/plugins/xscreensaver/screensaver_interface.moc 100644 root:root 917e7d4cbd474c78f3edc3541b385aea
+File: /usr/src/debug/kidletime-5.84.0/BUILD/src/plugins/xscreensaver/screensaver_interface.moc 100644 root:root 3a211655a059101df15765c97dcc4f48
File: /usr/src/debug/kidletime-5.84.0/BUILD/src/plugins/xsync 40755 root:root
@@ -112,3 +112,3 @@
File: /usr/src/debug/kidletime-5.84.0/BUILD/src/plugins/xsync/KF5IdleTimeXcbPlugin0_autogen/EWIEGA46WW 40755 root:root
-File: /usr/src/debug/kidletime-5.84.0/BUILD/src/plugins/xsync/KF5IdleTimeXcbPlugin0_autogen/EWIEGA46WW/moc_xsyncbasedpoller.cpp 100644 root:root 626a5c44abdf1f45fcb187f70c7e6ab1
+File: /usr/src/debug/kidletime-5.84.0/BUILD/src/plugins/xsync/KF5IdleTimeXcbPlugin0_autogen/EWIEGA46WW/moc_xsyncbasedpoller.cpp 100644 root:root 00882790e656be4c1ba650fb60b3c04e
File: /usr/src/debug/kidletime-5.84.0/BUILD/src/plugins/xsync/xsync_logging.cpp 100644 root:root 853d0de7620d9fce9dbca77501e8756c
@@ -130,2 +130,2 @@
File: /usr/src/debug/kidletime-5.84.0/src/widgetbasedpoller.h 100644 root:root 3e25c2f717d2c661ebf3f62c9e1a119a
-RPMIdentity: 92c9d0863008f62bda17004c2086c4f1
+RPMIdentity: 5d2f69cfc9081802415e849785af827a