<86>Apr 27 12:15:04 userdel[2793736]: delete user 'rooter'
<86>Apr 27 12:15:04 userdel[2793736]: removed group 'rooter' owned by 'rooter'
<86>Apr 27 12:15:04 userdel[2793736]: removed shadow group 'rooter' owned by 'rooter'
<86>Apr 27 12:15:04 groupadd[2793762]: group added to /etc/group: name=rooter, GID=642
<86>Apr 27 12:15:04 groupadd[2793762]: group added to /etc/gshadow: name=rooter
<86>Apr 27 12:15:04 groupadd[2793762]: new group: name=rooter, GID=642
<86>Apr 27 12:15:04 useradd[2793773]: new user: name=rooter, UID=642, GID=642, home=/root, shell=/bin/bash
<86>Apr 27 12:15:04 userdel[2793804]: delete user 'builder'
<86>Apr 27 12:15:04 userdel[2793804]: removed group 'builder' owned by 'builder'
<86>Apr 27 12:15:04 userdel[2793804]: removed shadow group 'builder' owned by 'builder'
<86>Apr 27 12:15:04 groupadd[2793834]: group added to /etc/group: name=builder, GID=643
<86>Apr 27 12:15:04 groupadd[2793834]: group added to /etc/gshadow: name=builder
<86>Apr 27 12:15:04 groupadd[2793834]: new group: name=builder, GID=643
<86>Apr 27 12:15:04 useradd[2793843]: new user: name=builder, UID=643, GID=643, home=/usr/src, shell=/bin/bash
warning: Macro %Kbuild not found
warning: Macro %Kinstall not found
<13>Apr 27 12:15:08 rpmi: xorg-proto-devel-2020.1-alt1 sisyphus+250406.100.1.1 1587554810 installed
<13>Apr 27 12:15:08 rpmi: libexpat-2.2.10-alt1 sisyphus+259966.100.1.1 1602824518 installed
<13>Apr 27 12:15:08 rpmi: libjpeg-2:2.0.6-alt1 sisyphus+266888.100.1.1 1614172387 installed
<13>Apr 27 12:15:08 rpmi: libglvnd-7:1.3.2-alt1 sisyphus+254610.100.1.1 1594124268 installed
<13>Apr 27 12:15:08 rpmi: libpng16-1.6.37-alt1 sisyphus+236677.100.2.1 1566917998 installed
<13>Apr 27 12:15:08 rpmi: libogg-1.3.4-alt1 sisyphus+247109.100.1.1 1582849994 installed
<13>Apr 27 12:15:08 rpmi: libICE-1.0.10-alt1 sisyphus+247690.100.1.1 1584000387 installed
<13>Apr 27 12:15:08 rpmi: libICE-devel-1.0.10-alt1 sisyphus+247690.100.1.1 1584000387 installed
<13>Apr 27 12:15:08 rpmi: libSM-1.2.3-alt1 sisyphus+226734.100.2.1 1554586158 installed
<13>Apr 27 12:15:08 rpmi: libsqlite3-3.35.5-alt1 sisyphus+270436.100.1.1 1619019903 installed
<13>Apr 27 12:15:08 rpmi: zlib-devel-1.2.11-alt1 sisyphus+221902.6000.4.1 1550601058 installed
<13>Apr 27 12:15:08 rpmi: libwebp7-1.2.0-alt1 sisyphus+265504.100.2.1 1612122046 installed
<13>Apr 27 12:15:08 rpmi: qt4-common-4.8.7-alt22 sisyphus+267345.100.1.1 1614860588 installed
<13>Apr 27 12:15:08 rpmi: libqt4-core-4.8.7-alt22 sisyphus+267345.100.1.1 1614860588 installed
<13>Apr 27 12:15:08 rpmi: libqt4-sql-4.8.7-alt22 sisyphus+267345.100.1.1 1614860588 installed
<13>Apr 27 12:15:08 rpmi: libXau-1.0.9-alt1 sisyphus+223149.200.2.1 1551268152 installed
<13>Apr 27 12:15:08 rpmi: libwayland-server-1.19.0-alt1 sisyphus+265427.100.1.1 1611852858 installed
<13>Apr 27 12:15:09 rpmi: libicu67-1:6.7.1-alt2 sisyphus+252432.100.2.2 1590796126 installed
<13>Apr 27 12:15:09 rpmi: libgraphite2-1.3.14-alt2 sisyphus+250009.100.1.1 1586943065 installed
<13>Apr 27 12:15:09 rpmi: libidn2-2.3.0-alt1 sisyphus+240846.100.1.2 1573870475 installed
<13>Apr 27 12:15:09 rpmi: libgraphite2-devel-1.3.14-alt2 sisyphus+250009.100.1.1 1586943065 installed
<13>Apr 27 12:15:09 rpmi: icu-utils-1:6.7.1-alt2 sisyphus+252432.100.2.2 1590796126 installed
<13>Apr 27 12:15:09 rpmi: libicu-devel-1:6.7.1-alt2 sisyphus+252432.100.2.2 1590796126 installed
<13>Apr 27 12:15:09 rpmi: libXau-devel-1.0.9-alt1 sisyphus+223149.200.2.1 1551268152 installed
<13>Apr 27 12:15:09 rpmi: libqt4-sql-sqlite-4.8.7-alt22 sisyphus+267345.100.1.1 1614860588 installed
<13>Apr 27 12:15:09 rpmi: libqt4-xml-4.8.7-alt22 sisyphus+267345.100.1.1 1614860588 installed
<13>Apr 27 12:15:09 rpmi: libqjson-0.8.1-alt2 1446565447 installed
<13>Apr 27 12:15:09 rpmi: libqt4-clucene-4.8.7-alt22 sisyphus+267345.100.1.1 1614860588 installed
<13>Apr 27 12:15:09 rpmi: libqt4-test-4.8.7-alt22 sisyphus+267345.100.1.1 1614860588 installed
<13>Apr 27 12:15:09 rpmi: rpm-macros-qt4-4.8.7-alt22 sisyphus+267345.100.1.1 1614860012 installed
<13>Apr 27 12:15:09 rpmi: libpng-devel-1.6.37-alt1 sisyphus+236677.100.2.1 1566917998 installed
<13>Apr 27 12:15:09 rpmi: libSM-devel-1.2.3-alt1 sisyphus+226734.100.2.1 1554586158 installed
<13>Apr 27 12:15:09 rpmi: libflac8-1.3.3.0.62.ce6d-alt1 sisyphus+262142.100.1.1 1605801639 installed
<13>Apr 27 12:15:09 rpmi: libvorbis-1.3.7-alt1 sisyphus+256535.100.1.1 1597965510 installed
<13>Apr 27 12:15:09 rpmi: libOpenGL-7:1.3.2-alt1 sisyphus+254610.100.1.1 1594124268 installed
<13>Apr 27 12:15:09 rpmi: libGLES-7:1.3.2-alt1 sisyphus+254610.100.1.1 1594124268 installed
<13>Apr 27 12:15:09 rpmi: libopus-1.3.1-alt3 sisyphus+248017.100.1.1 1584520433 installed
<13>Apr 27 12:15:09 rpmi: libltdl7-2.4.6-alt3 sisyphus+269178.2000.13.1 1618328602 installed
<13>Apr 27 12:15:09 rpmi: libunixODBC2-2.3.7-alt1 sisyphus+228027.100.1.1 1556027338 installed
<13>Apr 27 12:15:09 rpmi: libunixODBC-devel-compat-2.3.7-alt1 sisyphus+228027.100.1.1 1556027338 installed
<13>Apr 27 12:15:09 rpmi: libunixODBC-devel-2.3.7-alt1 sisyphus+228027.100.1.1 1556027338 installed
<13>Apr 27 12:15:09 rpmi: liblcms2-2.12-alt1 sisyphus+265911.100.2.1 1613037796 installed
<13>Apr 27 12:15:09 rpmi: libmng-2.0.3-alt2 sisyphus+222619.100.1.1 1550943853 installed
<13>Apr 27 12:15:09 rpmi: libjbig-2.1-alt1 1401380926 installed
<13>Apr 27 12:15:09 rpmi: libtiff5-4.2.0-alt1 sisyphus+266365.100.2.1 1613478695 installed
<13>Apr 27 12:15:09 rpmi: libgsm-1.0.17-alt1 1523356165 installed
<13>Apr 27 12:15:09 rpmi: libsndfile-1.0.30-alt2 sisyphus+263035.100.1.1 1607353107 installed
<13>Apr 27 12:15:09 rpmi: liblz4-1:1.9.3-alt1 sisyphus+262305.100.1.1 1606099167 installed
<13>Apr 27 12:15:09 rpmi: libgpg-error-1.41-alt4 sisyphus+264254.200.1.1 1609440111 installed
<13>Apr 27 12:15:09 rpmi: libgcrypt20-1.9.2-alt1 sisyphus+266496.100.1.1 1613559234 installed
<13>Apr 27 12:15:09 rpmi: libsystemd-1:247.3-alt2 sisyphus+266129.100.1.3 1613012672 installed
<13>Apr 27 12:15:09 rpmi: libdbus-1.12.18-alt1 sisyphus+252758.100.1.1 1591203693 installed
<13>Apr 27 12:15:09 rpmi: libqt4-dbus-4.8.7-alt22 sisyphus+267345.100.1.1 1614860588 installed
<13>Apr 27 12:15:09 rpmi: libqt4-script-4.8.7-alt22 sisyphus+267345.100.1.1 1614860588 installed
<13>Apr 27 12:15:10 rpmi: libdbus-devel-1.12.18-alt1 sisyphus+252758.100.1.1 1591203693 installed
<13>Apr 27 12:15:10 rpmi: libxslt-1.1.34-alt2 sisyphus+248264.100.1.1 1584829770 installed
<13>Apr 27 12:15:10 rpmi: libasyncns-0.8-alt2.qa1 1365949820 installed
<13>Apr 27 12:15:10 rpmi: libxshmfence-1.3-alt1 sisyphus+223149.1000.2.1 1551268571 installed
<13>Apr 27 12:15:10 rpmi: libX11-locales-3:1.7.0-alt1 sisyphus+264667.100.1.2 1610655150 installed
<13>Apr 27 12:15:10 rpmi: libXdmcp-1.1.3-alt1 sisyphus+225206.600.1.2 1552949353 installed
<13>Apr 27 12:15:10 rpmi: libxcb-1.14-alt1 sisyphus+247358.200.1.3 1583854228 installed
<13>Apr 27 12:15:10 rpmi: libX11-3:1.7.0-alt1 sisyphus+264667.100.1.2 1610655170 installed
<13>Apr 27 12:15:10 rpmi: libXext-1.3.4-alt1 sisyphus+225206.700.1.2 1552949429 installed
<13>Apr 27 12:15:10 rpmi: libXfixes-5.0.3-alt1 sisyphus+226736.100.2.2 1554614841 installed
<13>Apr 27 12:15:10 rpmi: libXrender-0.9.10-alt1 sisyphus+261890.100.1.1 1605595177 installed
<13>Apr 27 12:15:10 rpmi: libXcursor-1.2.0-alt1 sisyphus+225206.400.1.2 1552949218 installed
<13>Apr 27 12:15:10 rpmi: libXrandr-1.5.2-alt1 sisyphus+225206.1300.1.2 1552949710 installed
<13>Apr 27 12:15:10 rpmi: libXi-1.7.10-alt1 sisyphus+232786.300.1.1 1561106978 installed
<13>Apr 27 12:15:10 rpmi: libXinerama-1.1.4-alt1 sisyphus+223149.300.2.1 1551268216 installed
<13>Apr 27 12:15:10 rpmi: libXxf86vm-1.1.4-alt2 1527672187 installed
<13>Apr 27 12:15:10 rpmi: libXtst-1.2.3-alt1 sisyphus+261890.200.1.1 1605595243 installed
<13>Apr 27 12:15:10 rpmi: libXv-1.0.11-alt1 1527685499 installed
<13>Apr 27 12:15:11 rpmi: libxcb-devel-1.14-alt1 sisyphus+247358.200.1.3 1583854228 installed
<13>Apr 27 12:15:11 rpmi: libX11-devel-3:1.7.0-alt1 sisyphus+264667.100.1.2 1610655170 installed
<13>Apr 27 12:15:11 rpmi: libXext-devel-1.3.4-alt1 sisyphus+225206.700.1.2 1552949429 installed
<13>Apr 27 12:15:11 rpmi: libXfixes-devel-5.0.3-alt1 sisyphus+226736.100.2.2 1554614841 installed
<13>Apr 27 12:15:11 rpmi: libXi-devel-1.7.10-alt1 sisyphus+232786.300.1.1 1561106978 installed
<13>Apr 27 12:15:11 rpmi: libXrender-devel-0.9.10-alt1 sisyphus+261890.100.1.1 1605595177 installed
<13>Apr 27 12:15:11 rpmi: libXrandr-devel-1.5.2-alt1 sisyphus+225206.1300.1.2 1552949710 installed
<13>Apr 27 12:15:11 rpmi: libXtst-devel-1.2.3-alt1 sisyphus+261890.200.1.1 1605595243 installed
<13>Apr 27 12:15:11 rpmi: libXv-devel-1.0.11-alt1 1527685499 installed
<13>Apr 27 12:15:11 rpmi: libXcursor-devel-1.2.0-alt1 sisyphus+225206.400.1.2 1552949218 installed
<13>Apr 27 12:15:11 rpmi: libXinerama-devel-1.1.4-alt1 sisyphus+223149.300.2.1 1551268216 installed
<13>Apr 27 12:15:11 rpmi: libpulseaudio-14.2-alt3 sisyphus+270439.100.1.1 1619021338 installed
<13>Apr 27 12:15:11 rpmi: libwayland-client-1.19.0-alt1 sisyphus+265427.100.1.1 1611852858 installed
<13>Apr 27 12:15:11 rpmi: libpciaccess-1:0.16-alt1 sisyphus+234814.100.1.1 1563438291 installed
<13>Apr 27 12:15:11 rpmi: libdrm-1:2.4.105-alt1 sisyphus+269183.100.1.1 1617867189 installed
<13>Apr 27 12:15:11 rpmi: libGLX-mesa-4:21.0.2-alt1 sisyphus+269183.200.1.1 1617867532 installed
<13>Apr 27 12:15:11 rpmi: libGLX-7:1.3.2-alt1 sisyphus+254610.100.1.1 1594124268 installed
<13>Apr 27 12:15:11 rpmi: libGL-7:1.3.2-alt1 sisyphus+254610.100.1.1 1594124268 installed
<13>Apr 27 12:15:11 rpmi: libGLU-4:9.0.1-alt1 sisyphus+248864.100.1.1 1585556461 installed
<13>Apr 27 12:15:11 rpmi: libgbm-4:21.0.2-alt1 sisyphus+269183.200.1.1 1617867532 installed
<13>Apr 27 12:15:11 rpmi: libEGL-mesa-4:21.0.2-alt1 sisyphus+269183.200.1.1 1617867532 installed
<13>Apr 27 12:15:11 rpmi: libEGL-7:1.3.2-alt1 sisyphus+254610.100.1.1 1594124268 installed
<13>Apr 27 12:15:11 rpmi: libglvnd-devel-7:1.3.2-alt1 sisyphus+254610.100.1.1 1594124268 installed
<13>Apr 27 12:15:11 rpmi: libGL-devel-4:21.0.2-alt1 sisyphus+269183.200.1.1 1617867532 installed
<13>Apr 27 12:15:11 rpmi: libGLU-devel-4:9.0.1-alt1 sisyphus+248864.100.1.1 1585556461 installed
<13>Apr 27 12:15:11 rpmi: rpm-macros-kde-common-devel-14.12.1-alt1 1422279175 installed
<13>Apr 27 12:15:11 rpmi: strace-5.12-alt1 sisyphus+270734.100.1.1 1619446048 installed
<13>Apr 27 12:15:11 rpmi: gcc-c++-common-1.4.27-alt1 sisyphus+262033.600.7.2 1607340230 installed
<13>Apr 27 12:15:12 rpmi: libstdc++10-devel-10.2.1-alt3 sisyphus+267829.100.1.1 1615808579 installed
<13>Apr 27 12:15:13 rpmi: gcc10-c++-10.2.1-alt3 sisyphus+267829.100.1.1 1615808579 installed
<13>Apr 27 12:15:13 rpmi: libgdbm-1.8.3-alt10 1454943334 installed
<13>Apr 27 12:15:13 rpmi: xml-utils-1:2.9.10-alt6 sisyphus+265234.30740.49.1 1613765060 installed
<13>Apr 27 12:15:13 rpmi: rpm-build-gir-0.7.3-alt3 sisyphus+242150.100.1.1 1575312005 installed
<13>Apr 27 12:15:13 rpmi: ed-1:0.2-alt10 1449768440 installed
<13>Apr 27 12:15:13 rpmi: rpm-utils-0.10.3-alt1 sisyphus+234377.400.6.1 1569421271 installed
<13>Apr 27 12:15:13 rpmi: rpm-macros-cmake-3.19.7-alt2 sisyphus+270569.40.2.1 1619208660 installed
<13>Apr 27 12:15:13 rpmi: cmake-modules-3.19.7-alt2 sisyphus+270569.40.2.1 1619208639 installed
<13>Apr 27 12:15:13 rpmi: libuv-1.41.0-alt2 sisyphus+267695.100.2.1 1615786345 installed
<13>Apr 27 12:15:13 rpmi: librhash-1.3.5-alt2 1505156279 installed
<13>Apr 27 12:15:13 rpmi: libjsoncpp19-1.8.4-alt5 sisyphus+243670.100.1.1 1577521267 installed
<13>Apr 27 12:15:13 rpmi: publicsuffix-list-dafsa-20210419-alt1 sisyphus+270358.100.1.1 1618924010 installed
<13>Apr 27 12:15:13 rpmi: libpsl-0.21.1-alt1 sisyphus+255206.100.1.1 1595348938 installed
<13>Apr 27 12:15:13 rpmi: libnghttp2-1.41.0-alt1 sisyphus+253680.100.1.1 1592642271 installed
<13>Apr 27 12:15:13 rpmi: openldap-common-2.4.57-alt1 sisyphus+266287.100.1.1 1613244218 installed
<13>Apr 27 12:15:13 rpmi: libverto-0.3.2-alt1_1 sisyphus+268398.100.1.1 1616717462 installed
<13>Apr 27 12:15:13 rpmi: liblmdb-0.9.23-alt1 sisyphus+225277.100.2.1 1553001679 installed
<13>Apr 27 12:15:13 rpmi: libkeyutils-1.6.3-alt1 sisyphus+266061.100.1.1 1612919567 installed
<13>Apr 27 12:15:13 rpmi: libcom_err-1.45.6.0.24.af1a-alt1 sisyphus+262279.100.1.1 1606088229 installed
<13>Apr 27 12:15:13 rpmi: libbrotlicommon-1.0.9-alt2 sisyphus+257777.100.1.1 1599688017 installed
<13>Apr 27 12:15:13 rpmi: libbrotlidec-1.0.9-alt2 sisyphus+257777.100.1.1 1599688017 installed
<13>Apr 27 12:15:13 rpmi: libharfbuzz-2.6.8-alt1 sisyphus+254028.100.1.1 1593106819 installed
<13>Apr 27 12:15:13 rpmi: libfreetype-2.10.4-alt2 sisyphus+260293.100.2.1 1604479496 installed
<13>Apr 27 12:15:13 rpmi: fontconfig-2.13.1-alt1 sisyphus+257555.100.1.1 1599475160 installed
Updating fonts cache: <29>Apr 27 12:15:14 fontconfig: Updating fonts cache: succeeded
[ DONE ]
<13>Apr 27 12:15:14 rpmi: libqt4-gui-4.8.7-alt22 sisyphus+267345.100.1.1 1614860588 installed
<13>Apr 27 12:15:14 rpmi: libqt4-opengl-4.8.7-alt22 sisyphus+267345.100.1.1 1614860588 installed
<13>Apr 27 12:15:15 rpmi: libqt4-designer-4.8.7-alt22 sisyphus+267345.100.1.1 1614860588 installed
<13>Apr 27 12:15:15 rpmi: libphonon-4.8.3-alt1 1418134069 installed
<13>Apr 27 12:15:15 rpmi: libphononexperimental-4.8.3-alt1 1418134069 installed
<13>Apr 27 12:15:15 rpmi: libqt4-uitools-4.8.7-alt22 sisyphus+267345.100.1.1 1614860588 installed
<13>Apr 27 12:15:15 rpmi: libqt4-svg-4.8.7-alt22 sisyphus+267345.100.1.1 1614860588 installed
<13>Apr 27 12:15:15 rpmi: libqt4-scripttools-4.8.7-alt22 sisyphus+267345.100.1.1 1614860588 installed
<13>Apr 27 12:15:15 rpmi: libharfbuzz-icu-2.6.8-alt1 sisyphus+254028.100.1.1 1593106819 installed
<13>Apr 27 12:15:15 rpmi: libharfbuzz-gobject-2.6.8-alt1 sisyphus+254028.100.1.1 1593106819 installed
<13>Apr 27 12:15:15 rpmi: libp11-kit-0.23.15-alt2 sisyphus+252784.100.2.2 1591274901 installed
<13>Apr 27 12:15:15 rpmi: libtasn1-4.16.0-alt1 sisyphus+245480.100.1.1 1580825062 installed
<13>Apr 27 12:15:15 rpmi: rpm-macros-alternatives-0.5.1-alt1 sisyphus+226946.100.1.1 1554830426 installed
<13>Apr 27 12:15:15 rpmi: alternatives-0.5.1-alt1 sisyphus+226946.100.1.1 1554830426 installed
<13>Apr 27 12:15:15 rpmi: ca-certificates-2021.03.24-alt1 sisyphus+268304.300.1.1 1616591829 installed
<13>Apr 27 12:15:15 rpmi: ca-trust-0.1.2-alt1 sisyphus+233348.100.1.1 1561653823 installed
<13>Apr 27 12:15:15 rpmi: p11-kit-trust-0.23.15-alt2 sisyphus+252784.100.2.2 1591274901 installed
<13>Apr 27 12:15:15 rpmi: libcrypto1.1-1.1.1k-alt1 sisyphus+268375.100.1.1 1616684255 installed
<13>Apr 27 12:15:15 rpmi: libssl1.1-1.1.1k-alt1 sisyphus+268375.100.1.1 1616684255 installed
<13>Apr 27 12:15:15 rpmi: libqt4-network-4.8.7-alt22 sisyphus+267345.100.1.1 1614860588 installed
<13>Apr 27 12:15:15 rpmi: libpython3-3.9.4-alt1 sisyphus+268966.100.1.1 1617609166 installed
<13>Apr 27 12:15:15 rpmi: python3-3.9.4-alt1 sisyphus+268966.100.1.1 1617609166 installed
<13>Apr 27 12:15:16 rpmi: python3-base-3.9.4-alt1 sisyphus+268966.100.1.1 1617609166 installed
<86>Apr 27 12:15:16 groupadd[2829908]: group added to /etc/group: name=_keytab, GID=499
<86>Apr 27 12:15:16 groupadd[2829908]: group added to /etc/gshadow: name=_keytab
<86>Apr 27 12:15:16 groupadd[2829908]: new group: name=_keytab, GID=499
<13>Apr 27 12:15:16 rpmi: libkrb5-1.19.1-alt2 sisyphus+267847.100.1.1 1615814853 installed
<86>Apr 27 12:15:16 groupadd[2830219]: group added to /etc/group: name=sasl, GID=498
<86>Apr 27 12:15:16 groupadd[2830219]: group added to /etc/gshadow: name=sasl
<86>Apr 27 12:15:16 groupadd[2830219]: new group: name=sasl, GID=498
<13>Apr 27 12:15:16 rpmi: libsasl2-3-2.1.27-alt2.1 sisyphus+255909.100.2.1 1597199456 installed
<13>Apr 27 12:15:16 rpmi: libldap-2.4.57-alt1 sisyphus+266287.100.1.1 1613244306 installed
<13>Apr 27 12:15:16 rpmi: libcurl-7.76.1-alt1 sisyphus+269986.100.1.1 1618487446 installed
<13>Apr 27 12:15:16 rpmi: glib2-devel-2.68.1-alt1 sisyphus+269248.100.1.1 1617921065 installed
<13>Apr 27 12:15:16 rpmi: libfreetype-devel-2.10.4-alt2 sisyphus+260293.100.2.1 1604479496 installed
<13>Apr 27 12:15:16 rpmi: libharfbuzz-devel-2.6.8-alt1 sisyphus+254028.100.1.1 1593106819 installed
<13>Apr 27 12:15:16 rpmi: fontconfig-devel-2.13.1-alt1 sisyphus+257555.100.1.1 1599475160 installed
<13>Apr 27 12:15:17 rpmi: libqt4-xmlpatterns-4.8.7-alt22 sisyphus+267345.100.1.1 1614860588 installed
<13>Apr 27 12:15:17 rpmi: libqt4-declarative-4.8.7-alt22 sisyphus+267345.100.1.1 1614860588 installed
<13>Apr 27 12:15:18 rpmi: libqt4-webkit-1:2.3.4-alt8 sisyphus+243037.100.3.1 1576541718 installed
<13>Apr 27 12:15:18 rpmi: libqt4-qt3support-4.8.7-alt22 sisyphus+267345.100.1.1 1614860588 installed
<13>Apr 27 12:15:18 rpmi: libqt4-help-4.8.7-alt22 sisyphus+267345.100.1.1 1614860588 installed
<13>Apr 27 12:15:18 rpmi: libssl-devel-1.1.1k-alt1 sisyphus+268375.100.1.1 1616684255 installed
<13>Apr 27 12:15:18 rpmi: libarchive13-3.4.3-alt1 sisyphus+258566.100.1.2 1600916107 installed
<13>Apr 27 12:15:18 rpmi: alsa-ucm-conf-1.2.4-alt1 sisyphus+260180.200.1.1 1603282405 installed
<13>Apr 27 12:15:18 rpmi: alsa-topology-conf-1.2.4-alt1 sisyphus+260180.100.1.1 1603282384 installed
<13>Apr 27 12:15:18 rpmi: libalsa-1:1.2.4-alt1 sisyphus+260180.300.1.1 1603282509 installed
<13>Apr 27 12:15:18 rpmi: libqt4-multimedia-4.8.7-alt22 sisyphus+267345.100.1.1 1614860588 installed
<13>Apr 27 12:15:18 rpmi: phonon-devel-4.8.3-alt1 1418134069 installed
<13>Apr 27 12:15:18 rpmi: libqt4-webkit-devel-1:2.3.4-alt8 sisyphus+243037.100.3.1 1576541718 installed
<13>Apr 27 12:15:18 rpmi: libqt4-devel-4.8.7-alt22 sisyphus+267345.100.1.1 1614860588 installed
<13>Apr 27 12:15:18 rpmi: qjson-devel-0.8.1-alt2 1446565447 installed
<13>Apr 27 12:15:19 rpmi: cmake-3.19.7-alt2 sisyphus+270569.40.2.1 1619208660 installed
<13>Apr 27 12:15:19 rpmi: kde-common-devel-14.12.1-alt1 1422279175 installed
<13>Apr 27 12:15:19 rpmi: gcc-c++-10-alt1 sisyphus+263054.200.3.1 1607516810 installed
<13>Apr 27 12:15:19 rpmi: doxygen-1:1.8.17-alt2 sisyphus+251932.100.4.1 1589893423 installed
Building target platforms: i586
Building for target i586
Wrote: /usr/src/in/nosrpm/dbusmenu-qt-0.9.3-alt0.2.nosrc.rpm (w1.gzdio)
Installing dbusmenu-qt-0.9.3-alt0.2.src.rpm
Building target platforms: i586
Building for target i586
Executing(%prep): /bin/sh -e /usr/src/tmp/rpm-tmp.95208
+ umask 022
+ /bin/mkdir -p /usr/src/RPM/BUILD
+ cd /usr/src/RPM/BUILD
+ cd /usr/src/RPM/BUILD
+ rm -rf libdbusmenu-qt-0.9.3
+ echo 'Source #0 (libdbusmenu-qt-0.9.3.tar):'
Source #0 (libdbusmenu-qt-0.9.3.tar):
+ /bin/tar -xf /usr/src/RPM/SOURCES/libdbusmenu-qt-0.9.3.tar
+ cd libdbusmenu-qt-0.9.3
+ /bin/chmod -c -Rf u+rwX,go-w .
+ exit 0
Executing(%build): /bin/sh -e /usr/src/tmp/rpm-tmp.95208
+ umask 022
+ /bin/mkdir -p /usr/src/RPM/BUILD
+ cd /usr/src/RPM/BUILD
+ cd libdbusmenu-qt-0.9.3
+ __kde_build -DUSE_QT4=ON -DUSE_QT5=OFF
+ mkdir -p BUILD-i586-alt-linux
+ __kde4_cmake -DINCLUDE_INSTALL_DIR=/usr/include -DSOUND_INSTALL_DIR=/usr/share/sounds -DAUTOSTART_INSTALL_DIR=/etc/xdg/autostart -DXDG_DIRECTORY_INSTALL_DIR=/usr/share/desktop-directories -DXDG_APPS_INSTALL_DIR=/usr/share/applications -DUSE_QT4=ON -DUSE_QT5=OFF
+ export PATH=/usr/lib/kde4/bin:/usr/src/bin:/bin:/usr/bin:/usr/X11R6/bin:/usr/games
+ PATH=/usr/lib/kde4/bin:/usr/src/bin:/bin:/usr/bin:/usr/X11R6/bin:/usr/games
+ pushd BUILD-i586-alt-linux
~/RPM/BUILD/libdbusmenu-qt-0.9.3/BUILD-i586-alt-linux ~/RPM/BUILD/libdbusmenu-qt-0.9.3
+ cmake .. -DCMAKE_SKIP_RPATH:BOOL=yes -DCMAKE_BUILD_TYPE=Release '-DCMAKE_C_FLAGS:STRING=-pipe -frecord-gcc-switches -Wall -g -O2 -march=i586 -mtune=generic' '-DCMAKE_CXX_FLAGS:STRING=-pipe -frecord-gcc-switches -Wall -g -O2 -march=i586 -mtune=generic' '-DCMAKE_EXE_LINKER_FLAGS:STRING=-L/usr/lib/kde4link -L/usr/lib/kde4/devel' '-DCMAKE_MODULE_LINKER_FLAGS:STRING=-L/usr/lib/kde4link -L/usr/lib/kde4/devel' '-DCMAKE_SHARED_LINKER_FLAGS:STRING=-L/usr/lib/kde4link -L/usr/lib/kde4/devel' '-DCMAKE_LIBRARY_PATH:LIST=/usr/lib/kde4/devel;/usr/lib/kde4link;/usr/lib;/lib' -DLIB_DESTINATION=lib -DLIB_SUFFIX= -DCMAKE_INSTALL_PREFIX=/usr -DBIN_INSTALL_DIR=/usr/bin -DSBIN_INSTALL_DIR=/usr/sbin -DICON_INSTALL_DIR=/usr/share/icons -DXDG_APPS_INSTALL_DIR=/usr/share/applications/kde4 -DXDG_DIRECTORY_INSTALL_DIR=/usr/share/desktop-directories -DLIB_INSTALL_DIR=/usr/lib -DLIBEXEC_INSTALL_DIR=/usr/lib/kde4/libexec -DINCLUDE_INSTALL_DIR=/usr/include/kde4 -DKDE4_INCLUDE_INSTALL_DIR=/usr/include/kde4 -DSYSCONF_INSTALL_DIR=/etc -DDATA_INSTALL_DIR=/usr/share/kde4/apps -DCONFIG_INSTALL_DIR=/usr/share/kde4/config -DKCFG_INSTALL_DIR=/usr/share/kde4/config.kcfg -DHTML_INSTALL_DIR=/usr/share/kde4/doc/HTML -DAPPLNK_INSTALL_DIR=/usr/share/applnk -DLOCALE_INSTALL_DIR=/usr/share/kde4/locale -DSERVICES_INSTALL_DIR=/usr/share/kde4/services -DSERVICETYPES_INSTALL_DIR=/usr/share/kde4/servicetypes -DKCONF_UPDATE_INSTALL_DIR=/usr/share/kde4/apps/kconf_update -DXDG_MIME_INSTALL_DIR=/usr/share/mime/packages -DAUTOSTART_INSTALL_DIR=/usr/share/kde4/autostart -DSOUND_INSTALL_DIR=/usr/share/kde4/sounds -DTEMPLATES_INSTALL_DIR=/usr/share/kde4/templates -DWALLPAPER_INSTALL_DIR=/usr/share/wallpapers -DDBUS_INTERFACES_INSTALL_DIR=/usr/share/dbus-1/interfaces -DDBUS_SERVICES_INSTALL_DIR=/usr/share/dbus-1/services -DDBUS_SYSTEM_SERVICES_INSTALL_DIR=/usr/share/dbus-1/system-services -DMAN_INSTALL_DIR=/usr/share/man -DINFO_INSTALL_DIR=/usr/share/info -DINSTALL_PYTHON_FILES_IN_PYTHON_PREFIX:BOOL=yes -DINCLUDE_INSTALL_DIR=/usr/include -DSOUND_INSTALL_DIR=/usr/share/sounds -DAUTOSTART_INSTALL_DIR=/etc/xdg/autostart -DXDG_DIRECTORY_INSTALL_DIR=/usr/share/desktop-directories -DXDG_APPS_INSTALL_DIR=/usr/share/applications -DUSE_QT4=ON -DUSE_QT5=OFF
-- The C compiler identification is GNU 10.2.1
-- The CXX compiler identification is GNU 10.2.1
-- Detecting C compiler ABI info
-- Detecting C compiler ABI info - done
-- Check for working C compiler: /usr/bin/cc - skipped
-- Detecting C compile features
-- Detecting C compile features - done
-- Detecting CXX compiler ABI info
-- Detecting CXX compiler ABI info - done
-- Check for working CXX compiler: /usr/bin/c++ - skipped
-- Detecting CXX compile features
-- Detecting CXX compile features - done
CMake Deprecation Warning at CMakeLists.txt:2 (cmake_minimum_required):
  Compatibility with CMake < 2.8.12 will be removed from a future version of
  CMake.

  Update the VERSION argument <min> value or use a ...<max> suffix to tell
  CMake that the project does not need compatibility with older versions.


-- Looking for Q_WS_X11
-- Looking for Q_WS_X11 - found
-- Looking for Q_WS_WIN
-- Looking for Q_WS_WIN - not found
-- Looking for Q_WS_QWS
-- Looking for Q_WS_QWS - not found
-- Looking for Q_WS_MAC
-- Looking for Q_WS_MAC - not found
-- Found Qt4: /usr/bin/qmake-qt4 (found version "4.8.7") 
-- Performing Test __DBUSMENU_HAVE_GCC_VISIBILITY
-- Performing Test __DBUSMENU_HAVE_GCC_VISIBILITY - Success
-- Performing Test __DBUSMENU_HAVE_W_OVERLOADED_VIRTUAL
-- Performing Test __DBUSMENU_HAVE_W_OVERLOADED_VIRTUAL - Success
-- Performing Test __DBUSMENU_HAVE_CXX11
-- Performing Test __DBUSMENU_HAVE_CXX11 - Success
-- Performing Test __DBUSMENU_HAVE_W_ALL
-- Performing Test __DBUSMENU_HAVE_W_ALL - Success
-- Performing Test HAVE_QICON_NAME
-- Performing Test HAVE_QICON_NAME - Success
CMake Deprecation Warning at /usr/share/cmake/Modules/Qt4Macros.cmake:372 (message):
  The qt4_automoc macro is obsolete.  Use the CMAKE_AUTOMOC feature instead.
Call Stack (most recent call first):
  src/CMakeLists.txt:68 (qt4_automoc)


CMake Deprecation Warning at /usr/share/cmake/Modules/Qt4Macros.cmake:372 (message):
  The qt4_automoc macro is obsolete.  Use the CMAKE_AUTOMOC feature instead.
Call Stack (most recent call first):
  tests/CMakeLists.txt:2 (qt4_automoc)


CMake Deprecation Warning at /usr/share/cmake/Modules/Qt4Macros.cmake:372 (message):
  The qt4_automoc macro is obsolete.  Use the CMAKE_AUTOMOC feature instead.
Call Stack (most recent call first):
  tests/CMakeLists.txt:81 (qt4_automoc)


CMake Deprecation Warning at /usr/share/cmake/Modules/Qt4Macros.cmake:372 (message):
  The qt4_automoc macro is obsolete.  Use the CMAKE_AUTOMOC feature instead.
Call Stack (most recent call first):
  tests/CMakeLists.txt:98 (qt4_automoc)


CMake Deprecation Warning at /usr/share/cmake/Modules/Qt4Macros.cmake:372 (message):
  The qt4_automoc macro is obsolete.  Use the CMAKE_AUTOMOC feature instead.
Call Stack (most recent call first):
  tests/CMakeLists.txt:114 (qt4_automoc)


CMake Warning (dev) at /usr/share/cmake/Modules/FindPackageHandleStandardArgs.cmake:426 (message):
  The package name passed to `find_package_handle_standard_args` (PkgConfig)
  does not match the name of the calling package (QJSON).  This can lead to
  problems in calling code that expects `find_package` result variables
  (e.g., `_FOUND`) to follow a certain pattern.
Call Stack (most recent call first):
  /usr/share/cmake/Modules/FindPkgConfig.cmake:67 (find_package_handle_standard_args)
  cmake/modules/FindQJSON.cmake:19 (include)
  tools/CMakeLists.txt:1 (find_package)
This warning is for project developers.  Use -Wno-dev to suppress it.

-- Found PkgConfig: /usr/bin/pkg-config (found version "0.29.2") 
-- Checking for module 'QJson>=0.5'
--   Found QJson, version 0.8.1
-- Found QJSON: /usr/lib/libqjson.so  
-- QJSON found, testapp will be built
-- Configuring done
-- Generating done
CMake Warning:
  Manually-specified variables were not used by the project:

    APPLNK_INSTALL_DIR
    AUTOSTART_INSTALL_DIR
    BIN_INSTALL_DIR
    CMAKE_MODULE_LINKER_FLAGS
    CONFIG_INSTALL_DIR
    DATA_INSTALL_DIR
    DBUS_INTERFACES_INSTALL_DIR
    DBUS_SERVICES_INSTALL_DIR
    DBUS_SYSTEM_SERVICES_INSTALL_DIR
    HTML_INSTALL_DIR
    ICON_INSTALL_DIR
    INFO_INSTALL_DIR
    INSTALL_PYTHON_FILES_IN_PYTHON_PREFIX
    KCFG_INSTALL_DIR
    KCONF_UPDATE_INSTALL_DIR
    KDE4_INCLUDE_INSTALL_DIR
    LIBEXEC_INSTALL_DIR
    LIB_SUFFIX
    LOCALE_INSTALL_DIR
    MAN_INSTALL_DIR
    SBIN_INSTALL_DIR
    SERVICES_INSTALL_DIR
    SERVICETYPES_INSTALL_DIR
    SOUND_INSTALL_DIR
    SYSCONF_INSTALL_DIR
    TEMPLATES_INSTALL_DIR
    WALLPAPER_INSTALL_DIR
    XDG_APPS_INSTALL_DIR
    XDG_MIME_INSTALL_DIR


-- Build files have been written to: /usr/src/RPM/BUILD/libdbusmenu-qt-0.9.3/BUILD-i586-alt-linux
+ popd
~/RPM/BUILD/libdbusmenu-qt-0.9.3
+ __kde4_make
+ pushd BUILD-i586-alt-linux
~/RPM/BUILD/libdbusmenu-qt-0.9.3/BUILD-i586-alt-linux ~/RPM/BUILD/libdbusmenu-qt-0.9.3
+ make -j8
make[2]: Entering directory '/usr/src/RPM/BUILD/libdbusmenu-qt-0.9.3/BUILD-i586-alt-linux'
Scanning dependencies of target doc
make[2]: Leaving directory '/usr/src/RPM/BUILD/libdbusmenu-qt-0.9.3/BUILD-i586-alt-linux'
make[2]: Entering directory '/usr/src/RPM/BUILD/libdbusmenu-qt-0.9.3/BUILD-i586-alt-linux'
[  3%] Generating dbusmenuimporter.moc
make[2]: Leaving directory '/usr/src/RPM/BUILD/libdbusmenu-qt-0.9.3/BUILD-i586-alt-linux'
make[2]: Entering directory '/usr/src/RPM/BUILD/libdbusmenu-qt-0.9.3/BUILD-i586-alt-linux'
[  6%] Generating dbusmenu_p.moc
make[2]: Leaving directory '/usr/src/RPM/BUILD/libdbusmenu-qt-0.9.3/BUILD-i586-alt-linux'
make[2]: Entering directory '/usr/src/RPM/BUILD/libdbusmenu-qt-0.9.3/BUILD-i586-alt-linux'
[  9%] Generating dbusmenuadaptor.cpp, dbusmenuadaptor.h
Warning: deprecated annotation 'com.trolltech.QtDBus.QtTypeName.Out0' found; suggest updating to 'org.qtproject.QtDBus.QtTypeName.Out0'
Warning: deprecated annotation 'com.trolltech.QtDBus.QtTypeName.In0' found; suggest updating to 'org.qtproject.QtDBus.QtTypeName.In0'
Warning: deprecated annotation 'com.trolltech.QtDBus.QtTypeName.In0' found; suggest updating to 'org.qtproject.QtDBus.QtTypeName.In0'
Warning: deprecated annotation 'com.trolltech.QtDBus.QtTypeName.Out1' found; suggest updating to 'org.qtproject.QtDBus.QtTypeName.Out1'
Warning: deprecated annotation 'com.trolltech.QtDBus.QtTypeName.Out1' found; suggest updating to 'org.qtproject.QtDBus.QtTypeName.Out1'
Warning: deprecated annotation 'com.trolltech.QtDBus.QtTypeName.In0' found; suggest updating to 'org.qtproject.QtDBus.QtTypeName.In0'
Warning: deprecated annotation 'com.trolltech.QtDBus.QtTypeName.In1' found; suggest updating to 'org.qtproject.QtDBus.QtTypeName.In1'
make[2]: Leaving directory '/usr/src/RPM/BUILD/libdbusmenu-qt-0.9.3/BUILD-i586-alt-linux'
make[2]: Entering directory '/usr/src/RPM/BUILD/libdbusmenu-qt-0.9.3/BUILD-i586-alt-linux'
warning: Tag 'SYMBOL_CACHE_SIZE' at line 42 of file 'Doxyfile' has become obsolete.
         To avoid this warning please remove this line from your configuration file or upgrade it using "doxygen -u"
warning: Tag 'SHOW_DIRECTORIES' at line 75 of file 'Doxyfile' has become obsolete.
         To avoid this warning please remove this line from your configuration file or upgrade it using "doxygen -u"
warning: Tag 'HTML_ALIGN_MEMBERS' at line 139 of file 'Doxyfile' has become obsolete.
         To avoid this warning please remove this line from your configuration file or upgrade it using "doxygen -u"
warning: Tag 'USE_INLINE_TREES' at line 166 of file 'Doxyfile' has become obsolete.
         To avoid this warning please remove this line from your configuration file or upgrade it using "doxygen -u"
warning: Tag 'XML_SCHEMA' at line 212 of file 'Doxyfile' has become obsolete.
         To avoid this warning please remove this line from your configuration file or upgrade it using "doxygen -u"
warning: Tag 'XML_DTD' at line 213 of file 'Doxyfile' has become obsolete.
         To avoid this warning please remove this line from your configuration file or upgrade it using "doxygen -u"
warning: Tag 'PERL_PATH' at line 245 of file 'Doxyfile' has become obsolete.
         To avoid this warning please remove this line from your configuration file or upgrade it using "doxygen -u"
warning: Tag 'MSCGEN_PATH' at line 250 of file 'Doxyfile' has become obsolete.
         To avoid this warning please remove this line from your configuration file or upgrade it using "doxygen -u"
make[2]: Leaving directory '/usr/src/RPM/BUILD/libdbusmenu-qt-0.9.3/BUILD-i586-alt-linux'
make[1]: Entering directory '/usr/src/RPM/BUILD/libdbusmenu-qt-0.9.3/BUILD-i586-alt-linux'
[ 15%] Built target doc
make[1]: Leaving directory '/usr/src/RPM/BUILD/libdbusmenu-qt-0.9.3/BUILD-i586-alt-linux'
make[2]: Entering directory '/usr/src/RPM/BUILD/libdbusmenu-qt-0.9.3/BUILD-i586-alt-linux'
[ 12%] Generating dbusmenuexporter.moc
make[2]: Leaving directory '/usr/src/RPM/BUILD/libdbusmenu-qt-0.9.3/BUILD-i586-alt-linux'
make[2]: Entering directory '/usr/src/RPM/BUILD/libdbusmenu-qt-0.9.3/BUILD-i586-alt-linux'
[ 15%] Generating dbusmenuexporterdbus_p.moc
make[2]: Leaving directory '/usr/src/RPM/BUILD/libdbusmenu-qt-0.9.3/BUILD-i586-alt-linux'
make[2]: Entering directory '/usr/src/RPM/BUILD/libdbusmenu-qt-0.9.3/BUILD-i586-alt-linux'
[ 18%] Generating dbusmenuadaptor.moc
make[2]: Leaving directory '/usr/src/RPM/BUILD/libdbusmenu-qt-0.9.3/BUILD-i586-alt-linux'
make[2]: Entering directory '/usr/src/RPM/BUILD/libdbusmenu-qt-0.9.3/BUILD-i586-alt-linux'
Scanning dependencies of target dbusmenu-qt
make[2]: Leaving directory '/usr/src/RPM/BUILD/libdbusmenu-qt-0.9.3/BUILD-i586-alt-linux'
make[2]: Entering directory '/usr/src/RPM/BUILD/libdbusmenu-qt-0.9.3/BUILD-i586-alt-linux'
[ 39%] Building CXX object src/CMakeFiles/dbusmenu-qt.dir/utils.cpp.o
make[2]: Leaving directory '/usr/src/RPM/BUILD/libdbusmenu-qt-0.9.3/BUILD-i586-alt-linux'
make[2]: Entering directory '/usr/src/RPM/BUILD/libdbusmenu-qt-0.9.3/BUILD-i586-alt-linux'
[ 36%] Building CXX object src/CMakeFiles/dbusmenu-qt.dir/dbusmenushortcut_p.cpp.o
make[2]: Leaving directory '/usr/src/RPM/BUILD/libdbusmenu-qt-0.9.3/BUILD-i586-alt-linux'
make[2]: Entering directory '/usr/src/RPM/BUILD/libdbusmenu-qt-0.9.3/BUILD-i586-alt-linux'
[ 33%] Building CXX object src/CMakeFiles/dbusmenu-qt.dir/dbusmenutypes_p.cpp.o
make[2]: Leaving directory '/usr/src/RPM/BUILD/libdbusmenu-qt-0.9.3/BUILD-i586-alt-linux'
make[2]: Entering directory '/usr/src/RPM/BUILD/libdbusmenu-qt-0.9.3/BUILD-i586-alt-linux'
[ 42%] Building CXX object src/CMakeFiles/dbusmenu-qt.dir/dbusmenuadaptor.cpp.o
make[2]: Leaving directory '/usr/src/RPM/BUILD/libdbusmenu-qt-0.9.3/BUILD-i586-alt-linux'
make[2]: Entering directory '/usr/src/RPM/BUILD/libdbusmenu-qt-0.9.3/BUILD-i586-alt-linux'
[ 21%] Building CXX object src/CMakeFiles/dbusmenu-qt.dir/dbusmenu_p.cpp.o
make[2]: Leaving directory '/usr/src/RPM/BUILD/libdbusmenu-qt-0.9.3/BUILD-i586-alt-linux'
make[2]: Entering directory '/usr/src/RPM/BUILD/libdbusmenu-qt-0.9.3/BUILD-i586-alt-linux'
[ 27%] Building CXX object src/CMakeFiles/dbusmenu-qt.dir/dbusmenuexporterdbus_p.cpp.o
make[2]: Leaving directory '/usr/src/RPM/BUILD/libdbusmenu-qt-0.9.3/BUILD-i586-alt-linux'
make[2]: Entering directory '/usr/src/RPM/BUILD/libdbusmenu-qt-0.9.3/BUILD-i586-alt-linux'
[ 30%] Building CXX object src/CMakeFiles/dbusmenu-qt.dir/dbusmenuimporter.cpp.o
make[2]: Leaving directory '/usr/src/RPM/BUILD/libdbusmenu-qt-0.9.3/BUILD-i586-alt-linux'
make[2]: Entering directory '/usr/src/RPM/BUILD/libdbusmenu-qt-0.9.3/BUILD-i586-alt-linux'
[ 24%] Building CXX object src/CMakeFiles/dbusmenu-qt.dir/dbusmenuexporter.cpp.o
make[2]: Leaving directory '/usr/src/RPM/BUILD/libdbusmenu-qt-0.9.3/BUILD-i586-alt-linux'
make[2]: Entering directory '/usr/src/RPM/BUILD/libdbusmenu-qt-0.9.3/BUILD-i586-alt-linux'
[ 45%] Linking CXX shared library libdbusmenu-qt.so
make[2]: Leaving directory '/usr/src/RPM/BUILD/libdbusmenu-qt-0.9.3/BUILD-i586-alt-linux'
make[1]: Entering directory '/usr/src/RPM/BUILD/libdbusmenu-qt-0.9.3/BUILD-i586-alt-linux'
[ 45%] Built target dbusmenu-qt
make[1]: Leaving directory '/usr/src/RPM/BUILD/libdbusmenu-qt-0.9.3/BUILD-i586-alt-linux'
make[2]: Entering directory '/usr/src/RPM/BUILD/libdbusmenu-qt-0.9.3/BUILD-i586-alt-linux'
[ 51%] Generating testutils.moc
make[2]: Leaving directory '/usr/src/RPM/BUILD/libdbusmenu-qt-0.9.3/BUILD-i586-alt-linux'
make[2]: Entering directory '/usr/src/RPM/BUILD/libdbusmenu-qt-0.9.3/BUILD-i586-alt-linux'
Scanning dependencies of target dbusmenubench-qtapp
make[2]: Leaving directory '/usr/src/RPM/BUILD/libdbusmenu-qt-0.9.3/BUILD-i586-alt-linux'
make[2]: Entering directory '/usr/src/RPM/BUILD/libdbusmenu-qt-0.9.3/BUILD-i586-alt-linux'
[ 63%] Generating slowmenu.moc
make[2]: Leaving directory '/usr/src/RPM/BUILD/libdbusmenu-qt-0.9.3/BUILD-i586-alt-linux'
make[2]: Entering directory '/usr/src/RPM/BUILD/libdbusmenu-qt-0.9.3/BUILD-i586-alt-linux'
[ 60%] Generating testutils.moc
make[2]: Leaving directory '/usr/src/RPM/BUILD/libdbusmenu-qt-0.9.3/BUILD-i586-alt-linux'
make[2]: Entering directory '/usr/src/RPM/BUILD/libdbusmenu-qt-0.9.3/BUILD-i586-alt-linux'
[ 48%] Generating dbusmenushortcuttest.moc
make[2]: Leaving directory '/usr/src/RPM/BUILD/libdbusmenu-qt-0.9.3/BUILD-i586-alt-linux'
make[2]: Entering directory '/usr/src/RPM/BUILD/libdbusmenu-qt-0.9.3/BUILD-i586-alt-linux'
[ 57%] Generating dbusmenuexportertest.moc
make[2]: Leaving directory '/usr/src/RPM/BUILD/libdbusmenu-qt-0.9.3/BUILD-i586-alt-linux'
make[2]: Entering directory '/usr/src/RPM/BUILD/libdbusmenu-qt-0.9.3/BUILD-i586-alt-linux'
Scanning dependencies of target slowmenu
make[2]: Leaving directory '/usr/src/RPM/BUILD/libdbusmenu-qt-0.9.3/BUILD-i586-alt-linux'
make[2]: Entering directory '/usr/src/RPM/BUILD/libdbusmenu-qt-0.9.3/BUILD-i586-alt-linux'
[ 54%] Generating dbusmenuimportertest.moc
make[2]: Leaving directory '/usr/src/RPM/BUILD/libdbusmenu-qt-0.9.3/BUILD-i586-alt-linux'
make[2]: Entering directory '/usr/src/RPM/BUILD/libdbusmenu-qt-0.9.3/BUILD-i586-alt-linux'
Scanning dependencies of target dbusmenushortcuttest
make[2]: Leaving directory '/usr/src/RPM/BUILD/libdbusmenu-qt-0.9.3/BUILD-i586-alt-linux'
make[2]: Entering directory '/usr/src/RPM/BUILD/libdbusmenu-qt-0.9.3/BUILD-i586-alt-linux'
Scanning dependencies of target dbusmenuexportertest
make[2]: Leaving directory '/usr/src/RPM/BUILD/libdbusmenu-qt-0.9.3/BUILD-i586-alt-linux'
make[2]: Entering directory '/usr/src/RPM/BUILD/libdbusmenu-qt-0.9.3/BUILD-i586-alt-linux'
Scanning dependencies of target dbusmenuimportertest
make[2]: Leaving directory '/usr/src/RPM/BUILD/libdbusmenu-qt-0.9.3/BUILD-i586-alt-linux'
make[2]: Entering directory '/usr/src/RPM/BUILD/libdbusmenu-qt-0.9.3/BUILD-i586-alt-linux'
[ 66%] Building CXX object tools/testapp/CMakeFiles/dbusmenubench-qtapp.dir/main.cpp.o
make[2]: Leaving directory '/usr/src/RPM/BUILD/libdbusmenu-qt-0.9.3/BUILD-i586-alt-linux'
make[2]: Entering directory '/usr/src/RPM/BUILD/libdbusmenu-qt-0.9.3/BUILD-i586-alt-linux'
[ 87%] Linking CXX executable dbusmenubench-qtapp
make[2]: Leaving directory '/usr/src/RPM/BUILD/libdbusmenu-qt-0.9.3/BUILD-i586-alt-linux'
make[1]: Entering directory '/usr/src/RPM/BUILD/libdbusmenu-qt-0.9.3/BUILD-i586-alt-linux'
[ 87%] Built target dbusmenubench-qtapp
make[1]: Leaving directory '/usr/src/RPM/BUILD/libdbusmenu-qt-0.9.3/BUILD-i586-alt-linux'
make[2]: Entering directory '/usr/src/RPM/BUILD/libdbusmenu-qt-0.9.3/BUILD-i586-alt-linux'
[ 78%] Building CXX object tests/CMakeFiles/dbusmenuexportertest.dir/testutils.cpp.o
make[2]: Leaving directory '/usr/src/RPM/BUILD/libdbusmenu-qt-0.9.3/BUILD-i586-alt-linux'
make[2]: Entering directory '/usr/src/RPM/BUILD/libdbusmenu-qt-0.9.3/BUILD-i586-alt-linux'
[ 84%] Building CXX object tests/CMakeFiles/dbusmenuimportertest.dir/testutils.cpp.o
make[2]: Leaving directory '/usr/src/RPM/BUILD/libdbusmenu-qt-0.9.3/BUILD-i586-alt-linux'
make[2]: Entering directory '/usr/src/RPM/BUILD/libdbusmenu-qt-0.9.3/BUILD-i586-alt-linux'
[ 72%] Building CXX object tests/CMakeFiles/dbusmenushortcuttest.dir/dbusmenushortcuttest.cpp.o
make[2]: Leaving directory '/usr/src/RPM/BUILD/libdbusmenu-qt-0.9.3/BUILD-i586-alt-linux'
make[2]: Entering directory '/usr/src/RPM/BUILD/libdbusmenu-qt-0.9.3/BUILD-i586-alt-linux'
[ 69%] Building CXX object tests/CMakeFiles/slowmenu.dir/slowmenu.cpp.o
make[2]: Leaving directory '/usr/src/RPM/BUILD/libdbusmenu-qt-0.9.3/BUILD-i586-alt-linux'
make[2]: Entering directory '/usr/src/RPM/BUILD/libdbusmenu-qt-0.9.3/BUILD-i586-alt-linux'
[ 90%] Linking CXX executable dbusmenushortcuttest
make[2]: Leaving directory '/usr/src/RPM/BUILD/libdbusmenu-qt-0.9.3/BUILD-i586-alt-linux'
make[1]: Entering directory '/usr/src/RPM/BUILD/libdbusmenu-qt-0.9.3/BUILD-i586-alt-linux'
[ 93%] Built target dbusmenushortcuttest
make[1]: Leaving directory '/usr/src/RPM/BUILD/libdbusmenu-qt-0.9.3/BUILD-i586-alt-linux'
make[2]: Entering directory '/usr/src/RPM/BUILD/libdbusmenu-qt-0.9.3/BUILD-i586-alt-linux'
[ 93%] Linking CXX executable slowmenu
make[2]: Leaving directory '/usr/src/RPM/BUILD/libdbusmenu-qt-0.9.3/BUILD-i586-alt-linux'
make[1]: Entering directory '/usr/src/RPM/BUILD/libdbusmenu-qt-0.9.3/BUILD-i586-alt-linux'
[ 93%] Built target slowmenu
make[1]: Leaving directory '/usr/src/RPM/BUILD/libdbusmenu-qt-0.9.3/BUILD-i586-alt-linux'
make[2]: Entering directory '/usr/src/RPM/BUILD/libdbusmenu-qt-0.9.3/BUILD-i586-alt-linux'
[ 81%] Building CXX object tests/CMakeFiles/dbusmenuimportertest.dir/dbusmenuimportertest.cpp.o
/usr/src/RPM/BUILD/libdbusmenu-qt-0.9.3/tests/dbusmenuimportertest.cpp: In member function 'void DBusMenuImporterTest::testStandardItem()':
/usr/src/RPM/BUILD/libdbusmenu-qt-0.9.3/tests/dbusmenuimportertest.cpp:61:14: warning: unused variable 'action' [-Wunused-variable]
   61 |     QAction *action = inputMenu.addAction("Test");
      |              ^~~~~~
/usr/src/RPM/BUILD/libdbusmenu-qt-0.9.3/tests/dbusmenuimportertest.cpp: In member function 'void DBusMenuImporterTest::testAddingNewItem()':
/usr/src/RPM/BUILD/libdbusmenu-qt-0.9.3/tests/dbusmenuimportertest.cpp:76:14: warning: unused variable 'action' [-Wunused-variable]
   76 |     QAction *action = inputMenu.addAction("Test");
      |              ^~~~~~
make[2]: Leaving directory '/usr/src/RPM/BUILD/libdbusmenu-qt-0.9.3/BUILD-i586-alt-linux'
make[2]: Entering directory '/usr/src/RPM/BUILD/libdbusmenu-qt-0.9.3/BUILD-i586-alt-linux'
[ 96%] Linking CXX executable dbusmenuimportertest
make[2]: Leaving directory '/usr/src/RPM/BUILD/libdbusmenu-qt-0.9.3/BUILD-i586-alt-linux'
make[1]: Entering directory '/usr/src/RPM/BUILD/libdbusmenu-qt-0.9.3/BUILD-i586-alt-linux'
[ 96%] Built target dbusmenuimportertest
make[1]: Leaving directory '/usr/src/RPM/BUILD/libdbusmenu-qt-0.9.3/BUILD-i586-alt-linux'
make[2]: Entering directory '/usr/src/RPM/BUILD/libdbusmenu-qt-0.9.3/BUILD-i586-alt-linux'
[ 75%] Building CXX object tests/CMakeFiles/dbusmenuexportertest.dir/dbusmenuexportertest.cpp.o
/usr/src/RPM/BUILD/libdbusmenu-qt-0.9.3/tests/dbusmenuexportertest.cpp: In member function 'void DBusMenuExporterTest::testNonExclusiveActionGroup()':
/usr/src/RPM/BUILD/libdbusmenu-qt-0.9.3/tests/dbusmenuexportertest.cpp:392:9: warning: unused variable 'a1Id' [-Wunused-variable]
  392 |     int a1Id = item.id;
      |         ^~~~
/usr/src/RPM/BUILD/libdbusmenu-qt-0.9.3/tests/dbusmenuexportertest.cpp:395:9: warning: unused variable 'a2Id' [-Wunused-variable]
  395 |     int a2Id = item.id;
      |         ^~~~
/usr/src/RPM/BUILD/libdbusmenu-qt-0.9.3/tests/dbusmenuexportertest.cpp: In member function 'void DBusMenuExporterTest::testMenuShortcut()':
/usr/src/RPM/BUILD/libdbusmenu-qt-0.9.3/tests/dbusmenuexportertest.cpp:459:23: warning: unused variable 'exporter' [-Wunused-variable]
  459 |     DBusMenuExporter *exporter = new DBusMenuExporter(TEST_OBJECT_PATH, &inputMenu);
      |                       ^~~~~~~~
/usr/src/RPM/BUILD/libdbusmenu-qt-0.9.3/tests/dbusmenuexportertest.cpp: In member function 'void DBusMenuExporterTest::testGetGroupProperties()':
/usr/src/RPM/BUILD/libdbusmenu-qt-0.9.3/tests/dbusmenuexportertest.cpp:501:23: warning: unused variable 'exporter' [-Wunused-variable]
  501 |     DBusMenuExporter *exporter = new DBusMenuExporter(TEST_OBJECT_PATH, &inputMenu);
      |                       ^~~~~~~~
/usr/src/RPM/BUILD/libdbusmenu-qt-0.9.3/tests/dbusmenuexportertest.cpp:503:14: warning: unused variable 'a1' [-Wunused-variable]
  503 |     QAction *a1 = inputMenu.addAction("a1");
      |              ^~
/usr/src/RPM/BUILD/libdbusmenu-qt-0.9.3/tests/dbusmenuexportertest.cpp:504:14: warning: unused variable 'a2' [-Wunused-variable]
  504 |     QAction *a2 = inputMenu.addAction("a2");
      |              ^~
/usr/src/RPM/BUILD/libdbusmenu-qt-0.9.3/tests/dbusmenuexportertest.cpp: In member function 'void DBusMenuExporterTest::testTrackActionsOnlyOnce()':
/usr/src/RPM/BUILD/libdbusmenu-qt-0.9.3/tests/dbusmenuexportertest.cpp:587:23: warning: unused variable 'exporter' [-Wunused-variable]
  587 |     DBusMenuExporter *exporter = new DBusMenuExporter(TEST_OBJECT_PATH, &mainMenu);
      |                       ^~~~~~~~
/usr/src/RPM/BUILD/libdbusmenu-qt-0.9.3/tests/dbusmenuexportertest.cpp: In member function 'void DBusMenuExporterTest::testDBusMenuObjectIsDeletedWhenExporterIsDeleted()':
/usr/src/RPM/BUILD/libdbusmenu-qt-0.9.3/tests/dbusmenuexportertest.cpp:647:14: warning: unused variable 'a1' [-Wunused-variable]
  647 |     QAction *a1 = inputMenu.addAction("a1");
      |              ^~
/usr/src/RPM/BUILD/libdbusmenu-qt-0.9.3/tests/dbusmenuexportertest.cpp: In member function 'void DBusMenuExporterTest::testSeparatorCollapsing()':
/usr/src/RPM/BUILD/libdbusmenu-qt-0.9.3/tests/dbusmenuexportertest.cpp:677:23: warning: unused variable 'exporter' [-Wunused-variable]
  677 |     DBusMenuExporter *exporter = new DBusMenuExporter(TEST_OBJECT_PATH, &inputMenu);
      |                       ^~~~~~~~
make[2]: Leaving directory '/usr/src/RPM/BUILD/libdbusmenu-qt-0.9.3/BUILD-i586-alt-linux'
make[2]: Entering directory '/usr/src/RPM/BUILD/libdbusmenu-qt-0.9.3/BUILD-i586-alt-linux'
[100%] Linking CXX executable dbusmenuexportertest
make[2]: Leaving directory '/usr/src/RPM/BUILD/libdbusmenu-qt-0.9.3/BUILD-i586-alt-linux'
make[1]: Entering directory '/usr/src/RPM/BUILD/libdbusmenu-qt-0.9.3/BUILD-i586-alt-linux'
[100%] Built target dbusmenuexportertest
make[1]: Leaving directory '/usr/src/RPM/BUILD/libdbusmenu-qt-0.9.3/BUILD-i586-alt-linux'
+ popd
~/RPM/BUILD/libdbusmenu-qt-0.9.3
+ exit 0
Executing(%install): /bin/sh -e /usr/src/tmp/rpm-tmp.1109
+ umask 022
+ /bin/mkdir -p /usr/src/RPM/BUILD
+ cd /usr/src/RPM/BUILD
+ /bin/chmod -Rf u+rwX -- /usr/src/tmp/dbusmenu-qt-buildroot
+ :
+ /bin/rm -rf -- /usr/src/tmp/dbusmenu-qt-buildroot
+ PATH=/usr/libexec/rpm-build:/usr/src/bin:/bin:/usr/bin:/usr/X11R6/bin:/usr/games
+ cd libdbusmenu-qt-0.9.3
+ __kde_install
+ make -C BUILD-i586-alt-linux DESTDIR=/usr/src/tmp/dbusmenu-qt-buildroot install
make: Entering directory '/usr/src/RPM/BUILD/libdbusmenu-qt-0.9.3/BUILD-i586-alt-linux'
make[1]: Entering directory '/usr/src/RPM/BUILD/libdbusmenu-qt-0.9.3/BUILD-i586-alt-linux'
make[2]: Entering directory '/usr/src/RPM/BUILD/libdbusmenu-qt-0.9.3/BUILD-i586-alt-linux'
make[2]: Leaving directory '/usr/src/RPM/BUILD/libdbusmenu-qt-0.9.3/BUILD-i586-alt-linux'
make[2]: Entering directory '/usr/src/RPM/BUILD/libdbusmenu-qt-0.9.3/BUILD-i586-alt-linux'
warning: Tag 'SYMBOL_CACHE_SIZE' at line 42 of file 'Doxyfile' has become obsolete.
         To avoid this warning please remove this line from your configuration file or upgrade it using "doxygen -u"
warning: Tag 'SHOW_DIRECTORIES' at line 75 of file 'Doxyfile' has become obsolete.
         To avoid this warning please remove this line from your configuration file or upgrade it using "doxygen -u"
warning: Tag 'HTML_ALIGN_MEMBERS' at line 139 of file 'Doxyfile' has become obsolete.
         To avoid this warning please remove this line from your configuration file or upgrade it using "doxygen -u"
warning: Tag 'USE_INLINE_TREES' at line 166 of file 'Doxyfile' has become obsolete.
         To avoid this warning please remove this line from your configuration file or upgrade it using "doxygen -u"
warning: Tag 'XML_SCHEMA' at line 212 of file 'Doxyfile' has become obsolete.
         To avoid this warning please remove this line from your configuration file or upgrade it using "doxygen -u"
warning: Tag 'XML_DTD' at line 213 of file 'Doxyfile' has become obsolete.
         To avoid this warning please remove this line from your configuration file or upgrade it using "doxygen -u"
warning: Tag 'PERL_PATH' at line 245 of file 'Doxyfile' has become obsolete.
         To avoid this warning please remove this line from your configuration file or upgrade it using "doxygen -u"
warning: Tag 'MSCGEN_PATH' at line 250 of file 'Doxyfile' has become obsolete.
         To avoid this warning please remove this line from your configuration file or upgrade it using "doxygen -u"
make[2]: Leaving directory '/usr/src/RPM/BUILD/libdbusmenu-qt-0.9.3/BUILD-i586-alt-linux'
[  0%] Built target doc
make[2]: Entering directory '/usr/src/RPM/BUILD/libdbusmenu-qt-0.9.3/BUILD-i586-alt-linux'
make[2]: Leaving directory '/usr/src/RPM/BUILD/libdbusmenu-qt-0.9.3/BUILD-i586-alt-linux'
[ 45%] Built target dbusmenu-qt
make[2]: Entering directory '/usr/src/RPM/BUILD/libdbusmenu-qt-0.9.3/BUILD-i586-alt-linux'
make[2]: Leaving directory '/usr/src/RPM/BUILD/libdbusmenu-qt-0.9.3/BUILD-i586-alt-linux'
[ 54%] Built target dbusmenushortcuttest
make[2]: Entering directory '/usr/src/RPM/BUILD/libdbusmenu-qt-0.9.3/BUILD-i586-alt-linux'
make[2]: Leaving directory '/usr/src/RPM/BUILD/libdbusmenu-qt-0.9.3/BUILD-i586-alt-linux'
[ 69%] Built target dbusmenuimportertest
make[2]: Entering directory '/usr/src/RPM/BUILD/libdbusmenu-qt-0.9.3/BUILD-i586-alt-linux'
make[2]: Leaving directory '/usr/src/RPM/BUILD/libdbusmenu-qt-0.9.3/BUILD-i586-alt-linux'
[ 84%] Built target dbusmenuexportertest
make[2]: Entering directory '/usr/src/RPM/BUILD/libdbusmenu-qt-0.9.3/BUILD-i586-alt-linux'
make[2]: Leaving directory '/usr/src/RPM/BUILD/libdbusmenu-qt-0.9.3/BUILD-i586-alt-linux'
[ 93%] Built target slowmenu
make[2]: Entering directory '/usr/src/RPM/BUILD/libdbusmenu-qt-0.9.3/BUILD-i586-alt-linux'
make[2]: Leaving directory '/usr/src/RPM/BUILD/libdbusmenu-qt-0.9.3/BUILD-i586-alt-linux'
[100%] Built target dbusmenubench-qtapp
make[1]: Leaving directory '/usr/src/RPM/BUILD/libdbusmenu-qt-0.9.3/BUILD-i586-alt-linux'
Install the project...
-- Install configuration: "Release"
-- Installing: /usr/src/tmp/dbusmenu-qt-buildroot/usr/lib/pkgconfig/dbusmenu-qt.pc
-- Installing: /usr/src/tmp/dbusmenu-qt-buildroot/usr/share/doc/libdbusmenu-qt-doc
-- Installing: /usr/src/tmp/dbusmenu-qt-buildroot/usr/share/doc/libdbusmenu-qt-doc/splitbar.png
-- Installing: /usr/src/tmp/dbusmenu-qt-buildroot/usr/share/doc/libdbusmenu-qt-doc/folderclosed.png
-- Installing: /usr/src/tmp/dbusmenu-qt-buildroot/usr/share/doc/libdbusmenu-qt-doc/folderopen.png
-- Installing: /usr/src/tmp/dbusmenu-qt-buildroot/usr/share/doc/libdbusmenu-qt-doc/doc.png
-- Installing: /usr/src/tmp/dbusmenu-qt-buildroot/usr/share/doc/libdbusmenu-qt-doc/files.html
-- Installing: /usr/src/tmp/dbusmenu-qt-buildroot/usr/share/doc/libdbusmenu-qt-doc/functions_func.html
-- Installing: /usr/src/tmp/dbusmenu-qt-buildroot/usr/share/doc/libdbusmenu-qt-doc/functions.html
-- Installing: /usr/src/tmp/dbusmenu-qt-buildroot/usr/share/doc/libdbusmenu-qt-doc/hierarchy.html
-- Installing: /usr/src/tmp/dbusmenu-qt-buildroot/usr/share/doc/libdbusmenu-qt-doc/classes.html
-- Installing: /usr/src/tmp/dbusmenu-qt-buildroot/usr/share/doc/libdbusmenu-qt-doc/annotated.html
-- Installing: /usr/src/tmp/dbusmenu-qt-buildroot/usr/share/doc/libdbusmenu-qt-doc/pages.html
-- Installing: /usr/src/tmp/dbusmenu-qt-buildroot/usr/share/doc/libdbusmenu-qt-doc/index.html
-- Installing: /usr/src/tmp/dbusmenu-qt-buildroot/usr/share/doc/libdbusmenu-qt-doc/menudata.js
-- Installing: /usr/src/tmp/dbusmenu-qt-buildroot/usr/share/doc/libdbusmenu-qt-doc/dir_68267d1309a1af8e8297ef4c3efbcdba.html
-- Installing: /usr/src/tmp/dbusmenu-qt-buildroot/usr/share/doc/libdbusmenu-qt-doc/classDBusMenuImporter-members.html
-- Installing: /usr/src/tmp/dbusmenu-qt-buildroot/usr/share/doc/libdbusmenu-qt-doc/classDBusMenuImporter.png
-- Installing: /usr/src/tmp/dbusmenu-qt-buildroot/usr/share/doc/libdbusmenu-qt-doc/classDBusMenuImporter.html
-- Installing: /usr/src/tmp/dbusmenu-qt-buildroot/usr/share/doc/libdbusmenu-qt-doc/classDBusMenuExporter-members.html
-- Installing: /usr/src/tmp/dbusmenu-qt-buildroot/usr/share/doc/libdbusmenu-qt-doc/classDBusMenuExporter.png
-- Installing: /usr/src/tmp/dbusmenu-qt-buildroot/usr/share/doc/libdbusmenu-qt-doc/classDBusMenuExporter.html
-- Installing: /usr/src/tmp/dbusmenu-qt-buildroot/usr/share/doc/libdbusmenu-qt-doc/deprecated.html
-- Installing: /usr/src/tmp/dbusmenu-qt-buildroot/usr/share/doc/libdbusmenu-qt-doc/dbusmenuimporter_8h_source.html
-- Installing: /usr/src/tmp/dbusmenu-qt-buildroot/usr/share/doc/libdbusmenu-qt-doc/dbusmenuexporter_8h_source.html
-- Installing: /usr/src/tmp/dbusmenu-qt-buildroot/usr/share/doc/libdbusmenu-qt-doc/dbusmenu__export_8h_source.html
-- Installing: /usr/src/tmp/dbusmenu-qt-buildroot/usr/share/doc/libdbusmenu-qt-doc/search
-- Installing: /usr/src/tmp/dbusmenu-qt-buildroot/usr/share/doc/libdbusmenu-qt-doc/search/nomatches.html
-- Installing: /usr/src/tmp/dbusmenu-qt-buildroot/usr/share/doc/libdbusmenu-qt-doc/search/search.js
-- Installing: /usr/src/tmp/dbusmenu-qt-buildroot/usr/share/doc/libdbusmenu-qt-doc/search/searchdata.js
-- Installing: /usr/src/tmp/dbusmenu-qt-buildroot/usr/share/doc/libdbusmenu-qt-doc/search/pages_0.js
-- Installing: /usr/src/tmp/dbusmenu-qt-buildroot/usr/share/doc/libdbusmenu-qt-doc/search/pages_0.html
-- Installing: /usr/src/tmp/dbusmenu-qt-buildroot/usr/share/doc/libdbusmenu-qt-doc/search/functions_6.js
-- Installing: /usr/src/tmp/dbusmenu-qt-buildroot/usr/share/doc/libdbusmenu-qt-doc/search/functions_6.html
-- Installing: /usr/src/tmp/dbusmenu-qt-buildroot/usr/share/doc/libdbusmenu-qt-doc/search/functions_5.js
-- Installing: /usr/src/tmp/dbusmenu-qt-buildroot/usr/share/doc/libdbusmenu-qt-doc/search/functions_5.html
-- Installing: /usr/src/tmp/dbusmenu-qt-buildroot/usr/share/doc/libdbusmenu-qt-doc/search/functions_4.js
-- Installing: /usr/src/tmp/dbusmenu-qt-buildroot/usr/share/doc/libdbusmenu-qt-doc/search/functions_4.html
-- Installing: /usr/src/tmp/dbusmenu-qt-buildroot/usr/share/doc/libdbusmenu-qt-doc/search/functions_3.js
-- Installing: /usr/src/tmp/dbusmenu-qt-buildroot/usr/share/doc/libdbusmenu-qt-doc/search/functions_3.html
-- Installing: /usr/src/tmp/dbusmenu-qt-buildroot/usr/share/doc/libdbusmenu-qt-doc/search/functions_2.js
-- Installing: /usr/src/tmp/dbusmenu-qt-buildroot/usr/share/doc/libdbusmenu-qt-doc/search/functions_2.html
-- Installing: /usr/src/tmp/dbusmenu-qt-buildroot/usr/share/doc/libdbusmenu-qt-doc/search/functions_1.js
-- Installing: /usr/src/tmp/dbusmenu-qt-buildroot/usr/share/doc/libdbusmenu-qt-doc/search/functions_1.html
-- Installing: /usr/src/tmp/dbusmenu-qt-buildroot/usr/share/doc/libdbusmenu-qt-doc/search/functions_0.js
-- Installing: /usr/src/tmp/dbusmenu-qt-buildroot/usr/share/doc/libdbusmenu-qt-doc/search/functions_0.html
-- Installing: /usr/src/tmp/dbusmenu-qt-buildroot/usr/share/doc/libdbusmenu-qt-doc/search/classes_0.js
-- Installing: /usr/src/tmp/dbusmenu-qt-buildroot/usr/share/doc/libdbusmenu-qt-doc/search/classes_0.html
-- Installing: /usr/src/tmp/dbusmenu-qt-buildroot/usr/share/doc/libdbusmenu-qt-doc/search/all_6.js
-- Installing: /usr/src/tmp/dbusmenu-qt-buildroot/usr/share/doc/libdbusmenu-qt-doc/search/all_6.html
-- Installing: /usr/src/tmp/dbusmenu-qt-buildroot/usr/share/doc/libdbusmenu-qt-doc/search/all_5.js
-- Installing: /usr/src/tmp/dbusmenu-qt-buildroot/usr/share/doc/libdbusmenu-qt-doc/search/all_5.html
-- Installing: /usr/src/tmp/dbusmenu-qt-buildroot/usr/share/doc/libdbusmenu-qt-doc/search/all_4.js
-- Installing: /usr/src/tmp/dbusmenu-qt-buildroot/usr/share/doc/libdbusmenu-qt-doc/search/all_4.html
-- Installing: /usr/src/tmp/dbusmenu-qt-buildroot/usr/share/doc/libdbusmenu-qt-doc/search/all_3.js
-- Installing: /usr/src/tmp/dbusmenu-qt-buildroot/usr/share/doc/libdbusmenu-qt-doc/search/all_3.html
-- Installing: /usr/src/tmp/dbusmenu-qt-buildroot/usr/share/doc/libdbusmenu-qt-doc/search/all_2.js
-- Installing: /usr/src/tmp/dbusmenu-qt-buildroot/usr/share/doc/libdbusmenu-qt-doc/search/all_2.html
-- Installing: /usr/src/tmp/dbusmenu-qt-buildroot/usr/share/doc/libdbusmenu-qt-doc/search/all_1.js
-- Installing: /usr/src/tmp/dbusmenu-qt-buildroot/usr/share/doc/libdbusmenu-qt-doc/search/all_1.html
-- Installing: /usr/src/tmp/dbusmenu-qt-buildroot/usr/share/doc/libdbusmenu-qt-doc/search/all_0.js
-- Installing: /usr/src/tmp/dbusmenu-qt-buildroot/usr/share/doc/libdbusmenu-qt-doc/search/all_0.html
-- Installing: /usr/src/tmp/dbusmenu-qt-buildroot/usr/share/doc/libdbusmenu-qt-doc/search/search.css
-- Installing: /usr/src/tmp/dbusmenu-qt-buildroot/usr/share/doc/libdbusmenu-qt-doc/search/mag_sel.png
-- Installing: /usr/src/tmp/dbusmenu-qt-buildroot/usr/share/doc/libdbusmenu-qt-doc/search/close.png
-- Installing: /usr/src/tmp/dbusmenu-qt-buildroot/usr/share/doc/libdbusmenu-qt-doc/search/search_r.png
-- Installing: /usr/src/tmp/dbusmenu-qt-buildroot/usr/share/doc/libdbusmenu-qt-doc/search/search_m.png
-- Installing: /usr/src/tmp/dbusmenu-qt-buildroot/usr/share/doc/libdbusmenu-qt-doc/search/search_l.png
-- Installing: /usr/src/tmp/dbusmenu-qt-buildroot/usr/share/doc/libdbusmenu-qt-doc/doxygen.css
-- Installing: /usr/src/tmp/dbusmenu-qt-buildroot/usr/share/doc/libdbusmenu-qt-doc/nav_g.png
-- Installing: /usr/src/tmp/dbusmenu-qt-buildroot/usr/share/doc/libdbusmenu-qt-doc/sync_off.png
-- Installing: /usr/src/tmp/dbusmenu-qt-buildroot/usr/share/doc/libdbusmenu-qt-doc/sync_on.png
-- Installing: /usr/src/tmp/dbusmenu-qt-buildroot/usr/share/doc/libdbusmenu-qt-doc/bdwn.png
-- Installing: /usr/src/tmp/dbusmenu-qt-buildroot/usr/share/doc/libdbusmenu-qt-doc/open.png
-- Installing: /usr/src/tmp/dbusmenu-qt-buildroot/usr/share/doc/libdbusmenu-qt-doc/closed.png
-- Installing: /usr/src/tmp/dbusmenu-qt-buildroot/usr/share/doc/libdbusmenu-qt-doc/doxygen.png
-- Installing: /usr/src/tmp/dbusmenu-qt-buildroot/usr/share/doc/libdbusmenu-qt-doc/bc_s.png
-- Installing: /usr/src/tmp/dbusmenu-qt-buildroot/usr/share/doc/libdbusmenu-qt-doc/nav_f.png
-- Installing: /usr/src/tmp/dbusmenu-qt-buildroot/usr/share/doc/libdbusmenu-qt-doc/nav_h.png
-- Installing: /usr/src/tmp/dbusmenu-qt-buildroot/usr/share/doc/libdbusmenu-qt-doc/tab_s.png
-- Installing: /usr/src/tmp/dbusmenu-qt-buildroot/usr/share/doc/libdbusmenu-qt-doc/tab_h.png
-- Installing: /usr/src/tmp/dbusmenu-qt-buildroot/usr/share/doc/libdbusmenu-qt-doc/tab_b.png
-- Installing: /usr/src/tmp/dbusmenu-qt-buildroot/usr/share/doc/libdbusmenu-qt-doc/tab_a.png
-- Installing: /usr/src/tmp/dbusmenu-qt-buildroot/usr/share/doc/libdbusmenu-qt-doc/dynsections.js
-- Installing: /usr/src/tmp/dbusmenu-qt-buildroot/usr/share/doc/libdbusmenu-qt-doc/menu.js
-- Installing: /usr/src/tmp/dbusmenu-qt-buildroot/usr/share/doc/libdbusmenu-qt-doc/jquery.js
-- Installing: /usr/src/tmp/dbusmenu-qt-buildroot/usr/share/doc/libdbusmenu-qt-doc/tabs.css
-- Installing: /usr/src/tmp/dbusmenu-qt-buildroot/usr/lib/cmake/dbusmenu-qt/dbusmenu-qt-config.cmake
-- Installing: /usr/src/tmp/dbusmenu-qt-buildroot/usr/lib/cmake/dbusmenu-qt/dbusmenu-qt-config-version.cmake
-- Installing: /usr/src/tmp/dbusmenu-qt-buildroot/usr/lib/libdbusmenu-qt.so.2.6.0
-- Installing: /usr/src/tmp/dbusmenu-qt-buildroot/usr/lib/libdbusmenu-qt.so.2
-- Installing: /usr/src/tmp/dbusmenu-qt-buildroot/usr/lib/libdbusmenu-qt.so
-- Installing: /usr/src/tmp/dbusmenu-qt-buildroot/usr/lib/cmake/dbusmenu-qt/dbusmenu-qt-targets.cmake
-- Installing: /usr/src/tmp/dbusmenu-qt-buildroot/usr/lib/cmake/dbusmenu-qt/dbusmenu-qt-targets-release.cmake
-- Installing: /usr/src/tmp/dbusmenu-qt-buildroot/usr/include/dbusmenu-qt/.
-- Installing: /usr/src/tmp/dbusmenu-qt-buildroot/usr/include/dbusmenu-qt/./dbusmenuimporter.h
-- Installing: /usr/src/tmp/dbusmenu-qt-buildroot/usr/include/dbusmenu-qt/./dbusmenuexporter.h
-- Installing: /usr/src/tmp/dbusmenu-qt-buildroot/usr/include/dbusmenu-qt/./dbusmenu_export.h
-- Installing: /usr/src/tmp/dbusmenu-qt-buildroot/usr/include/dbusmenu-qt/dbusmenu_version.h
make: Leaving directory '/usr/src/RPM/BUILD/libdbusmenu-qt-0.9.3/BUILD-i586-alt-linux'
+ /usr/lib/rpm/brp-alt
Cleaning files in /usr/src/tmp/dbusmenu-qt-buildroot (auto)
mode of './usr/lib/libdbusmenu-qt.so.2.6.0' changed from 0755 (rwxr-xr-x) to 0644 (rw-r--r--)
Verifying and fixing files in /usr/src/tmp/dbusmenu-qt-buildroot (binconfig,pkgconfig,libtool,desktop,gnuconfig)
/usr/lib/pkgconfig/dbusmenu-qt.pc: Libs: '-L${libdir} -ldbusmenu-qt' --> '-ldbusmenu-qt'
Checking contents of files in /usr/src/tmp/dbusmenu-qt-buildroot/ (default)
Compressing files in /usr/src/tmp/dbusmenu-qt-buildroot (auto)
Adjusting library links in /usr/src/tmp/dbusmenu-qt-buildroot
./usr/lib: (from <cmdline>:0)
	libdbusmenu-qt.so.2 -> libdbusmenu-qt.so.2.6.0
Verifying ELF objects in /usr/src/tmp/dbusmenu-qt-buildroot (arch=normal,fhs=normal,lfs=relaxed,lint=relaxed,rpath=normal,stack=normal,textrel=normal,unresolved=normal)
Hardlinking identical .pyc and .pyo files
Processing files: libdbusmenu-qt2-0.9.3-alt0.2
Executing(%doc): /bin/sh -e /usr/src/tmp/rpm-tmp.67501
+ umask 022
+ /bin/mkdir -p /usr/src/RPM/BUILD
+ cd /usr/src/RPM/BUILD
+ cd libdbusmenu-qt-0.9.3
+ DOCDIR=/usr/src/tmp/dbusmenu-qt-buildroot/usr/share/doc/libdbusmenu-qt2-0.9.3
+ export DOCDIR
+ rm -rf /usr/src/tmp/dbusmenu-qt-buildroot/usr/share/doc/libdbusmenu-qt2-0.9.3
+ /bin/mkdir -p /usr/src/tmp/dbusmenu-qt-buildroot/usr/share/doc/libdbusmenu-qt2-0.9.3
+ cp -prL COPYING README /usr/src/tmp/dbusmenu-qt-buildroot/usr/share/doc/libdbusmenu-qt2-0.9.3
+ chmod -R go-w /usr/src/tmp/dbusmenu-qt-buildroot/usr/share/doc/libdbusmenu-qt2-0.9.3
+ chmod -R a+rX /usr/src/tmp/dbusmenu-qt-buildroot/usr/share/doc/libdbusmenu-qt2-0.9.3
+ exit 0
Finding Provides (using /usr/lib/rpm/find-provides)
Executing: /bin/sh -e /usr/src/tmp/rpm-tmp.i3uJGI
find-provides: running scripts (alternatives,debuginfo,gir,lib,pam,perl,pkgconfig,python,shell,typelib)
lib.prov: /usr/src/tmp/dbusmenu-qt-buildroot/usr/lib/libdbusmenu-qt.so.2: 56 symbols, 16 bpp
Finding Requires (using /usr/lib/rpm/find-requires)
Executing: /bin/sh -e /usr/src/tmp/rpm-tmp.4uvPAG
find-requires: running scripts (cpp,debuginfo,files,gir-js,gir-python,gir,lib,pam,perl,pkgconfig,pkgconfiglib,python,rpmlib,shebang,shell,static,symlinks,systemd-services,typelib)
Provides: libdbusmenu-qt.so.2 = set:jdIrhfL8uke596ocSurw6upF6uh8oBWg3xxGO3pBsxixnVkRfSTFyrwdTtGsZnvoXb6AFWbXGGduJKvPmOkn0CmTKUFSM9Ph96Z9fXT5Zq8dmfGP
Requires: libQtCore.so.4 >= set:piFOUbsVoi3UxucPyU95ZfU0Zpfx2V9wMnuywPEWQvayuVrlyHW12zP66ckdiqPuiZekw3a4e4DJ7fRVXcQRFEZfF4beR2AAh9JfZwqawSyCxjYOGVSJ6BA1y0E7Gguec3cPkBNMk0IBLsp76a51rCV1Z28Y6ubxBCWReVZCU8VayydZqJtiDV1XpEb78YkOk2JYHwV91yQI4LEnDEYTzy4wsw5QMqjZsBOTZKai3PCThp1nxEwqWErsbmClKhxfumpz9Z9ZabRlgAskexdStHtGGm8ZlO63U0LdkU14UundKz90Rgz3DGS0FNwK1zcMFERqZBAiuyEJ3fwIpLFp6k5, libQtDBus.so.4 >= set:mgbNqgjwhKKUSicrbUDMrdkuZuB8dg7GL5zi0kNBU9pAZBEV6QfPvx8IyoeQL2SzgEDvbJGIzMu0QWZ6cRv0kS5lMtGkjNZ9sDNxTaiJBKs5hv2s7feF8zQPdOQ9CwoHeWYXF9bZpzwNWzUQzpTFWZkX86d, libQtGui.so.4 >= set:rlkjZ2XzzeVau7QSrUaPiZK4dL9p9LnNVpNiAtU2BcPmaek8bkDl3pjEJgxVZbkGCd4ZbpxOGoxZEe7ZFtc5bsGeZ3dNmfKaOtZajEnygdJPgSfyJvxzxsKNNp6kUa66hrLhWDgTzgYiwd8jBS46nodHShMaBGwWKY8anXYGodWnxWQ8Z3nQRMZFKCAZFv5CNOCqbv7Yz0, libc.so.6(GLIBC_2.0), libc.so.6(GLIBC_2.1.3), libc.so.6(GLIBC_2.4), libgcc_s.so.1(GCC_3.0), libstdc++.so.6(CXXABI_1.3), libstdc++.so.6(GLIBCXX_3.4), rtld(GNU_HASH)
Requires(rpmlib): rpmlib(SetVersions)
Finding debuginfo files (using /usr/lib/rpm/find-debuginfo-files)
Executing: /bin/sh -e /usr/src/tmp/rpm-tmp.ajukZF
Creating libdbusmenu-qt2-debuginfo package
Processing files: libdbusmenu-qt-devel-0.9.3-alt0.2
Finding Provides (using /usr/lib/rpm/find-provides)
Executing: /bin/sh -e /usr/src/tmp/rpm-tmp.GVXDfJ
find-provides: running scripts (alternatives,debuginfo,gir,lib,pam,perl,pkgconfig,python,shell,typelib)
Finding Requires (using /usr/lib/rpm/find-requires)
Executing: /bin/sh -e /usr/src/tmp/rpm-tmp.LkqI0F
find-requires: running scripts (cpp,debuginfo,files,gir-js,gir-python,gir,lib,pam,perl,pkgconfig,pkgconfiglib,python,rpmlib,shebang,shell,static,symlinks,systemd-services,typelib)
/usr/src/tmp/dbusmenu-qt-buildroot/usr/include/dbusmenu-qt/dbusmenu_export.h:29:10: fatal error: QtCore/QtGlobal: No such file or directory
   29 | #include <QtCore/QtGlobal>
      |          ^~~~~~~~~~~~~~~~~
compilation terminated.
cpp.req: /usr/src/tmp/dbusmenu-qt-buildroot/usr/include/dbusmenu-qt/dbusmenu_export.h: cpp failed, trying c++ mode
/usr/src/tmp/dbusmenu-qt-buildroot/usr/include/dbusmenu-qt/dbusmenu_export.h:29:10: fatal error: QtCore/QtGlobal: No such file or directory
   29 | #include <QtCore/QtGlobal>
      |          ^~~~~~~~~~~~~~~~~
compilation terminated.
cpp.req: WARNING: /usr/src/tmp/dbusmenu-qt-buildroot/usr/include/dbusmenu-qt/dbusmenu_export.h: cpp failed
/usr/src/tmp/dbusmenu-qt-buildroot/usr/include/dbusmenu-qt/dbusmenuexporter.h:25:10: fatal error: QtCore/QObject: No such file or directory
   25 | #include <QtCore/QObject>
      |          ^~~~~~~~~~~~~~~~
compilation terminated.
cpp.req: /usr/src/tmp/dbusmenu-qt-buildroot/usr/include/dbusmenu-qt/dbusmenuexporter.h: cpp failed, trying c++ mode
/usr/src/tmp/dbusmenu-qt-buildroot/usr/include/dbusmenu-qt/dbusmenuexporter.h:25:10: fatal error: QtCore/QObject: No such file or directory
   25 | #include <QtCore/QObject>
      |          ^~~~~~~~~~~~~~~~
compilation terminated.
cpp.req: WARNING: /usr/src/tmp/dbusmenu-qt-buildroot/usr/include/dbusmenu-qt/dbusmenuexporter.h: cpp failed
/usr/src/tmp/dbusmenu-qt-buildroot/usr/include/dbusmenu-qt/dbusmenuimporter.h:25:10: fatal error: QtCore/QObject: No such file or directory
   25 | #include <QtCore/QObject>
      |          ^~~~~~~~~~~~~~~~
compilation terminated.
cpp.req: /usr/src/tmp/dbusmenu-qt-buildroot/usr/include/dbusmenu-qt/dbusmenuimporter.h: cpp failed, trying c++ mode
/usr/src/tmp/dbusmenu-qt-buildroot/usr/include/dbusmenu-qt/dbusmenuimporter.h:25:10: fatal error: QtCore/QObject: No such file or directory
   25 | #include <QtCore/QObject>
      |          ^~~~~~~~~~~~~~~~
compilation terminated.
cpp.req: WARNING: /usr/src/tmp/dbusmenu-qt-buildroot/usr/include/dbusmenu-qt/dbusmenuimporter.h: cpp failed
Provides: pkgconfig(dbusmenu-qt) = 0.9.2
Requires: libdbusmenu-qt2 = 0.9.3-alt0.2, /usr/lib/libdbusmenu-qt.so.2, /usr/lib/pkgconfig
Finding debuginfo files (using /usr/lib/rpm/find-debuginfo-files)
Executing: /bin/sh -e /usr/src/tmp/rpm-tmp.lbxM3H
Processing files: libdbusmenu-qt2-debuginfo-0.9.3-alt0.2
Finding Provides (using /usr/lib/rpm/find-provides)
Executing: /bin/sh -e /usr/src/tmp/rpm-tmp.HSgCoF
find-provides: running scripts (debuginfo)
Finding Requires (using /usr/lib/rpm/find-requires)
Executing: /bin/sh -e /usr/src/tmp/rpm-tmp.EVwvRI
find-requires: running scripts (debuginfo)
Provides: debug(libdbusmenu-qt.so.2)
Requires: libdbusmenu-qt2 = 0.9.3-alt0.2, debug(libQtCore.so.4), debug(libQtDBus.so.4), debug(libQtGui.so.4), debug(libc.so.6), debug(libgcc_s.so.1), debug(libstdc++.so.6)
Removing 1 extra deps from libdbusmenu-qt-devel due to dependency on libdbusmenu-qt2
warning: Installed (but unpackaged) file(s) found:
    /usr/share/doc/libdbusmenu-qt-doc/annotated.html
    /usr/share/doc/libdbusmenu-qt-doc/bc_s.png
    /usr/share/doc/libdbusmenu-qt-doc/bdwn.png
    /usr/share/doc/libdbusmenu-qt-doc/classDBusMenuExporter-members.html
    /usr/share/doc/libdbusmenu-qt-doc/classDBusMenuExporter.html
    /usr/share/doc/libdbusmenu-qt-doc/classDBusMenuExporter.png
    /usr/share/doc/libdbusmenu-qt-doc/classDBusMenuImporter-members.html
    /usr/share/doc/libdbusmenu-qt-doc/classDBusMenuImporter.html
    /usr/share/doc/libdbusmenu-qt-doc/classDBusMenuImporter.png
    /usr/share/doc/libdbusmenu-qt-doc/classes.html
    /usr/share/doc/libdbusmenu-qt-doc/closed.png
    /usr/share/doc/libdbusmenu-qt-doc/dbusmenu__export_8h_source.html
    /usr/share/doc/libdbusmenu-qt-doc/dbusmenuexporter_8h_source.html
    /usr/share/doc/libdbusmenu-qt-doc/dbusmenuimporter_8h_source.html
    /usr/share/doc/libdbusmenu-qt-doc/deprecated.html
    /usr/share/doc/libdbusmenu-qt-doc/dir_68267d1309a1af8e8297ef4c3efbcdba.html
    /usr/share/doc/libdbusmenu-qt-doc/doc.png
    /usr/share/doc/libdbusmenu-qt-doc/doxygen.css
    /usr/share/doc/libdbusmenu-qt-doc/doxygen.png
    /usr/share/doc/libdbusmenu-qt-doc/dynsections.js
    /usr/share/doc/libdbusmenu-qt-doc/files.html
    /usr/share/doc/libdbusmenu-qt-doc/folderclosed.png
    /usr/share/doc/libdbusmenu-qt-doc/folderopen.png
    /usr/share/doc/libdbusmenu-qt-doc/functions.html
    /usr/share/doc/libdbusmenu-qt-doc/functions_func.html
    /usr/share/doc/libdbusmenu-qt-doc/hierarchy.html
    /usr/share/doc/libdbusmenu-qt-doc/index.html
    /usr/share/doc/libdbusmenu-qt-doc/jquery.js
    /usr/share/doc/libdbusmenu-qt-doc/menu.js
    /usr/share/doc/libdbusmenu-qt-doc/menudata.js
    /usr/share/doc/libdbusmenu-qt-doc/nav_f.png
    /usr/share/doc/libdbusmenu-qt-doc/nav_g.png
    /usr/share/doc/libdbusmenu-qt-doc/nav_h.png
    /usr/share/doc/libdbusmenu-qt-doc/open.png
    /usr/share/doc/libdbusmenu-qt-doc/pages.html
    /usr/share/doc/libdbusmenu-qt-doc/search/all_0.html
    /usr/share/doc/libdbusmenu-qt-doc/search/all_0.js
    /usr/share/doc/libdbusmenu-qt-doc/search/all_1.html
    /usr/share/doc/libdbusmenu-qt-doc/search/all_1.js
    /usr/share/doc/libdbusmenu-qt-doc/search/all_2.html
    /usr/share/doc/libdbusmenu-qt-doc/search/all_2.js
    /usr/share/doc/libdbusmenu-qt-doc/search/all_3.html
    /usr/share/doc/libdbusmenu-qt-doc/search/all_3.js
    /usr/share/doc/libdbusmenu-qt-doc/search/all_4.html
    /usr/share/doc/libdbusmenu-qt-doc/search/all_4.js
    /usr/share/doc/libdbusmenu-qt-doc/search/all_5.html
    /usr/share/doc/libdbusmenu-qt-doc/search/all_5.js
    /usr/share/doc/libdbusmenu-qt-doc/search/all_6.html
    /usr/share/doc/libdbusmenu-qt-doc/search/all_6.js
    /usr/share/doc/libdbusmenu-qt-doc/search/classes_0.html
    /usr/share/doc/libdbusmenu-qt-doc/search/classes_0.js
    /usr/share/doc/libdbusmenu-qt-doc/search/close.png
    /usr/share/doc/libdbusmenu-qt-doc/search/functions_0.html
    /usr/share/doc/libdbusmenu-qt-doc/search/functions_0.js
    /usr/share/doc/libdbusmenu-qt-doc/search/functions_1.html
    /usr/share/doc/libdbusmenu-qt-doc/search/functions_1.js
    /usr/share/doc/libdbusmenu-qt-doc/search/functions_2.html
    /usr/share/doc/libdbusmenu-qt-doc/search/functions_2.js
    /usr/share/doc/libdbusmenu-qt-doc/search/functions_3.html
    /usr/share/doc/libdbusmenu-qt-doc/search/functions_3.js
    /usr/share/doc/libdbusmenu-qt-doc/search/functions_4.html
    /usr/share/doc/libdbusmenu-qt-doc/search/functions_4.js
    /usr/share/doc/libdbusmenu-qt-doc/search/functions_5.html
    /usr/share/doc/libdbusmenu-qt-doc/search/functions_5.js
    /usr/share/doc/libdbusmenu-qt-doc/search/functions_6.html
    /usr/share/doc/libdbusmenu-qt-doc/search/functions_6.js
    /usr/share/doc/libdbusmenu-qt-doc/search/mag_sel.png
    /usr/share/doc/libdbusmenu-qt-doc/search/nomatches.html
    /usr/share/doc/libdbusmenu-qt-doc/search/pages_0.html
    /usr/share/doc/libdbusmenu-qt-doc/search/pages_0.js
    /usr/share/doc/libdbusmenu-qt-doc/search/search.css
    /usr/share/doc/libdbusmenu-qt-doc/search/search.js
    /usr/share/doc/libdbusmenu-qt-doc/search/search_l.png
    /usr/share/doc/libdbusmenu-qt-doc/search/search_m.png
    /usr/share/doc/libdbusmenu-qt-doc/search/search_r.png
    /usr/share/doc/libdbusmenu-qt-doc/search/searchdata.js
    /usr/share/doc/libdbusmenu-qt-doc/splitbar.png
    /usr/share/doc/libdbusmenu-qt-doc/sync_off.png
    /usr/share/doc/libdbusmenu-qt-doc/sync_on.png
    /usr/share/doc/libdbusmenu-qt-doc/tab_a.png
    /usr/share/doc/libdbusmenu-qt-doc/tab_b.png
    /usr/share/doc/libdbusmenu-qt-doc/tab_h.png
    /usr/share/doc/libdbusmenu-qt-doc/tab_s.png
    /usr/share/doc/libdbusmenu-qt-doc/tabs.css
Wrote: /usr/src/RPM/RPMS/i586/libdbusmenu-qt2-0.9.3-alt0.2.i586.rpm (w2.lzdio)
Wrote: /usr/src/RPM/RPMS/i586/libdbusmenu-qt-devel-0.9.3-alt0.2.i586.rpm (w2.lzdio)
Wrote: /usr/src/RPM/RPMS/i586/libdbusmenu-qt2-debuginfo-0.9.3-alt0.2.i586.rpm (w2.lzdio)
51.82user 4.00system 0:49.50elapsed 112%CPU (0avgtext+0avgdata 213412maxresident)k
0inputs+0outputs (0major+1247428minor)pagefaults 0swaps
66.93user 8.72system 1:14.29elapsed 101%CPU (0avgtext+0avgdata 213412maxresident)k
264inputs+0outputs (0major+1694660minor)pagefaults 0swaps
--- libdbusmenu-qt2-0.9.3-alt0.2.i586.rpm.repo	2016-05-20 16:11:13.000000000 +0000
+++ libdbusmenu-qt2-0.9.3-alt0.2.i586.rpm.hasher	2021-04-27 12:16:14.961877758 +0000
@@ -11,2 +11,3 @@
 Requires: libc.so.6(GLIBC_2.1.3)  
+Requires: libc.so.6(GLIBC_2.4)  
 Requires: libgcc_s.so.1(GCC_3.0)  
@@ -16,3 +17,3 @@
 Requires: rpmlib(PayloadIsLzma)  
-Provides: libdbusmenu-qt.so.2 = set:jdIrhfL8uke596ocSurw6upF6uh8oBWg3xxq0GYjm9nEkUlelZ3STFyrwdTtGQHn9X3rvNwclvpnlJNHRZbpbpGb0jHrnYkrUAVE4zZsDZbbYlA6H7Rp
+Provides: libdbusmenu-qt.so.2 = set:jdIrhfL8uke596ocSurw6upF6uh8oBWg3xxGO3pBsxixnVkRfSTFyrwdTtGsZnvoXb6AFWbXGGduJKvPmOkn0CmTKUFSM9Ph96Z9fXT5Zq8dmfGP
 Provides: libdbusmenu-qt2 = 0.9.3-alt0.2