<86>Apr 23 14:48:07 userdel[502860]: delete user 'rooter'
<86>Apr 23 14:48:07 userdel[502860]: removed group 'rooter' owned by 'rooter'
<86>Apr 23 14:48:07 userdel[502860]: removed shadow group 'rooter' owned by 'rooter'
<86>Apr 23 14:48:07 groupadd[502867]: group added to /etc/group: name=rooter, GID=645
<86>Apr 23 14:48:07 groupadd[502867]: group added to /etc/gshadow: name=rooter
<86>Apr 23 14:48:07 groupadd[502867]: new group: name=rooter, GID=645
<86>Apr 23 14:48:07 useradd[502871]: new user: name=rooter, UID=645, GID=645, home=/root, shell=/bin/bash
<86>Apr 23 14:48:07 userdel[502877]: delete user 'builder'
<86>Apr 23 14:48:07 userdel[502877]: removed group 'builder' owned by 'builder'
<86>Apr 23 14:48:07 userdel[502877]: removed shadow group 'builder' owned by 'builder'
<86>Apr 23 14:48:07 groupadd[502882]: group added to /etc/group: name=builder, GID=646
<86>Apr 23 14:48:07 groupadd[502882]: group added to /etc/gshadow: name=builder
<86>Apr 23 14:48:07 groupadd[502882]: new group: name=builder, GID=646
<86>Apr 23 14:48:07 useradd[502886]: new user: name=builder, UID=646, GID=646, home=/usr/src, shell=/bin/bash
/usr/src/in/srpm/armadillo-10.2.0-alt1_2.src.rpm: license not found in '/usr/share/license' directory: ASL
/usr/src/in/srpm/armadillo-10.2.0-alt1_2.src.rpm: license not found in '/usr/share/license' directory: 2.0
warning: user igor does not exist - using root
warning: group igor does not exist - using root
warning: user igor does not exist - using root
warning: group igor does not exist - using root
warning: user igor does not exist - using root
warning: group igor does not exist - using root
<13>Apr 23 14:48:09 rpmi: rpm-macros-kde-common-devel-14.12.1-alt1 1422279175 installed
<13>Apr 23 14:48:09 rpmi: rpm-macros-generic-compat-0.04-alt1 1527350580 installed
<13>Apr 23 14:48:09 rpmi: rpm-macros-fedora-compat-0.159-alt1 sisyphus+258368.100.1.1 1600512138 installed
<13>Apr 23 14:48:09 rpmi: rpm-macros-cmake-3.19.7-alt1 sisyphus+267877.100.2.1 1615932773 installed
<13>Apr 23 14:48:11 rpmi: libopenblas-0.3.9-alt1 sisyphus+238855.200.5.1 1593950422 installed
<13>Apr 23 14:48:11 rpmi: libcom_err-1.45.6.0.24.af1a-alt1 sisyphus+262279.100.1.1 1606088229 installed
<13>Apr 23 14:48:11 rpmi: libuv-1.41.0-alt2 sisyphus+267695.100.2.1 1615786345 installed
<13>Apr 23 14:48:11 rpmi: libexpat-2.2.10-alt1 sisyphus+259966.100.1.1 1602824518 installed
<13>Apr 23 14:48:11 rpmi: libidn2-2.3.0-alt1 sisyphus+240846.100.1.2 1573870475 installed
<13>Apr 23 14:48:11 rpmi: libe2fs-1.45.6.0.24.af1a-alt1 sisyphus+262279.100.1.1 1606088229 installed
<13>Apr 23 14:48:11 rpmi: libopenblas-devel-0.3.9-alt1 sisyphus+238855.200.5.1 1593950422 installed
<13>Apr 23 14:48:11 rpmi: libsuperlu5-5.2.2-alt1 sisyphus+261373.100.1.1 1604935111 installed
<13>Apr 23 14:48:11 rpmi: zlib-devel-1.2.11-alt1 sisyphus+221902.6000.4.1 1550601058 installed
<13>Apr 23 14:48:11 rpmi: libhdf5-103-1.10.6-alt1 sisyphus+270051.70.10.1 1618903863 installed
<13>Apr 23 14:48:11 rpmi: libhdf5-hl-100-1.10.6-alt1 sisyphus+270051.70.10.1 1618903863 installed
<13>Apr 23 14:48:12 rpmi: libxblas-1.0.248-alt1.3 sisyphus+229150.100.1.1 1557388786 installed
<13>Apr 23 14:48:12 rpmi: libquadmath0-10.2.1-alt3 sisyphus+267829.100.1.1 1615808579 installed
<13>Apr 23 14:48:12 rpmi: libgfortran5-10.2.1-alt3 sisyphus+267829.100.1.1 1615808579 installed
<13>Apr 23 14:48:12 rpmi: liblapack-1:3.8.0-alt4 sisyphus+264284.100.1.1 1609587717 installed
<13>Apr 23 14:48:12 rpmi: libarpack-ng-3.8.0-alt1 sisyphus+263050.100.1.1 1607362284 installed
<13>Apr 23 14:48:12 rpmi: libatlas-3.9.35-alt1.qa1 sisyphus+248299.100.1.1 1584940394 installed
<13>Apr 23 14:48:12 rpmi: gcc-c++-common-1.4.27-alt1 sisyphus+262033.600.7.2 1607340230 installed
<13>Apr 23 14:48:12 rpmi: libstdc++10-devel-10.2.1-alt3 sisyphus+267829.100.1.1 1615808579 installed
<13>Apr 23 14:48:13 rpmi: gcc10-c++-10.2.1-alt3 sisyphus+267829.100.1.1 1615808579 installed
<13>Apr 23 14:48:13 rpmi: libstdc++-devel-10-alt1 sisyphus+263054.200.3.1 1607517515 installed
<13>Apr 23 14:48:13 rpmi: rmt-0.4b44-alt3 sisyphus+263220.100.1.1 1607607837 installed
<13>Apr 23 14:48:13 rpmi: dump-0.4b44-alt3 sisyphus+263220.100.1.1 1607607837 installed
<13>Apr 23 14:48:13 rpmi: cmake-modules-3.19.7-alt1 sisyphus+267877.100.2.1 1615932716 installed
<13>Apr 23 14:48:13 rpmi: librhash-1.3.5-alt2 1505156279 installed
<13>Apr 23 14:48:13 rpmi: libjsoncpp19-1.8.4-alt5 sisyphus+243670.100.1.1 1577521267 installed
<13>Apr 23 14:48:13 rpmi: publicsuffix-list-dafsa-20210419-alt1 sisyphus+270358.100.1.1 1618924010 installed
<13>Apr 23 14:48:13 rpmi: libpsl-0.21.1-alt1 sisyphus+255206.100.1.1 1595348938 installed
<13>Apr 23 14:48:13 rpmi: libnghttp2-1.41.0-alt1 sisyphus+253680.100.1.1 1592642271 installed
<13>Apr 23 14:48:13 rpmi: openldap-common-2.4.57-alt1 sisyphus+266287.100.1.1 1613244218 installed
<13>Apr 23 14:48:13 rpmi: libverto-0.3.2-alt1_1 sisyphus+268398.100.1.1 1616717462 installed
<13>Apr 23 14:48:13 rpmi: liblmdb-0.9.23-alt1 sisyphus+225277.100.2.1 1553001679 installed
<13>Apr 23 14:48:13 rpmi: libkeyutils-1.6.3-alt1 sisyphus+266061.100.1.1 1612919567 installed
<13>Apr 23 14:48:13 rpmi: libbrotlicommon-1.0.9-alt2 sisyphus+257777.100.1.1 1599688017 installed
<13>Apr 23 14:48:13 rpmi: libbrotlidec-1.0.9-alt2 sisyphus+257777.100.1.1 1599688017 installed
<13>Apr 23 14:48:13 rpmi: libp11-kit-0.23.15-alt2 sisyphus+252784.100.2.2 1591274901 installed
<13>Apr 23 14:48:13 rpmi: libtasn1-4.16.0-alt1 sisyphus+245480.100.1.1 1580825062 installed
<13>Apr 23 14:48:13 rpmi: rpm-macros-alternatives-0.5.1-alt1 sisyphus+226946.100.1.1 1554830426 installed
<13>Apr 23 14:48:13 rpmi: alternatives-0.5.1-alt1 sisyphus+226946.100.1.1 1554830426 installed
<13>Apr 23 14:48:13 rpmi: ca-certificates-2021.03.24-alt1 sisyphus+268304.300.1.1 1616591829 installed
<13>Apr 23 14:48:13 rpmi: ca-trust-0.1.2-alt1 sisyphus+233348.100.1.1 1561653823 installed
<13>Apr 23 14:48:13 rpmi: p11-kit-trust-0.23.15-alt2 sisyphus+252784.100.2.2 1591274901 installed
<13>Apr 23 14:48:14 rpmi: libcrypto1.1-1.1.1k-alt1 sisyphus+268375.100.1.1 1616684255 installed
<13>Apr 23 14:48:14 rpmi: libssl1.1-1.1.1k-alt1 sisyphus+268375.100.1.1 1616684255 installed
<86>Apr 23 14:48:14 groupadd[512951]: group added to /etc/group: name=_keytab, GID=499
<86>Apr 23 14:48:14 groupadd[512951]: group added to /etc/gshadow: name=_keytab
<86>Apr 23 14:48:14 groupadd[512951]: new group: name=_keytab, GID=499
<13>Apr 23 14:48:14 rpmi: libkrb5-1.19.1-alt2 sisyphus+267847.100.1.1 1615814853 installed
<86>Apr 23 14:48:14 groupadd[513028]: group added to /etc/group: name=sasl, GID=498
<86>Apr 23 14:48:14 groupadd[513028]: group added to /etc/gshadow: name=sasl
<86>Apr 23 14:48:14 groupadd[513028]: new group: name=sasl, GID=498
<13>Apr 23 14:48:14 rpmi: libsasl2-3-2.1.27-alt2.1 sisyphus+255909.100.2.1 1597199456 installed
<13>Apr 23 14:48:14 rpmi: libldap-2.4.57-alt1 sisyphus+266287.100.1.1 1613244306 installed
<13>Apr 23 14:48:14 rpmi: libcurl-7.76.1-alt1 sisyphus+269986.100.1.1 1618487446 installed
<13>Apr 23 14:48:14 rpmi: libarchive13-3.4.3-alt1 sisyphus+258566.100.1.2 1600916107 installed
<13>Apr 23 14:48:14 rpmi: cmake-3.19.7-alt1 sisyphus+267877.100.2.1 1615932773 installed
<13>Apr 23 14:48:14 rpmi: ctest-3.19.7-alt1 sisyphus+267877.100.2.1 1615932773 installed
<13>Apr 23 14:48:14 rpmi: libhdf5-devel-1.10.6-alt1 sisyphus+270051.70.10.1 1618903863 installed
<13>Apr 23 14:48:14 rpmi: gcc-c++-10-alt1 sisyphus+263054.200.3.1 1607516810 installed
<13>Apr 23 14:48:14 rpmi: libatlas-devel-3.9.35-alt1.qa1 sisyphus+248299.100.1.1 1584940394 installed
<13>Apr 23 14:48:14 rpmi: libarpack-ng-devel-3.8.0-alt1 sisyphus+263050.100.1.1 1607362284 installed
<13>Apr 23 14:48:14 rpmi: liblapack-devel-1:3.8.0-alt4 sisyphus+264284.100.1.1 1609587717 installed
<13>Apr 23 14:48:14 rpmi: libsuperlu-devel-5.2.2-alt1 sisyphus+261373.100.1.1 1604935111 installed
Building target platforms: i586
Building for target i586
Wrote: /usr/src/in/nosrpm/armadillo-10.2.0-alt1_2.nosrc.rpm (w1.gzdio)
Installing armadillo-10.2.0-alt1_2.src.rpm
Building target platforms: i586
Building for target i586
Executing(%prep): /bin/sh -e /usr/src/tmp/rpm-tmp.89113
+ umask 022
+ /bin/mkdir -p /usr/src/RPM/BUILD
+ cd /usr/src/RPM/BUILD
+ cd /usr/src/RPM/BUILD
+ rm -rf armadillo-10.2.0
+ echo 'Source #0 (armadillo-10.2.0.tar.xz):'
Source #0 (armadillo-10.2.0.tar.xz):
+ /bin/tar -xf -
+ /usr/bin/xz -dc /usr/src/RPM/SOURCES/armadillo-10.2.0.tar.xz
+ cd armadillo-10.2.0
+ /bin/chmod -c -Rf u+rwX,go-w .
+ sed -i 's/\r//' README.md
+ rm -rf examples/example1_win64.sln examples/example1_win64.vcxproj examples/lib_win64
+ exit 0
Executing(%build): /bin/sh -e /usr/src/tmp/rpm-tmp.47332
+ umask 022
+ /bin/mkdir -p /usr/src/RPM/BUILD
+ cd /usr/src/RPM/BUILD
+ cd armadillo-10.2.0
+ CFLAGS='-pipe -frecord-gcc-switches -Wall -g -O2 -march=i586 -mtune=generic'
+ export CFLAGS
+ CXXFLAGS='-pipe -frecord-gcc-switches -Wall -g -O2 -march=i586 -mtune=generic'
+ export CXXFLAGS
+ FFLAGS='-pipe -frecord-gcc-switches -Wall -g -O2 -march=i586 -mtune=generic '
+ export FFLAGS
+ FCFLAGS='-pipe -frecord-gcc-switches -Wall -g -O2 -march=i586 -mtune=generic '
+ export FCFLAGS
+ LDFLAGS=-Wl,-z,relro
+ export LDFLAGS
+ /usr/bin/cmake -S . -B i586-alt-linux -DCMAKE_INSTALL_LIBDIR:PATH=/usr/lib -DCMAKE_VERBOSE_MAKEFILE:BOOL=ON -DCMAKE_INSTALL_PREFIX:PATH=/usr -DINCLUDE_INSTALL_DIR:PATH=/usr/include -DLIB_INSTALL_DIR:PATH=/usr/lib -DSYSCONF_INSTALL_DIR:PATH=/etc -DSHARE_INSTALL_PREFIX:PATH=/usr/share -DBUILD_SHARED_LIBS:BOOL=ON
-- *** set cmake policy CMP0025 to NEW
-- CMAKE_CXX_STANDARD = 11
-- The CXX compiler identification is GNU 10.2.1
-- The C compiler identification is GNU 10.2.1
-- Detecting CXX compiler ABI info
-- Detecting CXX compiler ABI info - done
-- Check for working CXX compiler: /usr/bin/c++ - skipped
-- Detecting CXX compile features
-- Detecting CXX compile features - done
-- Detecting C compiler ABI info
-- Detecting C compiler ABI info - done
-- Check for working C compiler: /usr/bin/cc - skipped
-- Detecting C compile features
-- Detecting C compile features - done
-- Configuring Armadillo 10.2.0
-- 
-- *** WARNING: variable 'CMAKE_CXX_FLAGS' is not empty; this may cause problems!
-- 
-- Detected gcc 4.8.3 or later
-- ARMA_USE_EXTERN_RNG = true
-- CMAKE_SYSTEM_NAME          = Linux
-- CMAKE_CXX_COMPILER_ID      = GNU
-- CMAKE_CXX_COMPILER_VERSION = 10.2.1
-- CMAKE_COMPILER_IS_GNUCXX   = 1
-- BUILD_SHARED_LIBS          = ON
-- DETECT_HDF5                = ON
-- ALLOW_FLEXIBLAS_LINUX      = OFF
-- ALLOW_OPENBLAS_MACOS       = OFF
-- ALLOW_BLAS_LAPACK_MACOS    = OFF
-- BUILD_SMOKE_TEST           = OFF
-- 
-- *** Looking for external libraries
CMake Warning (dev) at cmake_aux/Modules/ARMA_FindMKL.cmake:27 (set):
  implicitly converting 'TYPE' to 'STRING' type.
Call Stack (most recent call first):
  CMakeLists.txt:326 (include)
This warning is for project developers.  Use -Wno-dev to suppress it.

-- Found OpenBLAS: /usr/lib/libopenblas.so
-- Found ATLAS: /usr/lib/libatlas.so
-- Found BLAS: /usr/lib/libblas.so
-- Found LAPACK: /usr/lib/liblapack.so
--       MKL_FOUND = NO
--  OpenBLAS_FOUND = YES
--     ATLAS_FOUND = YES
--      BLAS_FOUND = YES
--    LAPACK_FOUND = YES
-- 
-- *** WARNING: found both OpenBLAS and ATLAS; ATLAS will not be used
-- 
-- *** WARNING: found both OpenBLAS and BLAS; BLAS will not be used
-- 
-- *** If the OpenBLAS library is installed in
-- *** /usr/local/lib or /usr/local/lib64
-- *** make sure the run-time linker can find it.
-- *** On Linux systems this can be done by editing /etc/ld.so.conf
-- *** or modifying the LD_LIBRARY_PATH environment variable.
-- 
-- Found PkgConfig: /usr/bin/pkg-config (found version "0.29.2") 
-- HDF5_FOUND = TRUE
-- ARMA_HDF5_INCLUDE_DIR = /usr/include
-- 
-- *** If use of HDF5 is causing problems,
-- *** rerun cmake with HDF5 detection disabled:
-- *** cmake -D DETECT_HDF5=false .
-- 
-- Found ARPACK: /usr/lib/libarpack.so
-- ARPACK_FOUND = YES
-- Looking for SuperLU version 5
-- Found SuperLU: /usr/lib/libsuperlu.so
-- SuperLU_FOUND = YES
-- SuperLU_INCLUDE_DIR = /usr/include/superlu
-- 
-- *** Armadillo wrapper library will use the following libraries:
-- *** ARMA_LIBS = /usr/lib/libopenblas.so;/usr/lib/liblapack.so;/usr/lib/libhdf5.so;/usr/lib/libarpack.so;/usr/lib/libsuperlu.so
-- 
-- Copying /usr/src/RPM/BUILD/armadillo-10.2.0/include/ to /usr/src/RPM/BUILD/armadillo-10.2.0/i586-alt-linux/tmp/include/
-- Generating /usr/src/RPM/BUILD/armadillo-10.2.0/i586-alt-linux/tmp/include/config.hpp
-- CMAKE_CXX_FLAGS           = -pipe -frecord-gcc-switches -Wall -g -O2 -march=i586 -mtune=generic -O2
-- CMAKE_SHARED_LINKER_FLAGS = -Wl,-z,relro -Wl,--no-as-needed
-- CMAKE_REQUIRED_INCLUDES   = /usr/include;/usr/include/superlu
-- 
-- CMAKE_INSTALL_PREFIX     = /usr
-- CMAKE_INSTALL_LIBDIR     = /usr/lib
-- CMAKE_INSTALL_INCLUDEDIR = include
-- CMAKE_INSTALL_DATADIR    = share
-- CMAKE_INSTALL_BINDIR     = bin
-- Generating '/usr/src/RPM/BUILD/armadillo-10.2.0/i586-alt-linux/ArmadilloConfig.cmake'
-- Generating '/usr/src/RPM/BUILD/armadillo-10.2.0/i586-alt-linux/ArmadilloConfigVersion.cmake'
-- Generating '/usr/src/RPM/BUILD/armadillo-10.2.0/i586-alt-linux/InstallFiles/ArmadilloConfig.cmake'
-- Generating '/usr/src/RPM/BUILD/armadillo-10.2.0/i586-alt-linux/InstallFiles/ArmadilloConfigVersion.cmake'
-- Copying /usr/src/RPM/BUILD/armadillo-10.2.0/misc/ to /usr/src/RPM/BUILD/armadillo-10.2.0/i586-alt-linux/tmp/misc/
-- Generating '/usr/src/RPM/BUILD/armadillo-10.2.0/i586-alt-linux/tmp/misc/armadillo.pc'
-- Configuring done
-- Generating done
CMake Warning:
  Manually-specified variables were not used by the project:

    INCLUDE_INSTALL_DIR
    LIB_INSTALL_DIR
    SHARE_INSTALL_PREFIX
    SYSCONF_INSTALL_DIR


-- Build files have been written to: /usr/src/RPM/BUILD/armadillo-10.2.0/i586-alt-linux
+ /usr/bin/cmake --build i586-alt-linux -j8 --verbose
gmake: Entering directory '/usr/src/RPM/BUILD/armadillo-10.2.0/i586-alt-linux'
/usr/bin/cmake -S/usr/src/RPM/BUILD/armadillo-10.2.0 -B/usr/src/RPM/BUILD/armadillo-10.2.0/i586-alt-linux --check-build-system CMakeFiles/Makefile.cmake 0
gmake: Leaving directory '/usr/src/RPM/BUILD/armadillo-10.2.0/i586-alt-linux'
gmake: Entering directory '/usr/src/RPM/BUILD/armadillo-10.2.0/i586-alt-linux'
/usr/bin/cmake -E cmake_progress_start /usr/src/RPM/BUILD/armadillo-10.2.0/i586-alt-linux/CMakeFiles /usr/src/RPM/BUILD/armadillo-10.2.0/i586-alt-linux//CMakeFiles/progress.marks
gmake: Leaving directory '/usr/src/RPM/BUILD/armadillo-10.2.0/i586-alt-linux'
/usr/bin/gmake  -f CMakeFiles/Makefile2 all
/usr/bin/gmake  -f CMakeFiles/armadillo.dir/build.make CMakeFiles/armadillo.dir/depend
gmake[2]: Entering directory '/usr/src/RPM/BUILD/armadillo-10.2.0/i586-alt-linux'
cd /usr/src/RPM/BUILD/armadillo-10.2.0/i586-alt-linux && /usr/bin/cmake -E cmake_depends "Unix Makefiles" /usr/src/RPM/BUILD/armadillo-10.2.0 /usr/src/RPM/BUILD/armadillo-10.2.0 /usr/src/RPM/BUILD/armadillo-10.2.0/i586-alt-linux /usr/src/RPM/BUILD/armadillo-10.2.0/i586-alt-linux /usr/src/RPM/BUILD/armadillo-10.2.0/i586-alt-linux/CMakeFiles/armadillo.dir/DependInfo.cmake --color=
Dependee "/usr/src/RPM/BUILD/armadillo-10.2.0/i586-alt-linux/CMakeFiles/armadillo.dir/DependInfo.cmake" is newer than depender "/usr/src/RPM/BUILD/armadillo-10.2.0/i586-alt-linux/CMakeFiles/armadillo.dir/depend.internal".
Dependee "/usr/src/RPM/BUILD/armadillo-10.2.0/i586-alt-linux/CMakeFiles/CMakeDirectoryInformation.cmake" is newer than depender "/usr/src/RPM/BUILD/armadillo-10.2.0/i586-alt-linux/CMakeFiles/armadillo.dir/depend.internal".
Scanning dependencies of target armadillo
gmake[2]: Leaving directory '/usr/src/RPM/BUILD/armadillo-10.2.0/i586-alt-linux'
/usr/bin/gmake  -f CMakeFiles/armadillo.dir/build.make CMakeFiles/armadillo.dir/build
gmake[2]: Entering directory '/usr/src/RPM/BUILD/armadillo-10.2.0/i586-alt-linux'
[ 66%] Building CXX object CMakeFiles/armadillo.dir/src/wrapper2.cpp.o
/usr/bin/c++ -Darmadillo_EXPORTS -I/usr/src/RPM/BUILD/armadillo-10.2.0/i586-alt-linux/tmp/include -I/usr/include/superlu -pipe -frecord-gcc-switches -Wall -g -O2 -march=i586 -mtune=generic -O2 -fPIC -std=c++11 -o CMakeFiles/armadillo.dir/src/wrapper2.cpp.o -c /usr/src/RPM/BUILD/armadillo-10.2.0/src/wrapper2.cpp
gmake[2]: Leaving directory '/usr/src/RPM/BUILD/armadillo-10.2.0/i586-alt-linux'
gmake[2]: Entering directory '/usr/src/RPM/BUILD/armadillo-10.2.0/i586-alt-linux'
[ 33%] Building CXX object CMakeFiles/armadillo.dir/src/wrapper1.cpp.o
/usr/bin/c++ -Darmadillo_EXPORTS -I/usr/src/RPM/BUILD/armadillo-10.2.0/i586-alt-linux/tmp/include -I/usr/include/superlu -pipe -frecord-gcc-switches -Wall -g -O2 -march=i586 -mtune=generic -O2 -fPIC -std=c++11 -o CMakeFiles/armadillo.dir/src/wrapper1.cpp.o -c /usr/src/RPM/BUILD/armadillo-10.2.0/src/wrapper1.cpp
gmake[2]: Leaving directory '/usr/src/RPM/BUILD/armadillo-10.2.0/i586-alt-linux'
gmake[2]: Entering directory '/usr/src/RPM/BUILD/armadillo-10.2.0/i586-alt-linux'
[100%] Linking CXX shared library libarmadillo.so
/usr/bin/cmake -E cmake_link_script CMakeFiles/armadillo.dir/link.txt --verbose=1
/usr/bin/c++ -fPIC -pipe -frecord-gcc-switches -Wall -g -O2 -march=i586 -mtune=generic -O2 -Wl,-z,relro -Wl,--no-as-needed -shared -Wl,-soname,libarmadillo.so.10 -o libarmadillo.so.10.2.0 CMakeFiles/armadillo.dir/src/wrapper1.cpp.o CMakeFiles/armadillo.dir/src/wrapper2.cpp.o  -lopenblas -llapack -lhdf5 -larpack -lsuperlu 
/usr/bin/cmake -E cmake_symlink_library libarmadillo.so.10.2.0 libarmadillo.so.10 libarmadillo.so
gmake[2]: Leaving directory '/usr/src/RPM/BUILD/armadillo-10.2.0/i586-alt-linux'
gmake[1]: Entering directory '/usr/src/RPM/BUILD/armadillo-10.2.0/i586-alt-linux'
[100%] Built target armadillo
gmake[1]: Leaving directory '/usr/src/RPM/BUILD/armadillo-10.2.0/i586-alt-linux'
gmake: Entering directory '/usr/src/RPM/BUILD/armadillo-10.2.0/i586-alt-linux'
/usr/bin/cmake -E cmake_progress_start /usr/src/RPM/BUILD/armadillo-10.2.0/i586-alt-linux/CMakeFiles 0
gmake: Leaving directory '/usr/src/RPM/BUILD/armadillo-10.2.0/i586-alt-linux'
+ exit 0
Executing(%install): /bin/sh -e /usr/src/tmp/rpm-tmp.96280
+ umask 022
+ /bin/mkdir -p /usr/src/RPM/BUILD
+ cd /usr/src/RPM/BUILD
+ /bin/chmod -Rf u+rwX -- /usr/src/tmp/armadillo-buildroot
+ :
+ /bin/rm -rf -- /usr/src/tmp/armadillo-buildroot
+ PATH=/usr/libexec/rpm-build:/usr/src/bin:/bin:/usr/bin:/usr/X11R6/bin:/usr/games
+ cd armadillo-10.2.0
+ DESTDIR=/usr/src/tmp/armadillo-buildroot
+ /usr/bin/cmake --install i586-alt-linux
-- Install configuration: ""
-- Installing: /usr/src/tmp/armadillo-buildroot/usr/include
-- Installing: /usr/src/tmp/armadillo-buildroot/usr/include/armadillo
-- Installing: /usr/src/tmp/armadillo-buildroot/usr/include/armadillo_bits
-- Installing: /usr/src/tmp/armadillo-buildroot/usr/include/armadillo_bits/config.hpp
-- Installing: /usr/src/tmp/armadillo-buildroot/usr/include/armadillo_bits/BaseCube_bones.hpp
-- Installing: /usr/src/tmp/armadillo-buildroot/usr/include/armadillo_bits/BaseCube_meat.hpp
-- Installing: /usr/src/tmp/armadillo-buildroot/usr/include/armadillo_bits/Base_bones.hpp
-- Installing: /usr/src/tmp/armadillo-buildroot/usr/include/armadillo_bits/Base_meat.hpp
-- Installing: /usr/src/tmp/armadillo-buildroot/usr/include/armadillo_bits/Col_bones.hpp
-- Installing: /usr/src/tmp/armadillo-buildroot/usr/include/armadillo_bits/Col_meat.hpp
-- Installing: /usr/src/tmp/armadillo-buildroot/usr/include/armadillo_bits/CubeToMatOp_bones.hpp
-- Installing: /usr/src/tmp/armadillo-buildroot/usr/include/armadillo_bits/CubeToMatOp_meat.hpp
-- Installing: /usr/src/tmp/armadillo-buildroot/usr/include/armadillo_bits/Cube_bones.hpp
-- Installing: /usr/src/tmp/armadillo-buildroot/usr/include/armadillo_bits/Cube_meat.hpp
-- Installing: /usr/src/tmp/armadillo-buildroot/usr/include/armadillo_bits/GenCube_bones.hpp
-- Installing: /usr/src/tmp/armadillo-buildroot/usr/include/armadillo_bits/GenCube_meat.hpp
-- Installing: /usr/src/tmp/armadillo-buildroot/usr/include/armadillo_bits/GenSpecialiser.hpp
-- Installing: /usr/src/tmp/armadillo-buildroot/usr/include/armadillo_bits/Gen_bones.hpp
-- Installing: /usr/src/tmp/armadillo-buildroot/usr/include/armadillo_bits/Gen_meat.hpp
-- Installing: /usr/src/tmp/armadillo-buildroot/usr/include/armadillo_bits/GlueCube_bones.hpp
-- Installing: /usr/src/tmp/armadillo-buildroot/usr/include/armadillo_bits/GlueCube_meat.hpp
-- Installing: /usr/src/tmp/armadillo-buildroot/usr/include/armadillo_bits/Glue_bones.hpp
-- Installing: /usr/src/tmp/armadillo-buildroot/usr/include/armadillo_bits/Glue_meat.hpp
-- Installing: /usr/src/tmp/armadillo-buildroot/usr/include/armadillo_bits/MapMat_bones.hpp
-- Installing: /usr/src/tmp/armadillo-buildroot/usr/include/armadillo_bits/MapMat_meat.hpp
-- Installing: /usr/src/tmp/armadillo-buildroot/usr/include/armadillo_bits/Mat_bones.hpp
-- Installing: /usr/src/tmp/armadillo-buildroot/usr/include/armadillo_bits/Mat_meat.hpp
-- Installing: /usr/src/tmp/armadillo-buildroot/usr/include/armadillo_bits/OpCube_bones.hpp
-- Installing: /usr/src/tmp/armadillo-buildroot/usr/include/armadillo_bits/OpCube_meat.hpp
-- Installing: /usr/src/tmp/armadillo-buildroot/usr/include/armadillo_bits/Op_bones.hpp
-- Installing: /usr/src/tmp/armadillo-buildroot/usr/include/armadillo_bits/Op_meat.hpp
-- Installing: /usr/src/tmp/armadillo-buildroot/usr/include/armadillo_bits/Proxy.hpp
-- Installing: /usr/src/tmp/armadillo-buildroot/usr/include/armadillo_bits/ProxyCube.hpp
-- Installing: /usr/src/tmp/armadillo-buildroot/usr/include/armadillo_bits/Row_bones.hpp
-- Installing: /usr/src/tmp/armadillo-buildroot/usr/include/armadillo_bits/Row_meat.hpp
-- Installing: /usr/src/tmp/armadillo-buildroot/usr/include/armadillo_bits/SizeCube_bones.hpp
-- Installing: /usr/src/tmp/armadillo-buildroot/usr/include/armadillo_bits/SizeCube_meat.hpp
-- Installing: /usr/src/tmp/armadillo-buildroot/usr/include/armadillo_bits/SizeMat_bones.hpp
-- Installing: /usr/src/tmp/armadillo-buildroot/usr/include/armadillo_bits/SizeMat_meat.hpp
-- Installing: /usr/src/tmp/armadillo-buildroot/usr/include/armadillo_bits/SpBase_bones.hpp
-- Installing: /usr/src/tmp/armadillo-buildroot/usr/include/armadillo_bits/SpBase_meat.hpp
-- Installing: /usr/src/tmp/armadillo-buildroot/usr/include/armadillo_bits/SpCol_bones.hpp
-- Installing: /usr/src/tmp/armadillo-buildroot/usr/include/armadillo_bits/SpCol_meat.hpp
-- Installing: /usr/src/tmp/armadillo-buildroot/usr/include/armadillo_bits/SpGlue_bones.hpp
-- Installing: /usr/src/tmp/armadillo-buildroot/usr/include/armadillo_bits/SpGlue_meat.hpp
-- Installing: /usr/src/tmp/armadillo-buildroot/usr/include/armadillo_bits/SpMat_bones.hpp
-- Installing: /usr/src/tmp/armadillo-buildroot/usr/include/armadillo_bits/SpMat_iterators_meat.hpp
-- Installing: /usr/src/tmp/armadillo-buildroot/usr/include/armadillo_bits/SpMat_meat.hpp
-- Installing: /usr/src/tmp/armadillo-buildroot/usr/include/armadillo_bits/SpOp_bones.hpp
-- Installing: /usr/src/tmp/armadillo-buildroot/usr/include/armadillo_bits/SpOp_meat.hpp
-- Installing: /usr/src/tmp/armadillo-buildroot/usr/include/armadillo_bits/SpProxy.hpp
-- Installing: /usr/src/tmp/armadillo-buildroot/usr/include/armadillo_bits/SpRow_bones.hpp
-- Installing: /usr/src/tmp/armadillo-buildroot/usr/include/armadillo_bits/SpRow_meat.hpp
-- Installing: /usr/src/tmp/armadillo-buildroot/usr/include/armadillo_bits/SpSubview_bones.hpp
-- Installing: /usr/src/tmp/armadillo-buildroot/usr/include/armadillo_bits/SpSubview_col_list_bones.hpp
-- Installing: /usr/src/tmp/armadillo-buildroot/usr/include/armadillo_bits/SpSubview_col_list_meat.hpp
-- Installing: /usr/src/tmp/armadillo-buildroot/usr/include/armadillo_bits/SpSubview_iterators_meat.hpp
-- Installing: /usr/src/tmp/armadillo-buildroot/usr/include/armadillo_bits/SpSubview_meat.hpp
-- Installing: /usr/src/tmp/armadillo-buildroot/usr/include/armadillo_bits/SpToDOp_bones.hpp
-- Installing: /usr/src/tmp/armadillo-buildroot/usr/include/armadillo_bits/SpToDOp_meat.hpp
-- Installing: /usr/src/tmp/armadillo-buildroot/usr/include/armadillo_bits/SpValProxy_bones.hpp
-- Installing: /usr/src/tmp/armadillo-buildroot/usr/include/armadillo_bits/SpValProxy_meat.hpp
-- Installing: /usr/src/tmp/armadillo-buildroot/usr/include/armadillo_bits/access.hpp
-- Installing: /usr/src/tmp/armadillo-buildroot/usr/include/armadillo_bits/arma_cmath.hpp
-- Installing: /usr/src/tmp/armadillo-buildroot/usr/include/armadillo_bits/arma_config.hpp
-- Installing: /usr/src/tmp/armadillo-buildroot/usr/include/armadillo_bits/arma_forward.hpp
-- Installing: /usr/src/tmp/armadillo-buildroot/usr/include/armadillo_bits/arma_ostream_bones.hpp
-- Installing: /usr/src/tmp/armadillo-buildroot/usr/include/armadillo_bits/arma_ostream_meat.hpp
-- Installing: /usr/src/tmp/armadillo-buildroot/usr/include/armadillo_bits/arma_rel_comparators.hpp
-- Installing: /usr/src/tmp/armadillo-buildroot/usr/include/armadillo_bits/arma_rng.hpp
-- Installing: /usr/src/tmp/armadillo-buildroot/usr/include/armadillo_bits/arma_rng_cxx11.hpp
-- Installing: /usr/src/tmp/armadillo-buildroot/usr/include/armadillo_bits/arma_rng_cxx98.hpp
-- Installing: /usr/src/tmp/armadillo-buildroot/usr/include/armadillo_bits/arma_static_check.hpp
-- Installing: /usr/src/tmp/armadillo-buildroot/usr/include/armadillo_bits/arma_str.hpp
-- Installing: /usr/src/tmp/armadillo-buildroot/usr/include/armadillo_bits/arma_version.hpp
-- Installing: /usr/src/tmp/armadillo-buildroot/usr/include/armadillo_bits/arrayops_bones.hpp
-- Installing: /usr/src/tmp/armadillo-buildroot/usr/include/armadillo_bits/arrayops_meat.hpp
-- Installing: /usr/src/tmp/armadillo-buildroot/usr/include/armadillo_bits/auxlib_bones.hpp
-- Installing: /usr/src/tmp/armadillo-buildroot/usr/include/armadillo_bits/auxlib_meat.hpp
-- Installing: /usr/src/tmp/armadillo-buildroot/usr/include/armadillo_bits/band_helper.hpp
-- Installing: /usr/src/tmp/armadillo-buildroot/usr/include/armadillo_bits/compiler_check.hpp
-- Installing: /usr/src/tmp/armadillo-buildroot/usr/include/armadillo_bits/compiler_setup.hpp
-- Installing: /usr/src/tmp/armadillo-buildroot/usr/include/armadillo_bits/compiler_setup_post.hpp
-- Installing: /usr/src/tmp/armadillo-buildroot/usr/include/armadillo_bits/cond_rel_bones.hpp
-- Installing: /usr/src/tmp/armadillo-buildroot/usr/include/armadillo_bits/cond_rel_meat.hpp
-- Installing: /usr/src/tmp/armadillo-buildroot/usr/include/armadillo_bits/constants.hpp
-- Installing: /usr/src/tmp/armadillo-buildroot/usr/include/armadillo_bits/constants_old.hpp
-- Installing: /usr/src/tmp/armadillo-buildroot/usr/include/armadillo_bits/csv_name.hpp
-- Installing: /usr/src/tmp/armadillo-buildroot/usr/include/armadillo_bits/debug.hpp
-- Installing: /usr/src/tmp/armadillo-buildroot/usr/include/armadillo_bits/def_arpack.hpp
-- Installing: /usr/src/tmp/armadillo-buildroot/usr/include/armadillo_bits/def_atlas.hpp
-- Installing: /usr/src/tmp/armadillo-buildroot/usr/include/armadillo_bits/def_blas.hpp
-- Installing: /usr/src/tmp/armadillo-buildroot/usr/include/armadillo_bits/def_hdf5.hpp
-- Installing: /usr/src/tmp/armadillo-buildroot/usr/include/armadillo_bits/def_lapack.hpp
-- Installing: /usr/src/tmp/armadillo-buildroot/usr/include/armadillo_bits/def_superlu.hpp
-- Installing: /usr/src/tmp/armadillo-buildroot/usr/include/armadillo_bits/diagmat_proxy.hpp
-- Installing: /usr/src/tmp/armadillo-buildroot/usr/include/armadillo_bits/diagview_bones.hpp
-- Installing: /usr/src/tmp/armadillo-buildroot/usr/include/armadillo_bits/diagview_meat.hpp
-- Installing: /usr/src/tmp/armadillo-buildroot/usr/include/armadillo_bits/diskio_bones.hpp
-- Installing: /usr/src/tmp/armadillo-buildroot/usr/include/armadillo_bits/diskio_meat.hpp
-- Installing: /usr/src/tmp/armadillo-buildroot/usr/include/armadillo_bits/distr_param.hpp
-- Installing: /usr/src/tmp/armadillo-buildroot/usr/include/armadillo_bits/eGlueCube_bones.hpp
-- Installing: /usr/src/tmp/armadillo-buildroot/usr/include/armadillo_bits/eGlueCube_meat.hpp
-- Installing: /usr/src/tmp/armadillo-buildroot/usr/include/armadillo_bits/eGlue_bones.hpp
-- Installing: /usr/src/tmp/armadillo-buildroot/usr/include/armadillo_bits/eGlue_meat.hpp
-- Installing: /usr/src/tmp/armadillo-buildroot/usr/include/armadillo_bits/eOpCube_bones.hpp
-- Installing: /usr/src/tmp/armadillo-buildroot/usr/include/armadillo_bits/eOpCube_meat.hpp
-- Installing: /usr/src/tmp/armadillo-buildroot/usr/include/armadillo_bits/eOp_bones.hpp
-- Installing: /usr/src/tmp/armadillo-buildroot/usr/include/armadillo_bits/eOp_meat.hpp
-- Installing: /usr/src/tmp/armadillo-buildroot/usr/include/armadillo_bits/eglue_core_bones.hpp
-- Installing: /usr/src/tmp/armadillo-buildroot/usr/include/armadillo_bits/eglue_core_meat.hpp
-- Installing: /usr/src/tmp/armadillo-buildroot/usr/include/armadillo_bits/eop_aux.hpp
-- Installing: /usr/src/tmp/armadillo-buildroot/usr/include/armadillo_bits/eop_core_bones.hpp
-- Installing: /usr/src/tmp/armadillo-buildroot/usr/include/armadillo_bits/eop_core_meat.hpp
-- Installing: /usr/src/tmp/armadillo-buildroot/usr/include/armadillo_bits/fft_engine.hpp
-- Installing: /usr/src/tmp/armadillo-buildroot/usr/include/armadillo_bits/field_bones.hpp
-- Installing: /usr/src/tmp/armadillo-buildroot/usr/include/armadillo_bits/field_meat.hpp
-- Installing: /usr/src/tmp/armadillo-buildroot/usr/include/armadillo_bits/fn_accu.hpp
-- Installing: /usr/src/tmp/armadillo-buildroot/usr/include/armadillo_bits/fn_all.hpp
-- Installing: /usr/src/tmp/armadillo-buildroot/usr/include/armadillo_bits/fn_any.hpp
-- Installing: /usr/src/tmp/armadillo-buildroot/usr/include/armadillo_bits/fn_approx_equal.hpp
-- Installing: /usr/src/tmp/armadillo-buildroot/usr/include/armadillo_bits/fn_as_scalar.hpp
-- Installing: /usr/src/tmp/armadillo-buildroot/usr/include/armadillo_bits/fn_chi2rnd.hpp
-- Installing: /usr/src/tmp/armadillo-buildroot/usr/include/armadillo_bits/fn_chol.hpp
-- Installing: /usr/src/tmp/armadillo-buildroot/usr/include/armadillo_bits/fn_clamp.hpp
-- Installing: /usr/src/tmp/armadillo-buildroot/usr/include/armadillo_bits/fn_cond.hpp
-- Installing: /usr/src/tmp/armadillo-buildroot/usr/include/armadillo_bits/fn_conv.hpp
-- Installing: /usr/src/tmp/armadillo-buildroot/usr/include/armadillo_bits/fn_conv_to.hpp
-- Installing: /usr/src/tmp/armadillo-buildroot/usr/include/armadillo_bits/fn_cor.hpp
-- Installing: /usr/src/tmp/armadillo-buildroot/usr/include/armadillo_bits/fn_cov.hpp
-- Installing: /usr/src/tmp/armadillo-buildroot/usr/include/armadillo_bits/fn_cross.hpp
-- Installing: /usr/src/tmp/armadillo-buildroot/usr/include/armadillo_bits/fn_cumprod.hpp
-- Installing: /usr/src/tmp/armadillo-buildroot/usr/include/armadillo_bits/fn_cumsum.hpp
-- Installing: /usr/src/tmp/armadillo-buildroot/usr/include/armadillo_bits/fn_det.hpp
-- Installing: /usr/src/tmp/armadillo-buildroot/usr/include/armadillo_bits/fn_diagmat.hpp
-- Installing: /usr/src/tmp/armadillo-buildroot/usr/include/armadillo_bits/fn_diagvec.hpp
-- Installing: /usr/src/tmp/armadillo-buildroot/usr/include/armadillo_bits/fn_diff.hpp
-- Installing: /usr/src/tmp/armadillo-buildroot/usr/include/armadillo_bits/fn_dot.hpp
-- Installing: /usr/src/tmp/armadillo-buildroot/usr/include/armadillo_bits/fn_eig_gen.hpp
-- Installing: /usr/src/tmp/armadillo-buildroot/usr/include/armadillo_bits/fn_eig_pair.hpp
-- Installing: /usr/src/tmp/armadillo-buildroot/usr/include/armadillo_bits/fn_eig_sym.hpp
-- Installing: /usr/src/tmp/armadillo-buildroot/usr/include/armadillo_bits/fn_eigs_gen.hpp
-- Installing: /usr/src/tmp/armadillo-buildroot/usr/include/armadillo_bits/fn_eigs_sym.hpp
-- Installing: /usr/src/tmp/armadillo-buildroot/usr/include/armadillo_bits/fn_elem.hpp
-- Installing: /usr/src/tmp/armadillo-buildroot/usr/include/armadillo_bits/fn_eps.hpp
-- Installing: /usr/src/tmp/armadillo-buildroot/usr/include/armadillo_bits/fn_expmat.hpp
-- Installing: /usr/src/tmp/armadillo-buildroot/usr/include/armadillo_bits/fn_eye.hpp
-- Installing: /usr/src/tmp/armadillo-buildroot/usr/include/armadillo_bits/fn_fft.hpp
-- Installing: /usr/src/tmp/armadillo-buildroot/usr/include/armadillo_bits/fn_fft2.hpp
-- Installing: /usr/src/tmp/armadillo-buildroot/usr/include/armadillo_bits/fn_find.hpp
-- Installing: /usr/src/tmp/armadillo-buildroot/usr/include/armadillo_bits/fn_find_unique.hpp
-- Installing: /usr/src/tmp/armadillo-buildroot/usr/include/armadillo_bits/fn_flip.hpp
-- Installing: /usr/src/tmp/armadillo-buildroot/usr/include/armadillo_bits/fn_hess.hpp
-- Installing: /usr/src/tmp/armadillo-buildroot/usr/include/armadillo_bits/fn_hist.hpp
-- Installing: /usr/src/tmp/armadillo-buildroot/usr/include/armadillo_bits/fn_histc.hpp
-- Installing: /usr/src/tmp/armadillo-buildroot/usr/include/armadillo_bits/fn_index_max.hpp
-- Installing: /usr/src/tmp/armadillo-buildroot/usr/include/armadillo_bits/fn_index_min.hpp
-- Installing: /usr/src/tmp/armadillo-buildroot/usr/include/armadillo_bits/fn_inplace_strans.hpp
-- Installing: /usr/src/tmp/armadillo-buildroot/usr/include/armadillo_bits/fn_inplace_trans.hpp
-- Installing: /usr/src/tmp/armadillo-buildroot/usr/include/armadillo_bits/fn_interp1.hpp
-- Installing: /usr/src/tmp/armadillo-buildroot/usr/include/armadillo_bits/fn_interp2.hpp
-- Installing: /usr/src/tmp/armadillo-buildroot/usr/include/armadillo_bits/fn_intersect.hpp
-- Installing: /usr/src/tmp/armadillo-buildroot/usr/include/armadillo_bits/fn_inv.hpp
-- Installing: /usr/src/tmp/armadillo-buildroot/usr/include/armadillo_bits/fn_join.hpp
-- Installing: /usr/src/tmp/armadillo-buildroot/usr/include/armadillo_bits/fn_kmeans.hpp
-- Installing: /usr/src/tmp/armadillo-buildroot/usr/include/armadillo_bits/fn_kron.hpp
-- Installing: /usr/src/tmp/armadillo-buildroot/usr/include/armadillo_bits/fn_log_det.hpp
-- Installing: /usr/src/tmp/armadillo-buildroot/usr/include/armadillo_bits/fn_log_normpdf.hpp
-- Installing: /usr/src/tmp/armadillo-buildroot/usr/include/armadillo_bits/fn_logmat.hpp
-- Installing: /usr/src/tmp/armadillo-buildroot/usr/include/armadillo_bits/fn_lu.hpp
-- Installing: /usr/src/tmp/armadillo-buildroot/usr/include/armadillo_bits/fn_max.hpp
-- Installing: /usr/src/tmp/armadillo-buildroot/usr/include/armadillo_bits/fn_mean.hpp
-- Installing: /usr/src/tmp/armadillo-buildroot/usr/include/armadillo_bits/fn_median.hpp
-- Installing: /usr/src/tmp/armadillo-buildroot/usr/include/armadillo_bits/fn_min.hpp
-- Installing: /usr/src/tmp/armadillo-buildroot/usr/include/armadillo_bits/fn_misc.hpp
-- Installing: /usr/src/tmp/armadillo-buildroot/usr/include/armadillo_bits/fn_mvnrnd.hpp
-- Installing: /usr/src/tmp/armadillo-buildroot/usr/include/armadillo_bits/fn_n_unique.hpp
-- Installing: /usr/src/tmp/armadillo-buildroot/usr/include/armadillo_bits/fn_nonzeros.hpp
-- Installing: /usr/src/tmp/armadillo-buildroot/usr/include/armadillo_bits/fn_norm.hpp
-- Installing: /usr/src/tmp/armadillo-buildroot/usr/include/armadillo_bits/fn_normalise.hpp
-- Installing: /usr/src/tmp/armadillo-buildroot/usr/include/armadillo_bits/fn_normcdf.hpp
-- Installing: /usr/src/tmp/armadillo-buildroot/usr/include/armadillo_bits/fn_normpdf.hpp
-- Installing: /usr/src/tmp/armadillo-buildroot/usr/include/armadillo_bits/fn_numel.hpp
-- Installing: /usr/src/tmp/armadillo-buildroot/usr/include/armadillo_bits/fn_ones.hpp
-- Installing: /usr/src/tmp/armadillo-buildroot/usr/include/armadillo_bits/fn_orth_null.hpp
-- Installing: /usr/src/tmp/armadillo-buildroot/usr/include/armadillo_bits/fn_pinv.hpp
-- Installing: /usr/src/tmp/armadillo-buildroot/usr/include/armadillo_bits/fn_polyfit.hpp
-- Installing: /usr/src/tmp/armadillo-buildroot/usr/include/armadillo_bits/fn_polyval.hpp
-- Installing: /usr/src/tmp/armadillo-buildroot/usr/include/armadillo_bits/fn_powmat.hpp
-- Installing: /usr/src/tmp/armadillo-buildroot/usr/include/armadillo_bits/fn_princomp.hpp
-- Installing: /usr/src/tmp/armadillo-buildroot/usr/include/armadillo_bits/fn_prod.hpp
-- Installing: /usr/src/tmp/armadillo-buildroot/usr/include/armadillo_bits/fn_qr.hpp
-- Installing: /usr/src/tmp/armadillo-buildroot/usr/include/armadillo_bits/fn_quantile.hpp
-- Installing: /usr/src/tmp/armadillo-buildroot/usr/include/armadillo_bits/fn_qz.hpp
-- Installing: /usr/src/tmp/armadillo-buildroot/usr/include/armadillo_bits/fn_randg.hpp
-- Installing: /usr/src/tmp/armadillo-buildroot/usr/include/armadillo_bits/fn_randi.hpp
-- Installing: /usr/src/tmp/armadillo-buildroot/usr/include/armadillo_bits/fn_randn.hpp
-- Installing: /usr/src/tmp/armadillo-buildroot/usr/include/armadillo_bits/fn_randperm.hpp
-- Installing: /usr/src/tmp/armadillo-buildroot/usr/include/armadillo_bits/fn_randu.hpp
-- Installing: /usr/src/tmp/armadillo-buildroot/usr/include/armadillo_bits/fn_range.hpp
-- Installing: /usr/src/tmp/armadillo-buildroot/usr/include/armadillo_bits/fn_rank.hpp
-- Installing: /usr/src/tmp/armadillo-buildroot/usr/include/armadillo_bits/fn_regspace.hpp
-- Installing: /usr/src/tmp/armadillo-buildroot/usr/include/armadillo_bits/fn_repelem.hpp
-- Installing: /usr/src/tmp/armadillo-buildroot/usr/include/armadillo_bits/fn_repmat.hpp
-- Installing: /usr/src/tmp/armadillo-buildroot/usr/include/armadillo_bits/fn_reshape.hpp
-- Installing: /usr/src/tmp/armadillo-buildroot/usr/include/armadillo_bits/fn_resize.hpp
-- Installing: /usr/src/tmp/armadillo-buildroot/usr/include/armadillo_bits/fn_reverse.hpp
-- Installing: /usr/src/tmp/armadillo-buildroot/usr/include/armadillo_bits/fn_roots.hpp
-- Installing: /usr/src/tmp/armadillo-buildroot/usr/include/armadillo_bits/fn_schur.hpp
-- Installing: /usr/src/tmp/armadillo-buildroot/usr/include/armadillo_bits/fn_shift.hpp
-- Installing: /usr/src/tmp/armadillo-buildroot/usr/include/armadillo_bits/fn_shuffle.hpp
-- Installing: /usr/src/tmp/armadillo-buildroot/usr/include/armadillo_bits/fn_size.hpp
-- Installing: /usr/src/tmp/armadillo-buildroot/usr/include/armadillo_bits/fn_solve.hpp
-- Installing: /usr/src/tmp/armadillo-buildroot/usr/include/armadillo_bits/fn_sort.hpp
-- Installing: /usr/src/tmp/armadillo-buildroot/usr/include/armadillo_bits/fn_sort_index.hpp
-- Installing: /usr/src/tmp/armadillo-buildroot/usr/include/armadillo_bits/fn_speye.hpp
-- Installing: /usr/src/tmp/armadillo-buildroot/usr/include/armadillo_bits/fn_spones.hpp
-- Installing: /usr/src/tmp/armadillo-buildroot/usr/include/armadillo_bits/fn_sprandn.hpp
-- Installing: /usr/src/tmp/armadillo-buildroot/usr/include/armadillo_bits/fn_sprandu.hpp
-- Installing: /usr/src/tmp/armadillo-buildroot/usr/include/armadillo_bits/fn_spsolve.hpp
-- Installing: /usr/src/tmp/armadillo-buildroot/usr/include/armadillo_bits/fn_sqrtmat.hpp
-- Installing: /usr/src/tmp/armadillo-buildroot/usr/include/armadillo_bits/fn_stddev.hpp
-- Installing: /usr/src/tmp/armadillo-buildroot/usr/include/armadillo_bits/fn_strans.hpp
-- Installing: /usr/src/tmp/armadillo-buildroot/usr/include/armadillo_bits/fn_sum.hpp
-- Installing: /usr/src/tmp/armadillo-buildroot/usr/include/armadillo_bits/fn_svd.hpp
-- Installing: /usr/src/tmp/armadillo-buildroot/usr/include/armadillo_bits/fn_svds.hpp
-- Installing: /usr/src/tmp/armadillo-buildroot/usr/include/armadillo_bits/fn_syl_lyap.hpp
-- Installing: /usr/src/tmp/armadillo-buildroot/usr/include/armadillo_bits/fn_symmat.hpp
-- Installing: /usr/src/tmp/armadillo-buildroot/usr/include/armadillo_bits/fn_toeplitz.hpp
-- Installing: /usr/src/tmp/armadillo-buildroot/usr/include/armadillo_bits/fn_trace.hpp
-- Installing: /usr/src/tmp/armadillo-buildroot/usr/include/armadillo_bits/fn_trans.hpp
-- Installing: /usr/src/tmp/armadillo-buildroot/usr/include/armadillo_bits/fn_trapz.hpp
-- Installing: /usr/src/tmp/armadillo-buildroot/usr/include/armadillo_bits/fn_trig.hpp
-- Installing: /usr/src/tmp/armadillo-buildroot/usr/include/armadillo_bits/fn_trimat.hpp
-- Installing: /usr/src/tmp/armadillo-buildroot/usr/include/armadillo_bits/fn_trimat_ind.hpp
-- Installing: /usr/src/tmp/armadillo-buildroot/usr/include/armadillo_bits/fn_trunc_exp.hpp
-- Installing: /usr/src/tmp/armadillo-buildroot/usr/include/armadillo_bits/fn_trunc_log.hpp
-- Installing: /usr/src/tmp/armadillo-buildroot/usr/include/armadillo_bits/fn_unique.hpp
-- Installing: /usr/src/tmp/armadillo-buildroot/usr/include/armadillo_bits/fn_var.hpp
-- Installing: /usr/src/tmp/armadillo-buildroot/usr/include/armadillo_bits/fn_vectorise.hpp
-- Installing: /usr/src/tmp/armadillo-buildroot/usr/include/armadillo_bits/fn_wishrnd.hpp
-- Installing: /usr/src/tmp/armadillo-buildroot/usr/include/armadillo_bits/fn_zeros.hpp
-- Installing: /usr/src/tmp/armadillo-buildroot/usr/include/armadillo_bits/glue_affmul_bones.hpp
-- Installing: /usr/src/tmp/armadillo-buildroot/usr/include/armadillo_bits/glue_affmul_meat.hpp
-- Installing: /usr/src/tmp/armadillo-buildroot/usr/include/armadillo_bits/glue_atan2_bones.hpp
-- Installing: /usr/src/tmp/armadillo-buildroot/usr/include/armadillo_bits/glue_atan2_meat.hpp
-- Installing: /usr/src/tmp/armadillo-buildroot/usr/include/armadillo_bits/glue_conv_bones.hpp
-- Installing: /usr/src/tmp/armadillo-buildroot/usr/include/armadillo_bits/glue_conv_meat.hpp
-- Installing: /usr/src/tmp/armadillo-buildroot/usr/include/armadillo_bits/glue_cor_bones.hpp
-- Installing: /usr/src/tmp/armadillo-buildroot/usr/include/armadillo_bits/glue_cor_meat.hpp
-- Installing: /usr/src/tmp/armadillo-buildroot/usr/include/armadillo_bits/glue_cov_bones.hpp
-- Installing: /usr/src/tmp/armadillo-buildroot/usr/include/armadillo_bits/glue_cov_meat.hpp
-- Installing: /usr/src/tmp/armadillo-buildroot/usr/include/armadillo_bits/glue_cross_bones.hpp
-- Installing: /usr/src/tmp/armadillo-buildroot/usr/include/armadillo_bits/glue_cross_meat.hpp
-- Installing: /usr/src/tmp/armadillo-buildroot/usr/include/armadillo_bits/glue_hist_bones.hpp
-- Installing: /usr/src/tmp/armadillo-buildroot/usr/include/armadillo_bits/glue_hist_meat.hpp
-- Installing: /usr/src/tmp/armadillo-buildroot/usr/include/armadillo_bits/glue_histc_bones.hpp
-- Installing: /usr/src/tmp/armadillo-buildroot/usr/include/armadillo_bits/glue_histc_meat.hpp
-- Installing: /usr/src/tmp/armadillo-buildroot/usr/include/armadillo_bits/glue_hypot_bones.hpp
-- Installing: /usr/src/tmp/armadillo-buildroot/usr/include/armadillo_bits/glue_hypot_meat.hpp
-- Installing: /usr/src/tmp/armadillo-buildroot/usr/include/armadillo_bits/glue_intersect_bones.hpp
-- Installing: /usr/src/tmp/armadillo-buildroot/usr/include/armadillo_bits/glue_intersect_meat.hpp
-- Installing: /usr/src/tmp/armadillo-buildroot/usr/include/armadillo_bits/glue_join_bones.hpp
-- Installing: /usr/src/tmp/armadillo-buildroot/usr/include/armadillo_bits/glue_join_meat.hpp
-- Installing: /usr/src/tmp/armadillo-buildroot/usr/include/armadillo_bits/glue_kron_bones.hpp
-- Installing: /usr/src/tmp/armadillo-buildroot/usr/include/armadillo_bits/glue_kron_meat.hpp
-- Installing: /usr/src/tmp/armadillo-buildroot/usr/include/armadillo_bits/glue_max_bones.hpp
-- Installing: /usr/src/tmp/armadillo-buildroot/usr/include/armadillo_bits/glue_max_meat.hpp
-- Installing: /usr/src/tmp/armadillo-buildroot/usr/include/armadillo_bits/glue_min_bones.hpp
-- Installing: /usr/src/tmp/armadillo-buildroot/usr/include/armadillo_bits/glue_min_meat.hpp
-- Installing: /usr/src/tmp/armadillo-buildroot/usr/include/armadillo_bits/glue_mixed_bones.hpp
-- Installing: /usr/src/tmp/armadillo-buildroot/usr/include/armadillo_bits/glue_mixed_meat.hpp
-- Installing: /usr/src/tmp/armadillo-buildroot/usr/include/armadillo_bits/glue_mvnrnd_bones.hpp
-- Installing: /usr/src/tmp/armadillo-buildroot/usr/include/armadillo_bits/glue_mvnrnd_meat.hpp
-- Installing: /usr/src/tmp/armadillo-buildroot/usr/include/armadillo_bits/glue_polyfit_bones.hpp
-- Installing: /usr/src/tmp/armadillo-buildroot/usr/include/armadillo_bits/glue_polyfit_meat.hpp
-- Installing: /usr/src/tmp/armadillo-buildroot/usr/include/armadillo_bits/glue_polyval_bones.hpp
-- Installing: /usr/src/tmp/armadillo-buildroot/usr/include/armadillo_bits/glue_polyval_meat.hpp
-- Installing: /usr/src/tmp/armadillo-buildroot/usr/include/armadillo_bits/glue_quantile_bones.hpp
-- Installing: /usr/src/tmp/armadillo-buildroot/usr/include/armadillo_bits/glue_quantile_meat.hpp
-- Installing: /usr/src/tmp/armadillo-buildroot/usr/include/armadillo_bits/glue_relational_bones.hpp
-- Installing: /usr/src/tmp/armadillo-buildroot/usr/include/armadillo_bits/glue_relational_meat.hpp
-- Installing: /usr/src/tmp/armadillo-buildroot/usr/include/armadillo_bits/glue_solve_bones.hpp
-- Installing: /usr/src/tmp/armadillo-buildroot/usr/include/armadillo_bits/glue_solve_meat.hpp
-- Installing: /usr/src/tmp/armadillo-buildroot/usr/include/armadillo_bits/glue_times_bones.hpp
-- Installing: /usr/src/tmp/armadillo-buildroot/usr/include/armadillo_bits/glue_times_meat.hpp
-- Installing: /usr/src/tmp/armadillo-buildroot/usr/include/armadillo_bits/glue_toeplitz_bones.hpp
-- Installing: /usr/src/tmp/armadillo-buildroot/usr/include/armadillo_bits/glue_toeplitz_meat.hpp
-- Installing: /usr/src/tmp/armadillo-buildroot/usr/include/armadillo_bits/glue_trapz_bones.hpp
-- Installing: /usr/src/tmp/armadillo-buildroot/usr/include/armadillo_bits/glue_trapz_meat.hpp
-- Installing: /usr/src/tmp/armadillo-buildroot/usr/include/armadillo_bits/gmm_diag_bones.hpp
-- Installing: /usr/src/tmp/armadillo-buildroot/usr/include/armadillo_bits/gmm_diag_meat.hpp
-- Installing: /usr/src/tmp/armadillo-buildroot/usr/include/armadillo_bits/gmm_full_bones.hpp
-- Installing: /usr/src/tmp/armadillo-buildroot/usr/include/armadillo_bits/gmm_full_meat.hpp
-- Installing: /usr/src/tmp/armadillo-buildroot/usr/include/armadillo_bits/gmm_misc_bones.hpp
-- Installing: /usr/src/tmp/armadillo-buildroot/usr/include/armadillo_bits/gmm_misc_meat.hpp
-- Installing: /usr/src/tmp/armadillo-buildroot/usr/include/armadillo_bits/hdf5_misc.hpp
-- Installing: /usr/src/tmp/armadillo-buildroot/usr/include/armadillo_bits/hdf5_name.hpp
-- Installing: /usr/src/tmp/armadillo-buildroot/usr/include/armadillo_bits/include_atlas.hpp
-- Installing: /usr/src/tmp/armadillo-buildroot/usr/include/armadillo_bits/include_hdf5.hpp
-- Installing: /usr/src/tmp/armadillo-buildroot/usr/include/armadillo_bits/include_superlu.hpp
-- Installing: /usr/src/tmp/armadillo-buildroot/usr/include/armadillo_bits/injector_bones.hpp
-- Installing: /usr/src/tmp/armadillo-buildroot/usr/include/armadillo_bits/injector_meat.hpp
-- Installing: /usr/src/tmp/armadillo-buildroot/usr/include/armadillo_bits/memory.hpp
-- Installing: /usr/src/tmp/armadillo-buildroot/usr/include/armadillo_bits/mp_misc.hpp
-- Installing: /usr/src/tmp/armadillo-buildroot/usr/include/armadillo_bits/mtGlueCube_bones.hpp
-- Installing: /usr/src/tmp/armadillo-buildroot/usr/include/armadillo_bits/mtGlueCube_meat.hpp
-- Installing: /usr/src/tmp/armadillo-buildroot/usr/include/armadillo_bits/mtGlue_bones.hpp
-- Installing: /usr/src/tmp/armadillo-buildroot/usr/include/armadillo_bits/mtGlue_meat.hpp
-- Installing: /usr/src/tmp/armadillo-buildroot/usr/include/armadillo_bits/mtOpCube_bones.hpp
-- Installing: /usr/src/tmp/armadillo-buildroot/usr/include/armadillo_bits/mtOpCube_meat.hpp
-- Installing: /usr/src/tmp/armadillo-buildroot/usr/include/armadillo_bits/mtOp_bones.hpp
-- Installing: /usr/src/tmp/armadillo-buildroot/usr/include/armadillo_bits/mtOp_meat.hpp
-- Installing: /usr/src/tmp/armadillo-buildroot/usr/include/armadillo_bits/mtSpGlue_bones.hpp
-- Installing: /usr/src/tmp/armadillo-buildroot/usr/include/armadillo_bits/mtSpGlue_meat.hpp
-- Installing: /usr/src/tmp/armadillo-buildroot/usr/include/armadillo_bits/mtSpOp_bones.hpp
-- Installing: /usr/src/tmp/armadillo-buildroot/usr/include/armadillo_bits/mtSpOp_meat.hpp
-- Installing: /usr/src/tmp/armadillo-buildroot/usr/include/armadillo_bits/mul_gemm.hpp
-- Installing: /usr/src/tmp/armadillo-buildroot/usr/include/armadillo_bits/mul_gemm_mixed.hpp
-- Installing: /usr/src/tmp/armadillo-buildroot/usr/include/armadillo_bits/mul_gemv.hpp
-- Installing: /usr/src/tmp/armadillo-buildroot/usr/include/armadillo_bits/mul_herk.hpp
-- Installing: /usr/src/tmp/armadillo-buildroot/usr/include/armadillo_bits/mul_syrk.hpp
-- Installing: /usr/src/tmp/armadillo-buildroot/usr/include/armadillo_bits/newarp_DenseGenMatProd_bones.hpp
-- Installing: /usr/src/tmp/armadillo-buildroot/usr/include/armadillo_bits/newarp_DenseGenMatProd_meat.hpp
-- Installing: /usr/src/tmp/armadillo-buildroot/usr/include/armadillo_bits/newarp_DoubleShiftQR_bones.hpp
-- Installing: /usr/src/tmp/armadillo-buildroot/usr/include/armadillo_bits/newarp_DoubleShiftQR_meat.hpp
-- Installing: /usr/src/tmp/armadillo-buildroot/usr/include/armadillo_bits/newarp_EigsSelect.hpp
-- Installing: /usr/src/tmp/armadillo-buildroot/usr/include/armadillo_bits/newarp_GenEigsSolver_bones.hpp
-- Installing: /usr/src/tmp/armadillo-buildroot/usr/include/armadillo_bits/newarp_GenEigsSolver_meat.hpp
-- Installing: /usr/src/tmp/armadillo-buildroot/usr/include/armadillo_bits/newarp_SortEigenvalue.hpp
-- Installing: /usr/src/tmp/armadillo-buildroot/usr/include/armadillo_bits/newarp_SparseGenMatProd_bones.hpp
-- Installing: /usr/src/tmp/armadillo-buildroot/usr/include/armadillo_bits/newarp_SparseGenMatProd_meat.hpp
-- Installing: /usr/src/tmp/armadillo-buildroot/usr/include/armadillo_bits/newarp_SparseGenRealShiftSolve_bones.hpp
-- Installing: /usr/src/tmp/armadillo-buildroot/usr/include/armadillo_bits/newarp_SparseGenRealShiftSolve_meat.hpp
-- Installing: /usr/src/tmp/armadillo-buildroot/usr/include/armadillo_bits/newarp_SymEigsShiftSolver_bones.hpp
-- Installing: /usr/src/tmp/armadillo-buildroot/usr/include/armadillo_bits/newarp_SymEigsShiftSolver_meat.hpp
-- Installing: /usr/src/tmp/armadillo-buildroot/usr/include/armadillo_bits/newarp_SymEigsSolver_bones.hpp
-- Installing: /usr/src/tmp/armadillo-buildroot/usr/include/armadillo_bits/newarp_SymEigsSolver_meat.hpp
-- Installing: /usr/src/tmp/armadillo-buildroot/usr/include/armadillo_bits/newarp_TridiagEigen_bones.hpp
-- Installing: /usr/src/tmp/armadillo-buildroot/usr/include/armadillo_bits/newarp_TridiagEigen_meat.hpp
-- Installing: /usr/src/tmp/armadillo-buildroot/usr/include/armadillo_bits/newarp_UpperHessenbergEigen_bones.hpp
-- Installing: /usr/src/tmp/armadillo-buildroot/usr/include/armadillo_bits/newarp_UpperHessenbergEigen_meat.hpp
-- Installing: /usr/src/tmp/armadillo-buildroot/usr/include/armadillo_bits/newarp_UpperHessenbergQR_bones.hpp
-- Installing: /usr/src/tmp/armadillo-buildroot/usr/include/armadillo_bits/newarp_UpperHessenbergQR_meat.hpp
-- Installing: /usr/src/tmp/armadillo-buildroot/usr/include/armadillo_bits/newarp_cx_attrib.hpp
-- Installing: /usr/src/tmp/armadillo-buildroot/usr/include/armadillo_bits/op_all_bones.hpp
-- Installing: /usr/src/tmp/armadillo-buildroot/usr/include/armadillo_bits/op_all_meat.hpp
-- Installing: /usr/src/tmp/armadillo-buildroot/usr/include/armadillo_bits/op_any_bones.hpp
-- Installing: /usr/src/tmp/armadillo-buildroot/usr/include/armadillo_bits/op_any_meat.hpp
-- Installing: /usr/src/tmp/armadillo-buildroot/usr/include/armadillo_bits/op_chi2rnd_bones.hpp
-- Installing: /usr/src/tmp/armadillo-buildroot/usr/include/armadillo_bits/op_chi2rnd_meat.hpp
-- Installing: /usr/src/tmp/armadillo-buildroot/usr/include/armadillo_bits/op_chol_bones.hpp
-- Installing: /usr/src/tmp/armadillo-buildroot/usr/include/armadillo_bits/op_chol_meat.hpp
-- Installing: /usr/src/tmp/armadillo-buildroot/usr/include/armadillo_bits/op_clamp_bones.hpp
-- Installing: /usr/src/tmp/armadillo-buildroot/usr/include/armadillo_bits/op_clamp_meat.hpp
-- Installing: /usr/src/tmp/armadillo-buildroot/usr/include/armadillo_bits/op_cond_bones.hpp
-- Installing: /usr/src/tmp/armadillo-buildroot/usr/include/armadillo_bits/op_cond_meat.hpp
-- Installing: /usr/src/tmp/armadillo-buildroot/usr/include/armadillo_bits/op_cor_bones.hpp
-- Installing: /usr/src/tmp/armadillo-buildroot/usr/include/armadillo_bits/op_cor_meat.hpp
-- Installing: /usr/src/tmp/armadillo-buildroot/usr/include/armadillo_bits/op_cov_bones.hpp
-- Installing: /usr/src/tmp/armadillo-buildroot/usr/include/armadillo_bits/op_cov_meat.hpp
-- Installing: /usr/src/tmp/armadillo-buildroot/usr/include/armadillo_bits/op_cumprod_bones.hpp
-- Installing: /usr/src/tmp/armadillo-buildroot/usr/include/armadillo_bits/op_cumprod_meat.hpp
-- Installing: /usr/src/tmp/armadillo-buildroot/usr/include/armadillo_bits/op_cumsum_bones.hpp
-- Installing: /usr/src/tmp/armadillo-buildroot/usr/include/armadillo_bits/op_cumsum_meat.hpp
-- Installing: /usr/src/tmp/armadillo-buildroot/usr/include/armadillo_bits/op_cx_scalar_bones.hpp
-- Installing: /usr/src/tmp/armadillo-buildroot/usr/include/armadillo_bits/op_cx_scalar_meat.hpp
-- Installing: /usr/src/tmp/armadillo-buildroot/usr/include/armadillo_bits/op_diagmat_bones.hpp
-- Installing: /usr/src/tmp/armadillo-buildroot/usr/include/armadillo_bits/op_diagmat_meat.hpp
-- Installing: /usr/src/tmp/armadillo-buildroot/usr/include/armadillo_bits/op_diagvec_bones.hpp
-- Installing: /usr/src/tmp/armadillo-buildroot/usr/include/armadillo_bits/op_diagvec_meat.hpp
-- Installing: /usr/src/tmp/armadillo-buildroot/usr/include/armadillo_bits/op_diff_bones.hpp
-- Installing: /usr/src/tmp/armadillo-buildroot/usr/include/armadillo_bits/op_diff_meat.hpp
-- Installing: /usr/src/tmp/armadillo-buildroot/usr/include/armadillo_bits/op_dot_bones.hpp
-- Installing: /usr/src/tmp/armadillo-buildroot/usr/include/armadillo_bits/op_dot_meat.hpp
-- Installing: /usr/src/tmp/armadillo-buildroot/usr/include/armadillo_bits/op_dotext_bones.hpp
-- Installing: /usr/src/tmp/armadillo-buildroot/usr/include/armadillo_bits/op_dotext_meat.hpp
-- Installing: /usr/src/tmp/armadillo-buildroot/usr/include/armadillo_bits/op_expmat_bones.hpp
-- Installing: /usr/src/tmp/armadillo-buildroot/usr/include/armadillo_bits/op_expmat_meat.hpp
-- Installing: /usr/src/tmp/armadillo-buildroot/usr/include/armadillo_bits/op_fft_bones.hpp
-- Installing: /usr/src/tmp/armadillo-buildroot/usr/include/armadillo_bits/op_fft_meat.hpp
-- Installing: /usr/src/tmp/armadillo-buildroot/usr/include/armadillo_bits/op_find_bones.hpp
-- Installing: /usr/src/tmp/armadillo-buildroot/usr/include/armadillo_bits/op_find_meat.hpp
-- Installing: /usr/src/tmp/armadillo-buildroot/usr/include/armadillo_bits/op_find_unique_bones.hpp
-- Installing: /usr/src/tmp/armadillo-buildroot/usr/include/armadillo_bits/op_find_unique_meat.hpp
-- Installing: /usr/src/tmp/armadillo-buildroot/usr/include/armadillo_bits/op_flip_bones.hpp
-- Installing: /usr/src/tmp/armadillo-buildroot/usr/include/armadillo_bits/op_flip_meat.hpp
-- Installing: /usr/src/tmp/armadillo-buildroot/usr/include/armadillo_bits/op_hist_bones.hpp
-- Installing: /usr/src/tmp/armadillo-buildroot/usr/include/armadillo_bits/op_hist_meat.hpp
-- Installing: /usr/src/tmp/armadillo-buildroot/usr/include/armadillo_bits/op_htrans_bones.hpp
-- Installing: /usr/src/tmp/armadillo-buildroot/usr/include/armadillo_bits/op_htrans_meat.hpp
-- Installing: /usr/src/tmp/armadillo-buildroot/usr/include/armadillo_bits/op_index_max_bones.hpp
-- Installing: /usr/src/tmp/armadillo-buildroot/usr/include/armadillo_bits/op_index_max_meat.hpp
-- Installing: /usr/src/tmp/armadillo-buildroot/usr/include/armadillo_bits/op_index_min_bones.hpp
-- Installing: /usr/src/tmp/armadillo-buildroot/usr/include/armadillo_bits/op_index_min_meat.hpp
-- Installing: /usr/src/tmp/armadillo-buildroot/usr/include/armadillo_bits/op_inv_bones.hpp
-- Installing: /usr/src/tmp/armadillo-buildroot/usr/include/armadillo_bits/op_inv_meat.hpp
-- Installing: /usr/src/tmp/armadillo-buildroot/usr/include/armadillo_bits/op_logmat_bones.hpp
-- Installing: /usr/src/tmp/armadillo-buildroot/usr/include/armadillo_bits/op_logmat_meat.hpp
-- Installing: /usr/src/tmp/armadillo-buildroot/usr/include/armadillo_bits/op_max_bones.hpp
-- Installing: /usr/src/tmp/armadillo-buildroot/usr/include/armadillo_bits/op_max_meat.hpp
-- Installing: /usr/src/tmp/armadillo-buildroot/usr/include/armadillo_bits/op_mean_bones.hpp
-- Installing: /usr/src/tmp/armadillo-buildroot/usr/include/armadillo_bits/op_mean_meat.hpp
-- Installing: /usr/src/tmp/armadillo-buildroot/usr/include/armadillo_bits/op_median_bones.hpp
-- Installing: /usr/src/tmp/armadillo-buildroot/usr/include/armadillo_bits/op_median_meat.hpp
-- Installing: /usr/src/tmp/armadillo-buildroot/usr/include/armadillo_bits/op_min_bones.hpp
-- Installing: /usr/src/tmp/armadillo-buildroot/usr/include/armadillo_bits/op_min_meat.hpp
-- Installing: /usr/src/tmp/armadillo-buildroot/usr/include/armadillo_bits/op_misc_bones.hpp
-- Installing: /usr/src/tmp/armadillo-buildroot/usr/include/armadillo_bits/op_misc_meat.hpp
-- Installing: /usr/src/tmp/armadillo-buildroot/usr/include/armadillo_bits/op_nonzeros_bones.hpp
-- Installing: /usr/src/tmp/armadillo-buildroot/usr/include/armadillo_bits/op_nonzeros_meat.hpp
-- Installing: /usr/src/tmp/armadillo-buildroot/usr/include/armadillo_bits/op_norm_bones.hpp
-- Installing: /usr/src/tmp/armadillo-buildroot/usr/include/armadillo_bits/op_norm_meat.hpp
-- Installing: /usr/src/tmp/armadillo-buildroot/usr/include/armadillo_bits/op_normalise_bones.hpp
-- Installing: /usr/src/tmp/armadillo-buildroot/usr/include/armadillo_bits/op_normalise_meat.hpp
-- Installing: /usr/src/tmp/armadillo-buildroot/usr/include/armadillo_bits/op_orth_null_bones.hpp
-- Installing: /usr/src/tmp/armadillo-buildroot/usr/include/armadillo_bits/op_orth_null_meat.hpp
-- Installing: /usr/src/tmp/armadillo-buildroot/usr/include/armadillo_bits/op_pinv_bones.hpp
-- Installing: /usr/src/tmp/armadillo-buildroot/usr/include/armadillo_bits/op_pinv_meat.hpp
-- Installing: /usr/src/tmp/armadillo-buildroot/usr/include/armadillo_bits/op_powmat_bones.hpp
-- Installing: /usr/src/tmp/armadillo-buildroot/usr/include/armadillo_bits/op_powmat_meat.hpp
-- Installing: /usr/src/tmp/armadillo-buildroot/usr/include/armadillo_bits/op_princomp_bones.hpp
-- Installing: /usr/src/tmp/armadillo-buildroot/usr/include/armadillo_bits/op_princomp_meat.hpp
-- Installing: /usr/src/tmp/armadillo-buildroot/usr/include/armadillo_bits/op_prod_bones.hpp
-- Installing: /usr/src/tmp/armadillo-buildroot/usr/include/armadillo_bits/op_prod_meat.hpp
-- Installing: /usr/src/tmp/armadillo-buildroot/usr/include/armadillo_bits/op_range_bones.hpp
-- Installing: /usr/src/tmp/armadillo-buildroot/usr/include/armadillo_bits/op_range_meat.hpp
-- Installing: /usr/src/tmp/armadillo-buildroot/usr/include/armadillo_bits/op_relational_bones.hpp
-- Installing: /usr/src/tmp/armadillo-buildroot/usr/include/armadillo_bits/op_relational_meat.hpp
-- Installing: /usr/src/tmp/armadillo-buildroot/usr/include/armadillo_bits/op_repelem_bones.hpp
-- Installing: /usr/src/tmp/armadillo-buildroot/usr/include/armadillo_bits/op_repelem_meat.hpp
-- Installing: /usr/src/tmp/armadillo-buildroot/usr/include/armadillo_bits/op_repmat_bones.hpp
-- Installing: /usr/src/tmp/armadillo-buildroot/usr/include/armadillo_bits/op_repmat_meat.hpp
-- Installing: /usr/src/tmp/armadillo-buildroot/usr/include/armadillo_bits/op_reshape_bones.hpp
-- Installing: /usr/src/tmp/armadillo-buildroot/usr/include/armadillo_bits/op_reshape_meat.hpp
-- Installing: /usr/src/tmp/armadillo-buildroot/usr/include/armadillo_bits/op_resize_bones.hpp
-- Installing: /usr/src/tmp/armadillo-buildroot/usr/include/armadillo_bits/op_resize_meat.hpp
-- Installing: /usr/src/tmp/armadillo-buildroot/usr/include/armadillo_bits/op_reverse_bones.hpp
-- Installing: /usr/src/tmp/armadillo-buildroot/usr/include/armadillo_bits/op_reverse_meat.hpp
-- Installing: /usr/src/tmp/armadillo-buildroot/usr/include/armadillo_bits/op_roots_bones.hpp
-- Installing: /usr/src/tmp/armadillo-buildroot/usr/include/armadillo_bits/op_roots_meat.hpp
-- Installing: /usr/src/tmp/armadillo-buildroot/usr/include/armadillo_bits/op_shift_bones.hpp
-- Installing: /usr/src/tmp/armadillo-buildroot/usr/include/armadillo_bits/op_shift_meat.hpp
-- Installing: /usr/src/tmp/armadillo-buildroot/usr/include/armadillo_bits/op_shuffle_bones.hpp
-- Installing: /usr/src/tmp/armadillo-buildroot/usr/include/armadillo_bits/op_shuffle_meat.hpp
-- Installing: /usr/src/tmp/armadillo-buildroot/usr/include/armadillo_bits/op_sort_bones.hpp
-- Installing: /usr/src/tmp/armadillo-buildroot/usr/include/armadillo_bits/op_sort_index_bones.hpp
-- Installing: /usr/src/tmp/armadillo-buildroot/usr/include/armadillo_bits/op_sort_index_meat.hpp
-- Installing: /usr/src/tmp/armadillo-buildroot/usr/include/armadillo_bits/op_sort_meat.hpp
-- Installing: /usr/src/tmp/armadillo-buildroot/usr/include/armadillo_bits/op_sp_minus_bones.hpp
-- Installing: /usr/src/tmp/armadillo-buildroot/usr/include/armadillo_bits/op_sp_minus_meat.hpp
-- Installing: /usr/src/tmp/armadillo-buildroot/usr/include/armadillo_bits/op_sp_plus_bones.hpp
-- Installing: /usr/src/tmp/armadillo-buildroot/usr/include/armadillo_bits/op_sp_plus_meat.hpp
-- Installing: /usr/src/tmp/armadillo-buildroot/usr/include/armadillo_bits/op_sqrtmat_bones.hpp
-- Installing: /usr/src/tmp/armadillo-buildroot/usr/include/armadillo_bits/op_sqrtmat_meat.hpp
-- Installing: /usr/src/tmp/armadillo-buildroot/usr/include/armadillo_bits/op_stddev_bones.hpp
-- Installing: /usr/src/tmp/armadillo-buildroot/usr/include/armadillo_bits/op_stddev_meat.hpp
-- Installing: /usr/src/tmp/armadillo-buildroot/usr/include/armadillo_bits/op_strans_bones.hpp
-- Installing: /usr/src/tmp/armadillo-buildroot/usr/include/armadillo_bits/op_strans_meat.hpp
-- Installing: /usr/src/tmp/armadillo-buildroot/usr/include/armadillo_bits/op_sum_bones.hpp
-- Installing: /usr/src/tmp/armadillo-buildroot/usr/include/armadillo_bits/op_sum_meat.hpp
-- Installing: /usr/src/tmp/armadillo-buildroot/usr/include/armadillo_bits/op_symmat_bones.hpp
-- Installing: /usr/src/tmp/armadillo-buildroot/usr/include/armadillo_bits/op_symmat_meat.hpp
-- Installing: /usr/src/tmp/armadillo-buildroot/usr/include/armadillo_bits/op_toeplitz_bones.hpp
-- Installing: /usr/src/tmp/armadillo-buildroot/usr/include/armadillo_bits/op_toeplitz_meat.hpp
-- Installing: /usr/src/tmp/armadillo-buildroot/usr/include/armadillo_bits/op_trimat_bones.hpp
-- Installing: /usr/src/tmp/armadillo-buildroot/usr/include/armadillo_bits/op_trimat_meat.hpp
-- Installing: /usr/src/tmp/armadillo-buildroot/usr/include/armadillo_bits/op_unique_bones.hpp
-- Installing: /usr/src/tmp/armadillo-buildroot/usr/include/armadillo_bits/op_unique_meat.hpp
-- Installing: /usr/src/tmp/armadillo-buildroot/usr/include/armadillo_bits/op_var_bones.hpp
-- Installing: /usr/src/tmp/armadillo-buildroot/usr/include/armadillo_bits/op_var_meat.hpp
-- Installing: /usr/src/tmp/armadillo-buildroot/usr/include/armadillo_bits/op_vectorise_bones.hpp
-- Installing: /usr/src/tmp/armadillo-buildroot/usr/include/armadillo_bits/op_vectorise_meat.hpp
-- Installing: /usr/src/tmp/armadillo-buildroot/usr/include/armadillo_bits/op_wishrnd_bones.hpp
-- Installing: /usr/src/tmp/armadillo-buildroot/usr/include/armadillo_bits/op_wishrnd_meat.hpp
-- Installing: /usr/src/tmp/armadillo-buildroot/usr/include/armadillo_bits/operator_cube_div.hpp
-- Installing: /usr/src/tmp/armadillo-buildroot/usr/include/armadillo_bits/operator_cube_minus.hpp
-- Installing: /usr/src/tmp/armadillo-buildroot/usr/include/armadillo_bits/operator_cube_plus.hpp
-- Installing: /usr/src/tmp/armadillo-buildroot/usr/include/armadillo_bits/operator_cube_relational.hpp
-- Installing: /usr/src/tmp/armadillo-buildroot/usr/include/armadillo_bits/operator_cube_schur.hpp
-- Installing: /usr/src/tmp/armadillo-buildroot/usr/include/armadillo_bits/operator_cube_times.hpp
-- Installing: /usr/src/tmp/armadillo-buildroot/usr/include/armadillo_bits/operator_div.hpp
-- Installing: /usr/src/tmp/armadillo-buildroot/usr/include/armadillo_bits/operator_minus.hpp
-- Installing: /usr/src/tmp/armadillo-buildroot/usr/include/armadillo_bits/operator_ostream.hpp
-- Installing: /usr/src/tmp/armadillo-buildroot/usr/include/armadillo_bits/operator_plus.hpp
-- Installing: /usr/src/tmp/armadillo-buildroot/usr/include/armadillo_bits/operator_relational.hpp
-- Installing: /usr/src/tmp/armadillo-buildroot/usr/include/armadillo_bits/operator_schur.hpp
-- Installing: /usr/src/tmp/armadillo-buildroot/usr/include/armadillo_bits/operator_times.hpp
-- Installing: /usr/src/tmp/armadillo-buildroot/usr/include/armadillo_bits/podarray_bones.hpp
-- Installing: /usr/src/tmp/armadillo-buildroot/usr/include/armadillo_bits/podarray_meat.hpp
-- Installing: /usr/src/tmp/armadillo-buildroot/usr/include/armadillo_bits/promote_type.hpp
-- Installing: /usr/src/tmp/armadillo-buildroot/usr/include/armadillo_bits/restrictors.hpp
-- Installing: /usr/src/tmp/armadillo-buildroot/usr/include/armadillo_bits/running_stat_bones.hpp
-- Installing: /usr/src/tmp/armadillo-buildroot/usr/include/armadillo_bits/running_stat_meat.hpp
-- Installing: /usr/src/tmp/armadillo-buildroot/usr/include/armadillo_bits/running_stat_vec_bones.hpp
-- Installing: /usr/src/tmp/armadillo-buildroot/usr/include/armadillo_bits/running_stat_vec_meat.hpp
-- Installing: /usr/src/tmp/armadillo-buildroot/usr/include/armadillo_bits/sp_auxlib_bones.hpp
-- Installing: /usr/src/tmp/armadillo-buildroot/usr/include/armadillo_bits/sp_auxlib_meat.hpp
-- Installing: /usr/src/tmp/armadillo-buildroot/usr/include/armadillo_bits/span.hpp
-- Installing: /usr/src/tmp/armadillo-buildroot/usr/include/armadillo_bits/spdiagview_bones.hpp
-- Installing: /usr/src/tmp/armadillo-buildroot/usr/include/armadillo_bits/spdiagview_meat.hpp
-- Installing: /usr/src/tmp/armadillo-buildroot/usr/include/armadillo_bits/spglue_join_bones.hpp
-- Installing: /usr/src/tmp/armadillo-buildroot/usr/include/armadillo_bits/spglue_join_meat.hpp
-- Installing: /usr/src/tmp/armadillo-buildroot/usr/include/armadillo_bits/spglue_kron_bones.hpp
-- Installing: /usr/src/tmp/armadillo-buildroot/usr/include/armadillo_bits/spglue_kron_meat.hpp
-- Installing: /usr/src/tmp/armadillo-buildroot/usr/include/armadillo_bits/spglue_max_bones.hpp
-- Installing: /usr/src/tmp/armadillo-buildroot/usr/include/armadillo_bits/spglue_max_meat.hpp
-- Installing: /usr/src/tmp/armadillo-buildroot/usr/include/armadillo_bits/spglue_merge_bones.hpp
-- Installing: /usr/src/tmp/armadillo-buildroot/usr/include/armadillo_bits/spglue_merge_meat.hpp
-- Installing: /usr/src/tmp/armadillo-buildroot/usr/include/armadillo_bits/spglue_min_bones.hpp
-- Installing: /usr/src/tmp/armadillo-buildroot/usr/include/armadillo_bits/spglue_min_meat.hpp
-- Installing: /usr/src/tmp/armadillo-buildroot/usr/include/armadillo_bits/spglue_minus_bones.hpp
-- Installing: /usr/src/tmp/armadillo-buildroot/usr/include/armadillo_bits/spglue_minus_meat.hpp
-- Installing: /usr/src/tmp/armadillo-buildroot/usr/include/armadillo_bits/spglue_plus_bones.hpp
-- Installing: /usr/src/tmp/armadillo-buildroot/usr/include/armadillo_bits/spglue_plus_meat.hpp
-- Installing: /usr/src/tmp/armadillo-buildroot/usr/include/armadillo_bits/spglue_relational_bones.hpp
-- Installing: /usr/src/tmp/armadillo-buildroot/usr/include/armadillo_bits/spglue_relational_meat.hpp
-- Installing: /usr/src/tmp/armadillo-buildroot/usr/include/armadillo_bits/spglue_schur_bones.hpp
-- Installing: /usr/src/tmp/armadillo-buildroot/usr/include/armadillo_bits/spglue_schur_meat.hpp
-- Installing: /usr/src/tmp/armadillo-buildroot/usr/include/armadillo_bits/spglue_times_bones.hpp
-- Installing: /usr/src/tmp/armadillo-buildroot/usr/include/armadillo_bits/spglue_times_meat.hpp
-- Installing: /usr/src/tmp/armadillo-buildroot/usr/include/armadillo_bits/spop_diagmat_bones.hpp
-- Installing: /usr/src/tmp/armadillo-buildroot/usr/include/armadillo_bits/spop_diagmat_meat.hpp
-- Installing: /usr/src/tmp/armadillo-buildroot/usr/include/armadillo_bits/spop_htrans_bones.hpp
-- Installing: /usr/src/tmp/armadillo-buildroot/usr/include/armadillo_bits/spop_htrans_meat.hpp
-- Installing: /usr/src/tmp/armadillo-buildroot/usr/include/armadillo_bits/spop_max_bones.hpp
-- Installing: /usr/src/tmp/armadillo-buildroot/usr/include/armadillo_bits/spop_max_meat.hpp
-- Installing: /usr/src/tmp/armadillo-buildroot/usr/include/armadillo_bits/spop_mean_bones.hpp
-- Installing: /usr/src/tmp/armadillo-buildroot/usr/include/armadillo_bits/spop_mean_meat.hpp
-- Installing: /usr/src/tmp/armadillo-buildroot/usr/include/armadillo_bits/spop_min_bones.hpp
-- Installing: /usr/src/tmp/armadillo-buildroot/usr/include/armadillo_bits/spop_min_meat.hpp
-- Installing: /usr/src/tmp/armadillo-buildroot/usr/include/armadillo_bits/spop_misc_bones.hpp
-- Installing: /usr/src/tmp/armadillo-buildroot/usr/include/armadillo_bits/spop_misc_meat.hpp
-- Installing: /usr/src/tmp/armadillo-buildroot/usr/include/armadillo_bits/spop_normalise_bones.hpp
-- Installing: /usr/src/tmp/armadillo-buildroot/usr/include/armadillo_bits/spop_normalise_meat.hpp
-- Installing: /usr/src/tmp/armadillo-buildroot/usr/include/armadillo_bits/spop_repmat_bones.hpp
-- Installing: /usr/src/tmp/armadillo-buildroot/usr/include/armadillo_bits/spop_repmat_meat.hpp
-- Installing: /usr/src/tmp/armadillo-buildroot/usr/include/armadillo_bits/spop_reverse_bones.hpp
-- Installing: /usr/src/tmp/armadillo-buildroot/usr/include/armadillo_bits/spop_reverse_meat.hpp
-- Installing: /usr/src/tmp/armadillo-buildroot/usr/include/armadillo_bits/spop_strans_bones.hpp
-- Installing: /usr/src/tmp/armadillo-buildroot/usr/include/armadillo_bits/spop_strans_meat.hpp
-- Installing: /usr/src/tmp/armadillo-buildroot/usr/include/armadillo_bits/spop_sum_bones.hpp
-- Installing: /usr/src/tmp/armadillo-buildroot/usr/include/armadillo_bits/spop_sum_meat.hpp
-- Installing: /usr/src/tmp/armadillo-buildroot/usr/include/armadillo_bits/spop_symmat_bones.hpp
-- Installing: /usr/src/tmp/armadillo-buildroot/usr/include/armadillo_bits/spop_symmat_meat.hpp
-- Installing: /usr/src/tmp/armadillo-buildroot/usr/include/armadillo_bits/spop_trimat_bones.hpp
-- Installing: /usr/src/tmp/armadillo-buildroot/usr/include/armadillo_bits/spop_trimat_meat.hpp
-- Installing: /usr/src/tmp/armadillo-buildroot/usr/include/armadillo_bits/spop_var_bones.hpp
-- Installing: /usr/src/tmp/armadillo-buildroot/usr/include/armadillo_bits/spop_var_meat.hpp
-- Installing: /usr/src/tmp/armadillo-buildroot/usr/include/armadillo_bits/spop_vectorise_bones.hpp
-- Installing: /usr/src/tmp/armadillo-buildroot/usr/include/armadillo_bits/spop_vectorise_meat.hpp
-- Installing: /usr/src/tmp/armadillo-buildroot/usr/include/armadillo_bits/strip.hpp
-- Installing: /usr/src/tmp/armadillo-buildroot/usr/include/armadillo_bits/subview_bones.hpp
-- Installing: /usr/src/tmp/armadillo-buildroot/usr/include/armadillo_bits/subview_cube_bones.hpp
-- Installing: /usr/src/tmp/armadillo-buildroot/usr/include/armadillo_bits/subview_cube_each_bones.hpp
-- Installing: /usr/src/tmp/armadillo-buildroot/usr/include/armadillo_bits/subview_cube_each_meat.hpp
-- Installing: /usr/src/tmp/armadillo-buildroot/usr/include/armadillo_bits/subview_cube_meat.hpp
-- Installing: /usr/src/tmp/armadillo-buildroot/usr/include/armadillo_bits/subview_cube_slices_bones.hpp
-- Installing: /usr/src/tmp/armadillo-buildroot/usr/include/armadillo_bits/subview_cube_slices_meat.hpp
-- Installing: /usr/src/tmp/armadillo-buildroot/usr/include/armadillo_bits/subview_each_bones.hpp
-- Installing: /usr/src/tmp/armadillo-buildroot/usr/include/armadillo_bits/subview_each_meat.hpp
-- Installing: /usr/src/tmp/armadillo-buildroot/usr/include/armadillo_bits/subview_elem1_bones.hpp
-- Installing: /usr/src/tmp/armadillo-buildroot/usr/include/armadillo_bits/subview_elem1_meat.hpp
-- Installing: /usr/src/tmp/armadillo-buildroot/usr/include/armadillo_bits/subview_elem2_bones.hpp
-- Installing: /usr/src/tmp/armadillo-buildroot/usr/include/armadillo_bits/subview_elem2_meat.hpp
-- Installing: /usr/src/tmp/armadillo-buildroot/usr/include/armadillo_bits/subview_field_bones.hpp
-- Installing: /usr/src/tmp/armadillo-buildroot/usr/include/armadillo_bits/subview_field_meat.hpp
-- Installing: /usr/src/tmp/armadillo-buildroot/usr/include/armadillo_bits/subview_meat.hpp
-- Installing: /usr/src/tmp/armadillo-buildroot/usr/include/armadillo_bits/sympd_helper.hpp
-- Installing: /usr/src/tmp/armadillo-buildroot/usr/include/armadillo_bits/traits.hpp
-- Installing: /usr/src/tmp/armadillo-buildroot/usr/include/armadillo_bits/translate_arpack.hpp
-- Installing: /usr/src/tmp/armadillo-buildroot/usr/include/armadillo_bits/translate_atlas.hpp
-- Installing: /usr/src/tmp/armadillo-buildroot/usr/include/armadillo_bits/translate_blas.hpp
-- Installing: /usr/src/tmp/armadillo-buildroot/usr/include/armadillo_bits/translate_lapack.hpp
-- Installing: /usr/src/tmp/armadillo-buildroot/usr/include/armadillo_bits/translate_superlu.hpp
-- Installing: /usr/src/tmp/armadillo-buildroot/usr/include/armadillo_bits/trimat_helper.hpp
-- Installing: /usr/src/tmp/armadillo-buildroot/usr/include/armadillo_bits/typedef_elem.hpp
-- Installing: /usr/src/tmp/armadillo-buildroot/usr/include/armadillo_bits/typedef_elem_check.hpp
-- Installing: /usr/src/tmp/armadillo-buildroot/usr/include/armadillo_bits/typedef_mat.hpp
-- Installing: /usr/src/tmp/armadillo-buildroot/usr/include/armadillo_bits/typedef_mat_fixed.hpp
-- Installing: /usr/src/tmp/armadillo-buildroot/usr/include/armadillo_bits/unwrap.hpp
-- Installing: /usr/src/tmp/armadillo-buildroot/usr/include/armadillo_bits/unwrap_cube.hpp
-- Installing: /usr/src/tmp/armadillo-buildroot/usr/include/armadillo_bits/unwrap_spmat.hpp
-- Installing: /usr/src/tmp/armadillo-buildroot/usr/include/armadillo_bits/upgrade_val.hpp
-- Installing: /usr/src/tmp/armadillo-buildroot/usr/include/armadillo_bits/wall_clock_bones.hpp
-- Installing: /usr/src/tmp/armadillo-buildroot/usr/include/armadillo_bits/wall_clock_meat.hpp
-- Installing: /usr/src/tmp/armadillo-buildroot/usr/include/armadillo_bits/xtrans_mat_bones.hpp
-- Installing: /usr/src/tmp/armadillo-buildroot/usr/include/armadillo_bits/xtrans_mat_meat.hpp
-- Installing: /usr/src/tmp/armadillo-buildroot/usr/include/armadillo_bits/xvec_htrans_bones.hpp
-- Installing: /usr/src/tmp/armadillo-buildroot/usr/include/armadillo_bits/xvec_htrans_meat.hpp
-- Installing: /usr/src/tmp/armadillo-buildroot/usr/lib/libarmadillo.so.10.2.0
-- Installing: /usr/src/tmp/armadillo-buildroot/usr/lib/libarmadillo.so.10
-- Installing: /usr/src/tmp/armadillo-buildroot/usr/lib/libarmadillo.so
-- Installing: /usr/src/tmp/armadillo-buildroot/usr/share/Armadillo/CMake/ArmadilloLibraryDepends.cmake
-- Installing: /usr/src/tmp/armadillo-buildroot/usr/share/Armadillo/CMake/ArmadilloLibraryDepends-noconfig.cmake
-- Installing: /usr/src/tmp/armadillo-buildroot/usr/share/Armadillo/CMake/ArmadilloConfig.cmake
-- Installing: /usr/src/tmp/armadillo-buildroot/usr/share/Armadillo/CMake/ArmadilloConfigVersion.cmake
-- Installing: /usr/src/tmp/armadillo-buildroot/usr/lib/pkgconfig/armadillo.pc
+ /usr/lib/rpm/brp-alt
Cleaning files in /usr/src/tmp/armadillo-buildroot (auto)
mode of './usr/lib/libarmadillo.so.10.2.0' changed from 0755 (rwxr-xr-x) to 0644 (rw-r--r--)
Verifying and fixing files in /usr/src/tmp/armadillo-buildroot (binconfig,pkgconfig,libtool,desktop,gnuconfig)
/usr/lib/pkgconfig/armadillo.pc: Cflags: '-I${includedir}' --> ''
/usr/lib/pkgconfig/armadillo.pc: Libs: '-L${libdir} -larmadillo' --> '-larmadillo'
Checking contents of files in /usr/src/tmp/armadillo-buildroot/ (default)
Compressing files in /usr/src/tmp/armadillo-buildroot (auto)
Adjusting library links in /usr/src/tmp/armadillo-buildroot
./usr/lib: (from <cmdline>:0)
	libarmadillo.so.10 -> libarmadillo.so.10.2.0
Verifying ELF objects in /usr/src/tmp/armadillo-buildroot (arch=normal,fhs=normal,lfs=relaxed,lint=relaxed,rpath=normal,stack=normal,textrel=normal,unresolved=normal)
Hardlinking identical .pyc and .pyo files
Executing(%check): /bin/sh -e /usr/src/tmp/rpm-tmp.93773
+ umask 022
+ /bin/mkdir -p /usr/src/RPM/BUILD
+ cd /usr/src/RPM/BUILD
+ cd armadillo-10.2.0
+ CFLAGS='-pipe -frecord-gcc-switches -Wall -g -O2 -march=i586 -mtune=generic'
+ export CFLAGS
+ CXXFLAGS='-pipe -frecord-gcc-switches -Wall -g -O2 -march=i586 -mtune=generic'
+ export CXXFLAGS
+ FFLAGS='-pipe -frecord-gcc-switches -Wall -g -O2 -march=i586 -mtune=generic '
+ export FFLAGS
+ FCFLAGS='-pipe -frecord-gcc-switches -Wall -g -O2 -march=i586 -mtune=generic '
+ export FCFLAGS
+ LDFLAGS=-Wl,-z,relro
+ export LDFLAGS
+ /usr/bin/cmake -S . -B i586-alt-linux -DCMAKE_INSTALL_LIBDIR:PATH=/usr/lib -DCMAKE_VERBOSE_MAKEFILE:BOOL=ON -DCMAKE_INSTALL_PREFIX:PATH=/usr -DINCLUDE_INSTALL_DIR:PATH=/usr/include -DLIB_INSTALL_DIR:PATH=/usr/lib -DSYSCONF_INSTALL_DIR:PATH=/etc -DSHARE_INSTALL_PREFIX:PATH=/usr/share -DBUILD_SHARED_LIBS:BOOL=ON -DBUILD_SMOKE_TEST=ON
-- *** set cmake policy CMP0025 to NEW
-- CMAKE_CXX_STANDARD = 11
-- Configuring Armadillo 10.2.0
-- 
-- *** WARNING: variable 'CMAKE_CXX_FLAGS' is not empty; this may cause problems!
-- 
-- Detected gcc 4.8.3 or later
-- ARMA_USE_EXTERN_RNG = true
-- CMAKE_SYSTEM_NAME          = Linux
-- CMAKE_CXX_COMPILER_ID      = GNU
-- CMAKE_CXX_COMPILER_VERSION = 10.2.1
-- CMAKE_COMPILER_IS_GNUCXX   = 1
-- BUILD_SHARED_LIBS          = ON
-- DETECT_HDF5                = ON
-- ALLOW_FLEXIBLAS_LINUX      = OFF
-- ALLOW_OPENBLAS_MACOS       = OFF
-- ALLOW_BLAS_LAPACK_MACOS    = OFF
-- BUILD_SMOKE_TEST           = ON
-- 
-- *** Looking for external libraries
CMake Warning (dev) at cmake_aux/Modules/ARMA_FindMKL.cmake:27 (set):
  implicitly converting 'TYPE' to 'STRING' type.
Call Stack (most recent call first):
  CMakeLists.txt:326 (include)
This warning is for project developers.  Use -Wno-dev to suppress it.

-- Found OpenBLAS: /usr/lib/libopenblas.so
-- Found ATLAS: /usr/lib/libatlas.so
-- Found BLAS: /usr/lib/libblas.so
-- Found LAPACK: /usr/lib/liblapack.so
--       MKL_FOUND = NO
--  OpenBLAS_FOUND = YES
--     ATLAS_FOUND = YES
--      BLAS_FOUND = YES
--    LAPACK_FOUND = YES
-- 
-- *** WARNING: found both OpenBLAS and ATLAS; ATLAS will not be used
-- 
-- *** WARNING: found both OpenBLAS and BLAS; BLAS will not be used
-- 
-- *** If the OpenBLAS library is installed in
-- *** /usr/local/lib or /usr/local/lib64
-- *** make sure the run-time linker can find it.
-- *** On Linux systems this can be done by editing /etc/ld.so.conf
-- *** or modifying the LD_LIBRARY_PATH environment variable.
-- 
-- HDF5_FOUND = TRUE
-- ARMA_HDF5_INCLUDE_DIR = /usr/include
-- 
-- *** If use of HDF5 is causing problems,
-- *** rerun cmake with HDF5 detection disabled:
-- *** cmake -D DETECT_HDF5=false .
-- 
-- Found ARPACK: /usr/lib/libarpack.so
-- ARPACK_FOUND = YES
-- Looking for SuperLU version 5
-- Found SuperLU: /usr/lib/libsuperlu.so
-- SuperLU_FOUND = YES
-- SuperLU_INCLUDE_DIR = /usr/include/superlu
-- 
-- *** Armadillo wrapper library will use the following libraries:
-- *** ARMA_LIBS = /usr/lib/libopenblas.so;/usr/lib/liblapack.so;/usr/lib/libhdf5.so;/usr/lib/libarpack.so;/usr/lib/libsuperlu.so
-- 
-- Copying /usr/src/RPM/BUILD/armadillo-10.2.0/include/ to /usr/src/RPM/BUILD/armadillo-10.2.0/i586-alt-linux/tmp/include/
-- Generating /usr/src/RPM/BUILD/armadillo-10.2.0/i586-alt-linux/tmp/include/config.hpp
-- CMAKE_CXX_FLAGS           = -pipe -frecord-gcc-switches -Wall -g -O2 -march=i586 -mtune=generic -O2
-- CMAKE_SHARED_LINKER_FLAGS = -Wl,-z,relro -Wl,--no-as-needed
-- CMAKE_REQUIRED_INCLUDES   = /usr/include;/usr/include/superlu
-- 
-- CMAKE_INSTALL_PREFIX     = /usr
-- CMAKE_INSTALL_LIBDIR     = /usr/lib
-- CMAKE_INSTALL_INCLUDEDIR = include
-- CMAKE_INSTALL_DATADIR    = share
-- CMAKE_INSTALL_BINDIR     = bin
-- Generating '/usr/src/RPM/BUILD/armadillo-10.2.0/i586-alt-linux/ArmadilloConfig.cmake'
-- Generating '/usr/src/RPM/BUILD/armadillo-10.2.0/i586-alt-linux/ArmadilloConfigVersion.cmake'
-- Generating '/usr/src/RPM/BUILD/armadillo-10.2.0/i586-alt-linux/InstallFiles/ArmadilloConfig.cmake'
-- Generating '/usr/src/RPM/BUILD/armadillo-10.2.0/i586-alt-linux/InstallFiles/ArmadilloConfigVersion.cmake'
-- Copying /usr/src/RPM/BUILD/armadillo-10.2.0/misc/ to /usr/src/RPM/BUILD/armadillo-10.2.0/i586-alt-linux/tmp/misc/
-- Generating '/usr/src/RPM/BUILD/armadillo-10.2.0/i586-alt-linux/tmp/misc/armadillo.pc'
-- *** configuring smoke_test
-- Configuring done
-- Generating done
-- Build files have been written to: /usr/src/RPM/BUILD/armadillo-10.2.0/i586-alt-linux
+ make -C i586-alt-linux
make: Entering directory '/usr/src/RPM/BUILD/armadillo-10.2.0/i586-alt-linux'
/usr/bin/cmake -S/usr/src/RPM/BUILD/armadillo-10.2.0 -B/usr/src/RPM/BUILD/armadillo-10.2.0/i586-alt-linux --check-build-system CMakeFiles/Makefile.cmake 0
/usr/bin/cmake -E cmake_progress_start /usr/src/RPM/BUILD/armadillo-10.2.0/i586-alt-linux/CMakeFiles /usr/src/RPM/BUILD/armadillo-10.2.0/i586-alt-linux//CMakeFiles/progress.marks
make  -f CMakeFiles/Makefile2 all
make[1]: Entering directory '/usr/src/RPM/BUILD/armadillo-10.2.0/i586-alt-linux'
make  -f CMakeFiles/armadillo.dir/build.make CMakeFiles/armadillo.dir/depend
make[2]: Entering directory '/usr/src/RPM/BUILD/armadillo-10.2.0/i586-alt-linux'
cd /usr/src/RPM/BUILD/armadillo-10.2.0/i586-alt-linux && /usr/bin/cmake -E cmake_depends "Unix Makefiles" /usr/src/RPM/BUILD/armadillo-10.2.0 /usr/src/RPM/BUILD/armadillo-10.2.0 /usr/src/RPM/BUILD/armadillo-10.2.0/i586-alt-linux /usr/src/RPM/BUILD/armadillo-10.2.0/i586-alt-linux /usr/src/RPM/BUILD/armadillo-10.2.0/i586-alt-linux/CMakeFiles/armadillo.dir/DependInfo.cmake --color=
Scanning dependencies of target armadillo
make[2]: Leaving directory '/usr/src/RPM/BUILD/armadillo-10.2.0/i586-alt-linux'
make  -f CMakeFiles/armadillo.dir/build.make CMakeFiles/armadillo.dir/build
make[2]: Entering directory '/usr/src/RPM/BUILD/armadillo-10.2.0/i586-alt-linux'
[ 20%] Building CXX object CMakeFiles/armadillo.dir/src/wrapper1.cpp.o
/usr/bin/c++ -Darmadillo_EXPORTS -I/usr/src/RPM/BUILD/armadillo-10.2.0/i586-alt-linux/tmp/include -I/usr/include/superlu -pipe -frecord-gcc-switches -Wall -g -O2 -march=i586 -mtune=generic -O2 -fPIC -std=c++11 -o CMakeFiles/armadillo.dir/src/wrapper1.cpp.o -c /usr/src/RPM/BUILD/armadillo-10.2.0/src/wrapper1.cpp
[ 40%] Building CXX object CMakeFiles/armadillo.dir/src/wrapper2.cpp.o
/usr/bin/c++ -Darmadillo_EXPORTS -I/usr/src/RPM/BUILD/armadillo-10.2.0/i586-alt-linux/tmp/include -I/usr/include/superlu -pipe -frecord-gcc-switches -Wall -g -O2 -march=i586 -mtune=generic -O2 -fPIC -std=c++11 -o CMakeFiles/armadillo.dir/src/wrapper2.cpp.o -c /usr/src/RPM/BUILD/armadillo-10.2.0/src/wrapper2.cpp
[ 60%] Linking CXX shared library libarmadillo.so
/usr/bin/cmake -E cmake_link_script CMakeFiles/armadillo.dir/link.txt --verbose=1
/usr/bin/c++ -fPIC -pipe -frecord-gcc-switches -Wall -g -O2 -march=i586 -mtune=generic -O2 -Wl,-z,relro -Wl,--no-as-needed -shared -Wl,-soname,libarmadillo.so.10 -o libarmadillo.so.10.2.0 CMakeFiles/armadillo.dir/src/wrapper1.cpp.o CMakeFiles/armadillo.dir/src/wrapper2.cpp.o  -lopenblas -llapack -lhdf5 -larpack -lsuperlu 
/usr/bin/cmake -E cmake_symlink_library libarmadillo.so.10.2.0 libarmadillo.so.10 libarmadillo.so
make[2]: Leaving directory '/usr/src/RPM/BUILD/armadillo-10.2.0/i586-alt-linux'
[ 60%] Built target armadillo
make  -f tests1/CMakeFiles/smoke_test.dir/build.make tests1/CMakeFiles/smoke_test.dir/depend
make[2]: Entering directory '/usr/src/RPM/BUILD/armadillo-10.2.0/i586-alt-linux'
cd /usr/src/RPM/BUILD/armadillo-10.2.0/i586-alt-linux && /usr/bin/cmake -E cmake_depends "Unix Makefiles" /usr/src/RPM/BUILD/armadillo-10.2.0 /usr/src/RPM/BUILD/armadillo-10.2.0/tests1 /usr/src/RPM/BUILD/armadillo-10.2.0/i586-alt-linux /usr/src/RPM/BUILD/armadillo-10.2.0/i586-alt-linux/tests1 /usr/src/RPM/BUILD/armadillo-10.2.0/i586-alt-linux/tests1/CMakeFiles/smoke_test.dir/DependInfo.cmake --color=
Scanning dependencies of target smoke_test
make[2]: Leaving directory '/usr/src/RPM/BUILD/armadillo-10.2.0/i586-alt-linux'
make  -f tests1/CMakeFiles/smoke_test.dir/build.make tests1/CMakeFiles/smoke_test.dir/build
make[2]: Entering directory '/usr/src/RPM/BUILD/armadillo-10.2.0/i586-alt-linux'
[ 80%] Building CXX object tests1/CMakeFiles/smoke_test.dir/smoke_test.cpp.o
cd /usr/src/RPM/BUILD/armadillo-10.2.0/i586-alt-linux/tests1 && /usr/bin/c++  -I/usr/src/RPM/BUILD/armadillo-10.2.0/i586-alt-linux/tmp/include -I/usr/include/superlu -pipe -frecord-gcc-switches -Wall -g -O2 -march=i586 -mtune=generic -O2 -std=c++11 -o CMakeFiles/smoke_test.dir/smoke_test.cpp.o -c /usr/src/RPM/BUILD/armadillo-10.2.0/tests1/smoke_test.cpp
[100%] Linking CXX executable smoke_test
cd /usr/src/RPM/BUILD/armadillo-10.2.0/i586-alt-linux/tests1 && /usr/bin/cmake -E cmake_link_script CMakeFiles/smoke_test.dir/link.txt --verbose=1
/usr/bin/c++ -pipe -frecord-gcc-switches -Wall -g -O2 -march=i586 -mtune=generic -O2 -Wl,-z,relro -rdynamic CMakeFiles/smoke_test.dir/smoke_test.cpp.o -o smoke_test  -Wl,-rpath,/usr/src/RPM/BUILD/armadillo-10.2.0/i586-alt-linux ../libarmadillo.so.10.2.0 -lopenblas -llapack -lhdf5 -larpack -lsuperlu 
make[2]: Leaving directory '/usr/src/RPM/BUILD/armadillo-10.2.0/i586-alt-linux'
[100%] Built target smoke_test
make[1]: Leaving directory '/usr/src/RPM/BUILD/armadillo-10.2.0/i586-alt-linux'
/usr/bin/cmake -E cmake_progress_start /usr/src/RPM/BUILD/armadillo-10.2.0/i586-alt-linux/CMakeFiles 0
make: Leaving directory '/usr/src/RPM/BUILD/armadillo-10.2.0/i586-alt-linux'
+ cd i586-alt-linux
+ /usr/bin/ctest --output-on-failure --force-new-ctest-process -j8 --verbose
UpdateCTestConfiguration  from :/usr/src/RPM/BUILD/armadillo-10.2.0/i586-alt-linux/DartConfiguration.tcl
UpdateCTestConfiguration  from :/usr/src/RPM/BUILD/armadillo-10.2.0/i586-alt-linux/DartConfiguration.tcl
Test project /usr/src/RPM/BUILD/armadillo-10.2.0/i586-alt-linux
Constructing a list of tests
Done constructing a list of tests
Updating test list for fixtures
Added 0 tests to meet fixture requirements
Checking test dependency graph...
Checking test dependency graph end
test 1
    Start 1: smoke_test

1: Test command: /usr/src/RPM/BUILD/armadillo-10.2.0/i586-alt-linux/tests1/smoke_test
1: Test timeout computed to be: 10000000
1: *** smoke test start
1: A:
1:     1.7868    6.0000   11.0000   16.0000   21.0000
1:     2.0000    7.2505   12.0000   17.0000   22.0000
1:     3.0000    8.0000   13.7107   18.0000   23.0000
1:     4.0000    9.0000   14.0000   19.9467   24.0000
1:     5.0000   10.0000   15.0000   20.0000   25.0193
1: B:
1:    4.5987e+28   1.0686e+29   1.6923e+29   2.3167e+29   2.8959e+29
1:    4.9523e+28   1.1508e+29   1.8224e+29   2.4949e+29   3.1186e+29
1:    5.3777e+28   1.2497e+29   1.9790e+29   2.7092e+29   3.3865e+29
1:    5.7897e+28   1.3454e+29   2.1306e+29   2.9168e+29   3.6460e+29
1:    6.1002e+28   1.4176e+29   2.2448e+29   3.0732e+29   3.8415e+29
1: *** smoke test okay
1/1 Test #1: smoke_test .......................   Passed    0.01 sec

100% tests passed, 0 tests failed out of 1

Total Test time (real) =   0.01 sec
+ cd -
/usr/src/RPM/BUILD/armadillo-10.2.0
+ exit 0
Processing files: libarmadillo10-10.2.0-alt1_2
Executing(%doc): /bin/sh -e /usr/src/tmp/rpm-tmp.27096
+ umask 022
+ /bin/mkdir -p /usr/src/RPM/BUILD
+ cd /usr/src/RPM/BUILD
+ cd armadillo-10.2.0
+ DOCDIR=/usr/src/tmp/armadillo-buildroot/usr/share/doc/libarmadillo10-10.2.0
+ export DOCDIR
+ rm -rf /usr/src/tmp/armadillo-buildroot/usr/share/doc/libarmadillo10-10.2.0
+ /bin/mkdir -p /usr/src/tmp/armadillo-buildroot/usr/share/doc/libarmadillo10-10.2.0
+ cp -prL --no-dereference LICENSE.txt NOTICE.txt /usr/src/tmp/armadillo-buildroot/usr/share/doc/libarmadillo10-10.2.0
+ chmod -R go-w /usr/src/tmp/armadillo-buildroot/usr/share/doc/libarmadillo10-10.2.0
+ chmod -R a+rX /usr/src/tmp/armadillo-buildroot/usr/share/doc/libarmadillo10-10.2.0
+ exit 0
Finding Provides (using /usr/lib/rpm/find-provides)
Executing: /bin/sh -e /usr/src/tmp/rpm-tmp.pymYL7
find-provides: running scripts (alternatives,debuginfo,lib,pam,perl,pkgconfig,python,shell)
lib.prov: /usr/src/tmp/armadillo-buildroot/usr/lib/libarmadillo.so.10: 498 symbols, 19 bpp
Finding Requires (using /usr/lib/rpm/find-requires)
Executing: /bin/sh -e /usr/src/tmp/rpm-tmp.ooppl5
find-requires: running scripts (cpp,debuginfo,files,lib,pam,perl,pkgconfig,pkgconfiglib,python,rpmlib,shebang,shell,static,symlinks,systemd-services)
lib.req: WARNING: /usr/src/tmp/armadillo-buildroot/usr/lib/libarmadillo.so.10.2.0: overlinked libraries: /lib/libgcc_s.so.1 /lib/libm.so.6 /usr/lib/libstdc++.so.6
lib.req: WARNING: /usr/src/tmp/armadillo-buildroot/usr/lib/libarmadillo.so.10: overlinked libraries: /lib/libgcc_s.so.1 /lib/libm.so.6 /usr/lib/libstdc++.so.6
Provides: libarmadillo.so.10 = set:md50NykI0qPVqc9WyE5vF3U8t7CZnA6GB6pv9CRHLcjzN2aASsLFxDZxZ3GAZKCZ4njnaj5CYtHmiIPPrtXLS4x9neCVGlebrxWEwC4mnLNtKOyweejiNKcNHZIfOWYXVyxfksf6J4aTYKZjdZfXCDzeSVbRPOEFUgqg7HS5kfqQloqZwMEWQUcB2cnmxBIBYJzsqg8U5puajVAFmcYf2IIXoLeataeZfwQIq9lBL2PbAj36npLKVzImoddXf6qxJ4aZBGLh1DWYrEblJ3kTxZIIad77rYpCGZCA37ToPt0YEzghx5jebzs2V2pRdKGkcAX88Z9VkTMvoM8GEnnjGmlSwTQYT9ODKZ59nvQ86M6tZo47ZjZnv2iegCqvsYmc6YFHyF7WOJUUwp8kBXPb6ENS7GMGY27FIZ520ZnAbm77jOP7UCBH1RKKMBbm522bfUbMKq7NYpt4jde4vXaMIgZn5zgUxPZ8Z3gaF6Zcl8VsZgxk31dSHy365NT7VEf1hKF1ujYaettaYZfnRfiMq9ZcOX3EZmK1ZDfrLiHI4lrvFYUvB5Km1XLBUPHX15XAcCsXZHrHecdvd2zCyPEtBclECCOSHPXuOKfxX2pM5aL901AlOpiZmYiSMz7BBZ4e1IZ2FnQTwxF3MIeGwwxGZ8LvqcPstKP1tdpZwy0ei5BReQwaHHOMX624bASAc4tRJKLCDrTKPp2dHSMKveRW26bxupTM0EXodCwEbEpwPQZuZn4x4cUAsIHntT8yGgkc3ospZIsNEVeZjtaVmsaOKi2KOZuTMZJOwaqs3ut55lZKmjUuM7VisiWiytvbjICscjDKhXBc6kzv0zQ9pZKDGKWylwdIdhEni4Md0jNSSY0Gv57qUhxNoglMZIWzbCs46wpMhzJ1P5aZla277mZH2EZ1o5MubBD0O9Q1dTRkqWJjOckNboH4ZaDyf5vZu0hMhZayC4bIrUNrfLKan5mfs
Requires: ld-linux.so.2 >= set:ihL26, ld-linux.so.2(GLIBC_2.3), libarpack.so.2 >= set:kgfwlHNEadT0s5aRSKiJCdTGUlqnfZAe, libc.so.6(GLIBC_2.1.3), libgcc_s.so.1, libhdf5.so.103 >= set:pj42djBhTqQMKkW4wymEGbdngpNgYgCqvGR0fHwsJSeKMmCmNontMEY1WF1MoxPBm9NeXVNkZ38EDkko6O8ti1Zchtoi0u15sTOzS9es9pwHQqQg1KMwMLmAvh47JrMGu7, liblapack.so.4 >= set:ogd6FWZx8395Cv2Ib9nVJ6aSRjH9Fuem6FUgKh9tkQJtQ2rEZz3uO6scVZwIV93s41IwwqU99H5APcJl1SZiWsbk3yJNssMTRJCUcgm9zZajFzVt8WFOBPR9jUSrDqc8M8u2wLIWdt2Ygvcl7toG4kIvOZsEFSBU3iVzf73heZrndDJAqAh0BzGfmxEahIaO1GdGy0GbXxQkY1t95ms50zheJYxckjTMI5PCvZ88bTCYGYus1nN0e1kZq8g5RqGCEqXYWOCYNEOfrELXdBygTIb3qsaPNBB26orZzZf8o4rJgV4Do3K2418DJ5s55PZgWOPLjDvrtAiSkwtfG6kD7p074WiVs5l2sTpD2muOrp7gZFZnQdZis5o14wH8hGF0x1m4Rxb6m0Y28ZepJCZEecjaCiVC8UxjAVMZIEsCq7EV4McdwR8afhw827NZEl7jpgQzFqP1, libm.so.6, libopenblas.so.0 >= set:rmPMXEumxW006a20fnwWzxHoF3bOHwxyBbaZkaMp40JR8nd2VilD2EGlcPgP2qbFwk, libstdc++.so.6, libsuperlu.so.5 >= set:mgyU3WmwtpH08CaM7gFzYmzXXcDZsQCuFkdNuohj6bKhAa1Q0PCyuMz2Cgr4vYcqhOWOWCQWB6jSSg72UbE3Lds7kpKJe1, rtld(GNU_HASH)
Requires(rpmlib): rpmlib(SetVersions)
Finding debuginfo files (using /usr/lib/rpm/find-debuginfo-files)
Executing: /bin/sh -e /usr/src/tmp/rpm-tmp.druoP9
Creating libarmadillo10-debuginfo package
Processing files: libarmadillo-devel-10.2.0-alt1_2
Executing(%doc): /bin/sh -e /usr/src/tmp/rpm-tmp.54109
+ umask 022
+ /bin/mkdir -p /usr/src/RPM/BUILD
+ cd /usr/src/RPM/BUILD
+ cd armadillo-10.2.0
+ DOCDIR=/usr/src/tmp/armadillo-buildroot/usr/share/doc/libarmadillo-devel-10.2.0
+ export DOCDIR
+ rm -rf /usr/src/tmp/armadillo-buildroot/usr/share/doc/libarmadillo-devel-10.2.0
+ /bin/mkdir -p /usr/src/tmp/armadillo-buildroot/usr/share/doc/libarmadillo-devel-10.2.0
+ cp -prL README.md /usr/src/tmp/armadillo-buildroot/usr/share/doc/libarmadillo-devel-10.2.0
+ chmod -R go-w /usr/src/tmp/armadillo-buildroot/usr/share/doc/libarmadillo-devel-10.2.0
+ chmod -R a+rX /usr/src/tmp/armadillo-buildroot/usr/share/doc/libarmadillo-devel-10.2.0
+ cp -prL index.html /usr/src/tmp/armadillo-buildroot/usr/share/doc/libarmadillo-devel-10.2.0
+ chmod -R go-w /usr/src/tmp/armadillo-buildroot/usr/share/doc/libarmadillo-devel-10.2.0
+ chmod -R a+rX /usr/src/tmp/armadillo-buildroot/usr/share/doc/libarmadillo-devel-10.2.0
+ cp -prL docs.html /usr/src/tmp/armadillo-buildroot/usr/share/doc/libarmadillo-devel-10.2.0
+ chmod -R go-w /usr/src/tmp/armadillo-buildroot/usr/share/doc/libarmadillo-devel-10.2.0
+ chmod -R a+rX /usr/src/tmp/armadillo-buildroot/usr/share/doc/libarmadillo-devel-10.2.0
+ cp -prL examples /usr/src/tmp/armadillo-buildroot/usr/share/doc/libarmadillo-devel-10.2.0
+ chmod -R go-w /usr/src/tmp/armadillo-buildroot/usr/share/doc/libarmadillo-devel-10.2.0
+ chmod -R a+rX /usr/src/tmp/armadillo-buildroot/usr/share/doc/libarmadillo-devel-10.2.0
+ cp -prL armadillo_icon.png /usr/src/tmp/armadillo-buildroot/usr/share/doc/libarmadillo-devel-10.2.0
+ chmod -R go-w /usr/src/tmp/armadillo-buildroot/usr/share/doc/libarmadillo-devel-10.2.0
+ chmod -R a+rX /usr/src/tmp/armadillo-buildroot/usr/share/doc/libarmadillo-devel-10.2.0
+ cp -prL mex_interface /usr/src/tmp/armadillo-buildroot/usr/share/doc/libarmadillo-devel-10.2.0
+ chmod -R go-w /usr/src/tmp/armadillo-buildroot/usr/share/doc/libarmadillo-devel-10.2.0
+ chmod -R a+rX /usr/src/tmp/armadillo-buildroot/usr/share/doc/libarmadillo-devel-10.2.0
+ cp -prL armadillo_nicta_2010.pdf /usr/src/tmp/armadillo-buildroot/usr/share/doc/libarmadillo-devel-10.2.0
+ chmod -R go-w /usr/src/tmp/armadillo-buildroot/usr/share/doc/libarmadillo-devel-10.2.0
+ chmod -R a+rX /usr/src/tmp/armadillo-buildroot/usr/share/doc/libarmadillo-devel-10.2.0
+ cp -prL rcpp_armadillo_csda_2014.pdf /usr/src/tmp/armadillo-buildroot/usr/share/doc/libarmadillo-devel-10.2.0
+ chmod -R go-w /usr/src/tmp/armadillo-buildroot/usr/share/doc/libarmadillo-devel-10.2.0
+ chmod -R a+rX /usr/src/tmp/armadillo-buildroot/usr/share/doc/libarmadillo-devel-10.2.0
+ cp -prL armadillo_joss_2016.pdf /usr/src/tmp/armadillo-buildroot/usr/share/doc/libarmadillo-devel-10.2.0
+ chmod -R go-w /usr/src/tmp/armadillo-buildroot/usr/share/doc/libarmadillo-devel-10.2.0
+ chmod -R a+rX /usr/src/tmp/armadillo-buildroot/usr/share/doc/libarmadillo-devel-10.2.0
+ cp -prL armadillo_spcs_2017.pdf /usr/src/tmp/armadillo-buildroot/usr/share/doc/libarmadillo-devel-10.2.0
+ chmod -R go-w /usr/src/tmp/armadillo-buildroot/usr/share/doc/libarmadillo-devel-10.2.0
+ chmod -R a+rX /usr/src/tmp/armadillo-buildroot/usr/share/doc/libarmadillo-devel-10.2.0
+ cp -prL armadillo_lncs_2018.pdf /usr/src/tmp/armadillo-buildroot/usr/share/doc/libarmadillo-devel-10.2.0
+ chmod -R go-w /usr/src/tmp/armadillo-buildroot/usr/share/doc/libarmadillo-devel-10.2.0
+ chmod -R a+rX /usr/src/tmp/armadillo-buildroot/usr/share/doc/libarmadillo-devel-10.2.0
+ cp -prL armadillo_solver_2020.pdf /usr/src/tmp/armadillo-buildroot/usr/share/doc/libarmadillo-devel-10.2.0
+ chmod -R go-w /usr/src/tmp/armadillo-buildroot/usr/share/doc/libarmadillo-devel-10.2.0
+ chmod -R a+rX /usr/src/tmp/armadillo-buildroot/usr/share/doc/libarmadillo-devel-10.2.0
+ exit 0
Finding Provides (using /usr/lib/rpm/find-provides)
Executing: /bin/sh -e /usr/src/tmp/rpm-tmp.1mjcc8
find-provides: running scripts (alternatives,debuginfo,lib,pam,perl,pkgconfig,python,shell)
Finding Requires (using /usr/lib/rpm/find-requires)
Executing: /bin/sh -e /usr/src/tmp/rpm-tmp.AV2pJ9
find-requires: running scripts (cpp,debuginfo,files,lib,pam,perl,pkgconfig,pkgconfiglib,python,rpmlib,shebang,shell,static,symlinks,systemd-services)
/usr/src/tmp/armadillo-buildroot/usr/include/armadillo_bits/typedef_elem.hpp:32:6: error: #error "don't know how to typedef 'u8' on this system"
   32 |     #error "don't know how to typedef 'u8' on this system"
      |      ^~~~~
/usr/src/tmp/armadillo-buildroot/usr/include/armadillo_bits/typedef_elem.hpp:48:4: error: #error "don't know how to typedef 'u16' on this system"
   48 |   #error "don't know how to typedef 'u16' on this system"
      |    ^~~~~
/usr/src/tmp/armadillo-buildroot/usr/include/armadillo_bits/typedef_elem.hpp:59:4: error: #error "don't know how to typedef 'u32' on this system"
   59 |   #error "don't know how to typedef 'u32' on this system"
      |    ^~~~~
/usr/src/tmp/armadillo-buildroot/usr/include/armadillo_bits/typedef_elem.hpp:70:6: error: #error "don't know how to typedef 'u64' on this system"
   70 |     #error "don't know how to typedef 'u64' on this system"
      |      ^~~~~
cpp.req: /usr/src/tmp/armadillo-buildroot/usr/include/armadillo_bits/typedef_elem.hpp: cpp failed, trying c++ mode
/usr/src/tmp/armadillo-buildroot/usr/include/armadillo_bits/typedef_elem.hpp:32:6: error: #error "don't know how to typedef 'u8' on this system"
   32 |     #error "don't know how to typedef 'u8' on this system"
      |      ^~~~~
/usr/src/tmp/armadillo-buildroot/usr/include/armadillo_bits/typedef_elem.hpp:48:4: error: #error "don't know how to typedef 'u16' on this system"
   48 |   #error "don't know how to typedef 'u16' on this system"
      |    ^~~~~
/usr/src/tmp/armadillo-buildroot/usr/include/armadillo_bits/typedef_elem.hpp:59:4: error: #error "don't know how to typedef 'u32' on this system"
   59 |   #error "don't know how to typedef 'u32' on this system"
      |    ^~~~~
/usr/src/tmp/armadillo-buildroot/usr/include/armadillo_bits/typedef_elem.hpp:70:6: error: #error "don't know how to typedef 'u64' on this system"
   70 |     #error "don't know how to typedef 'u64' on this system"
      |      ^~~~~
cpp.req: WARNING: /usr/src/tmp/armadillo-buildroot/usr/include/armadillo_bits/typedef_elem.hpp: cpp failed
/usr/src/tmp/armadillo-buildroot/usr/include/armadillo_bits/compiler_check.hpp:50:4: error: #error "*** C++11 compiler required; enable C++11 mode in your compiler, or use an earlier version of Armadillo"
   50 |   #error "*** C++11 compiler required; enable C++11 mode in your compiler, or use an earlier version of Armadillo"
      |    ^~~~~
cpp.req: /usr/src/tmp/armadillo-buildroot/usr/include/armadillo_bits/compiler_check.hpp: cpp failed, trying c++ mode
Provides: armadillo-devel = 10.2.0-alt1_2, pkgconfig(armadillo) = 10.2.0
Requires: libarmadillo10 = 10.2.0-alt1_2, /usr/lib/libarmadillo.so.10, /usr/lib/pkgconfig
Finding debuginfo files (using /usr/lib/rpm/find-debuginfo-files)
Executing: /bin/sh -e /usr/src/tmp/rpm-tmp.gCGcy6
Processing files: libarmadillo10-debuginfo-10.2.0-alt1_2
Finding Provides (using /usr/lib/rpm/find-provides)
Executing: /bin/sh -e /usr/src/tmp/rpm-tmp.YVKeL7
find-provides: running scripts (debuginfo)
Finding Requires (using /usr/lib/rpm/find-requires)
Executing: /bin/sh -e /usr/src/tmp/rpm-tmp.C3BqA9
find-requires: running scripts (debuginfo)
Provides: debug(libarmadillo.so.10)
Requires: libarmadillo10 = 10.2.0-alt1_2, debug(ld-linux.so.2), debug(libarpack.so.2), debug(libc.so.6), debug(libgcc_s.so.1), debug(libhdf5.so.103), debug(liblapack.so.4), debug(libm.so.6), debug(libopenblas.so.0), debug(libstdc++.so.6), debug(libsuperlu.so.5)
Adding to libarmadillo-devel a strict dependency on libarmadillo10
Adding to libarmadillo10-debuginfo a strict dependency on libarmadillo10
Removing 1 extra deps from libarmadillo-devel due to dependency on libarmadillo10
Wrote: /usr/src/RPM/RPMS/i586/libarmadillo10-10.2.0-alt1_2.i586.rpm (w2.lzdio)
Wrote: /usr/src/RPM/RPMS/i586/libarmadillo-devel-10.2.0-alt1_2.i586.rpm (w2.lzdio)
Wrote: /usr/src/RPM/RPMS/i586/libarmadillo10-debuginfo-10.2.0-alt1_2.i586.rpm (w2.lzdio)
26.43user 7.47system 0:41.00elapsed 82%CPU (0avgtext+0avgdata 270884maxresident)k
0inputs+0outputs (0major+3040103minor)pagefaults 0swaps
/.out/libarmadillo10-10.2.0-alt1_2.i586.rpm: license not found in '/usr/share/license' directory: ASL
/.out/libarmadillo10-10.2.0-alt1_2.i586.rpm: license not found in '/usr/share/license' directory: 2.0
/.out/libarmadillo-devel-10.2.0-alt1_2.i586.rpm: license not found in '/usr/share/license' directory: ASL
/.out/libarmadillo-devel-10.2.0-alt1_2.i586.rpm: license not found in '/usr/share/license' directory: 2.0
/.out/libarmadillo10-debuginfo-10.2.0-alt1_2.i586.rpm: license not found in '/usr/share/license' directory: ASL
/.out/libarmadillo10-debuginfo-10.2.0-alt1_2.i586.rpm: license not found in '/usr/share/license' directory: 2.0
34.91user 10.75system 0:52.93elapsed 86%CPU (0avgtext+0avgdata 270884maxresident)k
5880inputs+0outputs (0major+3484887minor)pagefaults 0swaps