<86>Apr 20 12:22:02 userdel[860443]: delete user 'rooter'
<86>Apr 20 12:22:02 userdel[860443]: removed group 'rooter' owned by 'rooter'
<86>Apr 20 12:22:02 userdel[860443]: removed shadow group 'rooter' owned by 'rooter'
<86>Apr 20 12:22:02 groupadd[860449]: group added to /etc/group: name=rooter, GID=672
<86>Apr 20 12:22:02 groupadd[860449]: group added to /etc/gshadow: name=rooter
<86>Apr 20 12:22:02 groupadd[860449]: new group: name=rooter, GID=672
<86>Apr 20 12:22:02 useradd[860462]: new user: name=rooter, UID=672, GID=672, home=/root, shell=/bin/bash
<86>Apr 20 12:22:02 userdel[860475]: delete user 'builder'
<86>Apr 20 12:22:02 userdel[860475]: removed group 'builder' owned by 'builder'
<86>Apr 20 12:22:02 userdel[860475]: removed shadow group 'builder' owned by 'builder'
<86>Apr 20 12:22:02 groupadd[860483]: group added to /etc/group: name=builder, GID=673
<86>Apr 20 12:22:02 groupadd[860483]: group added to /etc/gshadow: name=builder
<86>Apr 20 12:22:02 groupadd[860483]: new group: name=builder, GID=673
<86>Apr 20 12:22:02 useradd[860492]: new user: name=builder, UID=673, GID=673, home=/usr/src, shell=/bin/bash
/usr/src/in/srpm/libdbus-tqt-3.5.13.2-alt1.1.src.rpm: The use of such a license name is ambiguous: GPL
/usr/src/in/srpm/libdbus-tqt-3.5.13.2-alt1.1.src.rpm: license not found in '/usr/share/license' directory: Academic
/usr/src/in/srpm/libdbus-tqt-3.5.13.2-alt1.1.src.rpm: license not found in '/usr/share/license' directory: Free
/usr/src/in/srpm/libdbus-tqt-3.5.13.2-alt1.1.src.rpm: license not found in '/usr/share/license' directory: License
warning: Macro %Kbuild not found
warning: Macro %Kinstall not found
<13>Apr 20 12:22:04 rpmi: xorg-proto-devel-2020.1-alt1 sisyphus+250406.100.1.1 1587554810 installed
<13>Apr 20 12:22:04 rpmi: libexpat-2.2.10-alt1 sisyphus+259966.100.1.1 1602824518 installed
<13>Apr 20 12:22:04 rpmi: libICE-1.0.10-alt1 sisyphus+247690.100.1.1 1584000387 installed
<13>Apr 20 12:22:04 rpmi: libglvnd-7:1.3.2-alt1 sisyphus+254610.100.1.1 1594124268 installed
<13>Apr 20 12:22:04 rpmi: libSM-1.2.3-alt1 sisyphus+226734.100.2.1 1554586158 installed
<13>Apr 20 12:22:04 rpmi: libjpeg-2:2.0.6-alt1 sisyphus+266888.100.1.1 1614172387 installed
<13>Apr 20 12:22:04 rpmi: libpng16-1.6.37-alt1 sisyphus+236677.100.2.1 1566917998 installed
<13>Apr 20 12:22:04 rpmi: libcom_err-1.45.6.0.24.af1a-alt1 sisyphus+262279.100.1.1 1606088229 installed
<13>Apr 20 12:22:04 rpmi: libICE-devel-1.0.10-alt1 sisyphus+247690.100.1.1 1584000387 installed
<13>Apr 20 12:22:04 rpmi: libSM-devel-1.2.3-alt1 sisyphus+226734.100.2.1 1554586158 installed
<13>Apr 20 12:22:04 rpmi: zlib-devel-1.2.11-alt1 sisyphus+221902.6000.4.1 1550601058 installed
<13>Apr 20 12:22:04 rpmi: libXau-1.0.9-alt1 sisyphus+223149.200.2.1 1551268152 installed
<13>Apr 20 12:22:04 rpmi: libwayland-server-1.19.0-alt1 sisyphus+265427.100.1.1 1611852858 installed
<13>Apr 20 12:22:05 rpmi: libicu67-1:6.7.1-alt2 sisyphus+252432.100.2.2 1590796126 installed
<13>Apr 20 12:22:05 rpmi: libgraphite2-1.3.14-alt2 sisyphus+250009.100.1.1 1586943065 installed
<13>Apr 20 12:22:05 rpmi: libidn2-2.3.0-alt1 sisyphus+240846.100.1.2 1573870475 installed
<13>Apr 20 12:22:05 rpmi: libgraphite2-devel-1.3.14-alt2 sisyphus+250009.100.1.1 1586943065 installed
<13>Apr 20 12:22:05 rpmi: icu-utils-1:6.7.1-alt2 sisyphus+252432.100.2.2 1590796126 installed
<13>Apr 20 12:22:05 rpmi: libicu-devel-1:6.7.1-alt2 sisyphus+252432.100.2.2 1590796126 installed
<13>Apr 20 12:22:05 rpmi: libXau-devel-1.0.9-alt1 sisyphus+223149.200.2.1 1551268152 installed
<13>Apr 20 12:22:05 rpmi: libe2fs-1.45.6.0.24.af1a-alt1 sisyphus+262279.100.1.1 1606088229 installed
<13>Apr 20 12:22:05 rpmi: libOpenGL-7:1.3.2-alt1 sisyphus+254610.100.1.1 1594124268 installed
<13>Apr 20 12:22:05 rpmi: libGLES-7:1.3.2-alt1 sisyphus+254610.100.1.1 1594124268 installed
<13>Apr 20 12:22:05 rpmi: rpm-macros-qt3-3.3.8d-alt14 sisyphus+245577.100.1.1 1580936166 installed
<13>Apr 20 12:22:05 rpmi: libqt3-settings-3.3-alt5 1393236356 installed
<13>Apr 20 12:22:05 rpmi: libltdl7-2.4.6-alt3 sisyphus+269178.2000.13.1 1618328602 installed
<13>Apr 20 12:22:05 rpmi: libunixODBC2-2.3.7-alt1 sisyphus+228027.100.1.1 1556027338 installed
<13>Apr 20 12:22:05 rpmi: libunixODBC-devel-compat-2.3.7-alt1 sisyphus+228027.100.1.1 1556027338 installed
<13>Apr 20 12:22:05 rpmi: libunixODBC-devel-2.3.7-alt1 sisyphus+228027.100.1.1 1556027338 installed
<13>Apr 20 12:22:05 rpmi: liblcms2-2.12-alt1 sisyphus+265911.100.2.1 1613037796 installed
<13>Apr 20 12:22:05 rpmi: libmng-2.0.3-alt2 sisyphus+222619.100.1.1 1550943853 installed
<13>Apr 20 12:22:05 rpmi: liblz4-1:1.9.3-alt1 sisyphus+262305.100.1.1 1606099167 installed
<13>Apr 20 12:22:05 rpmi: libgpg-error-1.41-alt4 sisyphus+264254.200.1.1 1609440111 installed
<13>Apr 20 12:22:06 rpmi: libgcrypt20-1.9.2-alt1 sisyphus+266496.100.1.1 1613559234 installed
<13>Apr 20 12:22:06 rpmi: libsystemd-1:247.3-alt2 sisyphus+266129.100.1.3 1613012672 installed
<13>Apr 20 12:22:06 rpmi: libdbus-1.12.18-alt1 sisyphus+252758.100.1.1 1591203693 installed
<13>Apr 20 12:22:06 rpmi: libxshmfence-1.3-alt1 sisyphus+223149.1000.2.1 1551268571 installed
<13>Apr 20 12:22:06 rpmi: libX11-locales-3:1.7.0-alt1 sisyphus+264667.100.1.2 1610655150 installed
<13>Apr 20 12:22:06 rpmi: libXdmcp-1.1.3-alt1 sisyphus+225206.600.1.2 1552949353 installed
<13>Apr 20 12:22:06 rpmi: libxcb-1.14-alt1 sisyphus+247358.200.1.3 1583854228 installed
<13>Apr 20 12:22:06 rpmi: libX11-3:1.7.0-alt1 sisyphus+264667.100.1.2 1610655170 installed
<13>Apr 20 12:22:06 rpmi: libXext-1.3.4-alt1 sisyphus+225206.700.1.2 1552949429 installed
<13>Apr 20 12:22:06 rpmi: libXrender-0.9.10-alt1 sisyphus+261890.100.1.1 1605595177 installed
<13>Apr 20 12:22:06 rpmi: libXfixes-5.0.3-alt1 sisyphus+226736.100.2.2 1554614841 installed
<13>Apr 20 12:22:06 rpmi: libXcursor-1.2.0-alt1 sisyphus+225206.400.1.2 1552949218 installed
<13>Apr 20 12:22:06 rpmi: libXrandr-1.5.2-alt1 sisyphus+225206.1300.1.2 1552949710 installed
<13>Apr 20 12:22:06 rpmi: libXi-1.7.10-alt1 sisyphus+232786.300.1.1 1561106978 installed
<13>Apr 20 12:22:06 rpmi: libXinerama-1.1.4-alt1 sisyphus+223149.300.2.1 1551268216 installed
<13>Apr 20 12:22:06 rpmi: libXt-1.2.1-alt1 sisyphus+265202.200.1.1 1611565459 installed
<13>Apr 20 12:22:06 rpmi: libXmu-1.1.3-alt1 sisyphus+225206.1200.1.2 1552949641 installed
<13>Apr 20 12:22:06 rpmi: libXxf86vm-1.1.4-alt2 1527672187 installed
<13>Apr 20 12:22:06 rpmi: libXv-1.0.11-alt1 1527685499 installed
<13>Apr 20 12:22:07 rpmi: libxcb-devel-1.14-alt1 sisyphus+247358.200.1.3 1583854228 installed
<13>Apr 20 12:22:07 rpmi: libX11-devel-3:1.7.0-alt1 sisyphus+264667.100.1.2 1610655170 installed
<13>Apr 20 12:22:07 rpmi: libXext-devel-1.3.4-alt1 sisyphus+225206.700.1.2 1552949429 installed
<13>Apr 20 12:22:07 rpmi: libXrender-devel-0.9.10-alt1 sisyphus+261890.100.1.1 1605595177 installed
<13>Apr 20 12:22:07 rpmi: libXfixes-devel-5.0.3-alt1 sisyphus+226736.100.2.2 1554614841 installed
<13>Apr 20 12:22:07 rpmi: libXi-devel-1.7.10-alt1 sisyphus+232786.300.1.1 1561106978 installed
<13>Apr 20 12:22:07 rpmi: libXrandr-devel-1.5.2-alt1 sisyphus+225206.1300.1.2 1552949710 installed
<13>Apr 20 12:22:07 rpmi: libXv-devel-1.0.11-alt1 1527685499 installed
<13>Apr 20 12:22:07 rpmi: libXcursor-devel-1.2.0-alt1 sisyphus+225206.400.1.2 1552949218 installed
<13>Apr 20 12:22:07 rpmi: libXinerama-devel-1.1.4-alt1 sisyphus+223149.300.2.1 1551268216 installed
<13>Apr 20 12:22:07 rpmi: libXt-devel-1.2.1-alt1 sisyphus+265202.200.1.1 1611565459 installed
<13>Apr 20 12:22:07 rpmi: libXmu-devel-1.1.3-alt1 sisyphus+225206.1200.1.2 1552949641 installed
<13>Apr 20 12:22:07 rpmi: libwayland-client-1.19.0-alt1 sisyphus+265427.100.1.1 1611852858 installed
<13>Apr 20 12:22:07 rpmi: libpciaccess-1:0.16-alt1 sisyphus+234814.100.1.1 1563438291 installed
<13>Apr 20 12:22:07 rpmi: libdrm-1:2.4.105-alt1 sisyphus+269183.100.1.1 1617867189 installed
<13>Apr 20 12:22:07 rpmi: libGLX-mesa-4:21.0.2-alt1 sisyphus+269183.200.1.1 1617867532 installed
<13>Apr 20 12:22:07 rpmi: libGLX-7:1.3.2-alt1 sisyphus+254610.100.1.1 1594124268 installed
<13>Apr 20 12:22:07 rpmi: libGL-7:1.3.2-alt1 sisyphus+254610.100.1.1 1594124268 installed
<13>Apr 20 12:22:07 rpmi: libGLU-4:9.0.1-alt1 sisyphus+248864.100.1.1 1585556461 installed
<13>Apr 20 12:22:07 rpmi: libgbm-4:21.0.2-alt1 sisyphus+269183.200.1.1 1617867532 installed
<13>Apr 20 12:22:07 rpmi: libEGL-mesa-4:21.0.2-alt1 sisyphus+269183.200.1.1 1617867532 installed
<13>Apr 20 12:22:07 rpmi: libEGL-7:1.3.2-alt1 sisyphus+254610.100.1.1 1594124268 installed
<13>Apr 20 12:22:07 rpmi: libglvnd-devel-7:1.3.2-alt1 sisyphus+254610.100.1.1 1594124268 installed
<13>Apr 20 12:22:07 rpmi: libGL-devel-4:21.0.2-alt1 sisyphus+269183.200.1.1 1617867532 installed
<13>Apr 20 12:22:07 rpmi: libGLU-devel-4:9.0.1-alt1 sisyphus+248864.100.1.1 1585556461 installed
<13>Apr 20 12:22:07 rpmi: rpm-macros-kde-common-devel-14.12.1-alt1 1422279175 installed
<13>Apr 20 12:22:07 rpmi: strace-5.11-alt1 sisyphus+265761.100.2.3 1613583702 installed
<13>Apr 20 12:22:07 rpmi: gcc-c++-common-1.4.27-alt1 sisyphus+262033.600.7.2 1607340230 installed
<13>Apr 20 12:22:08 rpmi: libstdc++10-devel-10.2.1-alt3 sisyphus+267829.100.1.1 1615808579 installed
<13>Apr 20 12:22:09 rpmi: gcc10-c++-10.2.1-alt3 sisyphus+267829.100.1.1 1615808579 installed
<13>Apr 20 12:22:09 rpmi: libgdbm-1.8.3-alt10 1454943334 installed
<13>Apr 20 12:22:09 rpmi: xml-utils-1:2.9.10-alt6 sisyphus+265234.30740.49.1 1613765060 installed
<13>Apr 20 12:22:09 rpmi: rpm-build-gir-0.7.3-alt3 sisyphus+242150.100.1.1 1575312005 installed
<13>Apr 20 12:22:09 rpmi: ed-1:0.2-alt10 1449768440 installed
<13>Apr 20 12:22:09 rpmi: rpm-utils-0.10.3-alt1 sisyphus+234377.400.6.1 1569421271 installed
<13>Apr 20 12:22:09 rpmi: rpm-macros-cmake-3.19.7-alt1 sisyphus+267877.100.2.1 1615932773 installed
<13>Apr 20 12:22:09 rpmi: rmt-0.4b44-alt3 sisyphus+263220.100.1.1 1607607837 installed
<13>Apr 20 12:22:09 rpmi: dump-0.4b44-alt3 sisyphus+263220.100.1.1 1607607837 installed
<13>Apr 20 12:22:09 rpmi: cmake-modules-3.19.7-alt1 sisyphus+267877.100.2.1 1615932716 installed
<13>Apr 20 12:22:09 rpmi: libuv-1.41.0-alt2 sisyphus+267695.100.2.1 1615786345 installed
<13>Apr 20 12:22:09 rpmi: librhash-1.3.5-alt2 1505156279 installed
<13>Apr 20 12:22:09 rpmi: libjsoncpp19-1.8.4-alt5 sisyphus+243670.100.1.1 1577521267 installed
<13>Apr 20 12:22:09 rpmi: publicsuffix-list-dafsa-20210121-alt1 sisyphus+265129.100.1.1 1611325490 installed
<13>Apr 20 12:22:09 rpmi: libpsl-0.21.1-alt1 sisyphus+255206.100.1.1 1595348938 installed
<13>Apr 20 12:22:09 rpmi: libnghttp2-1.41.0-alt1 sisyphus+253680.100.1.1 1592642271 installed
<13>Apr 20 12:22:09 rpmi: openldap-common-2.4.57-alt1 sisyphus+266287.100.1.1 1613244218 installed
<13>Apr 20 12:22:09 rpmi: libverto-0.3.2-alt1_1 sisyphus+268398.100.1.1 1616717462 installed
<13>Apr 20 12:22:09 rpmi: liblmdb-0.9.23-alt1 sisyphus+225277.100.2.1 1553001679 installed
<13>Apr 20 12:22:09 rpmi: libkeyutils-1.6.3-alt1 sisyphus+266061.100.1.1 1612919567 installed
<13>Apr 20 12:22:09 rpmi: libbrotlicommon-1.0.9-alt2 sisyphus+257777.100.1.1 1599688017 installed
<13>Apr 20 12:22:09 rpmi: libbrotlidec-1.0.9-alt2 sisyphus+257777.100.1.1 1599688017 installed
<13>Apr 20 12:22:09 rpmi: libharfbuzz-2.6.8-alt1 sisyphus+254028.100.1.1 1593106819 installed
<13>Apr 20 12:22:09 rpmi: libfreetype-2.10.4-alt2 sisyphus+260293.100.2.1 1604479496 installed
<13>Apr 20 12:22:09 rpmi: fontconfig-2.13.1-alt1 sisyphus+257555.100.1.1 1599475160 installed
Updating fonts cache: <29>Apr 20 12:22:10 fontconfig: Updating fonts cache: succeeded
[ DONE ]
<13>Apr 20 12:22:10 rpmi: libXft-2.3.3-alt1 sisyphus+225206.1000.3.2 1552987708 installed
<13>Apr 20 12:22:10 rpmi: libqt3-3.3.8d-alt14 sisyphus+245577.100.1.1 1580936166 installed
<13>Apr 20 12:22:10 rpmi: libtqt-3.5.13.2-alt2 1477555312 installed
<13>Apr 20 12:22:10 rpmi: libharfbuzz-icu-2.6.8-alt1 sisyphus+254028.100.1.1 1593106819 installed
<13>Apr 20 12:22:10 rpmi: libharfbuzz-gobject-2.6.8-alt1 sisyphus+254028.100.1.1 1593106819 installed
<13>Apr 20 12:22:10 rpmi: libp11-kit-0.23.15-alt2 sisyphus+252784.100.2.2 1591274901 installed
<13>Apr 20 12:22:10 rpmi: libtasn1-4.16.0-alt1 sisyphus+245480.100.1.1 1580825062 installed
<13>Apr 20 12:22:10 rpmi: rpm-macros-alternatives-0.5.1-alt1 sisyphus+226946.100.1.1 1554830426 installed
<13>Apr 20 12:22:10 rpmi: alternatives-0.5.1-alt1 sisyphus+226946.100.1.1 1554830426 installed
<13>Apr 20 12:22:10 rpmi: ca-certificates-2021.03.24-alt1 sisyphus+268304.300.1.1 1616591829 installed
<13>Apr 20 12:22:10 rpmi: ca-trust-0.1.2-alt1 sisyphus+233348.100.1.1 1561653823 installed
<13>Apr 20 12:22:10 rpmi: p11-kit-trust-0.23.15-alt2 sisyphus+252784.100.2.2 1591274901 installed
<13>Apr 20 12:22:11 rpmi: libcrypto1.1-1.1.1k-alt1 sisyphus+268375.100.1.1 1616684255 installed
<13>Apr 20 12:22:11 rpmi: libssl1.1-1.1.1k-alt1 sisyphus+268375.100.1.1 1616684255 installed
<13>Apr 20 12:22:11 rpmi: libpython3-3.9.4-alt1 sisyphus+268966.100.1.1 1617609166 installed
<13>Apr 20 12:22:11 rpmi: python3-3.9.4-alt1 sisyphus+268966.100.1.1 1617609166 installed
<13>Apr 20 12:22:11 rpmi: python3-base-3.9.4-alt1 sisyphus+268966.100.1.1 1617609166 installed
<86>Apr 20 12:22:12 groupadd[880248]: group added to /etc/group: name=_keytab, GID=499
<86>Apr 20 12:22:12 groupadd[880248]: group added to /etc/gshadow: name=_keytab
<86>Apr 20 12:22:12 groupadd[880248]: new group: name=_keytab, GID=499
<13>Apr 20 12:22:12 rpmi: libkrb5-1.19.1-alt2 sisyphus+267847.100.1.1 1615814853 installed
<86>Apr 20 12:22:12 groupadd[880664]: group added to /etc/group: name=sasl, GID=498
<86>Apr 20 12:22:12 groupadd[880664]: group added to /etc/gshadow: name=sasl
<86>Apr 20 12:22:12 groupadd[880664]: new group: name=sasl, GID=498
<13>Apr 20 12:22:12 rpmi: libsasl2-3-2.1.27-alt2.1 sisyphus+255909.100.2.1 1597199456 installed
<13>Apr 20 12:22:12 rpmi: libldap-2.4.57-alt1 sisyphus+266287.100.1.1 1613244306 installed
<13>Apr 20 12:22:12 rpmi: libcurl-7.76.1-alt1 sisyphus+269986.100.1.1 1618487446 installed
<13>Apr 20 12:22:12 rpmi: glib2-devel-2.68.1-alt1 sisyphus+269248.100.1.1 1617921065 installed
<13>Apr 20 12:22:12 rpmi: libfreetype-devel-2.10.4-alt2 sisyphus+260293.100.2.1 1604479496 installed
<13>Apr 20 12:22:12 rpmi: libharfbuzz-devel-2.6.8-alt1 sisyphus+254028.100.1.1 1593106819 installed
<13>Apr 20 12:22:12 rpmi: fontconfig-devel-2.13.1-alt1 sisyphus+257555.100.1.1 1599475160 installed
<13>Apr 20 12:22:12 rpmi: libXft-devel-2.3.3-alt1 sisyphus+225206.1000.3.2 1552987708 installed
<13>Apr 20 12:22:12 rpmi: libqt3-devel-3.3.8d-alt14 sisyphus+245577.100.1.1 1580936166 installed
<13>Apr 20 12:22:12 rpmi: libarchive13-3.4.3-alt1 sisyphus+258566.100.1.2 1600916107 installed
<13>Apr 20 12:22:13 rpmi: cmake-3.19.7-alt1 sisyphus+267877.100.2.1 1615932773 installed
<13>Apr 20 12:22:13 rpmi: libtqt-devel-3.5.13.2-alt2 1477555312 installed
<13>Apr 20 12:22:13 rpmi: kde-common-devel-14.12.1-alt1 1422279175 installed
<13>Apr 20 12:22:13 rpmi: gcc-c++-10-alt1 sisyphus+263054.200.3.1 1607516810 installed
<13>Apr 20 12:22:13 rpmi: libdbus-devel-1.12.18-alt1 sisyphus+252758.100.1.1 1591203693 installed
<13>Apr 20 12:22:13 rpmi: libpng-devel-1.6.37-alt1 sisyphus+236677.100.2.1 1566917998 installed
<13>Apr 20 12:22:13 rpmi: libjpeg-devel-2:2.0.6-alt1 sisyphus+266888.100.1.1 1614172387 installed
Building target platforms: i586
Building for target i586
Wrote: /usr/src/in/nosrpm/libdbus-tqt-3.5.13.2-alt1.1.nosrc.rpm (w1.gzdio)
Installing libdbus-tqt-3.5.13.2-alt1.1.src.rpm
Building target platforms: i586
Building for target i586
Executing(%prep): /bin/sh -e /usr/src/tmp/rpm-tmp.73171
+ umask 022
+ /bin/mkdir -p /usr/src/RPM/BUILD
+ cd /usr/src/RPM/BUILD
+ cd /usr/src/RPM/BUILD
+ rm -rf dbus-tqt-3.5.13.2
+ echo 'Source #0 (dbus-tqt-3.5.13.2.tar):'
Source #0 (dbus-tqt-3.5.13.2.tar):
+ /bin/tar -xf /usr/src/RPM/SOURCES/dbus-tqt-3.5.13.2.tar
+ cd dbus-tqt-3.5.13.2
+ /bin/chmod -c -Rf u+rwX,go-w .
+ exit 0
Executing(%build): /bin/sh -e /usr/src/tmp/rpm-tmp.94109
+ umask 022
+ /bin/mkdir -p /usr/src/RPM/BUILD
+ cd /usr/src/RPM/BUILD
+ cd dbus-tqt-3.5.13.2
+ __kde_build -DCMAKE_BUILD_TYPE=RelWithDebInfo -DPKGCONFIG_INSTALL_DIR=/usr/lib/pkgconfig
+ mkdir -p BUILD-i586-alt-linux
+ __kde4_cmake -DINCLUDE_INSTALL_DIR=/usr/include -DSOUND_INSTALL_DIR=/usr/share/sounds -DAUTOSTART_INSTALL_DIR=/etc/xdg/autostart -DXDG_DIRECTORY_INSTALL_DIR=/usr/share/desktop-directories -DXDG_APPS_INSTALL_DIR=/usr/share/applications -DCMAKE_BUILD_TYPE=RelWithDebInfo -DPKGCONFIG_INSTALL_DIR=/usr/lib/pkgconfig
+ export PATH=/usr/lib/kde4/bin:/usr/src/bin:/bin:/usr/bin:/usr/X11R6/bin:/usr/games
+ PATH=/usr/lib/kde4/bin:/usr/src/bin:/bin:/usr/bin:/usr/X11R6/bin:/usr/games
+ pushd BUILD-i586-alt-linux
~/RPM/BUILD/dbus-tqt-3.5.13.2/BUILD-i586-alt-linux ~/RPM/BUILD/dbus-tqt-3.5.13.2
+ cmake .. -DCMAKE_SKIP_RPATH:BOOL=yes -DCMAKE_BUILD_TYPE=Release '-DCMAKE_C_FLAGS:STRING=-pipe -frecord-gcc-switches -Wall -g -O2 -march=i586 -mtune=generic' '-DCMAKE_CXX_FLAGS:STRING=-pipe -frecord-gcc-switches -Wall -g -O2 -march=i586 -mtune=generic' '-DCMAKE_EXE_LINKER_FLAGS:STRING=-L/usr/lib/kde4link -L/usr/lib/kde4/devel' '-DCMAKE_MODULE_LINKER_FLAGS:STRING=-L/usr/lib/kde4link -L/usr/lib/kde4/devel' '-DCMAKE_SHARED_LINKER_FLAGS:STRING=-L/usr/lib/kde4link -L/usr/lib/kde4/devel' '-DCMAKE_LIBRARY_PATH:LIST=/usr/lib/kde4/devel;/usr/lib/kde4link;/usr/lib;/lib' -DLIB_DESTINATION=lib -DLIB_SUFFIX= -DCMAKE_INSTALL_PREFIX=/usr -DBIN_INSTALL_DIR=/usr/bin -DSBIN_INSTALL_DIR=/usr/sbin -DICON_INSTALL_DIR=/usr/share/icons -DXDG_APPS_INSTALL_DIR=/usr/share/applications/kde4 -DXDG_DIRECTORY_INSTALL_DIR=/usr/share/desktop-directories -DLIB_INSTALL_DIR=/usr/lib -DLIBEXEC_INSTALL_DIR=/usr/lib/kde4/libexec -DINCLUDE_INSTALL_DIR=/usr/include/kde4 -DKDE4_INCLUDE_INSTALL_DIR=/usr/include/kde4 -DSYSCONF_INSTALL_DIR=/etc -DDATA_INSTALL_DIR=/usr/share/kde4/apps -DCONFIG_INSTALL_DIR=/usr/share/kde4/config -DKCFG_INSTALL_DIR=/usr/share/kde4/config.kcfg -DHTML_INSTALL_DIR=/usr/share/kde4/doc/HTML -DAPPLNK_INSTALL_DIR=/usr/share/applnk -DLOCALE_INSTALL_DIR=/usr/share/kde4/locale -DSERVICES_INSTALL_DIR=/usr/share/kde4/services -DSERVICETYPES_INSTALL_DIR=/usr/share/kde4/servicetypes -DKCONF_UPDATE_INSTALL_DIR=/usr/share/kde4/apps/kconf_update -DXDG_MIME_INSTALL_DIR=/usr/share/mime/packages -DAUTOSTART_INSTALL_DIR=/usr/share/kde4/autostart -DSOUND_INSTALL_DIR=/usr/share/kde4/sounds -DTEMPLATES_INSTALL_DIR=/usr/share/kde4/templates -DWALLPAPER_INSTALL_DIR=/usr/share/wallpapers -DDBUS_INTERFACES_INSTALL_DIR=/usr/share/dbus-1/interfaces -DDBUS_SERVICES_INSTALL_DIR=/usr/share/dbus-1/services -DDBUS_SYSTEM_SERVICES_INSTALL_DIR=/usr/share/dbus-1/system-services -DMAN_INSTALL_DIR=/usr/share/man -DINFO_INSTALL_DIR=/usr/share/info -DINSTALL_PYTHON_FILES_IN_PYTHON_PREFIX:BOOL=yes -DINCLUDE_INSTALL_DIR=/usr/include -DSOUND_INSTALL_DIR=/usr/share/sounds -DAUTOSTART_INSTALL_DIR=/etc/xdg/autostart -DXDG_DIRECTORY_INSTALL_DIR=/usr/share/desktop-directories -DXDG_APPS_INSTALL_DIR=/usr/share/applications -DCMAKE_BUILD_TYPE=RelWithDebInfo -DPKGCONFIG_INSTALL_DIR=/usr/lib/pkgconfig
-- The C compiler identification is GNU 10.2.1
-- The CXX compiler identification is GNU 10.2.1
-- Detecting C compiler ABI info
-- Detecting C compiler ABI info - done
-- Check for working C compiler: /usr/bin/cc - skipped
-- Detecting C compile features
-- Detecting C compile features - done
-- Detecting CXX compiler ABI info
-- Detecting CXX compiler ABI info - done
-- Check for working CXX compiler: /usr/bin/c++ - skipped
-- Detecting CXX compile features
-- Detecting CXX compile features - done
CMake Deprecation Warning at CMakeLists.txt:18 (cmake_minimum_required):
  Compatibility with CMake < 2.8.12 will be removed from a future version of
  CMake.

  Update the VERSION argument <min> value or use a ...<max> suffix to tell
  CMake that the project does not need compatibility with older versions.


-- Found PkgConfig: /usr/bin/pkg-config (found version "0.29.2") 
-- Checking for one of the modules 'dbus-1'
-- Checking for one of the modules 'tqt'
--   tmoc path: /usr/bin/tmoc
--   moc path: /usr/bin/moc-qt3
--   uic path: /usr/bin/uic-qt3
-- Performing Test HAVE_USABLE_TQT
-- Performing Test HAVE_USABLE_TQT - Success
CMake Warning (dev) at cmake/modules/TDEMacros.cmake:523 (if):
  Policy CMP0054 is not set: Only interpret if() arguments as variables or
  keywords when unquoted.  Run "cmake --help-policy CMP0054" for policy
  details.  Use the cmake_policy command to set the policy and suppress this
  warning.

  Quoted variables like "VERSION" will no longer be dereferenced when the
  policy is set to NEW.  Since the policy is not set the OLD behavior will be
  used.
Call Stack (most recent call first):
  CMakeLists.txt:81 (tde_add_library)
This warning is for project developers.  Use -Wno-dev to suppress it.

CMake Warning (dev) at cmake/modules/TDEMacros.cmake:486 (if):
  Policy CMP0054 is not set: Only interpret if() arguments as variables or
  keywords when unquoted.  Run "cmake --help-policy CMP0054" for policy
  details.  Use the cmake_policy command to set the policy and suppress this
  warning.

  Quoted variables like "VERSION" will no longer be dereferenced when the
  policy is set to NEW.  Since the policy is not set the OLD behavior will be
  used.
Call Stack (most recent call first):
  CMakeLists.txt:81 (tde_add_library)
This warning is for project developers.  Use -Wno-dev to suppress it.

CMake Warning (dev) at cmake/modules/TDEMacros.cmake:492 (if):
  Policy CMP0054 is not set: Only interpret if() arguments as variables or
  keywords when unquoted.  Run "cmake --help-policy CMP0054" for policy
  details.  Use the cmake_policy command to set the policy and suppress this
  warning.

  Quoted variables like "VERSION" will no longer be dereferenced when the
  policy is set to NEW.  Since the policy is not set the OLD behavior will be
  used.
Call Stack (most recent call first):
  CMakeLists.txt:81 (tde_add_library)
This warning is for project developers.  Use -Wno-dev to suppress it.

CMake Warning (dev) at cmake/modules/TDEMacros.cmake:499 (if):
  Policy CMP0054 is not set: Only interpret if() arguments as variables or
  keywords when unquoted.  Run "cmake --help-policy CMP0054" for policy
  details.  Use the cmake_policy command to set the policy and suppress this
  warning.

  Quoted variables like "VERSION" will no longer be dereferenced when the
  policy is set to NEW.  Since the policy is not set the OLD behavior will be
  used.
Call Stack (most recent call first):
  CMakeLists.txt:81 (tde_add_library)
This warning is for project developers.  Use -Wno-dev to suppress it.

CMake Warning (dev) at cmake/modules/TDEMacros.cmake:505 (if):
  Policy CMP0054 is not set: Only interpret if() arguments as variables or
  keywords when unquoted.  Run "cmake --help-policy CMP0054" for policy
  details.  Use the cmake_policy command to set the policy and suppress this
  warning.

  Quoted variables like "VERSION" will no longer be dereferenced when the
  policy is set to NEW.  Since the policy is not set the OLD behavior will be
  used.
Call Stack (most recent call first):
  CMakeLists.txt:81 (tde_add_library)
This warning is for project developers.  Use -Wno-dev to suppress it.

CMake Warning (dev) at cmake/modules/TDEMacros.cmake:511 (if):
  Policy CMP0054 is not set: Only interpret if() arguments as variables or
  keywords when unquoted.  Run "cmake --help-policy CMP0054" for policy
  details.  Use the cmake_policy command to set the policy and suppress this
  warning.

  Quoted variables like "VERSION" will no longer be dereferenced when the
  policy is set to NEW.  Since the policy is not set the OLD behavior will be
  used.
Call Stack (most recent call first):
  CMakeLists.txt:81 (tde_add_library)
This warning is for project developers.  Use -Wno-dev to suppress it.

CMake Warning (dev) at cmake/modules/TDEMacros.cmake:517 (if):
  Policy CMP0054 is not set: Only interpret if() arguments as variables or
  keywords when unquoted.  Run "cmake --help-policy CMP0054" for policy
  details.  Use the cmake_policy command to set the policy and suppress this
  warning.

  Quoted variables like "VERSION" will no longer be dereferenced when the
  policy is set to NEW.  Since the policy is not set the OLD behavior will be
  used.
Call Stack (most recent call first):
  CMakeLists.txt:81 (tde_add_library)
This warning is for project developers.  Use -Wno-dev to suppress it.

CMake Warning (dev) at cmake/modules/TDEMacros.cmake:529 (if):
  Policy CMP0054 is not set: Only interpret if() arguments as variables or
  keywords when unquoted.  Run "cmake --help-policy CMP0054" for policy
  details.  Use the cmake_policy command to set the policy and suppress this
  warning.

  Quoted variables like "VERSION" will no longer be dereferenced when the
  policy is set to NEW.  Since the policy is not set the OLD behavior will be
  used.
Call Stack (most recent call first):
  CMakeLists.txt:81 (tde_add_library)
This warning is for project developers.  Use -Wno-dev to suppress it.

CMake Warning (dev) at cmake/modules/TDEMacros.cmake:535 (if):
  Policy CMP0054 is not set: Only interpret if() arguments as variables or
  keywords when unquoted.  Run "cmake --help-policy CMP0054" for policy
  details.  Use the cmake_policy command to set the policy and suppress this
  warning.

  Quoted variables like "VERSION" will no longer be dereferenced when the
  policy is set to NEW.  Since the policy is not set the OLD behavior will be
  used.
Call Stack (most recent call first):
  CMakeLists.txt:81 (tde_add_library)
This warning is for project developers.  Use -Wno-dev to suppress it.

CMake Warning (dev) at cmake/modules/TDEMacros.cmake:541 (if):
  Policy CMP0054 is not set: Only interpret if() arguments as variables or
  keywords when unquoted.  Run "cmake --help-policy CMP0054" for policy
  details.  Use the cmake_policy command to set the policy and suppress this
  warning.

  Quoted variables like "VERSION" will no longer be dereferenced when the
  policy is set to NEW.  Since the policy is not set the OLD behavior will be
  used.
Call Stack (most recent call first):
  CMakeLists.txt:81 (tde_add_library)
This warning is for project developers.  Use -Wno-dev to suppress it.

CMake Warning (dev) at cmake/modules/TDEMacros.cmake:547 (if):
  Policy CMP0054 is not set: Only interpret if() arguments as variables or
  keywords when unquoted.  Run "cmake --help-policy CMP0054" for policy
  details.  Use the cmake_policy command to set the policy and suppress this
  warning.

  Quoted variables like "VERSION" will no longer be dereferenced when the
  policy is set to NEW.  Since the policy is not set the OLD behavior will be
  used.
Call Stack (most recent call first):
  CMakeLists.txt:81 (tde_add_library)
This warning is for project developers.  Use -Wno-dev to suppress it.

CMake Warning (dev) at cmake/modules/TDEMacros.cmake:553 (if):
  Policy CMP0054 is not set: Only interpret if() arguments as variables or
  keywords when unquoted.  Run "cmake --help-policy CMP0054" for policy
  details.  Use the cmake_policy command to set the policy and suppress this
  warning.

  Quoted variables like "VERSION" will no longer be dereferenced when the
  policy is set to NEW.  Since the policy is not set the OLD behavior will be
  used.
Call Stack (most recent call first):
  CMakeLists.txt:81 (tde_add_library)
This warning is for project developers.  Use -Wno-dev to suppress it.

CMake Warning (dev) at cmake/modules/TDEMacros.cmake:660 (get_target_property):
  Policy CMP0026 is not set: Disallow use of the LOCATION target property.
  Run "cmake --help-policy CMP0026" for policy details.  Use the cmake_policy
  command to set the policy and suppress this warning.

  The LOCATION property should not be read from target "dbus-tqt-1-shared".
  Use the target name directly with add_custom_command, or use the generator
  expression $<TARGET_FILE>, as appropriate.

Call Stack (most recent call first):
  CMakeLists.txt:81 (tde_add_library)
This warning is for project developers.  Use -Wno-dev to suppress it.

CMake Warning (dev) at cmake/modules/TDEMacros.cmake:373 (get_target_property):
  Policy CMP0026 is not set: Disallow use of the LOCATION target property.
  Run "cmake --help-policy CMP0026" for policy details.  Use the cmake_policy
  command to set the policy and suppress this warning.

  The LOCATION property should not be read from target "dbus-tqt-1-shared".
  Use the target name directly with add_custom_command, or use the generator
  expression $<TARGET_FILE>, as appropriate.

Call Stack (most recent call first):
  cmake/modules/TDEMacros.cmake:681 (tde_install_libtool_file)
  CMakeLists.txt:81 (tde_add_library)
This warning is for project developers.  Use -Wno-dev to suppress it.

-- Configuring done
-- Generating done
CMake Warning:
  Manually-specified variables were not used by the project:

    APPLNK_INSTALL_DIR
    AUTOSTART_INSTALL_DIR
    BIN_INSTALL_DIR
    CMAKE_EXE_LINKER_FLAGS
    CMAKE_LIBRARY_PATH
    CMAKE_MODULE_LINKER_FLAGS
    CONFIG_INSTALL_DIR
    DATA_INSTALL_DIR
    DBUS_INTERFACES_INSTALL_DIR
    DBUS_SERVICES_INSTALL_DIR
    DBUS_SYSTEM_SERVICES_INSTALL_DIR
    HTML_INSTALL_DIR
    ICON_INSTALL_DIR
    INFO_INSTALL_DIR
    INSTALL_PYTHON_FILES_IN_PYTHON_PREFIX
    KCFG_INSTALL_DIR
    KCONF_UPDATE_INSTALL_DIR
    KDE4_INCLUDE_INSTALL_DIR
    LIBEXEC_INSTALL_DIR
    LIB_DESTINATION
    LOCALE_INSTALL_DIR
    MAN_INSTALL_DIR
    SBIN_INSTALL_DIR
    SERVICES_INSTALL_DIR
    SERVICETYPES_INSTALL_DIR
    SOUND_INSTALL_DIR
    SYSCONF_INSTALL_DIR
    TEMPLATES_INSTALL_DIR
    WALLPAPER_INSTALL_DIR
    XDG_APPS_INSTALL_DIR
    XDG_MIME_INSTALL_DIR


-- Build files have been written to: /usr/src/RPM/BUILD/dbus-tqt-3.5.13.2/BUILD-i586-alt-linux
+ popd
~/RPM/BUILD/dbus-tqt-3.5.13.2
+ __kde4_make
+ pushd BUILD-i586-alt-linux
~/RPM/BUILD/dbus-tqt-3.5.13.2/BUILD-i586-alt-linux ~/RPM/BUILD/dbus-tqt-3.5.13.2
+ make -j8
make[2]: Entering directory '/usr/src/RPM/BUILD/dbus-tqt-3.5.13.2/BUILD-i586-alt-linux'
[ 11%] Generating server.moc
make[2]: Leaving directory '/usr/src/RPM/BUILD/dbus-tqt-3.5.13.2/BUILD-i586-alt-linux'
make[2]: Entering directory '/usr/src/RPM/BUILD/dbus-tqt-3.5.13.2/BUILD-i586-alt-linux'
[ 22%] Generating connection.moc
make[2]: Leaving directory '/usr/src/RPM/BUILD/dbus-tqt-3.5.13.2/BUILD-i586-alt-linux'
make[2]: Entering directory '/usr/src/RPM/BUILD/dbus-tqt-3.5.13.2/BUILD-i586-alt-linux'
[ 33%] Generating integrator.moc
make[2]: Leaving directory '/usr/src/RPM/BUILD/dbus-tqt-3.5.13.2/BUILD-i586-alt-linux'
make[2]: Entering directory '/usr/src/RPM/BUILD/dbus-tqt-3.5.13.2/BUILD-i586-alt-linux'
Scanning dependencies of target dbus-tqt-1-shared
make[2]: Leaving directory '/usr/src/RPM/BUILD/dbus-tqt-3.5.13.2/BUILD-i586-alt-linux'
make[2]: Entering directory '/usr/src/RPM/BUILD/dbus-tqt-3.5.13.2/BUILD-i586-alt-linux'
[ 44%] Building CXX object CMakeFiles/dbus-tqt-1-shared.dir/dbus-qthread.cpp.o
make[2]: Leaving directory '/usr/src/RPM/BUILD/dbus-tqt-3.5.13.2/BUILD-i586-alt-linux'
make[2]: Entering directory '/usr/src/RPM/BUILD/dbus-tqt-3.5.13.2/BUILD-i586-alt-linux'
[ 88%] Building CXX object CMakeFiles/dbus-tqt-1-shared.dir/server.cpp.o
make[2]: Leaving directory '/usr/src/RPM/BUILD/dbus-tqt-3.5.13.2/BUILD-i586-alt-linux'
make[2]: Entering directory '/usr/src/RPM/BUILD/dbus-tqt-3.5.13.2/BUILD-i586-alt-linux'
[ 66%] Building CXX object CMakeFiles/dbus-tqt-1-shared.dir/connection.cpp.o
make[2]: Leaving directory '/usr/src/RPM/BUILD/dbus-tqt-3.5.13.2/BUILD-i586-alt-linux'
make[2]: Entering directory '/usr/src/RPM/BUILD/dbus-tqt-3.5.13.2/BUILD-i586-alt-linux'
[ 55%] Building CXX object CMakeFiles/dbus-tqt-1-shared.dir/message.cpp.o
make[2]: Leaving directory '/usr/src/RPM/BUILD/dbus-tqt-3.5.13.2/BUILD-i586-alt-linux'
make[2]: Entering directory '/usr/src/RPM/BUILD/dbus-tqt-3.5.13.2/BUILD-i586-alt-linux'
[ 77%] Building CXX object CMakeFiles/dbus-tqt-1-shared.dir/integrator.cpp.o
/usr/src/RPM/BUILD/dbus-tqt-3.5.13.2/integrator.cpp: In member function 'void DBusQt::Internal::Integrator::addWatch(DBusWatch*)':
/usr/src/RPM/BUILD/dbus-tqt-3.5.13.2/integrator.cpp:193:37: warning: 'int dbus_watch_get_fd(DBusWatch*)' is deprecated [-Wdeprecated-declarations]
  193 |   int fd = dbus_watch_get_fd( watch );
      |                                     ^
In file included from /usr/include/dbus-1.0/dbus/dbus-bus.h:30,
                 from /usr/include/dbus-1.0/dbus/dbus.h:31,
                 from /usr/src/RPM/BUILD/dbus-tqt-3.5.13.2/integrator.h:31,
                 from /usr/src/RPM/BUILD/dbus-tqt-3.5.13.2/integrator.cpp:23:
/usr/include/dbus-1.0/dbus/dbus-connection.h:481:21: note: declared here
  481 | DBUS_DEPRECATED int dbus_watch_get_fd      (DBusWatch        *watch);
      |                     ^~~~~~~~~~~~~~~~~
/usr/src/RPM/BUILD/dbus-tqt-3.5.13.2/integrator.cpp: In member function 'void DBusQt::Internal::Integrator::removeWatch(DBusWatch*)':
/usr/src/RPM/BUILD/dbus-tqt-3.5.13.2/integrator.cpp:210:38: warning: 'int dbus_watch_get_fd(DBusWatch*)' is deprecated [-Wdeprecated-declarations]
  210 |   int key = dbus_watch_get_fd( watch );
      |                                      ^
In file included from /usr/include/dbus-1.0/dbus/dbus-bus.h:30,
                 from /usr/include/dbus-1.0/dbus/dbus.h:31,
                 from /usr/src/RPM/BUILD/dbus-tqt-3.5.13.2/integrator.h:31,
                 from /usr/src/RPM/BUILD/dbus-tqt-3.5.13.2/integrator.cpp:23:
/usr/include/dbus-1.0/dbus/dbus-connection.h:481:21: note: declared here
  481 | DBUS_DEPRECATED int dbus_watch_get_fd      (DBusWatch        *watch);
      |                     ^~~~~~~~~~~~~~~~~
make[2]: Leaving directory '/usr/src/RPM/BUILD/dbus-tqt-3.5.13.2/BUILD-i586-alt-linux'
make[2]: Entering directory '/usr/src/RPM/BUILD/dbus-tqt-3.5.13.2/BUILD-i586-alt-linux'
[100%] Linking CXX shared library libdbus-tqt-1.so
make[2]: Leaving directory '/usr/src/RPM/BUILD/dbus-tqt-3.5.13.2/BUILD-i586-alt-linux'
make[1]: Entering directory '/usr/src/RPM/BUILD/dbus-tqt-3.5.13.2/BUILD-i586-alt-linux'
[100%] Built target dbus-tqt-1-shared
make[1]: Leaving directory '/usr/src/RPM/BUILD/dbus-tqt-3.5.13.2/BUILD-i586-alt-linux'
+ popd
~/RPM/BUILD/dbus-tqt-3.5.13.2
+ exit 0
Executing(%install): /bin/sh -e /usr/src/tmp/rpm-tmp.39303
+ umask 022
+ /bin/mkdir -p /usr/src/RPM/BUILD
+ cd /usr/src/RPM/BUILD
+ /bin/chmod -Rf u+rwX -- /usr/src/tmp/libdbus-tqt-buildroot
+ :
+ /bin/rm -rf -- /usr/src/tmp/libdbus-tqt-buildroot
+ PATH=/usr/libexec/rpm-build:/usr/src/bin:/bin:/usr/bin:/usr/X11R6/bin:/usr/games
+ cd dbus-tqt-3.5.13.2
+ __kde_install
+ make -C BUILD-i586-alt-linux DESTDIR=/usr/src/tmp/libdbus-tqt-buildroot install
make: Entering directory '/usr/src/RPM/BUILD/dbus-tqt-3.5.13.2/BUILD-i586-alt-linux'
make[1]: Entering directory '/usr/src/RPM/BUILD/dbus-tqt-3.5.13.2/BUILD-i586-alt-linux'
make[2]: Entering directory '/usr/src/RPM/BUILD/dbus-tqt-3.5.13.2/BUILD-i586-alt-linux'
make[2]: Leaving directory '/usr/src/RPM/BUILD/dbus-tqt-3.5.13.2/BUILD-i586-alt-linux'
[100%] Built target dbus-tqt-1-shared
make[1]: Leaving directory '/usr/src/RPM/BUILD/dbus-tqt-3.5.13.2/BUILD-i586-alt-linux'
Install the project...
-- Install configuration: "RelWithDebInfo"
-- Installing: /usr/src/tmp/libdbus-tqt-buildroot/usr/include/dbus-1.0/dbus/dbus-qt.h
-- Installing: /usr/src/tmp/libdbus-tqt-buildroot/usr/include/dbus-1.0/dbus/message.h
-- Installing: /usr/src/tmp/libdbus-tqt-buildroot/usr/include/dbus-1.0/dbus/connection.h
-- Installing: /usr/src/tmp/libdbus-tqt-buildroot/usr/include/dbus-1.0/dbus/server.h
-- Installing: /usr/src/tmp/libdbus-tqt-buildroot/usr/lib/pkgconfig/dbus-tqt.pc
-- Installing: /usr/src/tmp/libdbus-tqt-buildroot/usr/lib/libdbus-tqt-1.so.0.0.0
-- Installing: /usr/src/tmp/libdbus-tqt-buildroot/usr/lib/libdbus-tqt-1.so.0
-- Installing: /usr/src/tmp/libdbus-tqt-buildroot/usr/lib/libdbus-tqt-1.so
-- Installing: /usr/src/tmp/libdbus-tqt-buildroot/usr/lib/libdbus-tqt-1.la
make: Leaving directory '/usr/src/RPM/BUILD/dbus-tqt-3.5.13.2/BUILD-i586-alt-linux'
+ /usr/lib/rpm/brp-alt
Cleaning files in /usr/src/tmp/libdbus-tqt-buildroot (auto)
removed './usr/lib/libdbus-tqt-1.la'
mode of './usr/lib/libdbus-tqt-1.so.0.0.0' changed from 0755 (rwxr-xr-x) to 0644 (rw-r--r--)
Verifying and fixing files in /usr/src/tmp/libdbus-tqt-buildroot (binconfig,pkgconfig,libtool,desktop,gnuconfig)
/usr/lib/pkgconfig/dbus-tqt.pc: Cflags: '-I${includedir} -I${includedir}/dbus-1.0' --> '-I${includedir}/dbus-1.0'
/usr/lib/pkgconfig/dbus-tqt.pc: Libs: '-L${libdir}  -ldbus-tqt-1 -ldbus-1' --> '-ldbus-tqt-1 -ldbus-1'
Checking contents of files in /usr/src/tmp/libdbus-tqt-buildroot/ (default)
Compressing files in /usr/src/tmp/libdbus-tqt-buildroot (auto)
Adjusting library links in /usr/src/tmp/libdbus-tqt-buildroot
./usr/lib: (from <cmdline>:0)
	libdbus-tqt-1.so.0 -> libdbus-tqt-1.so.0.0.0
Verifying ELF objects in /usr/src/tmp/libdbus-tqt-buildroot (arch=normal,fhs=normal,lfs=relaxed,lint=relaxed,rpath=normal,stack=normal,textrel=normal,unresolved=normal)
Hardlinking identical .pyc and .pyo files
Processing files: libdbus-tqt-3.5.13.2-alt1.1
Finding Provides (using /usr/lib/rpm/find-provides)
Executing: /bin/sh -e /usr/src/tmp/rpm-tmp.lWXbeg
find-provides: running scripts (alternatives,debuginfo,gir,lib,pam,perl,pkgconfig,python,shell,typelib)
lib.prov: /usr/src/tmp/libdbus-tqt-buildroot/usr/lib/libdbus-tqt-1.so.0: 208 symbols, 18 bpp
Finding Requires (using /usr/lib/rpm/find-requires)
Executing: /bin/sh -e /usr/src/tmp/rpm-tmp.TfDcOf
find-requires: running scripts (cpp,debuginfo,files,gir-js,gir-python,gir,lib,pam,perl,pkgconfig,pkgconfiglib,python,rpmlib,shebang,shell,static,symlinks,systemd-services,typelib)
Provides: libdbus-tqt-1.so.0 = set:ldDEVXU6FzZmUJcMa0l8OFRUZDQ6l5WF4S877pCyZzHR1yLjp25P6IG7kUQOXSR0Bl5tKrFAoRGQU3v59DBjDNxV9WZvxdG5kTPlKTMMN2FZhFs3LpihMtPskaYvugnzPXaV1BSRYZCViXJe1IJRLQVYLKEFyJCH67X4OS0yfTAptU8lsmSLXIaldOZatP95zQRhcXOZcyVgr98fMqodJ4rzoGPPkjnazxk6XQT5f5xWJdXq0Zh2Sc5uYmYcOYpx8BFmKiqPo8xgKhfFKcoDe13A44zuUY37ZeZ25rBIOhyrjCY1xf4suEtYx24lr3tPVn5qlihKsWccD3cR4aULzaToGRBpgdUdZA2ZKrM8UiNV7ya6evGmbrRN8rtDomI47F7OUc868sTekpLK1M2pqOnTwRs4kc1
Requires: libc.so.6(GLIBC_2.0), libc.so.6(GLIBC_2.1.3), libc.so.6(GLIBC_2.4), libdbus-1.so.3 >= set:nhkDECYUZf4d2P6LOyrxeuSRpNGKTJh1m3wZBBu4m6nA0Sw6yJ2BLiSbZ6FGLbIDTKaV79TZq74MYHSYgcOx37PAIQyBZKflNAG0XN9uF9mxgji6Bkii0l8UI8Veh1ijggJBskXytXNrYPHw0kMWDe1, libdbus-1.so.3(LIBDBUS_1_3), libgcc_s.so.1(GCC_3.0), libqt-mt.so.3 >= set:slty9S1qZn2gRn3dTOeZHbaLL26ApAa7Ni7AUx9f0u94SElQHPQFwPf7bJmFEZmD8jHVM0dqant0Nr5YwxWkr5FHQWipAV3pUE51QrZze8eUIist1ODyd40OuhgF6Hoesgt3ZjD9oGvmAHJPQziw6Z2X0Th735yPqUhtwwcukxaxcHEYf6OBDm0iOhoXY2neZ2JgqguZy5XwjcgbiYl34BQEwvYk9ZikxnlMDT1MaQhlJ9KBUNCpilrMC1kSwV2lR6oLz0, libqt-mt.so.3(CXX3), libstdc++.so.6(CXXABI_1.3), libstdc++.so.6(CXXABI_1.3.9), libstdc++.so.6(GLIBCXX_3.4), rtld(GNU_HASH)
Requires(rpmlib): rpmlib(SetVersions)
Finding debuginfo files (using /usr/lib/rpm/find-debuginfo-files)
Executing: /bin/sh -e /usr/src/tmp/rpm-tmp.A98OZf
Creating libdbus-tqt-debuginfo package
Processing files: libdbus-tqt-devel-3.5.13.2-alt1.1
Finding Provides (using /usr/lib/rpm/find-provides)
Executing: /bin/sh -e /usr/src/tmp/rpm-tmp.UkXGne
find-provides: running scripts (alternatives,debuginfo,gir,lib,pam,perl,pkgconfig,python,shell,typelib)
Finding Requires (using /usr/lib/rpm/find-requires)
Executing: /bin/sh -e /usr/src/tmp/rpm-tmp.ycVS8f
find-requires: running scripts (cpp,debuginfo,files,gir-js,gir-python,gir,lib,pam,perl,pkgconfig,pkgconfiglib,python,rpmlib,shebang,shell,static,symlinks,systemd-services,typelib)
/usr/src/tmp/libdbus-tqt-buildroot/usr/include/dbus-1.0/dbus/server.h:26:10: fatal error: tqobject.h: No such file or directory
   26 | #include <tqobject.h>
      |          ^~~~~~~~~~~~
compilation terminated.
cpp.req: /usr/src/tmp/libdbus-tqt-buildroot/usr/include/dbus-1.0/dbus/server.h: cpp failed, trying c++ mode
/usr/src/tmp/libdbus-tqt-buildroot/usr/include/dbus-1.0/dbus/server.h:26:10: fatal error: tqobject.h: No such file or directory
   26 | #include <tqobject.h>
      |          ^~~~~~~~~~~~
compilation terminated.
cpp.req: WARNING: /usr/src/tmp/libdbus-tqt-buildroot/usr/include/dbus-1.0/dbus/server.h: cpp failed
/usr/src/tmp/libdbus-tqt-buildroot/usr/include/dbus-1.0/dbus/message.h:26:10: fatal error: tqvariant.h: No such file or directory
   26 | #include <tqvariant.h>
      |          ^~~~~~~~~~~~~
compilation terminated.
cpp.req: /usr/src/tmp/libdbus-tqt-buildroot/usr/include/dbus-1.0/dbus/message.h: cpp failed, trying c++ mode
/usr/src/tmp/libdbus-tqt-buildroot/usr/include/dbus-1.0/dbus/message.h:26:10: fatal error: tqvariant.h: No such file or directory
   26 | #include <tqvariant.h>
      |          ^~~~~~~~~~~~~
compilation terminated.
cpp.req: WARNING: /usr/src/tmp/libdbus-tqt-buildroot/usr/include/dbus-1.0/dbus/message.h: cpp failed
In file included from /usr/src/tmp/libdbus-tqt-buildroot/usr/include/dbus-1.0/dbus/connection.h:26:
/usr/src/tmp/libdbus-tqt-buildroot/usr/include/dbus-1.0/dbus/message.h:26:10: fatal error: tqvariant.h: No such file or directory
   26 | #include <tqvariant.h>
      |          ^~~~~~~~~~~~~
compilation terminated.
cpp.req: /usr/src/tmp/libdbus-tqt-buildroot/usr/include/dbus-1.0/dbus/connection.h: cpp failed, trying c++ mode
In file included from /usr/src/tmp/libdbus-tqt-buildroot/usr/include/dbus-1.0/dbus/connection.h:26:
/usr/src/tmp/libdbus-tqt-buildroot/usr/include/dbus-1.0/dbus/message.h:26:10: fatal error: tqvariant.h: No such file or directory
   26 | #include <tqvariant.h>
      |          ^~~~~~~~~~~~~
compilation terminated.
cpp.req: WARNING: /usr/src/tmp/libdbus-tqt-buildroot/usr/include/dbus-1.0/dbus/connection.h: cpp failed
Provides: pkgconfig(dbus-tqt) = 0.7
Requires: libdbus-tqt = 3.5.13.2-alt1.1, libdbus-devel >= 0.94, libtqt-devel, /usr/lib/libdbus-tqt-1.so.0, /usr/lib/pkgconfig, pkgconfig(dbus-1)
Finding debuginfo files (using /usr/lib/rpm/find-debuginfo-files)
Executing: /bin/sh -e /usr/src/tmp/rpm-tmp.uXm0Mg
Processing files: libdbus-tqt-debuginfo-3.5.13.2-alt1.1
Finding Provides (using /usr/lib/rpm/find-provides)
Executing: /bin/sh -e /usr/src/tmp/rpm-tmp.Pid6Mg
find-provides: running scripts (debuginfo)
Finding Requires (using /usr/lib/rpm/find-requires)
Executing: /bin/sh -e /usr/src/tmp/rpm-tmp.XQmdMe
find-requires: running scripts (debuginfo)
Provides: debug(libdbus-tqt-1.so.0)
Requires: libdbus-tqt = 3.5.13.2-alt1.1, debug(libc.so.6), debug(libdbus-1.so.3), debug(libgcc_s.so.1), debug(libqt-mt.so.3), debug(libstdc++.so.6)
Removing 1 extra deps from libdbus-tqt-devel due to dependency on libdbus-tqt
Wrote: /usr/src/RPM/RPMS/i586/libdbus-tqt-3.5.13.2-alt1.1.i586.rpm (w2.lzdio)
Wrote: /usr/src/RPM/RPMS/i586/libdbus-tqt-devel-3.5.13.2-alt1.1.i586.rpm (w2.lzdio)
Wrote: /usr/src/RPM/RPMS/i586/libdbus-tqt-debuginfo-3.5.13.2-alt1.1.i586.rpm (w2.lzdio)
6.44user 1.64system 0:13.79elapsed 58%CPU (0avgtext+0avgdata 57740maxresident)k
0inputs+0outputs (0major+491339minor)pagefaults 0swaps
/.out/libdbus-tqt-3.5.13.2-alt1.1.i586.rpm: The use of such a license name is ambiguous: GPL
/.out/libdbus-tqt-3.5.13.2-alt1.1.i586.rpm: license not found in '/usr/share/license' directory: Academic
/.out/libdbus-tqt-3.5.13.2-alt1.1.i586.rpm: license not found in '/usr/share/license' directory: Free
/.out/libdbus-tqt-3.5.13.2-alt1.1.i586.rpm: license not found in '/usr/share/license' directory: License
/.out/libdbus-tqt-devel-3.5.13.2-alt1.1.i586.rpm: The use of such a license name is ambiguous: GPL
/.out/libdbus-tqt-devel-3.5.13.2-alt1.1.i586.rpm: license not found in '/usr/share/license' directory: Academic
/.out/libdbus-tqt-devel-3.5.13.2-alt1.1.i586.rpm: license not found in '/usr/share/license' directory: Free
/.out/libdbus-tqt-devel-3.5.13.2-alt1.1.i586.rpm: license not found in '/usr/share/license' directory: License
/.out/libdbus-tqt-debuginfo-3.5.13.2-alt1.1.i586.rpm: The use of such a license name is ambiguous: GPL
/.out/libdbus-tqt-debuginfo-3.5.13.2-alt1.1.i586.rpm: license not found in '/usr/share/license' directory: Academic
/.out/libdbus-tqt-debuginfo-3.5.13.2-alt1.1.i586.rpm: license not found in '/usr/share/license' directory: Free
/.out/libdbus-tqt-debuginfo-3.5.13.2-alt1.1.i586.rpm: license not found in '/usr/share/license' directory: License
17.85user 5.35system 0:30.48elapsed 76%CPU (0avgtext+0avgdata 107224maxresident)k
25272inputs+0outputs (0major+918258minor)pagefaults 0swaps
--- libdbus-tqt-3.5.13.2-alt1.1.i586.rpm.repo	2015-11-13 00:43:41.000000000 +0000
+++ libdbus-tqt-3.5.13.2-alt1.1.i586.rpm.hasher	2021-04-20 12:22:30.854276380 +0000
@@ -4,4 +4,6 @@
 Requires: libc.so.6(GLIBC_2.1.3)  
-Requires: libdbus-1.so.3 >= set:lf6cSAsZcVGii2WZ4jZoQL2dqH7BKu4diZmZE8JkH9HDJe3jZGOMAOj2YiW0ZBtEWZ9uigA1EeraL4eKZd32MJCtrb0ERNjOBNRySYgWOwa9E5hZfF6xVueqLgfHw0kUbMJDe
+Requires: libc.so.6(GLIBC_2.4)  
+Requires: libdbus-1.so.3 >= set:nhkDECYUZf4d2P6LOyrxeuSRpNGKTJh1m3wZBBu4m6nA0Sw6yJ2BLiSbZ6FGLbIDTKaV79TZq74MYHSYgcOx37PAIQyBZKflNAG0XN9uF9mxgji6Bkii0l8UI8Veh1ijggJBskXytXNrYPHw0kMWDe1
 Requires: rpmlib(SetVersions)  
+Requires: libdbus-1.so.3(LIBDBUS_1_3)  
 Requires: libgcc_s.so.1(GCC_3.0)  
@@ -10,2 +12,3 @@
 Requires: libstdc++.so.6(CXXABI_1.3)  
+Requires: libstdc++.so.6(CXXABI_1.3.9)  
 Requires: libstdc++.so.6(GLIBCXX_3.4)  
@@ -13,3 +16,3 @@
 Requires: rpmlib(PayloadIsLzma)  
-Provides: libdbus-tqt-1.so.0 = set:ldDEVXU6FzZmUJcMa0l8OFRUZDQ6l5WF4S877pCyZzHR1yLjp25P6IG7kUQOXSR0Bl5tKrFAoRGQU3v59DBjDNxV9WZvxdG5kTPlKTMMN2FZhFs3LpihMtPskaYvugnzPXaV1BSRYZCViXJe1IJRLQVYLKEFyJCH67X4OS0yfTAptU8lsmSLXIaldOZatP95zQRhcXOZcyVgr98fMqodJ4rzoGPPkjnazxk6XQT5f5xWJdXq00pT2fubu6pZs2hajJsBQCNg2xszuitpMet26HmZk96Z0DvUETXByJimV8NJ9jZg2v8UYgXU358GS6WCPLaQGAysVQpoe7oG9kMv7lKNkHbPwqMrZp4ZtTwhMByPf4lcsZkRqpHe6pHX4PyBU8Z0ps6434Kr7GInT0oxcdVHrMqe2aC
+Provides: libdbus-tqt-1.so.0 = set:ldDEVXU6FzZmUJcMa0l8OFRUZDQ6l5WF4S877pCyZzHR1yLjp25P6IG7kUQOXSR0Bl5tKrFAoRGQU3v59DBjDNxV9WZvxdG5kTPlKTMMN2FZhFs3LpihMtPskaYvugnzPXaV1BSRYZCViXJe1IJRLQVYLKEFyJCH67X4OS0yfTAptU8lsmSLXIaldOZatP95zQRhcXOZcyVgr98fMqodJ4rzoGPPkjnazxk6XQT5f5xWJdXq0Zh2Sc5uYmYcOYpx8BFmKiqPo8xgKhfFKcoDe13A44zuUY37ZeZ25rBIOhyrjCY1xf4suEtYx24lr3tPVn5qlihKsWccD3cR4aULzaToGRBpgdUdZA2ZKrM8UiNV7ya6evGmbrRN8rtDomI47F7OUc868sTekpLK1M2pqOnTwRs4kc1
 Provides: libdbus-tqt = 3.5.13.2-alt1.1