<86>Mar 11 14:53:41 userdel[98237]: delete user 'rooter'
<86>Mar 11 14:53:41 userdel[98237]: removed group 'rooter' owned by 'rooter'
<86>Mar 11 14:53:41 groupadd[98244]: group added to /etc/group: name=rooter, GID=663
<86>Mar 11 14:53:41 groupadd[98244]: group added to /etc/gshadow: name=rooter
<86>Mar 11 14:53:41 groupadd[98244]: new group: name=rooter, GID=663
<86>Mar 11 14:53:41 useradd[98254]: new user: name=rooter, UID=663, GID=663, home=/root, shell=/bin/bash
<86>Mar 11 14:53:41 userdel[98264]: delete user 'builder'
<86>Mar 11 14:53:41 userdel[98264]: removed group 'builder' owned by 'builder'
<86>Mar 11 14:53:41 userdel[98264]: removed shadow group 'builder' owned by 'builder'
<86>Mar 11 14:53:41 groupadd[98272]: group added to /etc/group: name=builder, GID=664
<86>Mar 11 14:53:41 groupadd[98272]: group added to /etc/gshadow: name=builder
<86>Mar 11 14:53:41 groupadd[98272]: new group: name=builder, GID=664
<86>Mar 11 14:53:41 useradd[98280]: new user: name=builder, UID=664, GID=664, home=/usr/src, shell=/bin/bash
warning: user aris does not exist - using root
warning: group aris does not exist - using root
warning: user aris does not exist - using root
warning: group aris does not exist - using root
warning: Macro %_typelibdir not found
warning: Macro %_girdir not found
<13>Mar 11 14:53:44 rpmi: libwayland-client-1.19.0-alt1 sisyphus+265427.100.1.1 1611852858 installed
<13>Mar 11 14:53:44 rpmi: libexpat-2.2.10-alt1 sisyphus+259966.100.1.1 1602824518 installed
<13>Mar 11 14:53:44 rpmi: libjpeg-2:2.0.6-alt1 sisyphus+266888.100.1.1 1614172387 installed
<13>Mar 11 14:53:44 rpmi: libpng16-1.6.37-alt1 sisyphus+236677.100.2.1 1566917998 installed
<13>Mar 11 14:53:44 rpmi: libogg-1.3.4-alt1 sisyphus+247109.100.1.1 1582849994 installed
<13>Mar 11 14:53:44 rpmi: xorg-proto-devel-2020.1-alt1 sisyphus+250406.100.1.1 1587554810 installed
<13>Mar 11 14:53:44 rpmi: libwebp7-1.2.0-alt1 sisyphus+265504.100.2.1 1612122046 installed
<13>Mar 11 14:53:44 rpmi: libvorbis-1.3.7-alt1 sisyphus+256535.100.1.1 1597965510 installed
<13>Mar 11 14:53:44 rpmi: libwayland-egl-4:18.1.0-alt1 sisyphus+265427.100.1.1 1611852858 installed
<13>Mar 11 14:53:44 rpmi: sgml-common-0.6.3-alt15 1423664786 installed
<13>Mar 11 14:53:44 rpmi: libraw1394-11-2.1.2-alt1 sisyphus+225496.100.2.1 1553244590 installed
<13>Mar 11 14:53:44 rpmi: libopus-1.3.1-alt3 sisyphus+248017.100.1.1 1584520433 installed
<13>Mar 11 14:53:44 rpmi: libopenjpeg2.0-2.4.0-alt1 sisyphus+264173.100.1.1 1609245156 installed
<13>Mar 11 14:53:44 rpmi: libfribidi-1.0.10-alt1 sisyphus+254557.100.1.1 1594020362 installed
<13>Mar 11 14:53:45 rpmi: libsqlite3-3.34.1-alt1 sisyphus+265135.100.1.1 1611333114 installed
<13>Mar 11 14:53:45 rpmi: libgudev-1:234-alt1 sisyphus+258314.700.14.2 1600844807 installed
<13>Mar 11 14:53:45 rpmi: perl-HTTP-Date-6.05-alt1 sisyphus+258981.100.1.1 1601542386 installed
<13>Mar 11 14:53:45 rpmi: libglvnd-7:1.3.2-alt1 sisyphus+254610.100.1.1 1594124268 installed
<13>Mar 11 14:53:45 rpmi: libwayland-server-1.19.0-alt1 sisyphus+265427.100.1.1 1611852858 installed
<13>Mar 11 14:53:46 rpmi: libicu67-1:6.7.1-alt2 sisyphus+252432.100.2.2 1590796126 installed
<13>Mar 11 14:53:46 rpmi: libtheora-2:1.1.1-alt6 sisyphus+223372.100.2.1 1551525762 installed
<13>Mar 11 14:53:46 rpmi: vapi-common-0.50.4-alt1 sisyphus+267164.100.1.1 1614539839 installed
<13>Mar 11 14:53:46 rpmi: libhyphen-2.8.8-alt1 1433702533 installed
<13>Mar 11 14:53:46 rpmi: liborc-0.4.31-alt1 sisyphus+240181.100.1.1 1572853315 installed
<13>Mar 11 14:53:46 rpmi: libserd-0.30.6-alt1_1 sisyphus+263988.100.1.1 1608994290 installed
<13>Mar 11 14:53:46 rpmi: libspeex-1.2-alt1 1528115225 installed
<13>Mar 11 14:53:46 rpmi: libgsm-1.0.17-alt1 1523356165 installed
<13>Mar 11 14:53:46 rpmi: libidn2-2.3.0-alt1 sisyphus+240846.100.1.2 1573870475 installed
<13>Mar 11 14:53:46 rpmi: liblcms2-2.12-alt1 sisyphus+265911.100.2.1 1613037796 installed
<13>Mar 11 14:53:46 rpmi: libusb-1.0.23-alt1 sisyphus+237317.100.1.1 1568059905 installed
<13>Mar 11 14:53:46 rpmi: perl-XML-NamespaceSupport-1.12-alt1 1491296348 installed
<13>Mar 11 14:53:46 rpmi: xml-utils-1:2.9.10-alt6 sisyphus+265234.30740.49.1 1613765060 installed
<13>Mar 11 14:53:46 rpmi: docbook-dtds-4.5-alt1 1223476557 installed
<13>Mar 11 14:53:46 rpmi: libgomp1-10.2.1-alt2 sisyphus+263054.100.3.1 1607510657 installed
<13>Mar 11 14:53:46 rpmi: libp11-kit-0.23.15-alt2 sisyphus+252784.100.2.2 1591274901 installed
<13>Mar 11 14:53:46 rpmi: libtasn1-4.16.0-alt1 sisyphus+245480.100.1.1 1580825062 installed
<13>Mar 11 14:53:46 rpmi: rpm-build-gir-0.7.3-alt3 sisyphus+242150.100.1.1 1575312005 installed
<13>Mar 11 14:53:46 rpmi: libdc1394-22-2.2.5-alt1 1529659263 installed
<13>Mar 11 14:53:46 rpmi: libsord-0.16.6-alt1_1 sisyphus+263990.100.1.3 1608998937 installed
<13>Mar 11 14:53:46 rpmi: libGLES-7:1.3.2-alt1 sisyphus+254610.100.1.1 1594124268 installed
<13>Mar 11 14:53:46 rpmi: libflac8-1.3.3.0.62.ce6d-alt1 sisyphus+262142.100.1.1 1605801639 installed
<13>Mar 11 14:53:46 rpmi: libsndfile-1.0.30-alt2 sisyphus+263035.100.1.1 1607353107 installed
<13>Mar 11 14:53:46 rpmi: libv4l-1.20.0-alt1 sisyphus+252084.100.1.1 1590156518 installed
<13>Mar 11 14:53:46 rpmi: libwayland-cursor-1.19.0-alt1 sisyphus+265427.100.1.1 1611852858 installed
<13>Mar 11 14:53:46 rpmi: zlib-devel-1.2.11-alt1 sisyphus+221902.6000.4.1 1550601058 installed
<13>Mar 11 14:53:46 rpmi: libdv-1.0.0-alt5.7 sisyphus+220898.5400.11.1 1551973592 installed
<13>Mar 11 14:53:46 rpmi: libjack-1:1.9.14-alt1 sisyphus+251263.200.3.1 1588856135 installed
<13>Mar 11 14:53:46 rpmi: libdvdread8-6.1.1-alt3 sisyphus+263774.100.1.3 1608642561 installed
<13>Mar 11 14:53:46 rpmi: ilmbase25-common-2.5.3-alt1 sisyphus+260406.100.1.1 1603706892 installed
<13>Mar 11 14:53:46 rpmi: libiex25-2.5.3-alt1 sisyphus+260406.100.1.1 1603706892 installed
<13>Mar 11 14:53:46 rpmi: libhalf25-2.5.3-alt1 sisyphus+260406.100.1.1 1603706892 installed
<13>Mar 11 14:53:46 rpmi: libzeromq-4.2.3-alt1.qa1 sisyphus+263586.100.2.1 1608213283 installed
<13>Mar 11 14:53:46 rpmi: libbs2b-3.1.0-alt1.3 1327614927 installed
<13>Mar 11 14:53:46 rpmi: libx265-192-3.4-alt1 sisyphus+254160.100.7.1 1593756037 installed
<13>Mar 11 14:53:46 rpmi: libwavpack-5.4.0-alt1 sisyphus+265819.100.1.1 1612485165 installed
<13>Mar 11 14:53:46 rpmi: libvpx6-1.9.0-alt1 sisyphus+259077.100.2.1 1601616092 installed
<13>Mar 11 14:53:46 rpmi: libtwolame-0.4.0-alt1 sisyphus+239176.100.2.1 1571294398 installed
<13>Mar 11 14:53:46 rpmi: liblame-3.100-alt1 1527082574 installed
<13>Mar 11 14:53:46 rpmi: libnspr-1:4.29-alt1 sisyphus+260224.100.2.1 1603548999 installed
<13>Mar 11 14:53:46 rpmi: libxkbcommon-1.1.0-alt1 sisyphus+267202.300.3.1 1615309346 installed
<13>Mar 11 14:53:46 rpmi: libwpe-1.8.0-alt1 sisyphus+258314.3200.14.2 1600847112 installed
<13>Mar 11 14:53:46 rpmi: libepoxy-1.5.5-alt1 sisyphus+263785.100.1.1 1608657815 installed
<13>Mar 11 14:53:46 rpmi: libnettle8-3.7-alt1 sisyphus+265128.100.1.1 1611325151 installed
<13>Mar 11 14:53:46 rpmi: perl-LWP-MediaTypes-6.04-alt1 sisyphus+225468.100.1.1 1553186684 installed
<13>Mar 11 14:53:46 rpmi: perl-Compress-Raw-Zlib-2.101-alt1 sisyphus+266765.100.1.2 1614138847 installed
<13>Mar 11 14:53:46 rpmi: perl-libnet-1:3.13-alt1 sisyphus+266120.100.1.1 1612961310 installed
<13>Mar 11 14:53:46 rpmi: perl-XML-SAX-Base-1.09-alt1 1494364363 installed
<13>Mar 11 14:53:46 rpmi: libbrotlicommon-1.0.9-alt2 sisyphus+257777.100.1.1 1599688017 installed
<13>Mar 11 14:53:46 rpmi: libbrotlidec-1.0.9-alt2 sisyphus+257777.100.1.1 1599688017 installed
<13>Mar 11 14:53:46 rpmi: libgraphite2-1.3.14-alt2 sisyphus+250009.100.1.1 1586943065 installed
<13>Mar 11 14:53:46 rpmi: libharfbuzz-2.6.8-alt1 sisyphus+254028.100.1.1 1593106819 installed
<13>Mar 11 14:53:46 rpmi: libfreetype-2.10.4-alt2 sisyphus+260293.100.2.1 1604479496 installed
<13>Mar 11 14:53:46 rpmi: fontconfig-2.13.1-alt1 sisyphus+257555.100.1.1 1599475160 installed
Updating fonts cache: <29>Mar 11 14:53:47 fontconfig: Updating fonts cache: succeeded
[ DONE ]
<13>Mar 11 14:53:47 rpmi: libass9-0.15.0-alt1 sisyphus+261468.100.1.1 1605022975 installed
<13>Mar 11 14:53:47 rpmi: libharfbuzz-icu-2.6.8-alt1 sisyphus+254028.100.1.1 1593106819 installed
<13>Mar 11 14:53:47 rpmi: libgdbm-1.8.3-alt10 1454943334 installed
<13>Mar 11 14:53:47 rpmi: libglog-0.3.4-alt4 sisyphus+235324.300.2.1 1564663103 installed
<13>Mar 11 14:53:48 rpmi: libopenblas-0.3.9-alt1 sisyphus+238855.200.5.1 1593950422 installed
<13>Mar 11 14:53:48 rpmi: libXau-1.0.9-alt1 sisyphus+223149.200.2.1 1551268152 installed
<13>Mar 11 14:53:48 rpmi: libICE-1.0.10-alt1 sisyphus+247690.100.1.1 1584000387 installed
<13>Mar 11 14:53:48 rpmi: libSM-1.2.3-alt1 sisyphus+226734.100.2.1 1554586158 installed
<13>Mar 11 14:53:48 rpmi: libXau-devel-1.0.9-alt1 sisyphus+223149.200.2.1 1551268152 installed
<13>Mar 11 14:53:48 rpmi: libharfbuzz-gobject-2.6.8-alt1 sisyphus+254028.100.1.1 1593106819 installed
<13>Mar 11 14:53:48 rpmi: libgraphite2-devel-1.3.14-alt2 sisyphus+250009.100.1.1 1586943065 installed
<13>Mar 11 14:53:48 rpmi: libbrotlienc-1.0.9-alt2 sisyphus+257777.100.1.1 1599688017 installed
<13>Mar 11 14:53:48 rpmi: libwoff2-1.0.2-alt2 1516265772 installed
<13>Mar 11 14:53:48 rpmi: libhogweed6-3.7-alt1 sisyphus+265128.100.1.1 1611325151 installed
<13>Mar 11 14:53:48 rpmi: libgnutls30-3.6.15-alt1 sisyphus+257742.200.2.1 1599668978 installed
<13>Mar 11 14:53:48 rpmi: libilmthread25-2.5.3-alt1 sisyphus+260406.100.1.1 1603706892 installed
<13>Mar 11 14:53:48 rpmi: libimath25-2.5.3-alt1 sisyphus+260406.100.1.1 1603706892 installed
<13>Mar 11 14:53:48 rpmi: libdvdnav-6.1.0-alt1 sisyphus+250140.340.10.1 1587543016 installed
<13>Mar 11 14:53:48 rpmi: libpng-devel-1.6.37-alt1 sisyphus+236677.100.2.1 1566917998 installed
<13>Mar 11 14:53:48 rpmi: libsamplerate-0.1.9-alt2 1487790086 installed
<13>Mar 11 14:53:48 rpmi: libinstpatch-1.1.6-alt1 sisyphus+265289.100.1.1 1611651788 installed
<13>Mar 11 14:53:48 rpmi: libsratom-0.6.6-alt1_1 sisyphus+263991.100.1.1 1608994368 installed
<13>Mar 11 14:53:48 rpmi: libvidstab-1.1.0-alt2 sisyphus+247392.100.1.1 1583425859 installed
<13>Mar 11 14:53:48 rpmi: docbook-style-xsl-1.79.1-alt4 sisyphus+232871.100.1.1 1561238010 installed
<13>Mar 11 14:53:48 rpmi: libshout2-2.2.2-alt3 1303374835 installed
<13>Mar 11 14:53:48 rpmi: hyphen-en-2.8.8-alt1 1433702533 installed
<13>Mar 11 14:53:48 rpmi: hyphen-ru-20020727-alt3 1237777990 installed
<13>Mar 11 14:53:48 rpmi: icu-utils-1:6.7.1-alt2 sisyphus+252432.100.2.2 1590796126 installed
<13>Mar 11 14:53:48 rpmi: libicu-devel-1:6.7.1-alt2 sisyphus+252432.100.2.2 1590796126 installed
<13>Mar 11 14:53:48 rpmi: libOpenGL-7:1.3.2-alt1 sisyphus+254610.100.1.1 1594124268 installed
<13>Mar 11 14:53:48 rpmi: perl-File-Listing-6.14-alt1 sisyphus+262735.100.1.1 1606813544 installed
<13>Mar 11 14:53:48 rpmi: libavc1394-0.5.4-alt1.qa1 1460816781 installed
<13>Mar 11 14:53:48 rpmi: libiec61883-1.2.0-alt1.qa1 1460815903 installed
<13>Mar 11 14:53:48 rpmi: wayland-devel-1.19.0-alt1 sisyphus+265427.100.1.1 1611852858 installed
<13>Mar 11 14:53:48 rpmi: libwayland-client-devel-1.19.0-alt1 sisyphus+265427.100.1.1 1611852858 installed
<13>Mar 11 14:53:48 rpmi: libxml2-devel-1:2.9.10-alt6 sisyphus+265234.30740.49.1 1613765060 installed
<13>Mar 11 14:53:48 rpmi: rpm-build-vala-0.3-alt1 1332324961 installed
<13>Mar 11 14:53:48 rpmi: libhunspell-1.7.0-alt1 sisyphus+226731.100.2.1 1554585904 installed
<13>Mar 11 14:53:48 rpmi: libaspell-0.60.8-alt1 sisyphus+261820.100.1.1 1605516706 installed
<13>Mar 11 14:53:48 rpmi: libenchant2-2.2.15-alt1 sisyphus+263802.100.1.1 1608717788 installed
<13>Mar 11 14:53:48 rpmi: libOpenSP-1.5.2-alt3.qa1 1365943435 installed
<13>Mar 11 14:53:48 rpmi: openjade-1.3.2-alt15 sisyphus+219815.100.1.1 1548167857 installed
<13>Mar 11 14:53:49 rpmi: docbook-style-dsssl-1.79-alt3 1324062818 installed
<13>Mar 11 14:53:49 rpmi: python-modules-curses-2.7.18-alt4 sisyphus+266950.200.2.1 1614241383 installed
<13>Mar 11 14:53:49 rpmi: libtag-1.11.1-alt1 1479892963 installed
<13>Mar 11 14:53:49 rpmi: libmpg123-1.26.4-alt1 sisyphus+263850.100.1.1 1608818760 installed
<13>Mar 11 14:53:49 rpmi: libvisual0.4-0.4.0-alt3 1301290260 installed
<13>Mar 11 14:53:49 rpmi: libgraphene-1.10.4-alt1 sisyphus+266412.100.2.1 1613489233 installed
<13>Mar 11 14:53:49 rpmi: libcdparanoia-1:10.2-alt6 sisyphus+263561.300.9.1 1608157616 installed
<13>Mar 11 14:53:49 rpmi: libwebrtc-0.3-alt2 sisyphus+229377.100.1.1 1557873871 installed
<13>Mar 11 14:53:49 rpmi: libvo-amrwbenc-0.1.3-alt1 1465493713 installed
<13>Mar 11 14:53:49 rpmi: libvo-aacenc-0.1.3-alt1 1393497440 installed
<13>Mar 11 14:53:49 rpmi: libsrtp2-2.2.0-alt1 sisyphus+222652.100.1.1 1550888860 installed
<13>Mar 11 14:53:49 rpmi: libsbc-1.2-alt1.1 1501780340 installed
<13>Mar 11 14:53:49 rpmi: libtbb-2020.3-alt1 sisyphus+265234.21300.49.1 1613757361 installed
<13>Mar 11 14:53:49 rpmi: libprotobuf25-3.14.0-alt1 sisyphus+265234.52200.49.1 1613797603 installed
<13>Mar 11 14:53:49 rpmi: libgflags-2.2.2-alt1 sisyphus+235324.400.2.1 1564663147 installed
<13>Mar 11 14:53:49 rpmi: libmodplug-0.8.9.0-alt1 sisyphus+224334.100.1.1 1552243563 installed
<13>Mar 11 14:53:49 rpmi: libmms-0.6.4-alt1 1409679935 installed
<13>Mar 11 14:53:49 rpmi: libyajl-2.1.0-alt1 1399891591 installed
<13>Mar 11 14:53:49 rpmi: libkate-0.4.1-alt1.5 sisyphus+252782.100.1.1 1591254121 installed
<13>Mar 11 14:53:49 rpmi: libasyncns-0.8-alt2.qa1 1365949820 installed
<13>Mar 11 14:53:49 rpmi: liblash-1:0.5.4-alt1_43 sisyphus+262408.100.1.1 1606230353 installed
<13>Mar 11 14:53:49 rpmi: libSDL2-2.0.14-alt2 sisyphus+264412.100.1.1 1610114592 installed
<13>Mar 11 14:53:49 rpmi: libfaad2-2.10.0-alt1 sisyphus+265897.300.3.1 1612640210 installed
<13>Mar 11 14:53:49 rpmi: libdca0-0.0.5-alt4.qa1 sisyphus+222535.100.1.1 1550881649 installed
<13>Mar 11 14:53:49 rpmi: publicsuffix-list-dafsa-20210121-alt1 sisyphus+265129.100.1.1 1611325490 installed
<13>Mar 11 14:53:49 rpmi: libpsl-0.21.1-alt1 sisyphus+255206.100.1.1 1595348938 installed
<13>Mar 11 14:53:49 rpmi: libnghttp2-1.41.0-alt1 sisyphus+253680.100.1.1 1592642271 installed
<13>Mar 11 14:53:49 rpmi: openldap-common-2.4.57-alt1 sisyphus+266287.100.1.1 1613244218 installed
<13>Mar 11 14:53:49 rpmi: libsoundtouch-2.2-alt1 sisyphus+260490.100.1.1 1603791233 installed
<13>Mar 11 14:53:49 rpmi: openexr25-common-2.5.3-alt1 sisyphus+260406.200.2.1 1603719730 installed
<13>Mar 11 14:53:49 rpmi: libilmimf25-2.5.3-alt1 sisyphus+260406.200.2.1 1603719730 installed
<13>Mar 11 14:53:49 rpmi: libverto-0.3.1-alt1_2 sisyphus+265276.100.1.1 1611604625 installed
<13>Mar 11 14:53:49 rpmi: liblmdb-0.9.23-alt1 sisyphus+225277.100.2.1 1553001679 installed
<13>Mar 11 14:53:49 rpmi: libkeyutils-1.6.3-alt1 sisyphus+266061.100.1.1 1612919567 installed
<13>Mar 11 14:53:49 rpmi: libcom_err-1.45.6.0.24.af1a-alt1 sisyphus+262279.100.1.1 1606088229 installed
<13>Mar 11 14:53:49 rpmi: libgme-0.6.1-alt1 1521318055 installed
<13>Mar 11 14:53:49 rpmi: libudfread-1.1.1-alt1 sisyphus+262690.100.1.1 1606726456 installed
<13>Mar 11 14:53:49 rpmi: libbluray-1.2.1-alt1 sisyphus+265293.100.1.1 1611656206 installed
<13>Mar 11 14:53:49 rpmi: libfftw3-common-3.3.8-alt1 sisyphus+247390.100.1.1 1583426835 installed
<13>Mar 11 14:53:49 rpmi: libfftw3-3.3.8-alt1 sisyphus+247390.100.1.1 1583426459 installed
<13>Mar 11 14:53:49 rpmi: librubberband-1.8.1-alt1.hg20140905.1 1434271537 installed
<13>Mar 11 14:53:49 rpmi: libofa-0.9.3-alt4.1.qa3 1506957671 installed
<13>Mar 11 14:53:49 rpmi: lv2-1.18.0-alt1_1 sisyphus+262063.100.1.1 1605717083 installed
<13>Mar 11 14:53:49 rpmi: liblilv-0.24.10-alt1_1 sisyphus+263980.100.1.1 1608993666 installed
<13>Mar 11 14:53:49 rpmi: liblensfun-0.3.2-alt5 sisyphus+250060.100.1.1 1587032796 installed
<13>Mar 11 14:53:49 rpmi: vulkan-filesystem-1.2.152-alt1 sisyphus+257666.300.3.1 1599632436 installed
<13>Mar 11 14:53:49 rpmi: libvulkan1-1.2.152-alt1 sisyphus+257666.300.3.1 1599632437 installed
<13>Mar 11 14:53:50 rpmi: libsoxr-0.1.2-alt4 sisyphus+222649.100.1.1 1550964843 installed
<13>Mar 11 14:53:50 rpmi: libxvid-1.3.4-alt1 1507033991 installed
<13>Mar 11 14:53:50 rpmi: libx264-148-alt2 1496163832 installed
<13>Mar 11 14:53:50 rpmi: libsnappy-1.1.7-alt1 sisyphus+227320.100.1.3 1555618694 installed
<13>Mar 11 14:53:50 rpmi: libopencore-amrwb0-0.1.5-alt1 1529659346 installed
<13>Mar 11 14:53:50 rpmi: libopencore-amrnb0-0.1.5-alt1 1529659346 installed
<13>Mar 11 14:53:50 rpmi: libdav1d-0.5.2-alt1 sisyphus+245080.100.1.1 1580063364 installed
<13>Mar 11 14:53:50 rpmi: libcodec2-0.9.2-alt1 sisyphus+254267.100.1.1 1593522407 installed
<13>Mar 11 14:53:50 rpmi: libaom2-2.0.1-alt1 sisyphus+265247.100.1.1 1611584743 installed
<13>Mar 11 14:53:50 rpmi: python-sphinx-objects.inv-1:2.3.10.20210211-alt1 sisyphus+266318.100.1.1 1613345682 installed
<13>Mar 11 14:53:50 rpmi: libffi-devel-1:3.3-alt1 sisyphus+251953.40.2.1 1589891229 installed
<13>Mar 11 14:53:50 rpmi: libproxy-0.4.17-alt1 sisyphus+264902.100.1.1 1611078502 installed
<13>Mar 11 14:53:50 rpmi: libjson-c5-0.15-alt1 sisyphus+264955.100.1.1 1611154879 installed
<13>Mar 11 14:53:50 rpmi: libCharLS2-2.0.0-alt1_3 sisyphus+246862.100.1.1 1582570533 installed
<13>Mar 11 14:53:50 rpmi: libdatrie-0.2.9-alt1_6 1511686676 installed
<13>Mar 11 14:53:50 rpmi: libthai-0.1.28-alt1_1 sisyphus+226107.100.1.1 1554123079 installed
<13>Mar 11 14:53:50 rpmi: libjbig-2.1-alt1 1401380926 installed
<13>Mar 11 14:53:50 rpmi: libtiff5-4.2.0-alt1 sisyphus+266365.100.2.1 1613478695 installed
<13>Mar 11 14:53:50 rpmi: libgdk-pixbuf-locales-2.42.2-alt1 sisyphus+263074.100.1.1 1607428070 installed
<13>Mar 11 14:53:50 rpmi: udev-rules-1:247.3-alt2 sisyphus+266129.100.1.3 1613012524 installed
<13>Mar 11 14:53:50 rpmi: gtk+3-themes-incompatible-3.20-alt3 1461944560 installed
<13>Mar 11 14:53:50 rpmi: perl-Try-Tiny-0.30-alt1 1514318058 installed
<13>Mar 11 14:53:50 rpmi: perl-IO-Socket-IP-0.41-alt1 sisyphus+259012.100.1.2 1601553446 installed
<13>Mar 11 14:53:50 rpmi: perl-Compress-Raw-Bzip2-2.101-alt1 sisyphus+266764.100.1.2 1614138565 installed
<13>Mar 11 14:53:50 rpmi: perl-HTML-Tagset-3.20-alt2 1317725093 installed
<13>Mar 11 14:53:50 rpmi: perl-Term-ANSIColor-5.01-alt1 sisyphus+244783.100.1.2 1579747505 installed
<13>Mar 11 14:53:50 rpmi: perl-Data-Dump-1.23-alt1 1444601978 installed
<13>Mar 11 14:53:50 rpmi: perl-Filter-1.60-alt1 sisyphus+258375.300.14.2 1600904226 installed
<13>Mar 11 14:53:50 rpmi: perl-Encode-3.08-alt1 sisyphus+263440.100.1.1 1607955886 installed
<13>Mar 11 14:53:50 rpmi: perl-URI-5.09-alt1 sisyphus+267398.100.1.1 1614944505 installed
<13>Mar 11 14:53:50 rpmi: perl-IO-Compress-2.102-alt1 sisyphus+267295.100.1.1 1614764488 installed
<13>Mar 11 14:53:50 rpmi: perl-Net-HTTP-6.20-alt1 sisyphus+264543.100.1.2 1610433051 installed
<13>Mar 11 14:53:50 rpmi: perl-HTML-Parser-3.76-alt1 sisyphus+267397.100.1.3 1614945689 installed
<13>Mar 11 14:53:50 rpmi: perl-WWW-RobotRules-6.02-alt1 1329756211 installed
<13>Mar 11 14:53:50 rpmi: perl-Encode-Locale-1.05-alt1 1444608613 installed
<13>Mar 11 14:53:50 rpmi: perl-IO-HTML-1.004-alt1 sisyphus+258983.100.1.1 1601542619 installed
<13>Mar 11 14:53:50 rpmi: perl-HTTP-Message-6.29-alt1 sisyphus+267426.100.1.1 1615033749 installed
<13>Mar 11 14:53:50 rpmi: perl-HTTP-Cookies-6.10-alt1 sisyphus+264349.100.1.1 1609891183 installed
<13>Mar 11 14:53:50 rpmi: perl-HTTP-Negotiate-6.01-alt1 1329760563 installed
<13>Mar 11 14:53:50 rpmi: perl-libwww-6.52-alt1 sisyphus+264541.100.1.3 1610434036 installed
<13>Mar 11 14:53:50 rpmi: perl-XML-LibXML-2.0206-alt1 sisyphus+263441.100.1.1 1607955961 installed
<13>Mar 11 14:53:50 rpmi: perl-XML-SAX-1.02-alt1 sisyphus+232322.100.1.1 1560758406 installed
<13>Mar 11 14:53:50 rpmi: perl-XML-Simple-2.25-alt2 sisyphus+257498.100.1.1 1599324034 installed
<13>Mar 11 14:53:50 rpmi: icon-naming-utils-0.8.90-alt1 1236573102 installed
<13>Mar 11 14:53:51 rpmi: icon-theme-adwaita-3.38.0-alt1 sisyphus+258314.1700.14.2 1600844421 installed
<13>Mar 11 14:53:51 rpmi: perl-XML-Parser-2.46-alt1 sisyphus+263451.100.1.1 1607958574 installed
<13>Mar 11 14:53:51 rpmi: libpixman-3:0.40.0-alt1 sisyphus+250700.100.1.1 1587971055 installed
<13>Mar 11 14:53:51 rpmi: libxshmfence-1.3-alt1 sisyphus+223149.1000.2.1 1551268571 installed
<13>Mar 11 14:53:51 rpmi: libpciaccess-1:0.16-alt1 sisyphus+234814.100.1.1 1563438291 installed
<13>Mar 11 14:53:51 rpmi: libdrm-1:2.4.104-alt1 sisyphus+264662.100.1.1 1610612753 installed
<13>Mar 11 14:53:51 rpmi: libgbm-4:20.3.4-alt1 sisyphus+265564.100.1.1 1612163514 installed
<13>Mar 11 14:53:51 rpmi: libmetis-5.1.0-alt2 sisyphus+258189.100.1.1 1600298684 installed
<13>Mar 11 14:53:51 rpmi: libxblas-1.0.248-alt1.3 sisyphus+229150.100.1.1 1557388786 installed
<13>Mar 11 14:53:51 rpmi: libquadmath0-10.2.1-alt2 sisyphus+263054.100.3.1 1607510657 installed
<13>Mar 11 14:53:51 rpmi: libgfortran5-10.2.1-alt2 sisyphus+263054.100.3.1 1607510657 installed
<13>Mar 11 14:53:51 rpmi: liblapack-1:3.8.0-alt4 sisyphus+264284.100.1.1 1609587717 installed
<13>Mar 11 14:53:51 rpmi: libblas3gf-3.9.2-alt2 sisyphus+243053.200.1.1 1576493497 installed
<13>Mar 11 14:53:53 rpmi: libsuitesparse-5.8.1-alt1 sisyphus+265367.40.4.1 1613485270 installed
<13>Mar 11 14:53:53 rpmi: ceres-solver-2.0.0-alt1_4 sisyphus+267125.100.1.1 1614470496 installed
<13>Mar 11 14:53:53 rpmi: bubblewrap-0.4.1-alt2 sisyphus+251987.200.3.1 1589970076 installed
<13>Mar 11 14:53:53 rpmi: libatk-locales-2.36.0-alt1 sisyphus+249208.100.1.1 1585840405 installed
<13>Mar 11 14:53:53 rpmi: libatk-2.36.0-alt1 sisyphus+249208.100.1.1 1585840406 installed
<13>Mar 11 14:53:53 rpmi: shared-mime-info-2.1-alt1 sisyphus+264261.100.1.1 1609507723 installed
<13>Mar 11 14:53:53 rpmi: gsettings-desktop-schemas-data-3.38.0-alt1 sisyphus+258314.500.14.2 1600843028 installed
<13>Mar 11 14:53:53 rpmi: libgio-2.66.7-alt1 sisyphus+265234.43160.49.1 1613777318 installed
<13>Mar 11 14:53:53 rpmi: gsettings-desktop-schemas-3.38.0-alt1 sisyphus+258314.500.14.2 1600843530 installed
<13>Mar 11 14:53:53 rpmi: libgdk-pixbuf-2.42.2-alt1 sisyphus+263074.100.1.1 1607428069 installed
<13>Mar 11 14:53:53 rpmi: libgstreamer1.0-1.18.3-alt1 sisyphus+264668.100.1.3 1610658938 installed
<13>Mar 11 14:53:53 rpmi: gobject-introspection-1.66.1-alt1 sisyphus+265234.31700.49.1 1613765999 installed
<13>Mar 11 14:53:53 rpmi: libjson-glib-1.6.2-alt1 sisyphus+266194.200.1.1 1613062152 installed
<13>Mar 11 14:53:53 rpmi: libgstreamer1.0-gir-1.18.3-alt1 sisyphus+264668.100.1.3 1610658938 installed
<13>Mar 11 14:53:53 rpmi: gstreamer1.0-1.18.3-alt1 sisyphus+264668.100.1.3 1610658938 installed
<13>Mar 11 14:53:53 rpmi: libgusb-0.3.5-alt1 sisyphus+255577.100.1.1 1596150494 installed
<13>Mar 11 14:53:53 rpmi: libcolord-1.4.5-alt2 sisyphus+264292.100.1.1 1609619010 installed
<13>Mar 11 14:53:53 rpmi: libjson-glib-gir-1.6.2-alt1 sisyphus+266194.200.1.1 1613062152 installed
<13>Mar 11 14:53:53 rpmi: gobject-introspection-x11-1.66.1-alt1 sisyphus+265234.31700.49.1 1613765999 installed
<13>Mar 11 14:53:53 rpmi: gtk-update-icon-cache-3.24.26-alt1 sisyphus+266853.200.1.2 1614175345 installed
<13>Mar 11 14:53:53 rpmi: libnotify-0.7.9-alt1 sisyphus+247235.100.1.1 1583225654 installed
<13>Mar 11 14:53:53 rpmi: libdconf-0.38.0-alt1 sisyphus+258314.1000.14.2 1600844866 installed
<13>Mar 11 14:53:53 rpmi: xdg-dbus-proxy-0.1.2-alt1 sisyphus+238155.1300.2.1 1569408927 installed
<13>Mar 11 14:53:53 rpmi: libwpebackend-fdo-1.8.0-alt1 sisyphus+258314.3300.14.2 1600847158 installed
<13>Mar 11 14:53:53 rpmi: liblz4-1:1.9.3-alt1 sisyphus+262305.100.1.1 1606099167 installed
<13>Mar 11 14:53:53 rpmi: libgpg-error-1.41-alt4 sisyphus+264254.200.1.1 1609440111 installed
<13>Mar 11 14:53:53 rpmi: libgcrypt20-1.9.2-alt1 sisyphus+266496.100.1.1 1613559234 installed
<13>Mar 11 14:53:53 rpmi: libsystemd-1:247.3-alt2 sisyphus+266129.100.1.3 1613012672 installed
<13>Mar 11 14:53:53 rpmi: libdbus-1.12.18-alt1 sisyphus+252758.100.1.1 1591203693 installed
<13>Mar 11 14:53:53 rpmi: libxslt-1.1.34-alt2 sisyphus+248264.100.1.1 1584829770 installed
<13>Mar 11 14:53:54 rpmi: libjavascriptcoregtk4-2.30.5-alt1 sisyphus+266194.300.1.1 1613063279 installed
<13>Mar 11 14:53:54 rpmi: libsecret-0.20.4-alt1 sisyphus+260275.100.1.1 1603507764 installed
<13>Mar 11 14:53:54 rpmi: xsltproc-1.1.34-alt2 sisyphus+248264.100.1.1 1584829770 installed
<13>Mar 11 14:53:54 rpmi: dbus-tools-1.12.18-alt1 sisyphus+252758.100.1.1 1591203693 installed
<86>Mar 11 14:53:54 groupadd[137581]: group added to /etc/group: name=messagebus, GID=499
<86>Mar 11 14:53:54 groupadd[137581]: group added to /etc/gshadow: name=messagebus
<86>Mar 11 14:53:54 groupadd[137581]: new group: name=messagebus, GID=499
<86>Mar 11 14:53:54 useradd[137601]: new user: name=messagebus, UID=499, GID=499, home=/run/dbus, shell=/dev/null
<13>Mar 11 14:53:54 rpmi: dbus-1.12.18-alt1 sisyphus+252758.100.1.1 1591203693 installed
<13>Mar 11 14:53:54 rpmi: dconf-0.38.0-alt1 sisyphus+258314.1000.14.2 1600844866 installed
<13>Mar 11 14:53:54 rpmi: libgtk+3-schemas-3.24.26-alt1 sisyphus+266853.200.1.2 1614175298 installed
<13>Mar 11 14:53:54 rpmi: libavahi-0.8-alt1 sisyphus+255349.240.4.1 1595604514 installed
<13>Mar 11 14:53:54 rpmi: libcups-2.3.3-alt1 sisyphus+265411.100.1.1 1611832621 installed
<13>Mar 11 14:53:54 rpmi: libpolkit-0.118-alt2 sisyphus+263041.200.3.1 1611694165 installed
<86>Mar 11 14:53:54 groupadd[138134]: group added to /etc/group: name=colord, GID=498
<86>Mar 11 14:53:54 groupadd[138134]: group added to /etc/gshadow: name=colord
<86>Mar 11 14:53:54 groupadd[138134]: new group: name=colord, GID=498
<86>Mar 11 14:53:54 useradd[138146]: new user: name=colord, UID=498, GID=498, home=/var/colord, shell=/dev/null
<13>Mar 11 14:53:54 rpmi: colord-1.4.5-alt2 sisyphus+264292.100.1.1 1609619010 installed
<13>Mar 11 14:53:54 rpmi: libX11-locales-3:1.7.0-alt1 sisyphus+264667.100.1.2 1610655150 installed
<13>Mar 11 14:53:54 rpmi: libXdmcp-1.1.3-alt1 sisyphus+225206.600.1.2 1552949353 installed
<13>Mar 11 14:53:54 rpmi: libxcb-1.14-alt1 sisyphus+247358.200.1.3 1583854228 installed
<13>Mar 11 14:53:54 rpmi: libX11-3:1.7.0-alt1 sisyphus+264667.100.1.2 1610655170 installed
<13>Mar 11 14:53:54 rpmi: libXext-1.3.4-alt1 sisyphus+225206.700.1.2 1552949429 installed
<13>Mar 11 14:53:54 rpmi: libXrender-0.9.10-alt1 sisyphus+261890.100.1.1 1605595177 installed
<13>Mar 11 14:53:54 rpmi: libXfixes-5.0.3-alt1 sisyphus+226736.100.2.2 1554614841 installed
<13>Mar 11 14:53:54 rpmi: libXdamage-1.1.5-alt1 sisyphus+225206.500.1.2 1552949286 installed
<13>Mar 11 14:53:54 rpmi: libpulseaudio-14.2-alt1 sisyphus+265609.100.1.1 1612188821 installed
<13>Mar 11 14:53:54 rpmi: libXrandr-1.5.2-alt1 sisyphus+225206.1300.1.2 1552949710 installed
<13>Mar 11 14:53:54 rpmi: libXft-2.3.3-alt1 sisyphus+225206.1000.3.2 1552987708 installed
<13>Mar 11 14:53:54 rpmi: libXv-1.0.11-alt1 1527685499 installed
<13>Mar 11 14:53:54 rpmi: libat-spi2-core-2.38.0-alt1 sisyphus+258314.1440.14.2 1600845165 installed
<13>Mar 11 14:53:54 rpmi: libXcomposite-0.4.5-alt1 sisyphus+225206.300.1.2 1552949137 installed
<13>Mar 11 14:53:56 rpmi: libxcb-devel-1.14-alt1 sisyphus+247358.200.1.3 1583854228 installed
<13>Mar 11 14:53:56 rpmi: libX11-devel-3:1.7.0-alt1 sisyphus+264667.100.1.2 1610655170 installed
<13>Mar 11 14:53:56 rpmi: libXrender-devel-0.9.10-alt1 sisyphus+261890.100.1.1 1605595177 installed
<13>Mar 11 14:53:56 rpmi: libXext-devel-1.3.4-alt1 sisyphus+225206.700.1.2 1552949429 installed
<13>Mar 11 14:53:56 rpmi: libzbar-0.23.1-alt2 sisyphus+267015.2700.7.1 1614786371 installed
<13>Mar 11 14:53:56 rpmi: libXcursor-1.2.0-alt1 sisyphus+225206.400.1.2 1552949218 installed
<13>Mar 11 14:53:56 rpmi: libXtst-1.2.3-alt1 sisyphus+261890.200.1.1 1605595243 installed
<13>Mar 11 14:53:56 rpmi: libXxf86vm-1.1.4-alt2 1527672187 installed
<13>Mar 11 14:53:56 rpmi: libGLX-mesa-4:20.3.4-alt1 sisyphus+265564.100.1.1 1612163514 installed
<13>Mar 11 14:53:56 rpmi: libEGL-mesa-4:20.3.4-alt1 sisyphus+265564.100.1.1 1612163514 installed
<13>Mar 11 14:53:56 rpmi: libEGL-7:1.3.2-alt1 sisyphus+254610.100.1.1 1594124268 installed
<13>Mar 11 14:53:56 rpmi: libGLX-7:1.3.2-alt1 sisyphus+254610.100.1.1 1594124268 installed
<13>Mar 11 14:53:56 rpmi: libGL-7:1.3.2-alt1 sisyphus+254610.100.1.1 1594124268 installed
<13>Mar 11 14:53:56 rpmi: libcairo-1:1.16.0-alt1 sisyphus+226534.100.2.3 1554515535 installed
<13>Mar 11 14:53:56 rpmi: libpango-1.48.2-alt1 sisyphus+266169.100.1.1 1613030898 installed
<13>Mar 11 14:53:56 rpmi: libgst-plugins1.0-1.18.3-alt1 sisyphus+264668.200.1.3 1610659084 installed
<13>Mar 11 14:53:56 rpmi: libcairo-gobject-1:1.16.0-alt1 sisyphus+226534.100.2.3 1554515535 installed
<13>Mar 11 14:53:56 rpmi: libva-2.10.0-alt1 sisyphus+264299.100.1.1 1609662719 installed
<13>Mar 11 14:53:56 rpmi: libglvnd-devel-7:1.3.2-alt1 sisyphus+254610.100.1.1 1594124268 installed
<13>Mar 11 14:53:57 rpmi: librsvg-1:2.50.3-alt1 sisyphus+265438.100.1.1 1611858650 installed
<13>Mar 11 14:53:57 rpmi: libEGL-devel-4:20.3.4-alt1 sisyphus+265564.100.1.1 1612163514 installed
<13>Mar 11 14:53:57 rpmi: libGL-devel-4:20.3.4-alt1 sisyphus+265564.100.1.1 1612163514 installed
<13>Mar 11 14:53:57 rpmi: libgst-plugins1.0-gir-1.18.3-alt1 sisyphus+264668.200.1.3 1610659084 installed
<13>Mar 11 14:53:57 rpmi: libXi-1.7.10-alt1 sisyphus+232786.300.1.1 1561106978 installed
<13>Mar 11 14:53:57 rpmi: libXinerama-1.1.4-alt1 sisyphus+223149.300.2.1 1551268216 installed
<13>Mar 11 14:53:57 rpmi: libvdpau-1:1.4-alt1 sisyphus+258594.100.1.1 1600934674 installed
<13>Mar 11 14:53:57 rpmi: libavutil56-2:4.3.1-alt5 sisyphus+266524.100.2.1 1614598766 installed
<13>Mar 11 14:53:57 rpmi: libswscale5-2:4.3.1-alt5 sisyphus+266524.100.2.1 1614598766 installed
<13>Mar 11 14:53:57 rpmi: libswresample3-2:4.3.1-alt5 sisyphus+266524.100.2.1 1614598766 installed
<13>Mar 11 14:53:57 rpmi: libpostproc55-2:4.3.1-alt5 sisyphus+266524.100.2.1 1614598766 installed
<13>Mar 11 14:53:57 rpmi: libavresample4-2:4.3.1-alt5 sisyphus+266524.100.2.1 1614598766 installed
<13>Mar 11 14:53:57 rpmi: dbus-tools-gui-1.12.18-alt1 sisyphus+252758.100.1.1 1591203693 installed
<13>Mar 11 14:53:57 rpmi: at-spi2-core-2.38.0-alt1 sisyphus+258314.1440.14.2 1600845165 installed
<13>Mar 11 14:53:57 rpmi: at-spi2-atk-2.38.0-alt1 sisyphus+258314.1500.14.2 1600845211 installed
<13>Mar 11 14:53:57 rpmi: libgtk+3-3.24.26-alt1 sisyphus+266853.200.1.2 1614175345 installed
<13>Mar 11 14:53:57 rpmi: gcr-libs-3.38.1-alt1 sisyphus+264603.100.1.1 1610514321 installed
<13>Mar 11 14:53:57 rpmi: libzvbi-0.2.35-alt2 sisyphus+254029.100.2.1 1593111433 installed
<13>Mar 11 14:53:58 rpmi: libavcodec58-2:4.3.1-alt5 sisyphus+266524.100.2.1 1614598766 installed
<13>Mar 11 14:53:58 rpmi: libchromaprint1-1.5.0-alt1 sisyphus+264630.100.1.1 1610541944 installed
<13>Mar 11 14:53:58 rpmi: rpm-macros-alternatives-0.5.1-alt1 sisyphus+226946.100.1.1 1554830426 installed
<13>Mar 11 14:53:58 rpmi: alternatives-0.5.1-alt1 sisyphus+226946.100.1.1 1554830426 installed
<13>Mar 11 14:53:58 rpmi: ca-certificates-2021.01.27-alt1 sisyphus+265371.200.1.1 1611759824 installed
<13>Mar 11 14:53:58 rpmi: ca-trust-0.1.2-alt1 sisyphus+233348.100.1.1 1561653823 installed
<13>Mar 11 14:53:58 rpmi: p11-kit-trust-0.23.15-alt2 sisyphus+252784.100.2.2 1591274901 installed
<13>Mar 11 14:53:58 rpmi: libcrypto1.1-1.1.1i-alt3 sisyphus+265605.200.2.1 1612202596 installed
<13>Mar 11 14:53:58 rpmi: libssl1.1-1.1.1i-alt3 sisyphus+265605.200.2.1 1612202596 installed
<13>Mar 11 14:53:58 rpmi: libpython3-3.9.2-alt1 sisyphus+267062.100.1.1 1614381721 installed
<13>Mar 11 14:53:58 rpmi: python3-3.9.2-alt1 sisyphus+267062.100.1.1 1614381721 installed
<13>Mar 11 14:53:59 rpmi: python3-base-3.9.2-alt1 sisyphus+267062.100.1.1 1614381721 installed
<13>Mar 11 14:54:00 rpmi: glib2-devel-2.66.7-alt1 sisyphus+265234.43160.49.1 1613777318 installed
<13>Mar 11 14:54:00 rpmi: python3-module-pkg_resources-1:46.1.3-alt2 sisyphus+260458.600.6.1 1603876498 installed
<13>Mar 11 14:54:00 rpmi: python-modules-compiler-2.7.18-alt4 sisyphus+266950.200.2.1 1614241383 installed
<13>Mar 11 14:54:00 rpmi: python-modules-email-2.7.18-alt4 sisyphus+266950.200.2.1 1614241383 installed
<13>Mar 11 14:54:00 rpmi: python-modules-unittest-2.7.18-alt4 sisyphus+266950.200.2.1 1614241383 installed
<13>Mar 11 14:54:00 rpmi: python-modules-encodings-2.7.18-alt4 sisyphus+266950.200.2.1 1614241383 installed
<13>Mar 11 14:54:00 rpmi: python-modules-2.7.18-alt4 sisyphus+266950.200.2.1 1614241383 installed
<13>Mar 11 14:54:00 rpmi: libgio-devel-2.66.7-alt1 sisyphus+265234.43160.49.1 1613777318 installed
<13>Mar 11 14:54:00 rpmi: python3-module-six-1.15.0-alt1 sisyphus+255738.100.2.1 1596527214 installed
<86>Mar 11 14:54:00 groupadd[150560]: group added to /etc/group: name=_keytab, GID=497
<86>Mar 11 14:54:00 groupadd[150560]: group added to /etc/gshadow: name=_keytab
<86>Mar 11 14:54:00 groupadd[150560]: new group: name=_keytab, GID=497
<13>Mar 11 14:54:00 rpmi: libkrb5-1.19.1-alt1 sisyphus+266617.100.2.2 1614603178 installed
<13>Mar 11 14:54:00 rpmi: libfreetype-devel-2.10.4-alt2 sisyphus+260293.100.2.1 1604479496 installed
<13>Mar 11 14:54:00 rpmi: libharfbuzz-devel-2.6.8-alt1 sisyphus+254028.100.1.1 1593106819 installed
<13>Mar 11 14:54:00 rpmi: fontconfig-devel-2.13.1-alt1 sisyphus+257555.100.1.1 1599475160 installed
<13>Mar 11 14:54:00 rpmi: libcairo-devel-1:1.16.0-alt1 sisyphus+226534.100.2.3 1554515535 installed
<13>Mar 11 14:54:00 rpmi: libcairo-gobject-devel-1:1.16.0-alt1 sisyphus+226534.100.2.3 1554515535 installed
<13>Mar 11 14:54:00 rpmi: libXft-devel-2.3.3-alt1 sisyphus+225206.1000.3.2 1552987708 installed
<13>Mar 11 14:54:00 rpmi: libpango-devel-1.48.2-alt1 sisyphus+266169.100.1.1 1613030898 installed
<13>Mar 11 14:54:00 rpmi: libssh-0.9.3-alt2 sisyphus+247315.100.1.2 1583840783 installed
<86>Mar 11 14:54:00 groupadd[152114]: group added to /etc/group: name=sasl, GID=496
<86>Mar 11 14:54:00 groupadd[152114]: group added to /etc/gshadow: name=sasl
<86>Mar 11 14:54:00 groupadd[152114]: new group: name=sasl, GID=496
<13>Mar 11 14:54:00 rpmi: libsasl2-3-2.1.27-alt2.1 sisyphus+255909.100.2.1 1597199456 installed
<13>Mar 11 14:54:00 rpmi: libldap-2.4.57-alt1 sisyphus+266287.100.1.1 1613244306 installed
<13>Mar 11 14:54:01 rpmi: libcurl-7.75.0-alt1 sisyphus+266959.100.1.1 1614250021 installed
<13>Mar 11 14:54:01 rpmi: libraptor2-2.0.15-alt1 1417013332 installed
<13>Mar 11 14:54:01 rpmi: liblrdf-0.6.1-alt1 1493047570 installed
<13>Mar 11 14:54:01 rpmi: libneon-0.30.2-alt1 sisyphus+226834.100.1.1 1554686306 installed
<13>Mar 11 14:54:01 rpmi: python3-module-genshi-0.7.4-alt2 sisyphus+261703.100.2.1 1605232240 installed
<13>Mar 11 14:54:01 rpmi: libgdk-pixbuf-devel-2.42.2-alt1 sisyphus+263074.100.1.1 1607428069 installed
<13>Mar 11 14:54:01 rpmi: python-modules-xml-2.7.18-alt4 sisyphus+266950.200.2.1 1614241383 installed
<13>Mar 11 14:54:01 rpmi: python-modules-hotshot-2.7.18-alt4 sisyphus+266950.200.2.1 1614241383 installed
<13>Mar 11 14:54:01 rpmi: python-modules-bsddb-2.7.18-alt4 sisyphus+266950.200.2.1 1614241383 installed
<13>Mar 11 14:54:01 rpmi: python-modules-ctypes-2.7.18-alt4 sisyphus+266950.200.2.1 1614241383 installed
<13>Mar 11 14:54:01 rpmi: python-modules-multiprocessing-2.7.18-alt4 sisyphus+266950.200.2.1 1614241383 installed
<13>Mar 11 14:54:01 rpmi: python-modules-logging-2.7.18-alt4 sisyphus+266950.200.2.1 1614241383 installed
<13>Mar 11 14:54:01 rpmi: python-2.7.18-alt4 sisyphus+266950.200.2.1 1614241383 installed
<13>Mar 11 14:54:01 rpmi: python3-module-ntlm-1.1.0-alt1.2 sisyphus+228512.100.1.1 1556654575 installed
<13>Mar 11 14:54:01 rpmi: libatk-devel-2.36.0-alt1 sisyphus+249208.100.1.1 1585840406 installed
<13>Mar 11 14:54:01 rpmi: python3-module-pycparser-2.20-alt1 sisyphus+260990.100.1.1 1604547209 installed
<13>Mar 11 14:54:01 rpmi: python3-module-cffi-1.14.5-alt1 sisyphus+266847.100.1.1 1614157383 installed
<13>Mar 11 14:54:01 rpmi: python3-module-cryptography-3.4.6-alt1 sisyphus+267354.100.1.1 1614879025 installed
<13>Mar 11 14:54:01 rpmi: python3-module-openssl-19.1.0-alt1 sisyphus+261139.100.1.1 1604672912 installed
<13>Mar 11 14:54:01 rpmi: python3-module-pytz-1:2020.5-alt1 sisyphus+265473.100.1.1 1611923264 installed
<13>Mar 11 14:54:01 rpmi: python3-module-babel-1:2.8.0-alt1 sisyphus+260985.120.8.1 1604548484 installed
<13>Mar 11 14:54:01 rpmi: python3-module-zope.interface-5.1.0-alt3 sisyphus+265234.25100.49.1 1613760789 installed
<13>Mar 11 14:54:02 rpmi: python3-module-chameleon.core-3.8.1-alt1 sisyphus+257108.100.1.1 1598978997 installed
<13>Mar 11 14:54:02 rpmi: python3-module-click-7.1.2-alt2 sisyphus+260950.100.1.1 1604486258 installed
<13>Mar 11 14:54:02 rpmi: python3-module-polib-1.0.5-alt1.1.2 sisyphus+227468.1200.2.2 1555756059 installed
<13>Mar 11 14:54:02 rpmi: python3-module-lingua-4.14-alt1 sisyphus+261433.100.1.1 1605006591 installed
<13>Mar 11 14:54:02 rpmi: python3-module-webencodings-0.5.1-alt2 sisyphus+245915.200.1.1 1581496105 installed
<13>Mar 11 14:54:02 rpmi: python3-module-cssselect-0.9.1-alt2 sisyphus+250566.2300.6.1 1588188959 installed
<13>Mar 11 14:54:02 rpmi: python3-module-html5lib-1:1.0.1-alt1 sisyphus+238807.100.2.1 1570465973 installed
<13>Mar 11 14:54:02 rpmi: python3-module-lxml-4.6.2-alt1 sisyphus+267259.100.1.1 1614706638 installed
<13>Mar 11 14:54:02 rpmi: python3-module-docutils-0.16.0-alt1 sisyphus+250087.100.1.1 1587043829 installed
<13>Mar 11 14:54:02 rpmi: python3-module-chardet-1:3.0.4-alt2 sisyphus+263408.100.1.1 1607875228 installed
<13>Mar 11 14:54:02 rpmi: python3-module-idna-3.1-alt1 sisyphus+267356.100.1.1 1614879269 installed
<13>Mar 11 14:54:02 rpmi: python3-module-ndg-0.4.2-alt1.qa1 sisyphus+227504.1300.1.2 1555853234 installed
<13>Mar 11 14:54:02 rpmi: python3-module-ndg-httpsclient-0.4.2-alt1.qa1 sisyphus+227504.1300.1.2 1555853234 installed
<13>Mar 11 14:54:02 rpmi: python3-module-urllib3-2:1.25.10-alt1 sisyphus+255342.100.1.1 1595592746 installed
<13>Mar 11 14:54:02 rpmi: python3-module-requests-2.25.1-alt2 sisyphus+267359.100.1.1 1614881487 installed
<13>Mar 11 14:54:02 rpmi: python3-module-imagesize-1.1.0-alt1 sisyphus+229015.100.2.1 1557233756 installed
<13>Mar 11 14:54:02 rpmi: python3-module-markupsafe-1.1.1-alt1 sisyphus+265234.15700.49.1 1613753625 installed
<13>Mar 11 14:54:02 rpmi: python3-module-jinja2-2.11.2-alt1 sisyphus+254573.100.1.1 1594043344 installed
<13>Mar 11 14:54:02 rpmi: python3-module-pyparsing-2.4.2-alt2 sisyphus+261315.100.1.1 1604861802 installed
<13>Mar 11 14:54:02 rpmi: python3-module-packaging-19.0-alt3 sisyphus+261322.40.5.2 1604886824 installed
<13>Mar 11 14:54:02 rpmi: python3-module-snowballstemmer-1.2.0-alt2.1 1457859319 installed
<13>Mar 11 14:54:02 rpmi: python3-module-sphinxcontrib-applehelp-1.0.2-alt1 sisyphus+252614.200.1.1 1590949678 installed
<13>Mar 11 14:54:02 rpmi: python3-module-sphinxcontrib-devhelp-1.0.2-alt1 sisyphus+252614.300.1.1 1590949711 installed
<13>Mar 11 14:54:02 rpmi: python3-module-sphinxcontrib-htmlhelp-1.0.2-alt1 sisyphus+228401.100.1.1 1556572721 installed
<13>Mar 11 14:54:02 rpmi: python3-module-sphinxcontrib-jsmath-1.0.1-alt1 sisyphus+238085.500.1.1 1569313099 installed
<13>Mar 11 14:54:02 rpmi: python3-module-sphinxcontrib-qthelp-1.0.3-alt1 sisyphus+252614.400.1.1 1590949745 installed
<13>Mar 11 14:54:02 rpmi: python3-module-sphinxcontrib-serializinghtml-1.1.4-alt1 sisyphus+252614.100.1.1 1590949645 installed
<13>Mar 11 14:54:02 rpmi: python3-module-alabaster-0.7.6-alt3 sisyphus+228351.700.4.1 1556637370 installed
<13>Mar 11 14:54:02 rpmi: python3-module-Pygments-2.6.1-alt2 sisyphus+263434.100.1.1 1607946762 installed
<13>Mar 11 14:54:03 rpmi: python3-module-sphinx-1:2.4.4-alt1 sisyphus+254723.100.1.2 1594318607 installed
<13>Mar 11 14:54:03 rpmi: python3-module-markdown-3.3.4-alt1 sisyphus+267023.100.1.1 1614330293 installed
<13>Mar 11 14:54:03 rpmi: gtk-builder-convert-2.24.33-alt1 sisyphus+263711.100.20.1 1609407991 installed
<13>Mar 11 14:54:03 rpmi: libgtk+3-devel-3.24.26-alt1 sisyphus+266853.200.1.2 1614175345 installed
<13>Mar 11 14:54:03 rpmi: librabbitmq-c-0.9.0-alt1 sisyphus+223349.100.1.2 1551468904 installed
<13>Mar 11 14:54:03 rpmi: libavformat58-2:4.3.1-alt5 sisyphus+266524.100.2.1 1614598766 installed
<13>Mar 11 14:54:03 rpmi: libavfilter7-2:4.3.1-alt5 sisyphus+266524.100.2.1 1614598766 installed
<13>Mar 11 14:54:03 rpmi: gst-libav-1.18.3-alt1 sisyphus+264668.700.1.3 1610659578 installed
<13>Mar 11 14:54:03 rpmi: gdcm-3.0.5-alt1_0 sisyphus+251558.100.1.1 1589218627 installed
<13>Mar 11 14:54:05 rpmi: libopencv4.5-1:4.5.1-alt1 sisyphus+265234.52000.49.1 1613795523 installed
<13>Mar 11 14:54:05 rpmi: glib-networking-2.66.0-alt1 sisyphus+258314.1200.14.2 1600845027 installed
<13>Mar 11 14:54:06 rpmi: libsoup-2.72.0-alt1 sisyphus+258314.1100.14.2 1600844978 installed
<13>Mar 11 14:54:06 rpmi: libgssdp1.2-1.2.3-alt1 sisyphus+253858.100.1.1 1592889599 installed
<13>Mar 11 14:54:06 rpmi: vala-0.50.4-alt1 sisyphus+267164.100.1.1 1614540020 installed
<13>Mar 11 14:54:06 rpmi: libsoup-devel-2.72.0-alt1 sisyphus+258314.1100.14.2 1600844978 installed
<13>Mar 11 14:54:06 rpmi: libsoup-gir-2.72.0-alt1 sisyphus+258314.1100.14.2 1600844978 installed
<13>Mar 11 14:54:06 rpmi: libgupnp1.2-1.2.4-alt1 sisyphus+256093.100.1.1 1597013349 installed
<13>Mar 11 14:54:06 rpmi: libgupnp-igd-1.2.0-alt1.1 sisyphus+262195.100.1.1 1605882970 installed
<13>Mar 11 14:54:06 rpmi: libnice-0.1.18-alt1 sisyphus+260429.100.1.1 1603719449 installed
<13>Mar 11 14:54:06 rpmi: gst-plugins-good1.0-1.18.3-alt1 sisyphus+264668.300.1.3 1610659218 installed
<13>Mar 11 14:54:06 rpmi: libsoup-gnome-2.72.0-alt1 sisyphus+258314.1100.14.2 1600844978 installed
<13>Mar 11 14:54:06 rpmi: librest-0.8.1-alt1 1508266400 installed
<13>Mar 11 14:54:06 rpmi: librest-devel-0.8.1-alt1 1508266400 installed
<13>Mar 11 14:54:06 rpmi: librest-gir-0.8.1-alt1 1508266400 installed
<13>Mar 11 14:54:06 rpmi: libnss-3.61.0-alt1 sisyphus+265371.100.1.1 1611759823 installed
<13>Mar 11 14:54:06 rpmi: python3-module-nss-1.0.1-alt6 sisyphus+265234.10300.49.1 1613750227 installed
<13>Mar 11 14:54:06 rpmi: python3-module-beaker-1.11.0-alt1 sisyphus+260850.100.1.1 1604352882 installed
<13>Mar 11 14:54:06 rpmi: python3-module-mako-1.1.3-alt1 sisyphus+261443.100.1.1 1605011427 installed
<13>Mar 11 14:54:07 rpmi: gobject-introspection-devel-1.66.1-alt1 sisyphus+265234.31700.49.1 1613765999 installed
<13>Mar 11 14:54:07 rpmi: libsoup-gir-devel-2.72.0-alt1 sisyphus+258314.1100.14.2 1600844151 installed
<13>Mar 11 14:54:07 rpmi: alsa-ucm-conf-1.2.4-alt1 sisyphus+260180.200.1.1 1603282405 installed
<13>Mar 11 14:54:07 rpmi: alsa-topology-conf-1.2.4-alt1 sisyphus+260180.100.1.1 1603282384 installed
<13>Mar 11 14:54:07 rpmi: libalsa-1:1.2.4-alt1 sisyphus+260180.300.1.1 1603282509 installed
<13>Mar 11 14:54:07 rpmi: libfluidsynth-2.1.7-alt1 sisyphus+265503.100.2.1 1612122098 installed
<13>Mar 11 14:54:07 rpmi: libSDL-1.2.14-alt9 sisyphus+261262.100.1.1 1604829363 installed
<13>Mar 11 14:54:07 rpmi: libmjpegtools2.1-2.1.0-alt3 sisyphus+227903.100.1.1 1555879025 installed
<13>Mar 11 14:54:07 rpmi: gst-plugins-bad1.0-1.18.3-alt2 sisyphus+266315.200.3.1 1614183000 installed
<13>Mar 11 14:54:08 rpmi: gst-plugins-base1.0-1.18.3-alt1 sisyphus+264668.200.1.3 1610659084 installed
<13>Mar 11 14:54:11 rpmi: libwebkit2gtk-2.30.5-alt1 sisyphus+266194.300.1.1 1613063279 installed
<13>Mar 11 14:54:11 rpmi: libgnome-online-accounts-3.38.0-alt1 sisyphus+260477.100.1.1 1603764309 installed
<13>Mar 11 14:54:11 rpmi: libgnome-online-accounts-devel-3.38.0-alt1 sisyphus+260477.100.1.1 1603764309 installed
<13>Mar 11 14:54:11 rpmi: librest-gir-devel-0.8.1-alt1 1508266400 installed
<13>Mar 11 14:54:11 rpmi: libjson-glib-gir-devel-1.6.2-alt1 sisyphus+266194.200.1.1 1613062187 installed
<13>Mar 11 14:54:11 rpmi: gtk-doc-1.33.2-alt1 sisyphus+265119.100.1.1 1611321063 installed
<13>Mar 11 14:54:11 rpmi: libjson-glib-devel-1.6.2-alt1 sisyphus+266194.200.1.1 1613062152 installed
<13>Mar 11 14:54:11 rpmi: intltool-0.51.0-alt2 1513698802 installed
Building target platforms: i586
Building for target i586
Wrote: /usr/src/in/nosrpm/libzapojit-0.0.3-alt1.nosrc.rpm (w1.gzdio)
Installing libzapojit-0.0.3-alt1.src.rpm
Building target platforms: i586
Building for target i586
Executing(%prep): /bin/sh -e /usr/src/tmp/rpm-tmp.94506
+ umask 022
+ /bin/mkdir -p /usr/src/RPM/BUILD
+ cd /usr/src/RPM/BUILD
+ cd /usr/src/RPM/BUILD
+ rm -rf libzapojit-0.0.3
+ echo 'Source #0 (libzapojit-0.0.3.tar.xz):'
Source #0 (libzapojit-0.0.3.tar.xz):
+ /bin/tar -xf -
+ /usr/bin/xz -dc /usr/src/RPM/SOURCES/libzapojit-0.0.3.tar.xz
+ cd libzapojit-0.0.3
+ /bin/chmod -c -Rf u+rwX,go-w .
+ exit 0
Executing(%build): /bin/sh -e /usr/src/tmp/rpm-tmp.94506
+ umask 022
+ /bin/mkdir -p /usr/src/RPM/BUILD
+ cd /usr/src/RPM/BUILD
+ cd libzapojit-0.0.3
+ CFLAGS='-pipe -frecord-gcc-switches -Wall -g -O2 -march=i586 -mtune=generic'
+ export CFLAGS
+ CXXFLAGS='-pipe -frecord-gcc-switches -Wall -g -O2 -march=i586 -mtune=generic'
+ export CXXFLAGS
+ FFLAGS='-pipe -frecord-gcc-switches -Wall -g -O2 -march=i586 -mtune=generic'
+ export FFLAGS
+ FCFLAGS='-pipe -frecord-gcc-switches -Wall -g -O2 -march=i586 -mtune=generic'
+ export FCFLAGS
+ '[' -n '' ']'
++ sed -r 's/(^|[[:space:]]+)-[^m][^[:space:]]*//g'
++ printf %s '-pipe -frecord-gcc-switches -Wall -g -O2 -march=i586 -mtune=generic'
+ ASFLAGS=' -march=i586 -mtune=generic'
+ export ASFLAGS
+ export lt_cv_deplibs_check_method=pass_all
+ lt_cv_deplibs_check_method=pass_all
+ readlink -e -- ./configure
+ sort -u
+ xargs -ri find '{}' -type f '(' -name config.sub -or -name config.guess ')' -printf '%h/\n'
+ xargs -ri dirname -- '{}'
+ xargs -rn1 install -pm755 -- /usr/share/gnu-config/config.sub /usr/share/gnu-config/config.guess
+ ./configure --build=i586-alt-linux --host=i586-alt-linux --prefix=/usr --exec-prefix=/usr --bindir=/usr/bin --sbindir=/usr/sbin --sysconfdir=/etc --datadir=/usr/share --includedir=/usr/include --libdir=/usr/lib --libexecdir=/usr/lib --localstatedir=/var/lib --sharedstatedir=/var/lib --mandir=/usr/share/man --infodir=/usr/share/info --disable-dependency-tracking --disable-silent-rules --without-included-gettext --disable-static --enable-introspection=yes
configure: WARNING: unrecognized options: --without-included-gettext
checking whether make supports nested variables... yes
checking for a BSD-compatible install... /bin/install -c
checking whether build environment is sane... yes
checking for a thread-safe mkdir -p... /bin/mkdir -p
checking for gawk... gawk
checking whether make sets $(MAKE)... yes
checking whether to enable maintainer-specific portions of Makefiles... no
checking for i586-alt-linux-gcc... i586-alt-linux-gcc
checking whether the C compiler works... yes
checking for C compiler default output file name... a.out
checking for suffix of executables... 
checking whether we are cross compiling... no
checking for suffix of object files... o
checking whether we are using the GNU C compiler... yes
checking whether i586-alt-linux-gcc accepts -g... yes
checking for i586-alt-linux-gcc option to accept ISO C89... none needed
checking for style of include used by make... GNU
checking dependency style of i586-alt-linux-gcc... none
checking whether i586-alt-linux-gcc and cc understand -c and -o together... yes
checking how to run the C preprocessor... i586-alt-linux-gcc -E
checking for grep that handles long lines and -e... /bin/grep
checking for egrep... /bin/grep -E
checking for ANSI C header files... yes
checking whether gcc understands -Wno-sign-compare... yes
checking what warning flags to pass to the C compiler... -Wall -Wmissing-prototypes -Wnested-externs -Wpointer-arith -Wno-sign-compare
checking what language compliance flags to pass to the C compiler... 
checking for i586-alt-linux-pkg-config... no
checking for pkg-config... /usr/bin/pkg-config
checking pkg-config is at least version 0.9.0... yes
checking for gobject-introspection... yes
checking whether NLS is requested... yes
checking for intltool >= 0.35.0... 0.51.0 found
checking for intltool-update... /usr/bin/intltool-update
checking for intltool-merge... /usr/bin/intltool-merge
checking for intltool-extract... /usr/bin/intltool-extract
checking for xgettext... /usr/bin/xgettext
checking for msgmerge... /usr/bin/msgmerge
checking for msgfmt... /usr/bin/msgfmt
checking for gmsgfmt... /usr/bin/msgfmt
checking for perl... /usr/bin/perl
checking for perl >= 5.8.1... 5.30.3
checking for XML::Parser... ok
checking for sys/types.h... yes
checking for sys/stat.h... yes
checking for stdlib.h... yes
checking for string.h... yes
checking for memory.h... yes
checking for strings.h... yes
checking for inttypes.h... yes
checking for stdint.h... yes
checking for unistd.h... yes
checking locale.h usability... yes
checking locale.h presence... yes
checking for locale.h... yes
checking for LC_MESSAGES... yes
checking libintl.h usability... yes
checking libintl.h presence... yes
checking for libintl.h... yes
checking for ngettext in libc... yes
checking for dgettext in libc... yes
checking for bind_textdomain_codeset... yes
checking for msgfmt... (cached) /usr/bin/msgfmt
checking for dcgettext... yes
checking if msgfmt accepts -c... yes
checking for gmsgfmt... (cached) /usr/bin/msgfmt
checking for xgettext... (cached) /usr/bin/xgettext
checking build system type... i586-alt-linux-gnu
checking host system type... i586-alt-linux-gnu
checking how to print strings... printf
checking for a sed that does not truncate output... /bin/sed
checking for fgrep... /bin/grep -F
checking for ld used by i586-alt-linux-gcc... /usr/bin/ld
checking if the linker (/usr/bin/ld) is GNU ld... yes
checking for BSD- or MS-compatible name lister (nm)... /usr/bin/nm -B
checking the name lister (/usr/bin/nm -B) interface... BSD nm
checking whether ln -s works... yes
checking the maximum length of command line arguments... 1572864
checking whether the shell understands some XSI constructs... yes
checking whether the shell understands "+="... yes
checking how to convert i586-alt-linux-gnu file names to i586-alt-linux-gnu format... func_convert_file_noop
checking how to convert i586-alt-linux-gnu file names to toolchain format... func_convert_file_noop
checking for /usr/bin/ld option to reload object files... -r
checking for i586-alt-linux-objdump... no
checking for objdump... objdump
checking how to recognize dependent libraries... (cached) pass_all
checking for i586-alt-linux-dlltool... no
checking for dlltool... no
checking how to associate runtime and link libraries... printf %s\n
checking for i586-alt-linux-ar... no
checking for ar... ar
checking for archiver @FILE support... @
checking for i586-alt-linux-strip... no
checking for strip... strip
checking for i586-alt-linux-ranlib... no
checking for ranlib... ranlib
checking command to parse /usr/bin/nm -B output from i586-alt-linux-gcc object... ok
checking for sysroot... no
checking for i586-alt-linux-mt... no
checking for mt... no
checking if : is a manifest tool... no
checking for dlfcn.h... yes
checking for objdir... .libs
checking if i586-alt-linux-gcc supports -fno-rtti -fno-exceptions... no
checking for i586-alt-linux-gcc option to produce PIC... -fPIC -DPIC
checking if i586-alt-linux-gcc PIC flag -fPIC -DPIC works... yes
checking if i586-alt-linux-gcc static flag -static works... no
checking if i586-alt-linux-gcc supports -c -o file.o... yes
checking if i586-alt-linux-gcc supports -c -o file.o... (cached) yes
checking whether the i586-alt-linux-gcc linker (/usr/bin/ld) supports shared libraries... yes
checking whether -lc should be explicitly linked in... no
checking dynamic linker characteristics... GNU/Linux ld.so
checking how to hardcode library paths into programs... immediate
checking whether stripping libraries is possible... yes
checking if libtool supports shared libraries... yes
checking whether to build shared libraries... yes
checking whether to build static libraries... no
checking for gtkdoc-check... /usr/bin/gtkdoc-check
checking for gtkdoc-rebase... /usr/bin/gtkdoc-rebase
checking for gtkdoc-mkpdf... no
checking whether to build gtk-doc documentation... no
checking for GLIB... yes
checking for GIO... yes
checking for JSON... yes
checking for REST... yes
checking for SOUP... yes
checking for GOA... yes
checking that generated files are newer than configure... done
configure: creating ./config.status
config.status: creating zapojit-0.0.pc
config.status: creating Makefile
config.status: creating docs/Makefile
config.status: creating docs/reference/Makefile
config.status: creating docs/reference/version.xml
config.status: creating src/Makefile
config.status: creating po/Makefile.in
config.status: creating config.h
config.status: executing depfiles commands
config.status: executing default-1 commands
config.status: executing libtool commands
config.status: executing po/stamp-it commands
configure: WARNING: unrecognized options: --without-included-gettext
+ make -j8
make  all-recursive
Making all in src
make  all-am
make[3]: Entering directory '/usr/src/RPM/BUILD/libzapojit-0.0.3/src'
/bin/sh ../libtool  --tag=CC   --mode=compile i586-alt-linux-gcc -DHAVE_CONFIG_H -I. -I..  -DPACKAGE_LOCALE_DIR=\""/usr/share/locale"\" -DGOA_API_IS_SUBJECT_TO_CHANGE -DLIBSOUP_USE_UNSTABLE_REQUEST_API -pthread -I/usr/include/glib-2.0 -I/usr/lib/glib-2.0/include -I/usr/include/glib-2.0 -I/usr/lib/glib-2.0/include -pthread -I/usr/include/goa-1.0 -I/usr/lib/goa-1.0/include -I/usr/include/glib-2.0 -I/usr/lib/glib-2.0/include -pthread -I/usr/include/json-glib-1.0 -I/usr/include/glib-2.0 -I/usr/lib/glib-2.0/include -pthread -I/usr/include/rest-0.7 -I/usr/include/libsoup-2.4 -I/usr/include/glib-2.0 -I/usr/lib/glib-2.0/include -I/usr/include/libxml2 -pthread -I/usr/include/libsoup-2.4 -I/usr/include/libxml2 -I/usr/include/glib-2.0 -I/usr/lib/glib-2.0/include    -pipe -frecord-gcc-switches -Wall -g -O2 -march=i586 -mtune=generic -c -o zpj-authorization-domain.lo zpj-authorization-domain.c
libtool: compile:  i586-alt-linux-gcc -DHAVE_CONFIG_H -I. -I.. -DPACKAGE_LOCALE_DIR=\"/usr/share/locale\" -DGOA_API_IS_SUBJECT_TO_CHANGE -DLIBSOUP_USE_UNSTABLE_REQUEST_API -pthread -I/usr/include/glib-2.0 -I/usr/lib/glib-2.0/include -I/usr/include/glib-2.0 -I/usr/lib/glib-2.0/include -pthread -I/usr/include/goa-1.0 -I/usr/lib/goa-1.0/include -I/usr/include/glib-2.0 -I/usr/lib/glib-2.0/include -pthread -I/usr/include/json-glib-1.0 -I/usr/include/glib-2.0 -I/usr/lib/glib-2.0/include -pthread -I/usr/include/rest-0.7 -I/usr/include/libsoup-2.4 -I/usr/include/glib-2.0 -I/usr/lib/glib-2.0/include -I/usr/include/libxml2 -pthread -I/usr/include/libsoup-2.4 -I/usr/include/libxml2 -I/usr/include/glib-2.0 -I/usr/lib/glib-2.0/include -pipe -frecord-gcc-switches -Wall -g -O2 -march=i586 -mtune=generic -c zpj-authorization-domain.c  -fPIC -DPIC -o .libs/zpj-authorization-domain.o
zpj-authorization-domain.c: In function 'zpj_authorization_domain_init':
zpj-authorization-domain.c:106:13: warning: Deprecated pre-processor symbol, replace with 
  106 |   self->priv = G_TYPE_INSTANCE_GET_PRIVATE (self, ZPJ_TYPE_AUTHORIZATION_DOMAIN, ZpjAuthorizationDomainPrivate);
      |             ^~~~~~~~~~~~~~~~~~~~~~~~~~~~~~~~~~~~~~~~~~~~~~~~
zpj-authorization-domain.c: In function 'zpj_authorization_domain_class_init':
zpj-authorization-domain.c:136:3: warning: 'g_type_class_add_private' is deprecated [-Wdeprecated-declarations]
  136 |   g_type_class_add_private (class, sizeof (ZpjAuthorizationDomainPrivate));
      |   ^~~~~~~~~~~~~~~~~~~~~~~~
In file included from /usr/include/glib-2.0/gobject/gobject.h:24,
                 from /usr/include/glib-2.0/gobject/gbinding.h:29,
                 from /usr/include/glib-2.0/glib-object.h:22,
                 from zpj-authorization-domain.h:24,
                 from zpj-authorization-domain.c:24:
/usr/include/glib-2.0/gobject/gtype.h:1304:10: note: declared here
 1304 | void     g_type_class_add_private       (gpointer                    g_class,
      |          ^~~~~~~~~~~~~~~~~~~~~~~~
make[3]: Leaving directory '/usr/src/RPM/BUILD/libzapojit-0.0.3/src'
make[3]: Entering directory '/usr/src/RPM/BUILD/libzapojit-0.0.3/src'
/bin/sh ../libtool  --tag=CC   --mode=compile i586-alt-linux-gcc -DHAVE_CONFIG_H -I. -I..  -DPACKAGE_LOCALE_DIR=\""/usr/share/locale"\" -DGOA_API_IS_SUBJECT_TO_CHANGE -DLIBSOUP_USE_UNSTABLE_REQUEST_API -pthread -I/usr/include/glib-2.0 -I/usr/lib/glib-2.0/include -I/usr/include/glib-2.0 -I/usr/lib/glib-2.0/include -pthread -I/usr/include/goa-1.0 -I/usr/lib/goa-1.0/include -I/usr/include/glib-2.0 -I/usr/lib/glib-2.0/include -pthread -I/usr/include/json-glib-1.0 -I/usr/include/glib-2.0 -I/usr/lib/glib-2.0/include -pthread -I/usr/include/rest-0.7 -I/usr/include/libsoup-2.4 -I/usr/include/glib-2.0 -I/usr/lib/glib-2.0/include -I/usr/include/libxml2 -pthread -I/usr/include/libsoup-2.4 -I/usr/include/libxml2 -I/usr/include/glib-2.0 -I/usr/lib/glib-2.0/include    -pipe -frecord-gcc-switches -Wall -g -O2 -march=i586 -mtune=generic -c -o zpj-enums.lo zpj-enums.c
libtool: compile:  i586-alt-linux-gcc -DHAVE_CONFIG_H -I. -I.. -DPACKAGE_LOCALE_DIR=\"/usr/share/locale\" -DGOA_API_IS_SUBJECT_TO_CHANGE -DLIBSOUP_USE_UNSTABLE_REQUEST_API -pthread -I/usr/include/glib-2.0 -I/usr/lib/glib-2.0/include -I/usr/include/glib-2.0 -I/usr/lib/glib-2.0/include -pthread -I/usr/include/goa-1.0 -I/usr/lib/goa-1.0/include -I/usr/include/glib-2.0 -I/usr/lib/glib-2.0/include -pthread -I/usr/include/json-glib-1.0 -I/usr/include/glib-2.0 -I/usr/lib/glib-2.0/include -pthread -I/usr/include/rest-0.7 -I/usr/include/libsoup-2.4 -I/usr/include/glib-2.0 -I/usr/lib/glib-2.0/include -I/usr/include/libxml2 -pthread -I/usr/include/libsoup-2.4 -I/usr/include/libxml2 -I/usr/include/glib-2.0 -I/usr/lib/glib-2.0/include -pipe -frecord-gcc-switches -Wall -g -O2 -march=i586 -mtune=generic -c zpj-enums.c  -fPIC -DPIC -o .libs/zpj-enums.o
make[3]: Leaving directory '/usr/src/RPM/BUILD/libzapojit-0.0.3/src'
make[3]: Entering directory '/usr/src/RPM/BUILD/libzapojit-0.0.3/src'
/bin/sh ../libtool  --tag=CC   --mode=compile i586-alt-linux-gcc -DHAVE_CONFIG_H -I. -I..  -DPACKAGE_LOCALE_DIR=\""/usr/share/locale"\" -DGOA_API_IS_SUBJECT_TO_CHANGE -DLIBSOUP_USE_UNSTABLE_REQUEST_API -pthread -I/usr/include/glib-2.0 -I/usr/lib/glib-2.0/include -I/usr/include/glib-2.0 -I/usr/lib/glib-2.0/include -pthread -I/usr/include/goa-1.0 -I/usr/lib/goa-1.0/include -I/usr/include/glib-2.0 -I/usr/lib/glib-2.0/include -pthread -I/usr/include/json-glib-1.0 -I/usr/include/glib-2.0 -I/usr/lib/glib-2.0/include -pthread -I/usr/include/rest-0.7 -I/usr/include/libsoup-2.4 -I/usr/include/glib-2.0 -I/usr/lib/glib-2.0/include -I/usr/include/libxml2 -pthread -I/usr/include/libsoup-2.4 -I/usr/include/libxml2 -I/usr/include/glib-2.0 -I/usr/lib/glib-2.0/include    -pipe -frecord-gcc-switches -Wall -g -O2 -march=i586 -mtune=generic -c -o zpj-skydrive-folder.lo zpj-skydrive-folder.c
libtool: compile:  i586-alt-linux-gcc -DHAVE_CONFIG_H -I. -I.. -DPACKAGE_LOCALE_DIR=\"/usr/share/locale\" -DGOA_API_IS_SUBJECT_TO_CHANGE -DLIBSOUP_USE_UNSTABLE_REQUEST_API -pthread -I/usr/include/glib-2.0 -I/usr/lib/glib-2.0/include -I/usr/include/glib-2.0 -I/usr/lib/glib-2.0/include -pthread -I/usr/include/goa-1.0 -I/usr/lib/goa-1.0/include -I/usr/include/glib-2.0 -I/usr/lib/glib-2.0/include -pthread -I/usr/include/json-glib-1.0 -I/usr/include/glib-2.0 -I/usr/lib/glib-2.0/include -pthread -I/usr/include/rest-0.7 -I/usr/include/libsoup-2.4 -I/usr/include/glib-2.0 -I/usr/lib/glib-2.0/include -I/usr/include/libxml2 -pthread -I/usr/include/libsoup-2.4 -I/usr/include/libxml2 -I/usr/include/glib-2.0 -I/usr/lib/glib-2.0/include -pipe -frecord-gcc-switches -Wall -g -O2 -march=i586 -mtune=generic -c zpj-skydrive-folder.c  -fPIC -DPIC -o .libs/zpj-skydrive-folder.o
make[3]: Leaving directory '/usr/src/RPM/BUILD/libzapojit-0.0.3/src'
make[3]: Entering directory '/usr/src/RPM/BUILD/libzapojit-0.0.3/src'
/bin/sh ../libtool  --tag=CC   --mode=compile i586-alt-linux-gcc -DHAVE_CONFIG_H -I. -I..  -DPACKAGE_LOCALE_DIR=\""/usr/share/locale"\" -DGOA_API_IS_SUBJECT_TO_CHANGE -DLIBSOUP_USE_UNSTABLE_REQUEST_API -pthread -I/usr/include/glib-2.0 -I/usr/lib/glib-2.0/include -I/usr/include/glib-2.0 -I/usr/lib/glib-2.0/include -pthread -I/usr/include/goa-1.0 -I/usr/lib/goa-1.0/include -I/usr/include/glib-2.0 -I/usr/lib/glib-2.0/include -pthread -I/usr/include/json-glib-1.0 -I/usr/include/glib-2.0 -I/usr/lib/glib-2.0/include -pthread -I/usr/include/rest-0.7 -I/usr/include/libsoup-2.4 -I/usr/include/glib-2.0 -I/usr/lib/glib-2.0/include -I/usr/include/libxml2 -pthread -I/usr/include/libsoup-2.4 -I/usr/include/libxml2 -I/usr/include/glib-2.0 -I/usr/lib/glib-2.0/include    -pipe -frecord-gcc-switches -Wall -g -O2 -march=i586 -mtune=generic -c -o zpj-skydrive-entry.lo zpj-skydrive-entry.c
libtool: compile:  i586-alt-linux-gcc -DHAVE_CONFIG_H -I. -I.. -DPACKAGE_LOCALE_DIR=\"/usr/share/locale\" -DGOA_API_IS_SUBJECT_TO_CHANGE -DLIBSOUP_USE_UNSTABLE_REQUEST_API -pthread -I/usr/include/glib-2.0 -I/usr/lib/glib-2.0/include -I/usr/include/glib-2.0 -I/usr/lib/glib-2.0/include -pthread -I/usr/include/goa-1.0 -I/usr/lib/goa-1.0/include -I/usr/include/glib-2.0 -I/usr/lib/glib-2.0/include -pthread -I/usr/include/json-glib-1.0 -I/usr/include/glib-2.0 -I/usr/lib/glib-2.0/include -pthread -I/usr/include/rest-0.7 -I/usr/include/libsoup-2.4 -I/usr/include/glib-2.0 -I/usr/lib/glib-2.0/include -I/usr/include/libxml2 -pthread -I/usr/include/libsoup-2.4 -I/usr/include/libxml2 -I/usr/include/glib-2.0 -I/usr/lib/glib-2.0/include -pipe -frecord-gcc-switches -Wall -g -O2 -march=i586 -mtune=generic -c zpj-skydrive-entry.c  -fPIC -DPIC -o .libs/zpj-skydrive-entry.o
zpj-skydrive-entry.c: In function 'zpj_skydrive_entry_default_parse_json_node':
zpj-skydrive-entry.c:88:3: warning: 'GTimeVal' is deprecated: Use 'GDateTime' instead [-Wdeprecated-declarations]
   88 |   GTimeVal tv;
      |   ^~~~~~~~
In file included from /usr/include/glib-2.0/glib/galloca.h:32,
                 from /usr/include/glib-2.0/glib.h:30,
                 from zpj-skydrive-entry.c:24:
/usr/include/glib-2.0/glib/gtypes.h:547:8: note: declared here
  547 | struct _GTimeVal
      |        ^~~~~~~~~
zpj-skydrive-entry.c:116:3: warning: 'g_time_val_from_iso8601' is deprecated: Use 'g_date_time_new_from_iso8601' instead [-Wdeprecated-declarations]
  116 |   if (g_time_val_from_iso8601 (created_time, &tv))
      |   ^~
In file included from /usr/include/glib-2.0/glib.h:88,
                 from zpj-skydrive-entry.c:24:
/usr/include/glib-2.0/glib/gtimer.h:70:10: note: declared here
   70 | gboolean g_time_val_from_iso8601 (const gchar *iso_date,
      |          ^~~~~~~~~~~~~~~~~~~~~~~
zpj-skydrive-entry.c:117:5: warning: 'g_date_time_new_from_timeval_local' is deprecated: Use 'g_date_time_new_from_unix_local' instead [-Wdeprecated-declarations]
  117 |     priv->created_time = g_date_time_new_from_timeval_local (&tv);
      |     ^~~~
In file included from /usr/include/glib-2.0/glib/gbookmarkfile.h:26,
                 from /usr/include/glib-2.0/glib.h:37,
                 from zpj-skydrive-entry.c:24:
/usr/include/glib-2.0/glib/gdatetime.h:118:25: note: declared here
  118 | GDateTime *             g_date_time_new_from_timeval_local              (const GTimeVal *tv);
      |                         ^~~~~~~~~~~~~~~~~~~~~~~~~~~~~~~~~~
zpj-skydrive-entry.c:120:3: warning: 'g_time_val_from_iso8601' is deprecated: Use 'g_date_time_new_from_iso8601' instead [-Wdeprecated-declarations]
  120 |   if (g_time_val_from_iso8601 (updated_time, &tv))
      |   ^~
In file included from /usr/include/glib-2.0/glib.h:88,
                 from zpj-skydrive-entry.c:24:
/usr/include/glib-2.0/glib/gtimer.h:70:10: note: declared here
   70 | gboolean g_time_val_from_iso8601 (const gchar *iso_date,
      |          ^~~~~~~~~~~~~~~~~~~~~~~
zpj-skydrive-entry.c:121:5: warning: 'g_date_time_new_from_timeval_local' is deprecated: Use 'g_date_time_new_from_unix_local' instead [-Wdeprecated-declarations]
  121 |     priv->updated_time = g_date_time_new_from_timeval_local (&tv);
      |     ^~~~
In file included from /usr/include/glib-2.0/glib/gbookmarkfile.h:26,
                 from /usr/include/glib-2.0/glib.h:37,
                 from zpj-skydrive-entry.c:24:
/usr/include/glib-2.0/glib/gdatetime.h:118:25: note: declared here
  118 | GDateTime *             g_date_time_new_from_timeval_local              (const GTimeVal *tv);
      |                         ^~~~~~~~~~~~~~~~~~~~~~~~~~~~~~~~~~
zpj-skydrive-entry.c: In function 'zpj_skydrive_entry_set_property':
zpj-skydrive-entry.c:238:28: warning: unused variable 'priv' [-Wunused-variable]
  238 |   ZpjSkydriveEntryPrivate *priv = self->priv;
      |                            ^~~~
zpj-skydrive-entry.c: In function 'zpj_skydrive_entry_init':
zpj-skydrive-entry.c:264:13: warning: Deprecated pre-processor symbol, replace with 
  264 |   self->priv = G_TYPE_INSTANCE_GET_PRIVATE (self, ZPJ_TYPE_SKYDRIVE_ENTRY, ZpjSkydriveEntryPrivate);
      |             ^~~~~~~~~~~~~~~~~~~~~~~~~~~~~~~~~~~~~~~~~~~~~~~~
zpj-skydrive-entry.c: In function 'zpj_skydrive_entry_class_init':
zpj-skydrive-entry.c:360:3: warning: 'g_type_class_add_private' is deprecated [-Wdeprecated-declarations]
  360 |   g_type_class_add_private (class, sizeof (ZpjSkydriveEntryPrivate));
      |   ^~~~~~~~~~~~~~~~~~~~~~~~
In file included from /usr/include/glib-2.0/gobject/gobject.h:24,
                 from /usr/include/glib-2.0/gobject/gbinding.h:29,
                 from /usr/include/glib-2.0/glib-object.h:22,
                 from zpj-enums.h:8,
                 from zpj-skydrive-entry.c:26:
/usr/include/glib-2.0/gobject/gtype.h:1304:10: note: declared here
 1304 | void     g_type_class_add_private       (gpointer                    g_class,
      |          ^~~~~~~~~~~~~~~~~~~~~~~~
make[3]: Leaving directory '/usr/src/RPM/BUILD/libzapojit-0.0.3/src'
make[3]: Entering directory '/usr/src/RPM/BUILD/libzapojit-0.0.3/src'
/bin/sh ../libtool  --tag=CC   --mode=compile i586-alt-linux-gcc -DHAVE_CONFIG_H -I. -I..  -DPACKAGE_LOCALE_DIR=\""/usr/share/locale"\" -DGOA_API_IS_SUBJECT_TO_CHANGE -DLIBSOUP_USE_UNSTABLE_REQUEST_API -pthread -I/usr/include/glib-2.0 -I/usr/lib/glib-2.0/include -I/usr/include/glib-2.0 -I/usr/lib/glib-2.0/include -pthread -I/usr/include/goa-1.0 -I/usr/lib/goa-1.0/include -I/usr/include/glib-2.0 -I/usr/lib/glib-2.0/include -pthread -I/usr/include/json-glib-1.0 -I/usr/include/glib-2.0 -I/usr/lib/glib-2.0/include -pthread -I/usr/include/rest-0.7 -I/usr/include/libsoup-2.4 -I/usr/include/glib-2.0 -I/usr/lib/glib-2.0/include -I/usr/include/libxml2 -pthread -I/usr/include/libsoup-2.4 -I/usr/include/libxml2 -I/usr/include/glib-2.0 -I/usr/lib/glib-2.0/include    -pipe -frecord-gcc-switches -Wall -g -O2 -march=i586 -mtune=generic -c -o zpj-goa-authorizer.lo zpj-goa-authorizer.c
libtool: compile:  i586-alt-linux-gcc -DHAVE_CONFIG_H -I. -I.. -DPACKAGE_LOCALE_DIR=\"/usr/share/locale\" -DGOA_API_IS_SUBJECT_TO_CHANGE -DLIBSOUP_USE_UNSTABLE_REQUEST_API -pthread -I/usr/include/glib-2.0 -I/usr/lib/glib-2.0/include -I/usr/include/glib-2.0 -I/usr/lib/glib-2.0/include -pthread -I/usr/include/goa-1.0 -I/usr/lib/goa-1.0/include -I/usr/include/glib-2.0 -I/usr/lib/glib-2.0/include -pthread -I/usr/include/json-glib-1.0 -I/usr/include/glib-2.0 -I/usr/lib/glib-2.0/include -pthread -I/usr/include/rest-0.7 -I/usr/include/libsoup-2.4 -I/usr/include/glib-2.0 -I/usr/lib/glib-2.0/include -I/usr/include/libxml2 -pthread -I/usr/include/libsoup-2.4 -I/usr/include/libxml2 -I/usr/include/glib-2.0 -I/usr/lib/glib-2.0/include -pipe -frecord-gcc-switches -Wall -g -O2 -march=i586 -mtune=generic -c zpj-goa-authorizer.c  -fPIC -DPIC -o .libs/zpj-goa-authorizer.o
zpj-goa-authorizer.c: In function 'zpj_goa_authorizer_init':
zpj-goa-authorizer.c:228:13: warning: Deprecated pre-processor symbol, replace with 
  228 |   self->priv = G_TYPE_INSTANCE_GET_PRIVATE (self, ZPJ_TYPE_GOA_AUTHORIZER, ZpjGoaAuthorizerPrivate);
      |             ^~~~~~~~~~~~~~~~~~~~~~~~~~~~~~~~~~~~~~~~~~~~~~~~
zpj-goa-authorizer.c: In function 'zpj_goa_authorizer_class_init':
zpj-goa-authorizer.c:251:3: warning: 'g_type_class_add_private' is deprecated [-Wdeprecated-declarations]
  251 |   g_type_class_add_private (class, sizeof (ZpjGoaAuthorizerPrivate));
      |   ^~~~~~~~~~~~~~~~~~~~~~~~
In file included from /usr/include/glib-2.0/gobject/gobject.h:24,
                 from /usr/include/glib-2.0/gobject/gbinding.h:29,
                 from /usr/include/glib-2.0/glib-object.h:22,
                 from /usr/include/glib-2.0/gio/gioenums.h:28,
                 from /usr/include/glib-2.0/gio/giotypes.h:28,
                 from /usr/include/glib-2.0/gio/gio.h:26,
                 from /usr/include/libsoup-2.4/libsoup/soup-types.h:9,
                 from /usr/include/libsoup-2.4/libsoup/soup-address.h:11,
                 from /usr/include/libsoup-2.4/libsoup/soup.h:15,
                 from zpj-goa-authorizer.c:25:
/usr/include/glib-2.0/gobject/gtype.h:1304:10: note: declared here
 1304 | void     g_type_class_add_private       (gpointer                    g_class,
      |          ^~~~~~~~~~~~~~~~~~~~~~~~
make[3]: Leaving directory '/usr/src/RPM/BUILD/libzapojit-0.0.3/src'
make[3]: Entering directory '/usr/src/RPM/BUILD/libzapojit-0.0.3/src'
/bin/sh ../libtool  --tag=CC   --mode=compile i586-alt-linux-gcc -DHAVE_CONFIG_H -I. -I..  -DPACKAGE_LOCALE_DIR=\""/usr/share/locale"\" -DGOA_API_IS_SUBJECT_TO_CHANGE -DLIBSOUP_USE_UNSTABLE_REQUEST_API -pthread -I/usr/include/glib-2.0 -I/usr/lib/glib-2.0/include -I/usr/include/glib-2.0 -I/usr/lib/glib-2.0/include -pthread -I/usr/include/goa-1.0 -I/usr/lib/goa-1.0/include -I/usr/include/glib-2.0 -I/usr/lib/glib-2.0/include -pthread -I/usr/include/json-glib-1.0 -I/usr/include/glib-2.0 -I/usr/lib/glib-2.0/include -pthread -I/usr/include/rest-0.7 -I/usr/include/libsoup-2.4 -I/usr/include/glib-2.0 -I/usr/lib/glib-2.0/include -I/usr/include/libxml2 -pthread -I/usr/include/libsoup-2.4 -I/usr/include/libxml2 -I/usr/include/glib-2.0 -I/usr/lib/glib-2.0/include    -pipe -frecord-gcc-switches -Wall -g -O2 -march=i586 -mtune=generic -c -o zpj-skydrive-file.lo zpj-skydrive-file.c
libtool: compile:  i586-alt-linux-gcc -DHAVE_CONFIG_H -I. -I.. -DPACKAGE_LOCALE_DIR=\"/usr/share/locale\" -DGOA_API_IS_SUBJECT_TO_CHANGE -DLIBSOUP_USE_UNSTABLE_REQUEST_API -pthread -I/usr/include/glib-2.0 -I/usr/lib/glib-2.0/include -I/usr/include/glib-2.0 -I/usr/lib/glib-2.0/include -pthread -I/usr/include/goa-1.0 -I/usr/lib/goa-1.0/include -I/usr/include/glib-2.0 -I/usr/lib/glib-2.0/include -pthread -I/usr/include/json-glib-1.0 -I/usr/include/glib-2.0 -I/usr/lib/glib-2.0/include -pthread -I/usr/include/rest-0.7 -I/usr/include/libsoup-2.4 -I/usr/include/glib-2.0 -I/usr/lib/glib-2.0/include -I/usr/include/libxml2 -pthread -I/usr/include/libsoup-2.4 -I/usr/include/libxml2 -I/usr/include/glib-2.0 -I/usr/lib/glib-2.0/include -pipe -frecord-gcc-switches -Wall -g -O2 -march=i586 -mtune=generic -c zpj-skydrive-file.c  -fPIC -DPIC -o .libs/zpj-skydrive-file.o
zpj-skydrive-file.c: In function 'zpj_skydrive_file_init':
zpj-skydrive-file.c:88:13: warning: Deprecated pre-processor symbol, replace with 
   88 |   self->priv = G_TYPE_INSTANCE_GET_PRIVATE (self, ZPJ_TYPE_SKYDRIVE_FILE, ZpjSkydriveFilePrivate);
      |             ^~~~~~~~~~~~~~~~~~~~~~~~~~~~~~~~~~~~~~~~~~~~~~~~
zpj-skydrive-file.c: In function 'zpj_skydrive_file_class_init':
zpj-skydrive-file.c:111:3: warning: 'g_type_class_add_private' is deprecated [-Wdeprecated-declarations]
  111 |   g_type_class_add_private (class, sizeof (ZpjSkydriveFilePrivate));
      |   ^~~~~~~~~~~~~~~~~~~~~~~~
In file included from /usr/include/glib-2.0/gobject/gobject.h:24,
                 from /usr/include/glib-2.0/gobject/gbinding.h:29,
                 from /usr/include/glib-2.0/glib-object.h:22,
                 from /usr/include/json-glib-1.0/json-glib/json-types.h:31,
                 from /usr/include/json-glib-1.0/json-glib/json-glib.h:29,
                 from zpj-skydrive-file.h:24,
                 from zpj-skydrive-file.c:24:
/usr/include/glib-2.0/gobject/gtype.h:1304:10: note: declared here
 1304 | void     g_type_class_add_private       (gpointer                    g_class,
      |          ^~~~~~~~~~~~~~~~~~~~~~~~
make[3]: Leaving directory '/usr/src/RPM/BUILD/libzapojit-0.0.3/src'
make[3]: Entering directory '/usr/src/RPM/BUILD/libzapojit-0.0.3/src'
/bin/sh ../libtool  --tag=CC   --mode=compile i586-alt-linux-gcc -DHAVE_CONFIG_H -I. -I..  -DPACKAGE_LOCALE_DIR=\""/usr/share/locale"\" -DGOA_API_IS_SUBJECT_TO_CHANGE -DLIBSOUP_USE_UNSTABLE_REQUEST_API -pthread -I/usr/include/glib-2.0 -I/usr/lib/glib-2.0/include -I/usr/include/glib-2.0 -I/usr/lib/glib-2.0/include -pthread -I/usr/include/goa-1.0 -I/usr/lib/goa-1.0/include -I/usr/include/glib-2.0 -I/usr/lib/glib-2.0/include -pthread -I/usr/include/json-glib-1.0 -I/usr/include/glib-2.0 -I/usr/lib/glib-2.0/include -pthread -I/usr/include/rest-0.7 -I/usr/include/libsoup-2.4 -I/usr/include/glib-2.0 -I/usr/lib/glib-2.0/include -I/usr/include/libxml2 -pthread -I/usr/include/libsoup-2.4 -I/usr/include/libxml2 -I/usr/include/glib-2.0 -I/usr/lib/glib-2.0/include    -pipe -frecord-gcc-switches -Wall -g -O2 -march=i586 -mtune=generic -c -o zpj-authorizer.lo zpj-authorizer.c
libtool: compile:  i586-alt-linux-gcc -DHAVE_CONFIG_H -I. -I.. -DPACKAGE_LOCALE_DIR=\"/usr/share/locale\" -DGOA_API_IS_SUBJECT_TO_CHANGE -DLIBSOUP_USE_UNSTABLE_REQUEST_API -pthread -I/usr/include/glib-2.0 -I/usr/lib/glib-2.0/include -I/usr/include/glib-2.0 -I/usr/lib/glib-2.0/include -pthread -I/usr/include/goa-1.0 -I/usr/lib/goa-1.0/include -I/usr/include/glib-2.0 -I/usr/lib/glib-2.0/include -pthread -I/usr/include/json-glib-1.0 -I/usr/include/glib-2.0 -I/usr/lib/glib-2.0/include -pthread -I/usr/include/rest-0.7 -I/usr/include/libsoup-2.4 -I/usr/include/glib-2.0 -I/usr/lib/glib-2.0/include -I/usr/include/libxml2 -pthread -I/usr/include/libsoup-2.4 -I/usr/include/libxml2 -I/usr/include/glib-2.0 -I/usr/lib/glib-2.0/include -pipe -frecord-gcc-switches -Wall -g -O2 -march=i586 -mtune=generic -c zpj-authorizer.c  -fPIC -DPIC -o .libs/zpj-authorizer.o
zpj-authorizer.c: In function 'zpj_authorizer_refresh_authorization_thread_func':
zpj-authorizer.c:70:7: warning: 'g_simple_async_result_set_from_error' is deprecated [-Wdeprecated-declarations]
   70 |       g_simple_async_result_set_from_error (simple, error);
      |       ^~~~~~~~~~~~~~~~~~~~~~~~~~~~~~~~~~~~
In file included from /usr/include/glib-2.0/gio/gio.h:136,
                 from zpj-authorizer.h:24,
                 from zpj-authorizer.c:26:
/usr/include/glib-2.0/gio/gsimpleasyncresult.h:113:21: note: declared here
  113 | void                g_simple_async_result_set_from_error   (GSimpleAsyncResult      *simple,
      |                     ^~~~~~~~~~~~~~~~~~~~~~~~~~~~~~~~~~~~
zpj-authorizer.c: In function 'zpj_authorizer_refresh_authorization_async':
zpj-authorizer.c:193:3: warning: 'g_simple_async_result_new' is deprecated: Use 'g_task_new' instead [-Wdeprecated-declarations]
  193 |   simple = g_simple_async_result_new (G_OBJECT (iface),
      |   ^~~~~~
In file included from /usr/include/glib-2.0/gio/gio.h:136,
                 from zpj-authorizer.h:24,
                 from zpj-authorizer.c:26:
/usr/include/glib-2.0/gio/gsimpleasyncresult.h:51:21: note: declared here
   51 | GSimpleAsyncResult *g_simple_async_result_new              (GObject                 *source_object,
      |                     ^~~~~~~~~~~~~~~~~~~~~~~~~
zpj-authorizer.c:197:3: warning: 'g_simple_async_result_run_in_thread' is deprecated [-Wdeprecated-declarations]
  197 |   g_simple_async_result_run_in_thread (simple,
      |   ^~~~~~~~~~~~~~~~~~~~~~~~~~~~~~~~~~~
In file included from /usr/include/glib-2.0/gio/gio.h:136,
                 from zpj-authorizer.h:24,
                 from zpj-authorizer.c:26:
/usr/include/glib-2.0/gio/gsimpleasyncresult.h:108:21: note: declared here
  108 | void                g_simple_async_result_run_in_thread    (GSimpleAsyncResult      *simple,
      |                     ^~~~~~~~~~~~~~~~~~~~~~~~~~~~~~~~~~~
zpj-authorizer.c: In function 'zpj_authorizer_refresh_authorization_finish':
zpj-authorizer.c:219:3: warning: 'g_simple_async_result_is_valid' is deprecated [-Wdeprecated-declarations]
  219 |   g_return_val_if_fail (g_simple_async_result_is_valid (res,
      |   ^~~~~~~~~~~~~~~~~~~~
In file included from /usr/include/glib-2.0/gio/gio.h:136,
                 from zpj-authorizer.h:24,
                 from zpj-authorizer.c:26:
/usr/include/glib-2.0/gio/gsimpleasyncresult.h:135:21: note: declared here
  135 | gboolean            g_simple_async_result_is_valid         (GAsyncResult            *result,
      |                     ^~~~~~~~~~~~~~~~~~~~~~~~~~~~~~
zpj-authorizer.c:224:3: warning: 'g_simple_async_result_propagate_error' is deprecated [-Wdeprecated-declarations]
  224 |   if (g_simple_async_result_propagate_error (G_SIMPLE_ASYNC_RESULT (res), error))
      |   ^~
In file included from /usr/include/glib-2.0/gio/gio.h:136,
                 from zpj-authorizer.h:24,
                 from zpj-authorizer.c:26:
/usr/include/glib-2.0/gio/gsimpleasyncresult.h:119:21: note: declared here
  119 | gboolean            g_simple_async_result_propagate_error  (GSimpleAsyncResult      *simple,
      |                     ^~~~~~~~~~~~~~~~~~~~~~~~~~~~~~~~~~~~~
make[3]: Leaving directory '/usr/src/RPM/BUILD/libzapojit-0.0.3/src'
make[3]: Entering directory '/usr/src/RPM/BUILD/libzapojit-0.0.3/src'
/bin/sh ../libtool  --tag=CC   --mode=compile i586-alt-linux-gcc -DHAVE_CONFIG_H -I. -I..  -DPACKAGE_LOCALE_DIR=\""/usr/share/locale"\" -DGOA_API_IS_SUBJECT_TO_CHANGE -DLIBSOUP_USE_UNSTABLE_REQUEST_API -pthread -I/usr/include/glib-2.0 -I/usr/lib/glib-2.0/include -I/usr/include/glib-2.0 -I/usr/lib/glib-2.0/include -pthread -I/usr/include/goa-1.0 -I/usr/lib/goa-1.0/include -I/usr/include/glib-2.0 -I/usr/lib/glib-2.0/include -pthread -I/usr/include/json-glib-1.0 -I/usr/include/glib-2.0 -I/usr/lib/glib-2.0/include -pthread -I/usr/include/rest-0.7 -I/usr/include/libsoup-2.4 -I/usr/include/glib-2.0 -I/usr/lib/glib-2.0/include -I/usr/include/libxml2 -pthread -I/usr/include/libsoup-2.4 -I/usr/include/libxml2 -I/usr/include/glib-2.0 -I/usr/lib/glib-2.0/include    -pipe -frecord-gcc-switches -Wall -g -O2 -march=i586 -mtune=generic -c -o zpj-skydrive-photo.lo zpj-skydrive-photo.c
libtool: compile:  i586-alt-linux-gcc -DHAVE_CONFIG_H -I. -I.. -DPACKAGE_LOCALE_DIR=\"/usr/share/locale\" -DGOA_API_IS_SUBJECT_TO_CHANGE -DLIBSOUP_USE_UNSTABLE_REQUEST_API -pthread -I/usr/include/glib-2.0 -I/usr/lib/glib-2.0/include -I/usr/include/glib-2.0 -I/usr/lib/glib-2.0/include -pthread -I/usr/include/goa-1.0 -I/usr/lib/goa-1.0/include -I/usr/include/glib-2.0 -I/usr/lib/glib-2.0/include -pthread -I/usr/include/json-glib-1.0 -I/usr/include/glib-2.0 -I/usr/lib/glib-2.0/include -pthread -I/usr/include/rest-0.7 -I/usr/include/libsoup-2.4 -I/usr/include/glib-2.0 -I/usr/lib/glib-2.0/include -I/usr/include/libxml2 -pthread -I/usr/include/libsoup-2.4 -I/usr/include/libxml2 -I/usr/include/glib-2.0 -I/usr/lib/glib-2.0/include -pipe -frecord-gcc-switches -Wall -g -O2 -march=i586 -mtune=generic -c zpj-skydrive-photo.c  -fPIC -DPIC -o .libs/zpj-skydrive-photo.o
make[3]: Leaving directory '/usr/src/RPM/BUILD/libzapojit-0.0.3/src'
make[3]: Entering directory '/usr/src/RPM/BUILD/libzapojit-0.0.3/src'
/bin/sh ../libtool  --tag=CC   --mode=compile i586-alt-linux-gcc -DHAVE_CONFIG_H -I. -I..  -DPACKAGE_LOCALE_DIR=\""/usr/share/locale"\" -DGOA_API_IS_SUBJECT_TO_CHANGE -DLIBSOUP_USE_UNSTABLE_REQUEST_API -pthread -I/usr/include/glib-2.0 -I/usr/lib/glib-2.0/include -I/usr/include/glib-2.0 -I/usr/lib/glib-2.0/include -pthread -I/usr/include/goa-1.0 -I/usr/lib/goa-1.0/include -I/usr/include/glib-2.0 -I/usr/lib/glib-2.0/include -pthread -I/usr/include/json-glib-1.0 -I/usr/include/glib-2.0 -I/usr/lib/glib-2.0/include -pthread -I/usr/include/rest-0.7 -I/usr/include/libsoup-2.4 -I/usr/include/glib-2.0 -I/usr/lib/glib-2.0/include -I/usr/include/libxml2 -pthread -I/usr/include/libsoup-2.4 -I/usr/include/libxml2 -I/usr/include/glib-2.0 -I/usr/lib/glib-2.0/include    -pipe -frecord-gcc-switches -Wall -g -O2 -march=i586 -mtune=generic -c -o zpj-skydrive.lo zpj-skydrive.c
libtool: compile:  i586-alt-linux-gcc -DHAVE_CONFIG_H -I. -I.. -DPACKAGE_LOCALE_DIR=\"/usr/share/locale\" -DGOA_API_IS_SUBJECT_TO_CHANGE -DLIBSOUP_USE_UNSTABLE_REQUEST_API -pthread -I/usr/include/glib-2.0 -I/usr/lib/glib-2.0/include -I/usr/include/glib-2.0 -I/usr/lib/glib-2.0/include -pthread -I/usr/include/goa-1.0 -I/usr/lib/goa-1.0/include -I/usr/include/glib-2.0 -I/usr/lib/glib-2.0/include -pthread -I/usr/include/json-glib-1.0 -I/usr/include/glib-2.0 -I/usr/lib/glib-2.0/include -pthread -I/usr/include/rest-0.7 -I/usr/include/libsoup-2.4 -I/usr/include/glib-2.0 -I/usr/lib/glib-2.0/include -I/usr/include/libxml2 -pthread -I/usr/include/libsoup-2.4 -I/usr/include/libxml2 -I/usr/include/glib-2.0 -I/usr/lib/glib-2.0/include -pipe -frecord-gcc-switches -Wall -g -O2 -march=i586 -mtune=generic -c zpj-skydrive.c  -fPIC -DPIC -o .libs/zpj-skydrive.o
zpj-skydrive.c: In function 'zpj_skydrive_download_file_id_to_stream_in_thread_func':
zpj-skydrive.c:150:3: warning: 'g_simple_async_result_get_op_res_gpointer' is deprecated [-Wdeprecated-declarations]
  150 |   data = (ZpjSkydriveThreadData *) g_simple_async_result_get_op_res_gpointer (simple);
      |   ^~~~
In file included from /usr/include/glib-2.0/gio/gio.h:136,
                 from /usr/include/json-glib-1.0/json-glib/json-generator.h:32,
                 from /usr/include/json-glib-1.0/json-glib/json-glib.h:32,
                 from zpj-skydrive.c:24:
/usr/include/glib-2.0/gio/gsimpleasyncresult.h:79:21: note: declared here
   79 | gpointer            g_simple_async_result_get_op_res_gpointer (GSimpleAsyncResult      *simple);
      |                     ^~~~~~~~~~~~~~~~~~~~~~~~~~~~~~~~~~~~~~~~~
zpj-skydrive.c:155:5: warning: 'g_simple_async_result_take_error' is deprecated [-Wdeprecated-declarations]
  155 |     g_simple_async_result_take_error (simple, error);
      |     ^~~~~~~~~~~~~~~~~~~~~~~~~~~~~~~~
In file included from /usr/include/glib-2.0/gio/gio.h:136,
                 from /usr/include/json-glib-1.0/json-glib/json-generator.h:32,
                 from /usr/include/json-glib-1.0/json-glib/json-glib.h:32,
                 from zpj-skydrive.c:24:
/usr/include/glib-2.0/gio/gsimpleasyncresult.h:116:21: note: declared here
  116 | void                g_simple_async_result_take_error       (GSimpleAsyncResult      *simple,
      |                     ^~~~~~~~~~~~~~~~~~~~~~~~~~~~~~~~
zpj-skydrive.c: In function 'zpj_skydrive_list_folder_id_in_thread_func':
zpj-skydrive.c:169:3: warning: 'g_simple_async_result_get_op_res_gpointer' is deprecated [-Wdeprecated-declarations]
  169 |   data = (ZpjSkydriveThreadData *) g_simple_async_result_get_op_res_gpointer (simple);
      |   ^~~~
In file included from /usr/include/glib-2.0/gio/gio.h:136,
                 from /usr/include/json-glib-1.0/json-glib/json-generator.h:32,
                 from /usr/include/json-glib-1.0/json-glib/json-glib.h:32,
                 from zpj-skydrive.c:24:
/usr/include/glib-2.0/gio/gsimpleasyncresult.h:79:21: note: declared here
   79 | gpointer            g_simple_async_result_get_op_res_gpointer (GSimpleAsyncResult      *simple);
      |                     ^~~~~~~~~~~~~~~~~~~~~~~~~~~~~~~~~~~~~~~~~
zpj-skydrive.c:174:5: warning: 'g_simple_async_result_take_error' is deprecated [-Wdeprecated-declarations]
  174 |     g_simple_async_result_take_error (simple, error);
      |     ^~~~~~~~~~~~~~~~~~~~~~~~~~~~~~~~
In file included from /usr/include/glib-2.0/gio/gio.h:136,
                 from /usr/include/json-glib-1.0/json-glib/json-generator.h:32,
                 from /usr/include/json-glib-1.0/json-glib/json-glib.h:32,
                 from zpj-skydrive.c:24:
/usr/include/glib-2.0/gio/gsimpleasyncresult.h:116:21: note: declared here
  116 | void                g_simple_async_result_take_error       (GSimpleAsyncResult      *simple,
      |                     ^~~~~~~~~~~~~~~~~~~~~~~~~~~~~~~~
zpj-skydrive.c: In function 'zpj_skydrive_query_info_from_id_in_thread_func':
zpj-skydrive.c:214:3: warning: 'g_simple_async_result_get_op_res_gpointer' is deprecated [-Wdeprecated-declarations]
  214 |   data = (ZpjSkydriveThreadData *) g_simple_async_result_get_op_res_gpointer (simple);
      |   ^~~~
In file included from /usr/include/glib-2.0/gio/gio.h:136,
                 from /usr/include/json-glib-1.0/json-glib/json-generator.h:32,
                 from /usr/include/json-glib-1.0/json-glib/json-glib.h:32,
                 from zpj-skydrive.c:24:
/usr/include/glib-2.0/gio/gsimpleasyncresult.h:79:21: note: declared here
   79 | gpointer            g_simple_async_result_get_op_res_gpointer (GSimpleAsyncResult      *simple);
      |                     ^~~~~~~~~~~~~~~~~~~~~~~~~~~~~~~~~~~~~~~~~
zpj-skydrive.c:219:5: warning: 'g_simple_async_result_take_error' is deprecated [-Wdeprecated-declarations]
  219 |     g_simple_async_result_take_error (simple, error);
      |     ^~~~~~~~~~~~~~~~~~~~~~~~~~~~~~~~
In file included from /usr/include/glib-2.0/gio/gio.h:136,
                 from /usr/include/json-glib-1.0/json-glib/json-generator.h:32,
                 from /usr/include/json-glib-1.0/json-glib/json-glib.h:32,
                 from zpj-skydrive.c:24:
/usr/include/glib-2.0/gio/gsimpleasyncresult.h:116:21: note: declared here
  116 | void                g_simple_async_result_take_error       (GSimpleAsyncResult      *simple,
      |                     ^~~~~~~~~~~~~~~~~~~~~~~~~~~~~~~~
zpj-skydrive.c: In function 'zpj_skydrive_init':
zpj-skydrive.c:302:13: warning: Deprecated pre-processor symbol, replace with 
  302 |   self->priv = G_TYPE_INSTANCE_GET_PRIVATE (self, ZPJ_TYPE_SKYDRIVE, ZpjSkydrivePrivate);
      |             ^~~~~~~~~~~~~~~~~~~~~~~~~~~~~~~~~~~~~~~~~~~~~~~~
zpj-skydrive.c: In function 'zpj_skydrive_class_init':
zpj-skydrive.c:324:3: warning: 'g_type_class_add_private' is deprecated [-Wdeprecated-declarations]
  324 |   g_type_class_add_private (class, sizeof (ZpjSkydrivePrivate));
      |   ^~~~~~~~~~~~~~~~~~~~~~~~
In file included from /usr/include/glib-2.0/gobject/gobject.h:24,
                 from /usr/include/glib-2.0/gobject/gbinding.h:29,
                 from /usr/include/glib-2.0/glib-object.h:22,
                 from /usr/include/json-glib-1.0/json-glib/json-types.h:31,
                 from /usr/include/json-glib-1.0/json-glib/json-glib.h:29,
                 from zpj-skydrive.c:24:
/usr/include/glib-2.0/gobject/gtype.h:1304:10: note: declared here
 1304 | void     g_type_class_add_private       (gpointer                    g_class,
      |          ^~~~~~~~~~~~~~~~~~~~~~~~
zpj-skydrive.c: In function 'zpj_skydrive_delete_entry_id':
zpj-skydrive.c:417:3: warning: 'soup_session_sync_new' is deprecated: Use 'soup_session_new' instead [-Wdeprecated-declarations]
  417 |   session = soup_session_sync_new ();
      |   ^~~~~~~
In file included from /usr/include/libsoup-2.4/libsoup/soup.h:52,
                 from zpj-skydrive.c:25:
/usr/include/libsoup-2.4/libsoup/soup-session-sync.h:51:14: note: declared here
   51 | SoupSession *soup_session_sync_new              (void);
      |              ^~~~~~~~~~~~~~~~~~~~~
zpj-skydrive.c: In function 'zpj_skydrive_download_file_id_to_stream':
zpj-skydrive.c:479:3: warning: 'soup_session_sync_new' is deprecated: Use 'soup_session_new' instead [-Wdeprecated-declarations]
  479 |   session = soup_session_sync_new ();
      |   ^~~~~~~
In file included from /usr/include/libsoup-2.4/libsoup/soup.h:52,
                 from zpj-skydrive.c:25:
/usr/include/libsoup-2.4/libsoup/soup-session-sync.h:51:14: note: declared here
   51 | SoupSession *soup_session_sync_new              (void);
      |              ^~~~~~~~~~~~~~~~~~~~~
zpj-skydrive.c:480:3: warning: 'soup_requester_new' is deprecated [-Wdeprecated-declarations]
  480 |   requester = soup_requester_new ();
      |   ^~~~~~~~~
In file included from /usr/include/libsoup-2.4/libsoup/soup.h:45,
                 from zpj-skydrive.c:25:
/usr/include/libsoup-2.4/libsoup/soup-requester.h:56:16: note: declared here
   56 | SoupRequester *soup_requester_new             (void);
      |                ^~~~~~~~~~~~~~~~~~
zpj-skydrive.c:484:3: warning: 'soup_requester_request' is deprecated: Use 'soup_session_request' instead [-Wdeprecated-declarations]
  484 |   request = soup_requester_request (requester, url, error);
      |   ^~~~~~~
In file included from /usr/include/libsoup-2.4/libsoup/soup.h:45,
                 from zpj-skydrive.c:25:
/usr/include/libsoup-2.4/libsoup/soup-requester.h:60:16: note: declared here
   60 | SoupRequest   *soup_requester_request         (SoupRequester  *requester,
      |                ^~~~~~~~~~~~~~~~~~~~~~
zpj-skydrive.c: In function 'zpj_skydrive_download_file_id_to_stream_async':
zpj-skydrive.c:541:3: warning: 'g_simple_async_result_new' is deprecated: Use 'g_task_new' instead [-Wdeprecated-declarations]
  541 |   simple = g_simple_async_result_new (G_OBJECT (self),
      |   ^~~~~~
In file included from /usr/include/glib-2.0/gio/gio.h:136,
                 from /usr/include/json-glib-1.0/json-glib/json-generator.h:32,
                 from /usr/include/json-glib-1.0/json-glib/json-glib.h:32,
                 from zpj-skydrive.c:24:
/usr/include/glib-2.0/gio/gsimpleasyncresult.h:51:21: note: declared here
   51 | GSimpleAsyncResult *g_simple_async_result_new              (GObject                 *source_object,
      |                     ^~~~~~~~~~~~~~~~~~~~~~~~~
zpj-skydrive.c:548:3: warning: 'g_simple_async_result_set_op_res_gpointer' is deprecated [-Wdeprecated-declarations]
  548 |   g_simple_async_result_set_op_res_gpointer (simple, data, (GDestroyNotify) zpj_skydrive_thread_data_free);
      |   ^~~~~~~~~~~~~~~~~~~~~~~~~~~~~~~~~~~~~~~~~
In file included from /usr/include/glib-2.0/gio/gio.h:136,
                 from /usr/include/json-glib-1.0/json-glib/json-generator.h:32,
                 from /usr/include/json-glib-1.0/json-glib/json-glib.h:32,
                 from zpj-skydrive.c:24:
/usr/include/glib-2.0/gio/gsimpleasyncresult.h:75:21: note: declared here
   75 | void                g_simple_async_result_set_op_res_gpointer (GSimpleAsyncResult      *simple,
      |                     ^~~~~~~~~~~~~~~~~~~~~~~~~~~~~~~~~~~~~~~~~
zpj-skydrive.c:550:3: warning: 'g_simple_async_result_run_in_thread' is deprecated [-Wdeprecated-declarations]
  550 |   g_simple_async_result_run_in_thread (simple,
      |   ^~~~~~~~~~~~~~~~~~~~~~~~~~~~~~~~~~~
In file included from /usr/include/glib-2.0/gio/gio.h:136,
                 from /usr/include/json-glib-1.0/json-glib/json-generator.h:32,
                 from /usr/include/json-glib-1.0/json-glib/json-glib.h:32,
                 from zpj-skydrive.c:24:
/usr/include/glib-2.0/gio/gsimpleasyncresult.h:108:21: note: declared here
  108 | void                g_simple_async_result_run_in_thread    (GSimpleAsyncResult      *simple,
      |                     ^~~~~~~~~~~~~~~~~~~~~~~~~~~~~~~~~~~
zpj-skydrive.c: In function 'zpj_skydrive_download_file_id_to_stream_finish':
zpj-skydrive.c:579:3: warning: 'g_simple_async_result_is_valid' is deprecated [-Wdeprecated-declarations]
  579 |   g_return_val_if_fail (g_simple_async_result_is_valid (res,
      |   ^~~~~~~~~~~~~~~~~~~~
In file included from /usr/include/glib-2.0/gio/gio.h:136,
                 from /usr/include/json-glib-1.0/json-glib/json-generator.h:32,
                 from /usr/include/json-glib-1.0/json-glib/json-glib.h:32,
                 from zpj-skydrive.c:24:
/usr/include/glib-2.0/gio/gsimpleasyncresult.h:135:21: note: declared here
  135 | gboolean            g_simple_async_result_is_valid         (GAsyncResult            *result,
      |                     ^~~~~~~~~~~~~~~~~~~~~~~~~~~~~~
zpj-skydrive.c:585:3: warning: 'g_simple_async_result_propagate_error' is deprecated [-Wdeprecated-declarations]
  585 |   if (g_simple_async_result_propagate_error (simple, error))
      |   ^~
In file included from /usr/include/glib-2.0/gio/gio.h:136,
                 from /usr/include/json-glib-1.0/json-glib/json-generator.h:32,
                 from /usr/include/json-glib-1.0/json-glib/json-glib.h:32,
                 from zpj-skydrive.c:24:
/usr/include/glib-2.0/gio/gsimpleasyncresult.h:119:21: note: declared here
  119 | gboolean            g_simple_async_result_propagate_error  (GSimpleAsyncResult      *simple,
      |                     ^~~~~~~~~~~~~~~~~~~~~~~~~~~~~~~~~~~~~
zpj-skydrive.c:588:3: warning: 'g_simple_async_result_get_op_res_gpointer' is deprecated [-Wdeprecated-declarations]
  588 |   data = (ZpjSkydriveThreadData *) g_simple_async_result_get_op_res_gpointer (simple);
      |   ^~~~
In file included from /usr/include/glib-2.0/gio/gio.h:136,
                 from /usr/include/json-glib-1.0/json-glib/json-generator.h:32,
                 from /usr/include/json-glib-1.0/json-glib/json-glib.h:32,
                 from zpj-skydrive.c:24:
/usr/include/glib-2.0/gio/gsimpleasyncresult.h:79:21: note: declared here
   79 | gpointer            g_simple_async_result_get_op_res_gpointer (GSimpleAsyncResult      *simple);
      |                     ^~~~~~~~~~~~~~~~~~~~~~~~~~~~~~~~~~~~~~~~~
zpj-skydrive.c: In function 'zpj_skydrive_download_file_id_to_path':
zpj-skydrive.c:746:3: warning: 'soup_session_async_new_with_options' is deprecated: Use 'soup_session_new' instead [-Wdeprecated-declarations]
  746 |   session = soup_session_async_new_with_options (SOUP_SESSION_USE_THREAD_CONTEXT, TRUE, NULL);
      |   ^~~~~~~
In file included from /usr/include/libsoup-2.4/libsoup/soup.h:50,
                 from zpj-skydrive.c:25:
/usr/include/libsoup-2.4/libsoup/soup-session-async.h:54:14: note: declared here
   54 | SoupSession *soup_session_async_new_with_options (const char *optname1,
      |              ^~~~~~~~~~~~~~~~~~~~~~~~~~~~~~~~~~~
zpj-skydrive.c: In function 'zpj_skydrive_list_folder_id_async':
zpj-skydrive.c:965:3: warning: 'g_simple_async_result_new' is deprecated: Use 'g_task_new' instead [-Wdeprecated-declarations]
  965 |   simple = g_simple_async_result_new (G_OBJECT (self), callback, user_data, zpj_skydrive_list_folder_id_async);
      |   ^~~~~~
In file included from /usr/include/glib-2.0/gio/gio.h:136,
                 from /usr/include/json-glib-1.0/json-glib/json-generator.h:32,
                 from /usr/include/json-glib-1.0/json-glib/json-glib.h:32,
                 from zpj-skydrive.c:24:
/usr/include/glib-2.0/gio/gsimpleasyncresult.h:51:21: note: declared here
   51 | GSimpleAsyncResult *g_simple_async_result_new              (GObject                 *source_object,
      |                     ^~~~~~~~~~~~~~~~~~~~~~~~~
zpj-skydrive.c:969:3: warning: 'g_simple_async_result_set_op_res_gpointer' is deprecated [-Wdeprecated-declarations]
  969 |   g_simple_async_result_set_op_res_gpointer (simple, data, (GDestroyNotify) zpj_skydrive_thread_data_free);
      |   ^~~~~~~~~~~~~~~~~~~~~~~~~~~~~~~~~~~~~~~~~
In file included from /usr/include/glib-2.0/gio/gio.h:136,
                 from /usr/include/json-glib-1.0/json-glib/json-generator.h:32,
                 from /usr/include/json-glib-1.0/json-glib/json-glib.h:32,
                 from zpj-skydrive.c:24:
/usr/include/glib-2.0/gio/gsimpleasyncresult.h:75:21: note: declared here
   75 | void                g_simple_async_result_set_op_res_gpointer (GSimpleAsyncResult      *simple,
      |                     ^~~~~~~~~~~~~~~~~~~~~~~~~~~~~~~~~~~~~~~~~
zpj-skydrive.c:971:3: warning: 'g_simple_async_result_run_in_thread' is deprecated [-Wdeprecated-declarations]
  971 |   g_simple_async_result_run_in_thread (simple,
      |   ^~~~~~~~~~~~~~~~~~~~~~~~~~~~~~~~~~~
In file included from /usr/include/glib-2.0/gio/gio.h:136,
                 from /usr/include/json-glib-1.0/json-glib/json-generator.h:32,
                 from /usr/include/json-glib-1.0/json-glib/json-glib.h:32,
                 from zpj-skydrive.c:24:
/usr/include/glib-2.0/gio/gsimpleasyncresult.h:108:21: note: declared here
  108 | void                g_simple_async_result_run_in_thread    (GSimpleAsyncResult      *simple,
      |                     ^~~~~~~~~~~~~~~~~~~~~~~~~~~~~~~~~~~
zpj-skydrive.c: In function 'zpj_skydrive_list_folder_id_finish':
zpj-skydrive.c:1000:3: warning: 'g_simple_async_result_is_valid' is deprecated [-Wdeprecated-declarations]
 1000 |   g_return_val_if_fail (g_simple_async_result_is_valid (res, G_OBJECT (self), zpj_skydrive_list_folder_id_async),
      |   ^~~~~~~~~~~~~~~~~~~~
In file included from /usr/include/glib-2.0/gio/gio.h:136,
                 from /usr/include/json-glib-1.0/json-glib/json-generator.h:32,
                 from /usr/include/json-glib-1.0/json-glib/json-glib.h:32,
                 from zpj-skydrive.c:24:
/usr/include/glib-2.0/gio/gsimpleasyncresult.h:135:21: note: declared here
  135 | gboolean            g_simple_async_result_is_valid         (GAsyncResult            *result,
      |                     ^~~~~~~~~~~~~~~~~~~~~~~~~~~~~~
zpj-skydrive.c:1004:3: warning: 'g_simple_async_result_propagate_error' is deprecated [-Wdeprecated-declarations]
 1004 |   if (g_simple_async_result_propagate_error (simple, error))
      |   ^~
In file included from /usr/include/glib-2.0/gio/gio.h:136,
                 from /usr/include/json-glib-1.0/json-glib/json-generator.h:32,
                 from /usr/include/json-glib-1.0/json-glib/json-glib.h:32,
                 from zpj-skydrive.c:24:
/usr/include/glib-2.0/gio/gsimpleasyncresult.h:119:21: note: declared here
  119 | gboolean            g_simple_async_result_propagate_error  (GSimpleAsyncResult      *simple,
      |                     ^~~~~~~~~~~~~~~~~~~~~~~~~~~~~~~~~~~~~
zpj-skydrive.c:1007:3: warning: 'g_simple_async_result_get_op_res_gpointer' is deprecated [-Wdeprecated-declarations]
 1007 |   data = (ZpjSkydriveThreadData *) g_simple_async_result_get_op_res_gpointer (simple);
      |   ^~~~
In file included from /usr/include/glib-2.0/gio/gio.h:136,
                 from /usr/include/json-glib-1.0/json-glib/json-generator.h:32,
                 from /usr/include/json-glib-1.0/json-glib/json-glib.h:32,
                 from zpj-skydrive.c:24:
/usr/include/glib-2.0/gio/gsimpleasyncresult.h:79:21: note: declared here
   79 | gpointer            g_simple_async_result_get_op_res_gpointer (GSimpleAsyncResult      *simple);
      |                     ^~~~~~~~~~~~~~~~~~~~~~~~~~~~~~~~~~~~~~~~~
zpj-skydrive.c: In function 'zpj_skydrive_query_info_from_id':
zpj-skydrive.c:1054:15: warning: unused variable 'object' [-Wunused-variable]
 1054 |   JsonObject *object;
      |               ^~~~~~
zpj-skydrive.c: In function 'zpj_skydrive_query_info_from_id_async':
zpj-skydrive.c:1133:3: warning: 'g_simple_async_result_new' is deprecated: Use 'g_task_new' instead [-Wdeprecated-declarations]
 1133 |   simple = g_simple_async_result_new (G_OBJECT (self), callback, user_data, zpj_skydrive_query_info_from_id_async);
      |   ^~~~~~
In file included from /usr/include/glib-2.0/gio/gio.h:136,
                 from /usr/include/json-glib-1.0/json-glib/json-generator.h:32,
                 from /usr/include/json-glib-1.0/json-glib/json-glib.h:32,
                 from zpj-skydrive.c:24:
/usr/include/glib-2.0/gio/gsimpleasyncresult.h:51:21: note: declared here
   51 | GSimpleAsyncResult *g_simple_async_result_new              (GObject                 *source_object,
      |                     ^~~~~~~~~~~~~~~~~~~~~~~~~
zpj-skydrive.c:1137:3: warning: 'g_simple_async_result_set_op_res_gpointer' is deprecated [-Wdeprecated-declarations]
 1137 |   g_simple_async_result_set_op_res_gpointer (simple, data, (GDestroyNotify) zpj_skydrive_thread_data_free);
      |   ^~~~~~~~~~~~~~~~~~~~~~~~~~~~~~~~~~~~~~~~~
In file included from /usr/include/glib-2.0/gio/gio.h:136,
                 from /usr/include/json-glib-1.0/json-glib/json-generator.h:32,
                 from /usr/include/json-glib-1.0/json-glib/json-glib.h:32,
                 from zpj-skydrive.c:24:
/usr/include/glib-2.0/gio/gsimpleasyncresult.h:75:21: note: declared here
   75 | void                g_simple_async_result_set_op_res_gpointer (GSimpleAsyncResult      *simple,
      |                     ^~~~~~~~~~~~~~~~~~~~~~~~~~~~~~~~~~~~~~~~~
zpj-skydrive.c:1139:3: warning: 'g_simple_async_result_run_in_thread' is deprecated [-Wdeprecated-declarations]
 1139 |   g_simple_async_result_run_in_thread (simple,
      |   ^~~~~~~~~~~~~~~~~~~~~~~~~~~~~~~~~~~
In file included from /usr/include/glib-2.0/gio/gio.h:136,
                 from /usr/include/json-glib-1.0/json-glib/json-generator.h:32,
                 from /usr/include/json-glib-1.0/json-glib/json-glib.h:32,
                 from zpj-skydrive.c:24:
/usr/include/glib-2.0/gio/gsimpleasyncresult.h:108:21: note: declared here
  108 | void                g_simple_async_result_run_in_thread    (GSimpleAsyncResult      *simple,
      |                     ^~~~~~~~~~~~~~~~~~~~~~~~~~~~~~~~~~~
zpj-skydrive.c: In function 'zpj_skydrive_query_info_from_id_finish':
zpj-skydrive.c:1166:3: warning: 'g_simple_async_result_is_valid' is deprecated [-Wdeprecated-declarations]
 1166 |   g_return_val_if_fail (g_simple_async_result_is_valid (res,
      |   ^~~~~~~~~~~~~~~~~~~~
In file included from /usr/include/glib-2.0/gio/gio.h:136,
                 from /usr/include/json-glib-1.0/json-glib/json-generator.h:32,
                 from /usr/include/json-glib-1.0/json-glib/json-glib.h:32,
                 from zpj-skydrive.c:24:
/usr/include/glib-2.0/gio/gsimpleasyncresult.h:135:21: note: declared here
  135 | gboolean            g_simple_async_result_is_valid         (GAsyncResult            *result,
      |                     ^~~~~~~~~~~~~~~~~~~~~~~~~~~~~~
zpj-skydrive.c:1172:3: warning: 'g_simple_async_result_propagate_error' is deprecated [-Wdeprecated-declarations]
 1172 |   if (g_simple_async_result_propagate_error (simple, error))
      |   ^~
In file included from /usr/include/glib-2.0/gio/gio.h:136,
                 from /usr/include/json-glib-1.0/json-glib/json-generator.h:32,
                 from /usr/include/json-glib-1.0/json-glib/json-glib.h:32,
                 from zpj-skydrive.c:24:
/usr/include/glib-2.0/gio/gsimpleasyncresult.h:119:21: note: declared here
  119 | gboolean            g_simple_async_result_propagate_error  (GSimpleAsyncResult      *simple,
      |                     ^~~~~~~~~~~~~~~~~~~~~~~~~~~~~~~~~~~~~
zpj-skydrive.c:1175:3: warning: 'g_simple_async_result_get_op_res_gpointer' is deprecated [-Wdeprecated-declarations]
 1175 |   data = (ZpjSkydriveThreadData *) g_simple_async_result_get_op_res_gpointer (simple);
      |   ^~~~
In file included from /usr/include/glib-2.0/gio/gio.h:136,
                 from /usr/include/json-glib-1.0/json-glib/json-generator.h:32,
                 from /usr/include/json-glib-1.0/json-glib/json-glib.h:32,
                 from zpj-skydrive.c:24:
/usr/include/glib-2.0/gio/gsimpleasyncresult.h:79:21: note: declared here
   79 | gpointer            g_simple_async_result_get_op_res_gpointer (GSimpleAsyncResult      *simple);
      |                     ^~~~~~~~~~~~~~~~~~~~~~~~~~~~~~~~~~~~~~~~~
zpj-skydrive.c: In function 'zpj_skydrive_upload_path_to_folder_id':
zpj-skydrive.c:1293:3: warning: 'soup_session_sync_new' is deprecated: Use 'soup_session_new' instead [-Wdeprecated-declarations]
 1293 |   session = soup_session_sync_new ();
      |   ^~~~~~~
In file included from /usr/include/libsoup-2.4/libsoup/soup.h:52,
                 from zpj-skydrive.c:25:
/usr/include/libsoup-2.4/libsoup/soup-session-sync.h:51:14: note: declared here
   51 | SoupSession *soup_session_sync_new              (void);
      |              ^~~~~~~~~~~~~~~~~~~~~
make[3]: Leaving directory '/usr/src/RPM/BUILD/libzapojit-0.0.3/src'
make[3]: Entering directory '/usr/src/RPM/BUILD/libzapojit-0.0.3/src'
/bin/sh ../libtool  --tag=CC   --mode=link i586-alt-linux-gcc  -pipe -frecord-gcc-switches -Wall -g -O2 -march=i586 -mtune=generic   -o libzapojit-0.0.la -rpath /usr/lib zpj-enums.lo zpj-authorization-domain.lo zpj-authorizer.lo zpj-goa-authorizer.lo zpj-skydrive.lo zpj-skydrive-entry.lo zpj-skydrive-file.lo zpj-skydrive-folder.lo zpj-skydrive-photo.lo -lgio-2.0 -lgobject-2.0 -lglib-2.0 -lglib-2.0 -lgoa-1.0 -lgio-2.0 -lgobject-2.0 -lglib-2.0 -ljson-glib-1.0 -lgio-2.0 -lgobject-2.0 -lglib-2.0 -lrest-0.7 -lsoup-2.4 -lgio-2.0 -lgobject-2.0 -lglib-2.0 -lxml2 -lsoup-2.4 -lgio-2.0 -lgobject-2.0 -lglib-2.0  
libtool: link: i586-alt-linux-gcc -shared  -fPIC -DPIC  .libs/zpj-enums.o .libs/zpj-authorization-domain.o .libs/zpj-authorizer.o .libs/zpj-goa-authorizer.o .libs/zpj-skydrive.o .libs/zpj-skydrive-entry.o .libs/zpj-skydrive-file.o .libs/zpj-skydrive-folder.o .libs/zpj-skydrive-photo.o   -lgoa-1.0 -ljson-glib-1.0 -lrest-0.7 -lxml2 -lsoup-2.4 -lgio-2.0 -lgobject-2.0 -lglib-2.0  -O2 -march=i586 -mtune=generic   -Wl,-soname -Wl,libzapojit-0.0.so.0 -o .libs/libzapojit-0.0.so.0.0.0
libtool: link: (cd ".libs" && rm -f "libzapojit-0.0.so.0" && ln -s "libzapojit-0.0.so.0.0.0" "libzapojit-0.0.so.0")
libtool: link: (cd ".libs" && rm -f "libzapojit-0.0.so" && ln -s "libzapojit-0.0.so.0.0.0" "libzapojit-0.0.so")
libtool: link: ( cd ".libs" && rm -f "libzapojit-0.0.la" && ln -s "../libzapojit-0.0.la" "libzapojit-0.0.la" )
make[3]: Leaving directory '/usr/src/RPM/BUILD/libzapojit-0.0.3/src'
make[3]: Entering directory '/usr/src/RPM/BUILD/libzapojit-0.0.3/src'
CPPFLAGS="" CFLAGS="-pipe -frecord-gcc-switches -Wall -g -O2 -march=i586 -mtune=generic" LDFLAGS="" CC="i586-alt-linux-gcc" PKG_CONFIG="/usr/bin/pkg-config" GI_HOST_OS="" DLLTOOL="false"  /usr/bin/g-ir-scanner  --add-include-path=. --namespace=Zpj --nsversion=0.0 --libtool="/bin/sh ../libtool"  --include=Gio-2.0 --include=GLib-2.0 --include=Json-1.0 --include=Rest-0.7 --include=Soup-2.4    --library=libzapojit-0.0.la  --cflags-begin -DPACKAGE_LOCALE_DIR=\""/usr/share/locale"\" -DGOA_API_IS_SUBJECT_TO_CHANGE -DLIBSOUP_USE_UNSTABLE_REQUEST_API -pthread -I/usr/include/glib-2.0 -I/usr/lib/glib-2.0/include -I/usr/include/glib-2.0 -I/usr/lib/glib-2.0/include -pthread -I/usr/include/goa-1.0 -I/usr/lib/goa-1.0/include -I/usr/include/glib-2.0 -I/usr/lib/glib-2.0/include -pthread -I/usr/include/json-glib-1.0 -I/usr/include/glib-2.0 -I/usr/lib/glib-2.0/include -pthread -I/usr/include/rest-0.7 -I/usr/include/libsoup-2.4 -I/usr/include/glib-2.0 -I/usr/lib/glib-2.0/include -I/usr/include/libxml2 -pthread -I/usr/include/libsoup-2.4 -I/usr/include/libxml2 -I/usr/include/glib-2.0 -I/usr/lib/glib-2.0/include  --cflags-end  zpj-authorization-domain.h zpj-authorizer.h zpj-goa-authorizer.h zpj-skydrive.h zpj-skydrive-entry.h zpj-skydrive-file.h zpj-skydrive-folder.h zpj-skydrive-photo.h zpj-enums.c zpj-enums.h zpj-authorization-domain.c zpj-authorizer.c zpj-goa-authorizer.c zpj-skydrive.c zpj-skydrive-entry.c zpj-skydrive-file.c zpj-skydrive-folder.c zpj-skydrive-photo.c libzapojit-0.0.la Makefile --output Zpj-0.0.gir
/usr/lib/gcc/i586-alt-linux/10/include/stddef.h:424: syntax error, unexpected identifier in '  __float128 __max_align_f128 __attribute__((__aligned__(__alignof(__float128))));' at '__float128'
g-ir-scanner: link: /bin/sh ../libtool --mode=link --tag=CC i586-alt-linux-gcc -o /usr/src/RPM/BUILD/libzapojit-0.0.3/src/tmp-introspect_ltodc4r/Zpj-0.0 -export-dynamic -pipe -frecord-gcc-switches -Wall -g -O2 -march=i586 -mtune=generic /usr/src/RPM/BUILD/libzapojit-0.0.3/src/tmp-introspect_ltodc4r/Zpj-0.0.o -L. libzapojit-0.0.la -lgio-2.0 -lgobject-2.0 -Wl,--export-dynamic -lgmodule-2.0 -pthread -lglib-2.0
libtool: link: i586-alt-linux-gcc -o /usr/src/RPM/BUILD/libzapojit-0.0.3/src/tmp-introspect_ltodc4r/.libs/Zpj-0.0 -pipe -frecord-gcc-switches -Wall -g -O2 -march=i586 -mtune=generic /usr/src/RPM/BUILD/libzapojit-0.0.3/src/tmp-introspect_ltodc4r/Zpj-0.0.o -Wl,--export-dynamic -pthread -Wl,--export-dynamic  -L. ./.libs/libzapojit-0.0.so -lgoa-1.0 -ljson-glib-1.0 -lrest-0.7 -lxml2 -lsoup-2.4 -lgio-2.0 -lgobject-2.0 -lgmodule-2.0 -lglib-2.0 -pthread
g-ir-scanner: Zpj: warning: 2 warnings suppressed (use --warn-all to see them)
make[3]: Leaving directory '/usr/src/RPM/BUILD/libzapojit-0.0.3/src'
make[3]: Entering directory '/usr/src/RPM/BUILD/libzapojit-0.0.3/src'
/usr/bin/g-ir-compiler --includedir=. --includedir=. Zpj-0.0.gir -o Zpj-0.0.typelib
make[3]: Leaving directory '/usr/src/RPM/BUILD/libzapojit-0.0.3/src'
Making all in docs
Making all in reference
make[3]: Nothing to be done for 'all'.
make[3]: Nothing to be done for 'all-am'.
Making all in po
make[2]: Nothing to be done for 'all'.
+ exit 0
Executing(%install): /bin/sh -e /usr/src/tmp/rpm-tmp.92186
+ umask 022
+ /bin/mkdir -p /usr/src/RPM/BUILD
+ cd /usr/src/RPM/BUILD
+ /bin/chmod -Rf u+rwX -- /usr/src/tmp/libzapojit-buildroot
+ :
+ /bin/rm -rf -- /usr/src/tmp/libzapojit-buildroot
+ PATH=/usr/libexec/rpm-build:/usr/src/bin:/bin:/usr/bin:/usr/X11R6/bin:/usr/games
+ cd libzapojit-0.0.3
+ make 'INSTALL=/usr/libexec/rpm-build/install -p' install DESTDIR=/usr/src/tmp/libzapojit-buildroot
make: Entering directory '/usr/src/RPM/BUILD/libzapojit-0.0.3'
Making install in src
make[1]: Entering directory '/usr/src/RPM/BUILD/libzapojit-0.0.3/src'
make  install-am
make[2]: Entering directory '/usr/src/RPM/BUILD/libzapojit-0.0.3/src'
make[3]: Entering directory '/usr/src/RPM/BUILD/libzapojit-0.0.3/src'
 /bin/mkdir -p '/usr/src/tmp/libzapojit-buildroot/usr/lib'
 /bin/sh ../libtool   --mode=install /usr/libexec/rpm-build/install -p   libzapojit-0.0.la '/usr/src/tmp/libzapojit-buildroot/usr/lib'
libtool: install: /usr/libexec/rpm-build/install -p .libs/libzapojit-0.0.so.0.0.0 /usr/src/tmp/libzapojit-buildroot/usr/lib/libzapojit-0.0.so.0.0.0
libtool: install: (cd /usr/src/tmp/libzapojit-buildroot/usr/lib && { ln -s -f libzapojit-0.0.so.0.0.0 libzapojit-0.0.so.0 || { rm -f libzapojit-0.0.so.0 && ln -s libzapojit-0.0.so.0.0.0 libzapojit-0.0.so.0; }; })
libtool: install: (cd /usr/src/tmp/libzapojit-buildroot/usr/lib && { ln -s -f libzapojit-0.0.so.0.0.0 libzapojit-0.0.so || { rm -f libzapojit-0.0.so && ln -s libzapojit-0.0.so.0.0.0 libzapojit-0.0.so; }; })
libtool: install: /usr/libexec/rpm-build/install -p .libs/libzapojit-0.0.lai /usr/src/tmp/libzapojit-buildroot/usr/lib/libzapojit-0.0.la
libtool: install: warning: remember to run `libtool --finish /usr/lib'
 /bin/mkdir -p '/usr/src/tmp/libzapojit-buildroot/usr/share/gir-1.0'
 /usr/libexec/rpm-build/install -p -m 644 Zpj-0.0.gir '/usr/src/tmp/libzapojit-buildroot/usr/share/gir-1.0'
 /bin/mkdir -p '/usr/src/tmp/libzapojit-buildroot/usr/include/libzapojit-0.0/zpj'
 /usr/libexec/rpm-build/install -p -m 644 zpj.h zpj-authorization-domain.h zpj-authorizer.h zpj-goa-authorizer.h zpj-skydrive.h zpj-skydrive-entry.h zpj-skydrive-file.h zpj-skydrive-folder.h zpj-skydrive-photo.h '/usr/src/tmp/libzapojit-buildroot/usr/include/libzapojit-0.0/zpj'
 /bin/mkdir -p '/usr/src/tmp/libzapojit-buildroot/usr/lib/girepository-1.0'
 /usr/libexec/rpm-build/install -p -m 644 Zpj-0.0.typelib '/usr/src/tmp/libzapojit-buildroot/usr/lib/girepository-1.0'
make[3]: Leaving directory '/usr/src/RPM/BUILD/libzapojit-0.0.3/src'
make[2]: Leaving directory '/usr/src/RPM/BUILD/libzapojit-0.0.3/src'
make[1]: Leaving directory '/usr/src/RPM/BUILD/libzapojit-0.0.3/src'
Making install in docs
make[1]: Entering directory '/usr/src/RPM/BUILD/libzapojit-0.0.3/docs'
Making install in reference
make[2]: Entering directory '/usr/src/RPM/BUILD/libzapojit-0.0.3/docs/reference'
make[3]: Entering directory '/usr/src/RPM/BUILD/libzapojit-0.0.3/docs/reference'
make[3]: Nothing to be done for 'install-exec-am'.
 /usr/libexec/rpm-build/install -p -m 644 ./html/ZpjGoaAuthorizer.html
 /usr/libexec/rpm-build/install -p -m 644 ./html/ZpjSkydrive.html
 /usr/libexec/rpm-build/install -p -m 644 ./html/ZpjSkydriveEntry.html
 /usr/libexec/rpm-build/install -p -m 644 ./html/ZpjSkydriveFile.html
 /usr/libexec/rpm-build/install -p -m 644 ./html/ZpjSkydriveFolder.html
 /usr/libexec/rpm-build/install -p -m 644 ./html/ZpjSkydrivePhoto.html
 /usr/libexec/rpm-build/install -p -m 644 ./html/annotation-glossary.html
 /usr/libexec/rpm-build/install -p -m 644 ./html/authorization.html
 /usr/libexec/rpm-build/install -p -m 644 ./html/home.png
 /usr/libexec/rpm-build/install -p -m 644 ./html/index.html
 /usr/libexec/rpm-build/install -p -m 644 ./html/index.sgml
 /usr/libexec/rpm-build/install -p -m 644 ./html/ix01.html
 /usr/libexec/rpm-build/install -p -m 644 ./html/left.png
 /usr/libexec/rpm-build/install -p -m 644 ./html/libzapojit-0.0-ZpjAuthorizer.html
 /usr/libexec/rpm-build/install -p -m 644 ./html/libzapojit-0.0.devhelp2
 /usr/libexec/rpm-build/install -p -m 644 ./html/right.png
 /usr/libexec/rpm-build/install -p -m 644 ./html/skydrive.html
 /usr/libexec/rpm-build/install -p -m 644 ./html/style.css
 /usr/libexec/rpm-build/install -p -m 644 ./html/up.png
make[3]: Leaving directory '/usr/src/RPM/BUILD/libzapojit-0.0.3/docs/reference'
make[2]: Leaving directory '/usr/src/RPM/BUILD/libzapojit-0.0.3/docs/reference'
make[2]: Entering directory '/usr/src/RPM/BUILD/libzapojit-0.0.3/docs'
make[3]: Entering directory '/usr/src/RPM/BUILD/libzapojit-0.0.3/docs'
make[3]: Nothing to be done for 'install-exec-am'.
make[3]: Nothing to be done for 'install-data-am'.
make[3]: Leaving directory '/usr/src/RPM/BUILD/libzapojit-0.0.3/docs'
make[2]: Leaving directory '/usr/src/RPM/BUILD/libzapojit-0.0.3/docs'
make[1]: Leaving directory '/usr/src/RPM/BUILD/libzapojit-0.0.3/docs'
Making install in po
make[1]: Entering directory '/usr/src/RPM/BUILD/libzapojit-0.0.3/po'
linguas=""; \
for lang in $linguas; do \
  dir=/usr/src/tmp/libzapojit-buildroot/usr/share/locale/$lang/LC_MESSAGES; \
  /bin/sh /usr/src/RPM/BUILD/libzapojit-0.0.3/config/install-sh -d $dir; \
  if test -r $lang.gmo; then \
    /usr/libexec/rpm-build/install -p -m 644 $lang.gmo $dir/libzapojit.mo; \
    echo "installing $lang.gmo as $dir/libzapojit.mo"; \
  else \
    /usr/libexec/rpm-build/install -p -m 644 ./$lang.gmo $dir/libzapojit.mo; \
    echo "installing ./$lang.gmo as" \
	 "$dir/libzapojit.mo"; \
  fi; \
  if test -r $lang.gmo.m; then \
    /usr/libexec/rpm-build/install -p -m 644 $lang.gmo.m $dir/libzapojit.mo.m; \
    echo "installing $lang.gmo.m as $dir/libzapojit.mo.m"; \
  else \
    if test -r ./$lang.gmo.m ; then \
      /usr/libexec/rpm-build/install -p -m 644 ./$lang.gmo.m \
	$dir/libzapojit.mo.m; \
      echo "installing ./$lang.gmo.m as" \
	   "$dir/libzapojit.mo.m"; \
    else \
      true; \
    fi; \
  fi; \
done
make[1]: Leaving directory '/usr/src/RPM/BUILD/libzapojit-0.0.3/po'
make[1]: Entering directory '/usr/src/RPM/BUILD/libzapojit-0.0.3'
make[2]: Entering directory '/usr/src/RPM/BUILD/libzapojit-0.0.3'
make[2]: Nothing to be done for 'install-exec-am'.
 /bin/mkdir -p '/usr/src/tmp/libzapojit-buildroot/usr/share/doc/libzapojit'
 /usr/libexec/rpm-build/install -p -m 644 AUTHORS COPYING ChangeLog INSTALL NEWS README '/usr/src/tmp/libzapojit-buildroot/usr/share/doc/libzapojit'
 /bin/mkdir -p '/usr/src/tmp/libzapojit-buildroot/usr/lib/pkgconfig'
 /usr/libexec/rpm-build/install -p -m 644 zapojit-0.0.pc '/usr/src/tmp/libzapojit-buildroot/usr/lib/pkgconfig'
make[2]: Leaving directory '/usr/src/RPM/BUILD/libzapojit-0.0.3'
make[1]: Leaving directory '/usr/src/RPM/BUILD/libzapojit-0.0.3'
make: Leaving directory '/usr/src/RPM/BUILD/libzapojit-0.0.3'
+ rm -rf /usr/src/tmp/libzapojit-buildroot/usr/share/doc/libzapojit
+ /usr/lib/rpm/brp-alt
Cleaning files in /usr/src/tmp/libzapojit-buildroot (auto)
removed './usr/lib/libzapojit-0.0.la'
mode of './usr/lib/libzapojit-0.0.so.0.0.0' changed from 0755 (rwxr-xr-x) to 0644 (rw-r--r--)
Verifying and fixing files in /usr/src/tmp/libzapojit-buildroot (binconfig,pkgconfig,libtool,desktop,gnuconfig)
/usr/lib/pkgconfig/zapojit-0.0.pc: Libs: '-L${libdir} -lzapojit-0.0' --> '-lzapojit-0.0'
Checking contents of files in /usr/src/tmp/libzapojit-buildroot/ (default)
Compressing files in /usr/src/tmp/libzapojit-buildroot (auto)
Adjusting library links in /usr/src/tmp/libzapojit-buildroot
./usr/lib: (from <cmdline>:0)
	libzapojit-0.0.so.0 -> libzapojit-0.0.so.0.0.0
Verifying ELF objects in /usr/src/tmp/libzapojit-buildroot (arch=normal,fhs=normal,lfs=relaxed,lint=relaxed,rpath=normal,stack=normal,textrel=normal,unresolved=normal)
Hardlinking identical .pyc and .pyo files
Processing files: libzapojit-0.0.3-alt1
Executing(%doc): /bin/sh -e /usr/src/tmp/rpm-tmp.12332
+ umask 022
+ /bin/mkdir -p /usr/src/RPM/BUILD
+ cd /usr/src/RPM/BUILD
+ cd libzapojit-0.0.3
+ DOCDIR=/usr/src/tmp/libzapojit-buildroot/usr/share/doc/libzapojit-0.0.3
+ export DOCDIR
+ rm -rf /usr/src/tmp/libzapojit-buildroot/usr/share/doc/libzapojit-0.0.3
+ /bin/mkdir -p /usr/src/tmp/libzapojit-buildroot/usr/share/doc/libzapojit-0.0.3
+ cp -prL AUTHORS NEWS README /usr/src/tmp/libzapojit-buildroot/usr/share/doc/libzapojit-0.0.3
+ chmod -R go-w /usr/src/tmp/libzapojit-buildroot/usr/share/doc/libzapojit-0.0.3
+ chmod -R a+rX /usr/src/tmp/libzapojit-buildroot/usr/share/doc/libzapojit-0.0.3
+ exit 0
Finding Provides (using /usr/lib/rpm/find-provides)
Executing: /bin/sh -e /usr/src/tmp/rpm-tmp.loYWHe
find-provides: running scripts (alternatives,debuginfo,gir,lib,pam,perl,pkgconfig,python,shell,typelib,vala)
lib.prov: /usr/src/tmp/libzapojit-buildroot/usr/lib/libzapojit-0.0.so.0: 55 symbols, 16 bpp
Finding Requires (using /usr/lib/rpm/find-requires)
Executing: /bin/sh -e /usr/src/tmp/rpm-tmp.P0SzZe
find-requires: running scripts (cpp,debuginfo,files,gir-js,gir-python,gir,lib,pam,perl,pkgconfig,pkgconfiglib,python,rpmlib,shebang,shell,static,symlinks,systemd-services,typelib,vala)
Provides: libzapojit-0.0.so.0 = set:jdWmj2CnvwEXVLNZKIBztwwQpH4twn5k7QlbOJZyABwM5YTasq6Iwn9y0ZpzqDGwh1C83IySW4pDp9vgxHUQFqBEfACsaYA2eK599rlngSOJfHh
Requires: libc.so.6(GLIBC_2.1.3), libc.so.6(GLIBC_2.4), libgio-2.0.so.0 >= set:ojZ14mJ9XmPdOinD8IFqQx1EU9S6gQxO9NBSVN8YcEA2zcelEVOX23LVLWpznR3, libglib-2.0.so.0 >= set:oipEyBzT1NZ6Ku1GsOzwj9Cfq1Td1N0gABek0slu4igMrysVwOohKgXIfIvQ02O6a0BY7VBqEnrulKcpi6AssTRLctC09VEJ8nJb0vVpCgZePdtc, libgoa-1.0.so.0 >= set:mjFxj5f6GplJGYfrlDYvw12, libgobject-2.0.so.0 >= set:mg9fw40ZFT24VD3ZwXr8Z73rURaDEpoUPlSDD1op08tDV4qhUZmDuCQXUqy9ffV58JyoWtDC2K3K2ZLxlY8pexumsT0WfY0TqMcf, libjson-glib-1.0.so.0 >= set:lhMXBZHX5cFZlg78eTGso3NbEtmHs2, librest-0.7.so.0 >= set:khfc19cE6BDBobjBZl6E6, libsoup-2.4.so.1 >= set:niVotepZ2tXH0GKw1B2uLco33S2SRzW8woVwWZ9tfgQ1OCa1ZtdYdzoxd6w3ZsJZsO0, rtld(GNU_HASH)
Requires(rpmlib): rpmlib(SetVersions)
Finding debuginfo files (using /usr/lib/rpm/find-debuginfo-files)
Executing: /bin/sh -e /usr/src/tmp/rpm-tmp.oHhKJf
Creating libzapojit-debuginfo package
Processing files: libzapojit-devel-0.0.3-alt1
Finding Provides (using /usr/lib/rpm/find-provides)
Executing: /bin/sh -e /usr/src/tmp/rpm-tmp.6d4ueg
find-provides: running scripts (alternatives,debuginfo,gir,lib,pam,perl,pkgconfig,python,shell,typelib,vala)
Finding Requires (using /usr/lib/rpm/find-requires)
Executing: /bin/sh -e /usr/src/tmp/rpm-tmp.9sM9ag
find-requires: running scripts (cpp,debuginfo,files,gir-js,gir-python,gir,lib,pam,perl,pkgconfig,pkgconfiglib,python,rpmlib,shebang,shell,static,symlinks,systemd-services,typelib,vala)
In file included from /usr/src/tmp/libzapojit-buildroot/usr/include/libzapojit-0.0/zpj/zpj-goa-authorizer.h:25,
                 from /usr/src/tmp/libzapojit-buildroot/usr/include/libzapojit-0.0/zpj/zpj.h:26:
/usr/include/goa-1.0/goa/goa.h:23:2: error: #error libgoa is unstable API. You must define GOA_API_IS_SUBJECT_TO_CHANGE before including goa/goa.h
   23 | #error  libgoa is unstable API. You must define GOA_API_IS_SUBJECT_TO_CHANGE before including goa/goa.h
      |  ^~~~~
cpp.req: /usr/src/tmp/libzapojit-buildroot/usr/include/libzapojit-0.0/zpj/zpj.h: cpp failed, trying c++ mode
i586-alt-linux-cpp: fatal error: cannot execute 'cc1plus': execvp: No such file or directory
compilation terminated.
cpp.req: WARNING: /usr/src/tmp/libzapojit-buildroot/usr/include/libzapojit-0.0/zpj/zpj.h: cpp failed
In file included from /usr/src/tmp/libzapojit-buildroot/usr/include/libzapojit-0.0/zpj/zpj-goa-authorizer.h:25:
/usr/include/goa-1.0/goa/goa.h:23:2: error: #error libgoa is unstable API. You must define GOA_API_IS_SUBJECT_TO_CHANGE before including goa/goa.h
   23 | #error  libgoa is unstable API. You must define GOA_API_IS_SUBJECT_TO_CHANGE before including goa/goa.h
      |  ^~~~~
cpp.req: WARNING: /usr/src/tmp/libzapojit-buildroot/usr/include/libzapojit-0.0/zpj/zpj-goa-authorizer.h: cpp failed
Provides: pkgconfig(zapojit-0.0) = 0.0.3
Requires: libzapojit = 0.0.3-alt1, /usr/lib/libzapojit-0.0.so.0.0.0, /usr/lib/pkgconfig, glib2-devel, libgio-devel, libjson-glib-devel, librest-devel, libsoup-devel, pkgconfig(gio-2.0), pkgconfig(glib-2.0), pkgconfig(goa-1.0), pkgconfig(json-glib-1.0), pkgconfig(libsoup-2.4), pkgconfig(rest-0.7)
Finding debuginfo files (using /usr/lib/rpm/find-debuginfo-files)
Executing: /bin/sh -e /usr/src/tmp/rpm-tmp.wO3ATe
Processing files: libzapojit-gir-0.0.3-alt1
Finding Provides (using /usr/lib/rpm/find-provides)
Executing: /bin/sh -e /usr/src/tmp/rpm-tmp.UXpLAf
find-provides: running scripts (alternatives,debuginfo,gir,lib,pam,perl,pkgconfig,python,shell,typelib,vala)
Finding Requires (using /usr/lib/rpm/find-requires)
Executing: /bin/sh -e /usr/src/tmp/rpm-tmp.MvD9Ve
find-requires: running scripts (cpp,debuginfo,files,gir-js,gir-python,gir,lib,pam,perl,pkgconfig,pkgconfiglib,python,rpmlib,shebang,shell,static,symlinks,systemd-services,typelib,vala)
Provides: typelib(Zpj) = 0.0
Requires: libzapojit = 0.0.3-alt1, typelib(GLib) = 2.0, typelib(Gio) = 2.0, typelib(Json) = 1.0, typelib(Rest) = 0.7, typelib(Soup) = 2.4
Finding debuginfo files (using /usr/lib/rpm/find-debuginfo-files)
Executing: /bin/sh -e /usr/src/tmp/rpm-tmp.b6Cotf
Processing files: libzapojit-gir-devel-0.0.3-alt1
Finding Provides (using /usr/lib/rpm/find-provides)
Executing: /bin/sh -e /usr/src/tmp/rpm-tmp.8XM5Rg
find-provides: running scripts (alternatives,debuginfo,gir,lib,pam,perl,pkgconfig,python,shell,typelib,vala)
Finding Requires (using /usr/lib/rpm/find-requires)
Executing: /bin/sh -e /usr/src/tmp/rpm-tmp.tEADEe
find-requires: running scripts (cpp,debuginfo,files,gir-js,gir-python,gir,lib,pam,perl,pkgconfig,pkgconfiglib,python,rpmlib,shebang,shell,static,symlinks,systemd-services,typelib,vala)
Provides: gir(Zpj) = 0.0
Requires: libzapojit-gir = 0.0.3-alt1, libzapojit-devel = 0.0.3-alt1, gir(GLib) = 2.0, gir(Gio) = 2.0, gir(Json) = 1.0, gir(Rest) = 0.7, gir(Soup) = 2.4
Processing files: libzapojit-devel-doc-0.0.3-alt1
Finding Provides (using /usr/lib/rpm/find-provides)
Executing: /bin/sh -e /usr/src/tmp/rpm-tmp.tLUaBe
find-provides: running scripts (alternatives,debuginfo,gir,lib,pam,perl,pkgconfig,python,shell,typelib,vala)
Finding Requires (using /usr/lib/rpm/find-requires)
Executing: /bin/sh -e /usr/src/tmp/rpm-tmp.CZuvwh
find-requires: running scripts (cpp,debuginfo,files,gir-js,gir-python,gir,lib,pam,perl,pkgconfig,pkgconfiglib,python,rpmlib,shebang,shell,static,symlinks,systemd-services,typelib,vala)
Conflicts: libzapojit-devel < 0.0.3-alt1
Processing files: libzapojit-debuginfo-0.0.3-alt1
Finding Provides (using /usr/lib/rpm/find-provides)
Executing: /bin/sh -e /usr/src/tmp/rpm-tmp.ZOJbpe
find-provides: running scripts (debuginfo)
Finding Requires (using /usr/lib/rpm/find-requires)
Executing: /bin/sh -e /usr/src/tmp/rpm-tmp.CWWKDe
find-requires: running scripts (debuginfo)
Provides: debug(libzapojit-0.0.so.0)
Requires: libzapojit = 0.0.3-alt1, debug(libc.so.6), debug(libgio-2.0.so.0), debug(libglib-2.0.so.0), debug(libgoa-1.0.so.0), debug(libgobject-2.0.so.0), debug(libjson-glib-1.0.so.0), debug(librest-0.7.so.0), debug(libsoup-2.4.so.1)
Removing 1 extra deps from libzapojit-devel due to dependency on libzapojit
Wrote: /usr/src/RPM/RPMS/i586/libzapojit-0.0.3-alt1.i586.rpm (w2.lzdio)
Wrote: /usr/src/RPM/RPMS/i586/libzapojit-devel-0.0.3-alt1.i586.rpm (w2.lzdio)
Wrote: /usr/src/RPM/RPMS/i586/libzapojit-gir-0.0.3-alt1.i586.rpm (w2.lzdio)
Wrote: /usr/src/RPM/RPMS/noarch/libzapojit-gir-devel-0.0.3-alt1.noarch.rpm (w2.lzdio)
Wrote: /usr/src/RPM/RPMS/noarch/libzapojit-devel-doc-0.0.3-alt1.noarch.rpm (w2.lzdio)
Wrote: /usr/src/RPM/RPMS/i586/libzapojit-debuginfo-0.0.3-alt1.i586.rpm (w2.lzdio)
12.68user 2.83system 0:29.61elapsed 52%CPU (0avgtext+0avgdata 42932maxresident)k
0inputs+0outputs (0major+1106301minor)pagefaults 0swaps
38.91user 8.73system 1:12.20elapsed 65%CPU (0avgtext+0avgdata 107244maxresident)k
520inputs+0outputs (0major+1765894minor)pagefaults 0swaps
--- libzapojit-0.0.3-alt1.i586.rpm.repo	2013-03-08 14:25:17.000000000 +0000
+++ libzapojit-0.0.3-alt1.i586.rpm.hasher	2021-03-11 14:54:51.256992733 +0000
@@ -7,7 +7,8 @@
 Requires: libc.so.6(GLIBC_2.1.3)  
+Requires: libc.so.6(GLIBC_2.4)  
 Requires: libgio-2.0.so.0 >= set:ojZ14mJ9XmPdOinD8IFqQx1EU9S6gQxO9NBSVN8YcEA2zcelEVOX23LVLWpznR3
 Requires: rpmlib(SetVersions)  
-Requires: libglib-2.0.so.0 >= set:oipEyBzT1NZ6Ku1GT0GUt7saNwa1yo0oqjVGY8AwwT4VO1BNysxSpvoZE6sXaIE2k0aVfObRgLSYGspOAc8VUKHvpWc1iOhrhKqn0ZifP4GTDrWo0
+Requires: libglib-2.0.so.0 >= set:oipEyBzT1NZ6Ku1GsOzwj9Cfq1Td1N0gABek0slu4igMrysVwOohKgXIfIvQ02O6a0BY7VBqEnrulKcpi6AssTRLctC09VEJ8nJb0vVpCgZePdtc
 Requires: libgoa-1.0.so.0 >= set:mjFxj5f6GplJGYfrlDYvw12
-Requires: libgobject-2.0.so.0 >= set:mg9fw40ZFT24VD3ZwXr8Z73rURaDEpoUPlSDD1op08tDV4qhUZmDuCQXUqy9ffV58JyoWtDC2K3K2ZL1CnnED5TdwZjY0TqMcf
+Requires: libgobject-2.0.so.0 >= set:mg9fw40ZFT24VD3ZwXr8Z73rURaDEpoUPlSDD1op08tDV4qhUZmDuCQXUqy9ffV58JyoWtDC2K3K2ZLxlY8pexumsT0WfY0TqMcf
 Requires: libjson-glib-1.0.so.0 >= set:lhMXBZHX5cFZlg78eTGso3NbEtmHs2
--- libzapojit-gir-0.0.3-alt1.i586.rpm.repo	2013-03-08 14:25:17.000000000 +0000
+++ libzapojit-gir-0.0.3-alt1.i586.rpm.hasher	2021-03-11 14:54:51.347993340 +0000
@@ -3,3 +3,2 @@
 Requires: typelib(GLib) = 2.0
-Requires: typelib(GObject) = 2.0
 Requires: typelib(Gio) = 2.0
--- libzapojit-gir-devel-0.0.3-alt1.noarch.rpm.repo	2013-03-08 14:25:17.000000000 +0000
+++ libzapojit-gir-devel-0.0.3-alt1.noarch.rpm.hasher	2021-03-11 14:54:51.372993506 +0000
@@ -4,3 +4,2 @@
 Requires: gir(GLib) = 2.0
-Requires: gir(GObject) = 2.0
 Requires: gir(Gio) = 2.0