<86>Mar 11 08:09:34 userdel[2250852]: delete user 'rooter'
<86>Mar 11 08:09:34 userdel[2250852]: removed group 'rooter' owned by 'rooter'
<86>Mar 11 08:09:34 userdel[2250852]: removed shadow group 'rooter' owned by 'rooter'
<86>Mar 11 08:09:34 groupadd[2250857]: group added to /etc/group: name=rooter, GID=630
<86>Mar 11 08:09:34 groupadd[2250857]: group added to /etc/gshadow: name=rooter
<86>Mar 11 08:09:34 groupadd[2250857]: new group: name=rooter, GID=630
<86>Mar 11 08:09:34 useradd[2250861]: new user: name=rooter, UID=630, GID=630, home=/root, shell=/bin/bash
<86>Mar 11 08:09:34 userdel[2250867]: delete user 'builder'
<86>Mar 11 08:09:34 userdel[2250867]: removed group 'builder' owned by 'builder'
<86>Mar 11 08:09:34 userdel[2250867]: removed shadow group 'builder' owned by 'builder'
<86>Mar 11 08:09:34 groupadd[2250872]: group added to /etc/group: name=builder, GID=631
<86>Mar 11 08:09:34 groupadd[2250872]: group added to /etc/gshadow: name=builder
<86>Mar 11 08:09:34 groupadd[2250872]: new group: name=builder, GID=631
<86>Mar 11 08:09:34 useradd[2250876]: new user: name=builder, UID=631, GID=631, home=/usr/src, shell=/bin/bash
<13>Mar 11 08:09:36 rpmi: ninja-build-1.10.2-alt1 sisyphus+262658.100.1.1 1606573135 installed
<13>Mar 11 08:09:36 rpmi: libgdbm-1.8.3-alt10 1454943334 installed
<13>Mar 11 08:09:36 rpmi: libexpat-2.2.10-alt1 sisyphus+259966.100.1.1 1602824518 installed
<13>Mar 11 08:09:36 rpmi: libp11-kit-0.23.15-alt2 sisyphus+252784.100.2.2 1591274901 installed
<13>Mar 11 08:09:36 rpmi: libtasn1-4.16.0-alt1 sisyphus+245480.100.1.1 1580825062 installed
<13>Mar 11 08:09:36 rpmi: rpm-macros-alternatives-0.5.1-alt1 sisyphus+226946.100.1.1 1554830426 installed
<13>Mar 11 08:09:36 rpmi: alternatives-0.5.1-alt1 sisyphus+226946.100.1.1 1554830426 installed
<13>Mar 11 08:09:36 rpmi: ca-certificates-2021.01.27-alt1 sisyphus+265371.200.1.1 1611759824 installed
<13>Mar 11 08:09:36 rpmi: ca-trust-0.1.2-alt1 sisyphus+233348.100.1.1 1561653823 installed
<13>Mar 11 08:09:36 rpmi: p11-kit-trust-0.23.15-alt2 sisyphus+252784.100.2.2 1591274901 installed
<13>Mar 11 08:09:36 rpmi: libcrypto1.1-1.1.1i-alt3 sisyphus+265605.200.2.1 1612202596 installed
<13>Mar 11 08:09:36 rpmi: libssl1.1-1.1.1i-alt3 sisyphus+265605.200.2.1 1612202596 installed
<13>Mar 11 08:09:36 rpmi: python3-3.9.2-alt1 sisyphus+267062.100.1.1 1614381721 installed
<13>Mar 11 08:09:37 rpmi: python3-base-3.9.2-alt1 sisyphus+267062.100.1.1 1614381721 installed
<13>Mar 11 08:09:37 rpmi: libpython3-3.9.2-alt1 sisyphus+267062.100.1.1 1614381721 installed
<13>Mar 11 08:09:37 rpmi: python3-module-pkg_resources-1:46.1.3-alt2 sisyphus+260458.600.6.1 1603876498 installed
<13>Mar 11 08:09:37 rpmi: meson-0.57.1-alt1 sisyphus+266296.20.4.1 1614137029 installed
<13>Mar 11 08:09:40 rpmi: libxkbcommon-1.1.0-alt1 sisyphus+267202.300.3.1 1615309346 installed
<13>Mar 11 08:09:40 rpmi: python3-module-six-1.15.0-alt1 sisyphus+255738.100.2.1 1596527214 installed
<13>Mar 11 08:09:40 rpmi: libglvnd-7:1.3.2-alt1 sisyphus+254610.100.1.1 1594124268 installed
<13>Mar 11 08:09:40 rpmi: perl-HTTP-Date-6.05-alt1 sisyphus+258981.100.1.1 1601542386 installed
<13>Mar 11 08:09:40 rpmi: sgml-common-0.6.3-alt15 1423664786 installed
<13>Mar 11 08:09:40 rpmi: xml-utils-1:2.9.10-alt6 sisyphus+265234.30740.49.1 1613765060 installed
<13>Mar 11 08:09:40 rpmi: docbook-dtds-4.5-alt1 1223476557 installed
<13>Mar 11 08:09:41 rpmi: libsqlite3-3.34.1-alt1 sisyphus+265135.100.1.1 1611333114 installed
<13>Mar 11 08:09:41 rpmi: libidn2-2.3.0-alt1 sisyphus+240846.100.1.2 1573870475 installed
<13>Mar 11 08:09:41 rpmi: libcom_err-1.45.6.0.24.af1a-alt1 sisyphus+262279.100.1.1 1606088229 installed
<13>Mar 11 08:09:41 rpmi: docbook-style-xsl-1.79.1-alt4 sisyphus+232871.100.1.1 1561238010 installed
<13>Mar 11 08:09:41 rpmi: rpm-build-gir-0.7.3-alt3 sisyphus+242150.100.1.1 1575312005 installed
<13>Mar 11 08:09:41 rpmi: glib2-devel-2.66.7-alt1 sisyphus+265234.43160.49.1 1613777318 installed
<13>Mar 11 08:09:41 rpmi: python-modules-email-2.7.18-alt4 sisyphus+266950.200.2.1 1614241383 installed
<13>Mar 11 08:09:41 rpmi: python-modules-unittest-2.7.18-alt4 sisyphus+266950.200.2.1 1614241383 installed
<13>Mar 11 08:09:41 rpmi: python-modules-encodings-2.7.18-alt4 sisyphus+266950.200.2.1 1614241383 installed
<13>Mar 11 08:09:41 rpmi: python-modules-2.7.18-alt4 sisyphus+266950.200.2.1 1614241383 installed
<13>Mar 11 08:09:41 rpmi: python-modules-compiler-2.7.18-alt4 sisyphus+266950.200.2.1 1614241383 installed
<13>Mar 11 08:09:41 rpmi: vapi-common-0.50.4-alt1 sisyphus+267164.100.1.1 1614539839 installed
<13>Mar 11 08:09:41 rpmi: libts0-1.22-alt3 sisyphus+259302.100.1.1 1601981878 installed
<13>Mar 11 08:09:41 rpmi: qt5-base-common-5.15.2-alt2 sisyphus+267350.100.1.1 1614868933 installed
<13>Mar 11 08:09:41 rpmi: libprotobuf25-3.14.0-alt1 sisyphus+265234.52200.49.1 1613797603 installed
<13>Mar 11 08:09:41 rpmi: libmtdev-1.1.6-alt1 sisyphus+250141.100.1.1 1587131316 installed
<13>Mar 11 08:09:41 rpmi: udev-rules-1:247.3-alt2 sisyphus+266129.100.1.3 1613012524 installed
<13>Mar 11 08:09:41 rpmi: libpng16-1.6.37-alt1 sisyphus+236677.100.2.1 1566917998 installed
<13>Mar 11 08:09:41 rpmi: xorg-proto-devel-2020.1-alt1 sisyphus+250406.100.1.1 1587554810 installed
<13>Mar 11 08:09:41 rpmi: libICE-1.0.10-alt1 sisyphus+247690.100.1.1 1584000387 installed
<13>Mar 11 08:09:41 rpmi: libwayland-server-1.19.0-alt1 sisyphus+265427.100.1.1 1611852858 installed
<13>Mar 11 08:09:41 rpmi: perl-LWP-MediaTypes-6.04-alt1 sisyphus+225468.100.1.1 1553186684 installed
<13>Mar 11 08:09:41 rpmi: perl-Compress-Raw-Zlib-2.101-alt1 sisyphus+266765.100.1.2 1614138847 installed
<13>Mar 11 08:09:41 rpmi: perl-libnet-1:3.13-alt1 sisyphus+266120.100.1.1 1612961310 installed
<13>Mar 11 08:09:42 rpmi: libicu67-1:6.7.1-alt2 sisyphus+252432.100.2.2 1590796126 installed
<13>Mar 11 08:09:42 rpmi: libnspr-1:4.29-alt1 sisyphus+260224.100.2.1 1603548999 installed
<13>Mar 11 08:09:42 rpmi: libproxy-0.4.17-alt1 sisyphus+264902.100.1.1 1611078502 installed
<13>Mar 11 08:09:42 rpmi: libnettle8-3.7-alt1 sisyphus+265128.100.1.1 1611325151 installed
<13>Mar 11 08:09:42 rpmi: libuv-1.40.0-alt1 sisyphus+259303.100.2.1 1602003324 installed
<13>Mar 11 08:09:42 rpmi: liblmdb-0.9.23-alt1 sisyphus+225277.100.2.1 1553001679 installed
<13>Mar 11 08:09:42 rpmi: libhogweed6-3.7-alt1 sisyphus+265128.100.1.1 1611325151 installed
<13>Mar 11 08:09:42 rpmi: libgnutls30-3.6.15-alt1 sisyphus+257742.200.2.1 1599668978 installed
<13>Mar 11 08:09:42 rpmi: libnss-3.61.0-alt1 sisyphus+265371.100.1.1 1611759823 installed
<13>Mar 11 08:09:42 rpmi: python3-module-nss-1.0.1-alt6 sisyphus+265234.10300.49.1 1613750227 installed
<13>Mar 11 08:09:43 rpmi: icu-utils-1:6.7.1-alt2 sisyphus+252432.100.2.2 1590796126 installed
<13>Mar 11 08:09:43 rpmi: libicu-devel-1:6.7.1-alt2 sisyphus+252432.100.2.2 1590796126 installed
<13>Mar 11 08:09:43 rpmi: libSM-1.2.3-alt1 sisyphus+226734.100.2.1 1554586158 installed
<13>Mar 11 08:09:43 rpmi: rpm-macros-qt5-5.15.2-alt2 sisyphus+267350.100.1.1 1614868112 installed
<13>Mar 11 08:09:43 rpmi: python-modules-xml-2.7.18-alt4 sisyphus+266950.200.2.1 1614241383 installed
<13>Mar 11 08:09:43 rpmi: python-modules-hotshot-2.7.18-alt4 sisyphus+266950.200.2.1 1614241383 installed
<13>Mar 11 08:09:43 rpmi: python-modules-bsddb-2.7.18-alt4 sisyphus+266950.200.2.1 1614241383 installed
<13>Mar 11 08:09:43 rpmi: python-modules-ctypes-2.7.18-alt4 sisyphus+266950.200.2.1 1614241383 installed
<13>Mar 11 08:09:43 rpmi: python-modules-multiprocessing-2.7.18-alt4 sisyphus+266950.200.2.1 1614241383 installed
<13>Mar 11 08:09:43 rpmi: python-modules-logging-2.7.18-alt4 sisyphus+266950.200.2.1 1614241383 installed
<13>Mar 11 08:09:43 rpmi: libe2fs-1.45.6.0.24.af1a-alt1 sisyphus+262279.100.1.1 1606088229 installed
<13>Mar 11 08:09:43 rpmi: perl-File-Listing-6.14-alt1 sisyphus+262735.100.1.1 1606813544 installed
<13>Mar 11 08:09:43 rpmi: libGLES-7:1.3.2-alt1 sisyphus+254610.100.1.1 1594124268 installed
<13>Mar 11 08:09:43 rpmi: libOpenGL-7:1.3.2-alt1 sisyphus+254610.100.1.1 1594124268 installed
<13>Mar 11 08:09:43 rpmi: python3-module-genshi-0.7.4-alt2 sisyphus+261703.100.2.1 1605232240 installed
<13>Mar 11 08:09:43 rpmi: libxkbcommon-devel-1.1.0-alt1 sisyphus+267202.300.3.1 1615309346 installed
<13>Mar 11 08:09:43 rpmi: xxd-4:8.2.0011-alt2 sisyphus+265234.21600.49.1 1613758359 installed
<13>Mar 11 08:09:43 rpmi: libyaml2-0.2.5-alt1 sisyphus+253672.100.1.1 1592583137 installed
<13>Mar 11 08:09:43 rpmi: libxapian-1.4.15-alt1 sisyphus+248304.20.4.1 1585071490 installed
<13>Mar 11 08:09:43 rpmi: vulkan-filesystem-1.2.152-alt1 sisyphus+257666.300.3.1 1599632436 installed
<13>Mar 11 08:09:43 rpmi: libvulkan1-1.2.152-alt1 sisyphus+257666.300.3.1 1599632437 installed
<13>Mar 11 08:09:43 rpmi: libvulkan-devel-1.2.152-alt1 sisyphus+257666.300.3.1 1599632437 installed
<13>Mar 11 08:09:43 rpmi: libudev-devel-1:247.3-alt2 sisyphus+266129.100.1.3 1613012672 installed
<13>Mar 11 08:09:43 rpmi: libstemmer-2.0.0-alt1 sisyphus+253893.100.1.1 1596636642 installed
<13>Mar 11 08:09:43 rpmi: libssl-devel-1.1.1i-alt3 sisyphus+265605.200.2.1 1612202596 installed
<13>Mar 11 08:09:43 rpmi: rpm-build-vala-0.3-alt1 1332324961 installed
<13>Mar 11 08:09:43 rpmi: libprotobuf25-lite-3.14.0-alt1 sisyphus+265234.52200.49.1 1613797603 installed
<13>Mar 11 08:09:43 rpmi: zlib-devel-1.2.11-alt1 sisyphus+221902.6000.4.1 1550601058 installed
<13>Mar 11 08:09:43 rpmi: libprotobuf-devel-3.14.0-alt1 sisyphus+265234.52200.49.1 1613797603 installed
<13>Mar 11 08:09:43 rpmi: libpcre2-10.36-alt1 sisyphus+262985.100.2.1 1607423140 installed
<13>Mar 11 08:09:43 rpmi: libqt5-core-5.15.2-alt2 sisyphus+267350.100.1.1 1614868933 installed
<13>Mar 11 08:09:43 rpmi: libqt5-concurrent-5.15.2-alt2 sisyphus+267350.100.1.1 1614868933 installed
<13>Mar 11 08:09:43 rpmi: libqt5-sql-5.15.2-alt2 sisyphus+267350.100.1.1 1614868933 installed
<13>Mar 11 08:09:43 rpmi: libqt5-test-5.15.2-alt2 sisyphus+267350.100.1.1 1614868933 installed
<13>Mar 11 08:09:43 rpmi: libqt5-xml-5.15.2-alt2 sisyphus+267350.100.1.1 1614868933 installed
<13>Mar 11 08:09:43 rpmi: libpaper-1.1.28-alt1 sisyphus+259176.100.1.1 1601738993 installed
<13>Mar 11 08:09:43 rpmi: libjpeg-2:2.0.6-alt1 sisyphus+266888.100.1.1 1614172387 installed
<13>Mar 11 08:09:43 rpmi: libwacom-data-1.9-alt1 sisyphus+266853.140.1.1 1614171050 installed
<13>Mar 11 08:09:43 rpmi: libgudev-1:234-alt1 sisyphus+258314.700.14.2 1600844807 installed
<13>Mar 11 08:09:43 rpmi: libwacom-1.9-alt1 sisyphus+266853.140.1.1 1614171053 installed
<13>Mar 11 08:09:43 rpmi: libgraphite2-1.3.14-alt2 sisyphus+250009.100.1.1 1586943065 installed
<13>Mar 11 08:09:43 rpmi: libevdev-1.11.0-alt1 sisyphus+265566.100.1.1 1612165512 installed
<13>Mar 11 08:09:43 rpmi: libinput-1.17.0-alt1 sisyphus+266853.100.1.2 1614175028 installed
<13>Mar 11 08:09:43 rpmi: liblz4-1:1.9.3-alt1 sisyphus+262305.100.1.1 1606099167 installed
<13>Mar 11 08:09:43 rpmi: libSDL2-2.0.14-alt2 sisyphus+264412.100.1.1 1610114592 installed
<13>Mar 11 08:09:43 rpmi: tslib-1.22-alt3 sisyphus+259302.100.1.1 1601981878 installed
<13>Mar 11 08:09:43 rpmi: libxshmfence-1.3-alt1 sisyphus+223149.1000.2.1 1551268571 installed
<13>Mar 11 08:09:43 rpmi: libX11-locales-3:1.7.0-alt1 sisyphus+264667.100.1.2 1610655150 installed
<13>Mar 11 08:09:43 rpmi: libXdmcp-1.1.3-alt1 sisyphus+225206.600.1.2 1552949353 installed
<13>Mar 11 08:09:43 rpmi: libXau-1.0.9-alt1 sisyphus+223149.200.2.1 1551268152 installed
<13>Mar 11 08:09:43 rpmi: libxcb-1.14-alt1 sisyphus+247358.200.1.3 1583854228 installed
<13>Mar 11 08:09:43 rpmi: libX11-3:1.7.0-alt1 sisyphus+264667.100.1.2 1610655170 installed
<13>Mar 11 08:09:43 rpmi: libXext-1.3.4-alt1 sisyphus+225206.700.1.2 1552949429 installed
<13>Mar 11 08:09:45 rpmi: libxcb-devel-1.14-alt1 sisyphus+247358.200.1.3 1583854228 installed
<13>Mar 11 08:09:45 rpmi: libX11-devel-3:1.7.0-alt1 sisyphus+264667.100.1.2 1610655170 installed
<13>Mar 11 08:09:45 rpmi: libXxf86vm-1.1.4-alt2 1527672187 installed
<13>Mar 11 08:09:45 rpmi: libXdamage-1.1.5-alt1 sisyphus+225206.500.1.2 1552949286 installed
<13>Mar 11 08:09:45 rpmi: libXfixes-5.0.3-alt1 sisyphus+226736.100.2.2 1554614841 installed
<13>Mar 11 08:09:45 rpmi: libxcbutil-icccm-0.4.1-alt2 sisyphus+229000.100.1.1 1557152221 installed
<13>Mar 11 08:09:45 rpmi: libxcbutil-1:0.4.0-alt1 1413392888 installed
<13>Mar 11 08:09:45 rpmi: libxcbutil-image-0.4.0-alt1 1446204182 installed
<13>Mar 11 08:09:45 rpmi: libxcbutil-keysyms-0.4.0-alt1 1446204124 installed
<13>Mar 11 08:09:45 rpmi: libxcb-render-util-0.3.9-alt3 sisyphus+222674.100.1.1 1550989886 installed
<13>Mar 11 08:09:45 rpmi: libxkbcommon-x11-1.1.0-alt1 sisyphus+267202.300.3.1 1615309346 installed
<13>Mar 11 08:09:45 rpmi: libwayland-client-1.19.0-alt1 sisyphus+265427.100.1.1 1611852858 installed
<13>Mar 11 08:09:45 rpmi: libpciaccess-1:0.16-alt1 sisyphus+234814.100.1.1 1563438291 installed
<13>Mar 11 08:09:45 rpmi: libdrm-1:2.4.104-alt1 sisyphus+264662.100.1.1 1610612753 installed
<13>Mar 11 08:09:45 rpmi: libGLX-mesa-4:20.3.4-alt1 sisyphus+265564.100.1.1 1612163514 installed
<13>Mar 11 08:09:45 rpmi: libgbm-4:20.3.4-alt1 sisyphus+265564.100.1.1 1612163514 installed
<13>Mar 11 08:09:45 rpmi: libEGL-mesa-4:20.3.4-alt1 sisyphus+265564.100.1.1 1612163514 installed
<13>Mar 11 08:09:45 rpmi: libEGL-7:1.3.2-alt1 sisyphus+254610.100.1.1 1594124268 installed
<13>Mar 11 08:09:45 rpmi: libGLX-7:1.3.2-alt1 sisyphus+254610.100.1.1 1594124268 installed
<13>Mar 11 08:09:45 rpmi: libGL-7:1.3.2-alt1 sisyphus+254610.100.1.1 1594124268 installed
<13>Mar 11 08:09:45 rpmi: libglvnd-devel-7:1.3.2-alt1 sisyphus+254610.100.1.1 1594124268 installed
<13>Mar 11 08:09:45 rpmi: python3-module-libxml2-1:2.9.10-alt6 sisyphus+265234.30740.49.1 1613765060 installed
<13>Mar 11 08:09:45 rpmi: perl-Try-Tiny-0.30-alt1 1514318058 installed
<13>Mar 11 08:09:45 rpmi: perl-IO-Socket-IP-0.41-alt1 sisyphus+259012.100.1.2 1601553446 installed
<13>Mar 11 08:09:45 rpmi: perl-Compress-Raw-Bzip2-2.101-alt1 sisyphus+266764.100.1.2 1614138565 installed
<13>Mar 11 08:09:45 rpmi: perl-HTML-Tagset-3.20-alt2 1317725093 installed
<13>Mar 11 08:09:45 rpmi: perl-Filter-1.60-alt1 sisyphus+258375.300.14.2 1600904226 installed
<13>Mar 11 08:09:45 rpmi: perl-Encode-3.08-alt1 sisyphus+263440.100.1.1 1607955886 installed
<13>Mar 11 08:09:45 rpmi: perl-URI-5.09-alt1 sisyphus+267398.100.1.1 1614944505 installed
<13>Mar 11 08:09:45 rpmi: perl-IO-Compress-2.102-alt1 sisyphus+267295.100.1.1 1614764488 installed
<13>Mar 11 08:09:45 rpmi: perl-Net-HTTP-6.20-alt1 sisyphus+264543.100.1.2 1610433051 installed
<13>Mar 11 08:09:45 rpmi: perl-HTML-Parser-3.76-alt1 sisyphus+267397.100.1.3 1614945689 installed
<13>Mar 11 08:09:45 rpmi: perl-WWW-RobotRules-6.02-alt1 1329756211 installed
<13>Mar 11 08:09:45 rpmi: perl-Encode-Locale-1.05-alt1 1444608613 installed
<13>Mar 11 08:09:45 rpmi: perl-IO-HTML-1.004-alt1 sisyphus+258983.100.1.1 1601542619 installed
<13>Mar 11 08:09:45 rpmi: perl-HTTP-Message-6.29-alt1 sisyphus+267426.100.1.1 1615033749 installed
<13>Mar 11 08:09:45 rpmi: perl-HTTP-Cookies-6.10-alt1 sisyphus+264349.100.1.1 1609891183 installed
<13>Mar 11 08:09:45 rpmi: perl-HTTP-Negotiate-6.01-alt1 1329760563 installed
<13>Mar 11 08:09:45 rpmi: perl-Term-ANSIColor-5.01-alt1 sisyphus+244783.100.1.2 1579747505 installed
<13>Mar 11 08:09:45 rpmi: perl-Data-Dump-1.23-alt1 1444601978 installed
<13>Mar 11 08:09:45 rpmi: perl-libwww-6.52-alt1 sisyphus+264541.100.1.3 1610434036 installed
<13>Mar 11 08:09:45 rpmi: perl-XML-Parser-2.46-alt1 sisyphus+263451.100.1.1 1607958574 installed
<13>Mar 11 08:09:45 rpmi: libOpenSP-1.5.2-alt3.qa1 1365943435 installed
<13>Mar 11 08:09:45 rpmi: openjade-1.3.2-alt15 sisyphus+219815.100.1.1 1548167857 installed
<13>Mar 11 08:09:45 rpmi: docbook-style-dsssl-1.79-alt3 1324062818 installed
<13>Mar 11 08:09:45 rpmi: python-modules-curses-2.7.18-alt4 sisyphus+266950.200.2.1 1614241383 installed
<13>Mar 11 08:09:45 rpmi: python-2.7.18-alt4 sisyphus+266950.200.2.1 1614241383 installed
<13>Mar 11 08:09:46 rpmi: python3-module-snowballstemmer-1.2.0-alt2.1 1457859319 installed
<13>Mar 11 08:09:46 rpmi: python3-module-pyparsing-2.4.2-alt2 sisyphus+261315.100.1.1 1604861802 installed
<13>Mar 11 08:09:46 rpmi: python3-module-packaging-19.0-alt3 sisyphus+261322.40.5.2 1604886824 installed
<13>Mar 11 08:09:46 rpmi: python3-module-markupsafe-1.1.1-alt1 sisyphus+265234.15700.49.1 1613753625 installed
<13>Mar 11 08:09:46 rpmi: python3-module-jinja2-2.11.2-alt1 sisyphus+254573.100.1.1 1594043344 installed
<13>Mar 11 08:09:46 rpmi: python3-module-imagesize-1.1.0-alt1 sisyphus+229015.100.2.1 1557233756 installed
<13>Mar 11 08:09:46 rpmi: python-sphinx-objects.inv-1:2.3.10.20210211-alt1 sisyphus+266318.100.1.1 1613345682 installed
<13>Mar 11 08:09:46 rpmi: python3-module-ntlm-1.1.0-alt1.2 sisyphus+228512.100.1.1 1556654575 installed
<13>Mar 11 08:09:46 rpmi: python3-module-ndg-0.4.2-alt1.qa1 sisyphus+227504.1300.1.2 1555853234 installed
<13>Mar 11 08:09:46 rpmi: python3-module-idna-3.1-alt1 sisyphus+267356.100.1.1 1614879269 installed
<13>Mar 11 08:09:46 rpmi: python3-module-chardet-1:3.0.4-alt2 sisyphus+263408.100.1.1 1607875228 installed
<13>Mar 11 08:09:46 rpmi: python3-module-webencodings-0.5.1-alt2 sisyphus+245915.200.1.1 1581496105 installed
<13>Mar 11 08:09:46 rpmi: libgpg-error-1.41-alt4 sisyphus+264254.200.1.1 1609440111 installed
<13>Mar 11 08:09:46 rpmi: libgcrypt20-1.9.2-alt1 sisyphus+266496.100.1.1 1613559234 installed
<13>Mar 11 08:09:46 rpmi: libxslt-1.1.34-alt2 sisyphus+248264.100.1.1 1584829770 installed
<13>Mar 11 08:09:46 rpmi: python3-module-html5lib-1:1.0.1-alt1 sisyphus+238807.100.2.1 1570465973 installed
<13>Mar 11 08:09:46 rpmi: python3-module-lxml-4.6.2-alt1 sisyphus+267259.100.1.1 1614706638 installed
<13>Mar 11 08:09:46 rpmi: python3-module-cssselect-0.9.1-alt2 sisyphus+250566.2300.6.1 1588188959 installed
<13>Mar 11 08:09:46 rpmi: python3-module-docutils-0.16.0-alt1 sisyphus+250087.100.1.1 1587043829 installed
<13>Mar 11 08:09:46 rpmi: xsltproc-1.1.34-alt2 sisyphus+248264.100.1.1 1584829770 installed
<13>Mar 11 08:09:46 rpmi: libsystemd-1:247.3-alt2 sisyphus+266129.100.1.3 1613012672 installed
<13>Mar 11 08:09:46 rpmi: libdbus-1.12.18-alt1 sisyphus+252758.100.1.1 1591203693 installed
<13>Mar 11 08:09:46 rpmi: libavahi-0.8-alt1 sisyphus+255349.240.4.1 1595604514 installed
<13>Mar 11 08:09:46 rpmi: libcups-2.3.3-alt1 sisyphus+265411.100.1.1 1611832621 installed
<13>Mar 11 08:09:46 rpmi: libqt5-dbus-5.15.2-alt2 sisyphus+267350.100.1.1 1614868933 installed
<13>Mar 11 08:09:46 rpmi: python3-module-polib-1.0.5-alt1.1.2 sisyphus+227468.1200.2.2 1555756059 installed
<13>Mar 11 08:09:46 rpmi: python3-module-click-7.1.2-alt2 sisyphus+260950.100.1.1 1604486258 installed
<13>Mar 11 08:09:46 rpmi: python3-module-zope.interface-5.1.0-alt3 sisyphus+265234.25100.49.1 1613760789 installed
<13>Mar 11 08:09:46 rpmi: python3-module-chameleon.core-3.8.1-alt1 sisyphus+257108.100.1.1 1598978997 installed
<13>Mar 11 08:09:46 rpmi: python3-module-lingua-4.14-alt1 sisyphus+261433.100.1.1 1605006591 installed
<13>Mar 11 08:09:46 rpmi: python3-module-pytz-1:2020.5-alt1 sisyphus+265473.100.1.1 1611923264 installed
<13>Mar 11 08:09:47 rpmi: python3-module-babel-1:2.8.0-alt1 sisyphus+260985.120.8.1 1604548484 installed
<13>Mar 11 08:09:47 rpmi: python3-module-pycparser-2.20-alt1 sisyphus+260990.100.1.1 1604547209 installed
<13>Mar 11 08:09:47 rpmi: python3-module-cffi-1.14.5-alt1 sisyphus+266847.100.1.1 1614157383 installed
<13>Mar 11 08:09:47 rpmi: python3-module-cryptography-3.4.6-alt1 sisyphus+267354.100.1.1 1614879025 installed
<13>Mar 11 08:09:47 rpmi: python3-module-openssl-19.1.0-alt1 sisyphus+261139.100.1.1 1604672912 installed
<13>Mar 11 08:09:47 rpmi: python3-module-ndg-httpsclient-0.4.2-alt1.qa1 sisyphus+227504.1300.1.2 1555853234 installed
<13>Mar 11 08:09:47 rpmi: python3-module-urllib3-2:1.25.10-alt1 sisyphus+255342.100.1.1 1595592746 installed
<13>Mar 11 08:09:47 rpmi: python3-module-requests-2.25.1-alt2 sisyphus+267359.100.1.1 1614881487 installed
<13>Mar 11 08:09:47 rpmi: python3-module-sphinxcontrib-applehelp-1.0.2-alt1 sisyphus+252614.200.1.1 1590949678 installed
<13>Mar 11 08:09:47 rpmi: python3-module-sphinxcontrib-devhelp-1.0.2-alt1 sisyphus+252614.300.1.1 1590949711 installed
<13>Mar 11 08:09:47 rpmi: python3-module-sphinxcontrib-htmlhelp-1.0.2-alt1 sisyphus+228401.100.1.1 1556572721 installed
<13>Mar 11 08:09:47 rpmi: python3-module-sphinxcontrib-jsmath-1.0.1-alt1 sisyphus+238085.500.1.1 1569313099 installed
<13>Mar 11 08:09:47 rpmi: python3-module-sphinxcontrib-qthelp-1.0.3-alt1 sisyphus+252614.400.1.1 1590949745 installed
<13>Mar 11 08:09:47 rpmi: python3-module-sphinxcontrib-serializinghtml-1.1.4-alt1 sisyphus+252614.100.1.1 1590949645 installed
<13>Mar 11 08:09:47 rpmi: python3-module-alabaster-0.7.6-alt3 sisyphus+228351.700.4.1 1556637370 installed
<13>Mar 11 08:09:47 rpmi: python3-module-Pygments-2.6.1-alt2 sisyphus+263434.100.1.1 1607946762 installed
<13>Mar 11 08:09:47 rpmi: python3-module-sphinx-1:2.4.4-alt1 sisyphus+254723.100.1.2 1594318607 installed
<13>Mar 11 08:09:47 rpmi: python3-module-markdown-3.3.4-alt1 sisyphus+267023.100.1.1 1614330293 installed
<13>Mar 11 08:09:47 rpmi: python3-module-beaker-1.11.0-alt1 sisyphus+260850.100.1.1 1604352882 installed
<13>Mar 11 08:09:48 rpmi: python3-module-mako-1.1.3-alt1 sisyphus+261443.100.1.1 1605011427 installed
<13>Mar 11 08:09:48 rpmi: libffi-devel-1:3.3-alt1 sisyphus+251953.40.2.1 1589891229 installed
<13>Mar 11 08:09:48 rpmi: gsettings-desktop-schemas-data-3.38.0-alt1 sisyphus+258314.500.14.2 1600843028 installed
<13>Mar 11 08:09:48 rpmi: shared-mime-info-2.1-alt1 sisyphus+264261.100.1.1 1609507723 installed
<13>Mar 11 08:09:48 rpmi: libgio-2.66.7-alt1 sisyphus+265234.43160.49.1 1613777318 installed
<13>Mar 11 08:09:48 rpmi: gsettings-desktop-schemas-3.38.0-alt1 sisyphus+258314.500.14.2 1600843530 installed
<13>Mar 11 08:09:48 rpmi: libgio-devel-2.66.7-alt1 sisyphus+265234.43160.49.1 1613777318 installed
<13>Mar 11 08:09:48 rpmi: glib-networking-2.66.0-alt1 sisyphus+258314.1200.14.2 1600845027 installed
<13>Mar 11 08:09:48 rpmi: gobject-introspection-1.66.1-alt1 sisyphus+265234.31700.49.1 1613765999 installed
<13>Mar 11 08:09:48 rpmi: gobject-introspection-x11-1.66.1-alt1 sisyphus+265234.31700.49.1 1613765999 installed
<13>Mar 11 08:09:48 rpmi: gcc-c++-common-1.4.27-alt1 sisyphus+262033.600.7.2 1607340230 installed
<13>Mar 11 08:09:48 rpmi: libstdc++10-devel-10.2.1-alt2 sisyphus+263054.100.3.1 1607510657 installed
<13>Mar 11 08:09:49 rpmi: gcc10-c++-10.2.1-alt2 sisyphus+263054.100.3.1 1607510657 installed
<13>Mar 11 08:09:49 rpmi: gcc-c++-10-alt1 sisyphus+263054.200.3.1 1607516810 installed
<13>Mar 11 08:09:49 rpmi: rpm-macros-cmake-3.19.6-alt1 sisyphus+266937.100.2.1 1614258178 installed
<13>Mar 11 08:09:49 rpmi: rmt-0.4b44-alt3 sisyphus+263220.100.1.1 1607607837 installed
<13>Mar 11 08:09:49 rpmi: dump-0.4b44-alt3 sisyphus+263220.100.1.1 1607607837 installed
<13>Mar 11 08:09:49 rpmi: cmake-modules-3.19.6-alt1 sisyphus+266937.100.2.1 1614258110 installed
<13>Mar 11 08:09:49 rpmi: librhash-1.3.5-alt2 1505156279 installed
<13>Mar 11 08:09:49 rpmi: libjsoncpp19-1.8.4-alt5 sisyphus+243670.100.1.1 1577521267 installed
<13>Mar 11 08:09:49 rpmi: publicsuffix-list-dafsa-20210121-alt1 sisyphus+265129.100.1.1 1611325490 installed
<13>Mar 11 08:09:49 rpmi: libpsl-0.21.1-alt1 sisyphus+255206.100.1.1 1595348938 installed
<13>Mar 11 08:09:49 rpmi: libnghttp2-1.41.0-alt1 sisyphus+253680.100.1.1 1592642271 installed
<13>Mar 11 08:09:49 rpmi: openldap-common-2.4.57-alt1 sisyphus+266287.100.1.1 1613244218 installed
<13>Mar 11 08:09:49 rpmi: libverto-0.3.1-alt1_2 sisyphus+265276.100.1.1 1611604625 installed
<13>Mar 11 08:09:49 rpmi: libkeyutils-1.6.3-alt1 sisyphus+266061.100.1.1 1612919567 installed
<86>Mar 11 08:09:49 groupadd[2254921]: group added to /etc/group: name=_keytab, GID=499
<86>Mar 11 08:09:49 groupadd[2254921]: group added to /etc/gshadow: name=_keytab
<86>Mar 11 08:09:49 groupadd[2254921]: new group: name=_keytab, GID=499
<13>Mar 11 08:09:49 rpmi: libkrb5-1.19.1-alt1 sisyphus+266617.100.2.2 1614603178 installed
<13>Mar 11 08:09:49 rpmi: libqt5-network-5.15.2-alt2 sisyphus+267350.100.1.1 1614868933 installed
<86>Mar 11 08:09:49 groupadd[2254939]: group added to /etc/group: name=sasl, GID=498
<86>Mar 11 08:09:49 groupadd[2254939]: group added to /etc/gshadow: name=sasl
<86>Mar 11 08:09:49 groupadd[2254939]: new group: name=sasl, GID=498
<13>Mar 11 08:09:49 rpmi: libsasl2-3-2.1.27-alt2.1 sisyphus+255909.100.2.1 1597199456 installed
<13>Mar 11 08:09:49 rpmi: libldap-2.4.57-alt1 sisyphus+266287.100.1.1 1613244306 installed
<13>Mar 11 08:09:49 rpmi: libsoup-2.72.0-alt1 sisyphus+258314.1100.14.2 1600844978 installed
<13>Mar 11 08:09:50 rpmi: vala-0.50.4-alt1 sisyphus+267164.100.1.1 1614540020 installed
<13>Mar 11 08:09:50 rpmi: libsoup-devel-2.72.0-alt1 sisyphus+258314.1100.14.2 1600844978 installed
<13>Mar 11 08:09:50 rpmi: libbrotlicommon-1.0.9-alt2 sisyphus+257777.100.1.1 1599688017 installed
<13>Mar 11 08:09:50 rpmi: libbrotlidec-1.0.9-alt2 sisyphus+257777.100.1.1 1599688017 installed
<13>Mar 11 08:09:50 rpmi: libcurl-7.75.0-alt1 sisyphus+266959.100.1.1 1614250021 installed
<13>Mar 11 08:09:50 rpmi: libharfbuzz-2.6.8-alt1 sisyphus+254028.100.1.1 1593106819 installed
<13>Mar 11 08:09:50 rpmi: libfreetype-2.10.4-alt2 sisyphus+260293.100.2.1 1604479496 installed
<13>Mar 11 08:09:50 rpmi: fontconfig-2.13.1-alt1 sisyphus+257555.100.1.1 1599475160 installed
Updating fonts cache: <29>Mar 11 08:09:51 fontconfig: Updating fonts cache: succeeded
[ DONE ]
<13>Mar 11 08:09:51 rpmi: libqt5-eglfskmssupport-5.15.2-alt2 sisyphus+267350.100.1.1 1614868933 installed
<13>Mar 11 08:09:51 rpmi: libqt5-eglfsdeviceintegration-5.15.2-alt2 sisyphus+267350.100.1.1 1614868933 installed
<13>Mar 11 08:09:51 rpmi: libqt5-gui-5.15.2-alt2 sisyphus+267350.100.1.1 1614868933 installed
<13>Mar 11 08:09:51 rpmi: libqt5-xcbqpa-5.15.2-alt2 sisyphus+267350.100.1.1 1614868933 installed
<13>Mar 11 08:09:51 rpmi: libqt5-widgets-5.15.2-alt2 sisyphus+267350.100.1.1 1614868933 installed
<13>Mar 11 08:09:51 rpmi: libqt5-opengl-5.15.2-alt2 sisyphus+267350.100.1.1 1614868933 installed
<13>Mar 11 08:09:51 rpmi: libqt5-printsupport-5.15.2-alt2 sisyphus+267350.100.1.1 1614868933 installed
<13>Mar 11 08:09:51 rpmi: libarchive13-3.4.3-alt1 sisyphus+258566.100.1.2 1600916107 installed
<13>Mar 11 08:09:52 rpmi: cmake-3.19.6-alt1 sisyphus+266937.100.2.1 1614258178 installed
<13>Mar 11 08:09:52 rpmi: bc-1:1.07.1-alt1 sisyphus+221902.700.4.1 1550587857 installed
<13>Mar 11 08:09:52 rpmi: libcurl-devel-7.75.0-alt1 sisyphus+266959.100.1.1 1614250021 installed
<13>Mar 11 08:09:52 rpmi: ctest-3.19.6-alt1 sisyphus+266937.100.2.1 1614258178 installed
<13>Mar 11 08:09:53 rpmi: qt5-base-devel-5.15.2-alt2 sisyphus+267350.100.1.1 1614868933 installed
<13>Mar 11 08:09:53 rpmi: gobject-introspection-devel-1.66.1-alt1 sisyphus+265234.31700.49.1 1613765999 installed
<13>Mar 11 08:09:53 rpmi: gtk-doc-1.33.2-alt1 sisyphus+265119.100.1.1 1611321063 installed
<13>Mar 11 08:09:53 rpmi: xmlto-0.0.28-alt2 1518213370 installed
<13>Mar 11 08:09:53 rpmi: intltool-0.51.0-alt2 1513698802 installed
<13>Mar 11 08:09:53 rpmi: itstool-2.0.6-alt1 sisyphus+227101.1400.2.2 1555197431 installed
<13>Mar 11 08:09:53 rpmi: libprotobuf-lite-devel-3.14.0-alt1 sisyphus+265234.52200.49.1 1613797603 installed
<13>Mar 11 08:09:53 rpmi: libstemmer-devel-2.0.0-alt1 sisyphus+253893.100.1.1 1596636642 installed
<13>Mar 11 08:09:53 rpmi: libxapian-devel-1.4.15-alt1 sisyphus+248304.20.4.1 1585071490 installed
<13>Mar 11 08:09:53 rpmi: libyaml-devel-0.2.5-alt1 sisyphus+253672.100.1.1 1592583137 installed
<13>Mar 11 08:09:53 rpmi: liblmdb-devel-0.9.23-alt1 sisyphus+225277.100.2.1 1553001679 installed
<13>Mar 11 08:09:53 rpmi: protobuf-compiler-3.14.0-alt1 sisyphus+265234.52200.49.1 1613797603 installed
<13>Mar 11 08:09:53 rpmi: libxml2-devel-1:2.9.10-alt6 sisyphus+265234.30740.49.1 1613765060 installed
<13>Mar 11 08:09:53 rpmi: gperf-3.1.0.19.9f4f-alt1 sisyphus+221902.3100.4.1 1550597726 installed
Building target platforms: i586
Building for target i586
Wrote: /usr/src/in/nosrpm/appstream-0.14.3-alt1.nosrc.rpm (w1.gzdio)
Installing appstream-0.14.3-alt1.src.rpm
Building target platforms: i586
Building for target i586
Executing(%prep): /bin/sh -e /usr/src/tmp/rpm-tmp.46173
+ umask 022
+ /bin/mkdir -p /usr/src/RPM/BUILD
+ cd /usr/src/RPM/BUILD
+ cd /usr/src/RPM/BUILD
+ rm -rf appstream-0.14.3
+ echo 'Source #0 (appstream-0.14.3.tar):'
Source #0 (appstream-0.14.3.tar):
+ /bin/tar -xf /usr/src/RPM/SOURCES/appstream-0.14.3.tar
+ cd appstream-0.14.3
+ /bin/chmod -c -Rf u+rwX,go-w .
+ exit 0
Executing(%build): /bin/sh -e /usr/src/tmp/rpm-tmp.46173
+ umask 022
+ /bin/mkdir -p /usr/src/RPM/BUILD
+ cd /usr/src/RPM/BUILD
+ cd appstream-0.14.3
+ mkdir -p i586-alt-linux
+ CFLAGS='-pipe -frecord-gcc-switches -Wall -g -O2 -march=i586 -mtune=generic'
+ export CFLAGS
+ CXXFLAGS='-pipe -frecord-gcc-switches -Wall -g -O2 -march=i586 -mtune=generic'
+ export CXXFLAGS
+ FFLAGS='-pipe -frecord-gcc-switches -Wall -g -O2 -march=i586 -mtune=generic'
+ export FFLAGS
+ FCFLAGS='-pipe -frecord-gcc-switches -Wall -g -O2 -march=i586 -mtune=generic'
+ export FCFLAGS
+ /usr/bin/meson . i586-alt-linux --buildtype=plain --prefix=/usr --bindir=/usr/bin --sbindir=/usr/sbin --libexecdir=/usr/lib --libdir=/usr/lib --localstatedir=/var --sharedstatedir=/var/lib --includedir=/usr/include --datadir=/usr/share --sysconfdir=/etc --mandir=/usr/share/man --infodir=/usr/share/info --localedir=/usr/share/locale --wrap-mode=nodownload -Dqt=true -Ddocs=false -Dstemming=true
The Meson build system
Version: 0.57.1
Source dir: /usr/src/RPM/BUILD/appstream-0.14.3
Build dir: /usr/src/RPM/BUILD/appstream-0.14.3/i586-alt-linux
Build type: native build
Project name: AppStream
Project version: 0.14.3
C compiler for the host machine: cc (gcc 10.2.1 "i586-alt-linux-gcc (GCC) 10.2.1 20201125 (ALT Sisyphus 10.2.1-alt2)")
C linker for the host machine: cc ld.bfd 2.35.1.20210104
Host machine cpu family: x86
Host machine cpu: i686
Configuring config.h using configuration
Found pkg-config: /usr/bin/pkg-config (0.29.2)
Run-time dependency glib-2.0 found: YES 2.66.7
Run-time dependency gobject-2.0 found: YES 2.66.7
Run-time dependency gio-2.0 found: YES 2.66.7
Run-time dependency gio-unix-2.0 found: YES 2.66.7
Run-time dependency libcurl found: YES 7.75.0
Run-time dependency libxml-2.0 found: YES 2.9.10
Run-time dependency yaml-0.1 found: YES 0.2.5
Found CMake: /usr/bin/cmake (3.19.6)
Run-time dependency lmdb found: NO (tried pkgconfig and cmake)
Library lmdb found: YES
Has header "lmdb.h" : YES 
Run-time dependency gobject-introspection-1.0 found: YES 1.66.1
Library stemmer found: YES
Has header "libstemmer.h" : YES 
Program gperf found: YES (/usr/bin/gperf)
Configuring as-version.h using configuration
Program glib-mkenums found: YES (/usr/bin/glib-mkenums)
Program glib-mkenums found: YES (/usr/bin/glib-mkenums)
Found pkg-config: /usr/bin/pkg-config (0.29.2)
Program glib-compile-resources found: YES (/usr/bin/glib-compile-resources)
Program sed found: YES (/bin/sed)
Build-time dependency gobject-introspection-1.0 found: YES 1.66.1
Dependency gobject-introspection-1.0 found: YES 1.66.1 (cached)
Program g-ir-scanner found: YES (/usr/bin/g-ir-scanner)
Dependency gobject-introspection-1.0 found: YES 1.66.1 (cached)
Program g-ir-compiler found: YES (/usr/bin/g-ir-compiler)
Program xsltproc found: YES (/usr/bin/xsltproc)
Program gtkdoc-scan found: YES (/usr/bin/gtkdoc-scan)
Program gtkdoc-scangobj found: YES (/usr/bin/gtkdoc-scangobj)
Program gtkdoc-mkdb found: YES (/usr/bin/gtkdoc-mkdb)
Program gtkdoc-mkhtml found: YES (/usr/bin/gtkdoc-mkhtml)
Program gtkdoc-fixxref found: YES (/usr/bin/gtkdoc-fixxref)
Program sh found: YES (/bin/sh)
C++ compiler for the host machine: c++ (gcc 10.2.1 "i586-alt-linux-g++ (GCC) 10.2.1 20201125 (ALT Sisyphus 10.2.1-alt2)")
C++ linker for the host machine: c++ ld.bfd 2.35.1.20210104
Run-time dependency qt5 (modules: Core) found: YES 5.15.2 (pkg-config)
Detecting Qt5 tools
Program /usr/share/qt5/bin/moc found: YES 5.15.2 (/usr/share/qt5/bin/moc)
Program /usr/share/qt5/bin/uic found: YES 5.15.2 (/usr/share/qt5/bin/uic)
Program /usr/share/qt5/bin/rcc found: YES 5.15.2 (/usr/share/qt5/bin/rcc)
Program /usr/share/qt5/bin/lrelease found: NO
Program lrelease-qt5 found: NO
Program lrelease found: NO
Run-time dependency qt5 (modules: Core, Test) found: YES 5.15.2 (pkg-config)
Configuring testpaths.h using configuration
Configuring AppStreamQtConfig.cmake using configuration
Configuring AppStreamQtConfigVersion.cmake using configuration
Build targets in project: 29

Found ninja-1.10.2 at /usr/bin/ninja
+ ninja-build -j8 -C i586-alt-linux
ninja: Entering directory `i586-alt-linux'
[1/154] Generating as-resources_h with a custom command
[2/154] Generating gperf as-yaml-tag with a custom command
[3/154] Generating gperf as-xml-tag with a custom command
[4/154] Generating 'qt/libAppStreamQt.so.0.14.3.p/moc_appstreamqt_export.cpp'.
../qt/appstreamqt_export.h:0: Note: No relevant classes found. No output generated.
[5/154] Generating 'qt/libAppStreamQt.so.0.14.3.p/moc_bundle.cpp'.
[6/154] Generating as-resources_c with a custom command
[7/154] Generating 'qt/libAppStreamQt.so.0.14.3.p/moc_category.cpp'.
[8/154] Generating 'qt/libAppStreamQt.so.0.14.3.p/moc_component.cpp'.
[9/154] Generating 'qt/libAppStreamQt.so.0.14.3.p/moc_contentrating.cpp'.
[10/154] Generating 'qt/libAppStreamQt.so.0.14.3.p/moc_icon.cpp'.
[11/154] Generating 'qt/libAppStreamQt.so.0.14.3.p/moc_image.cpp'.
[12/154] Generating 'qt/libAppStreamQt.so.0.14.3.p/moc_launchable.cpp'.
[13/154] Generating 'qt/libAppStreamQt.so.0.14.3.p/moc_metadata.cpp'.
[14/154] Generating 'qt/libAppStreamQt.so.0.14.3.p/moc_pool.cpp'.
[15/154] Generating 'qt/libAppStreamQt.so.0.14.3.p/moc_provided.cpp'.
[16/154] Generating 'qt/libAppStreamQt.so.0.14.3.p/moc_relation.cpp'.
[17/154] Generating 'qt/libAppStreamQt.so.0.14.3.p/moc_release.cpp'.
[18/154] Generating 'qt/libAppStreamQt.so.0.14.3.p/moc_screenshot.cpp'.
[19/154] Generating 'qt/libAppStreamQt.so.0.14.3.p/moc_spdx.cpp'.
../qt/spdx.h:0: Note: No relevant classes found. No output generated.
[20/154] Generating 'qt/libAppStreamQt.so.0.14.3.p/moc_suggested.cpp'.
[21/154] Generating 'qt/libAppStreamQt.so.0.14.3.p/moc_translation.cpp'.
[22/154] Generating 'qt/libAppStreamQt.so.0.14.3.p/moc_utils.cpp'.
../qt/utils.h:0: Note: No relevant classes found. No output generated.
[23/154] Generating 'qt/libAppStreamQt.so.0.14.3.p/moc_video.cpp'.
[24/154] Generating 'qt/tests/as-test_qt.p/asqt-pool-test.moc'.
[25/154] Generating man-appstreamcli with a custom command
[26/154] Generating as-enum-types.h with a custom command (wrapped by meson because command contains newlines, to capture output)
[27/154] Generating as-enum-types.c with a custom command (wrapped by meson because command contains newlines, to capture output)
[28/154] Compiling C object src/libappstream.so.0.14.3.p/as-curl.c.o
[29/154] Compiling C object src/libappstream.so.0.14.3.p/meson-generated_.._as-resources.c.o
[30/154] Compiling C object src/libappstream.so.0.14.3.p/as-distro-extras.c.o
[31/154] Compiling C object src/libappstream.so.0.14.3.p/as-desktop-entry.c.o
[32/154] Compiling C object src/libappstream.so.0.14.3.p/as-stemmer.c.o
[33/154] Compiling C object src/libappstream.so.0.14.3.p/as-tag.c.o
[34/154] Compiling C object src/libappstream.so.0.14.3.p/as-utils.c.o
[35/154] Compiling C object src/libappstream.so.0.14.3.p/as-news-convert.c.o
[36/154] Compiling C object src/libappstream.so.0.14.3.p/meson-generated_.._as-enum-types.c.o
[37/154] Compiling C object src/libappstream.so.0.14.3.p/as-profile.c.o
[38/154] Compiling C object src/libappstream.so.0.14.3.p/as-yaml.c.o
[39/154] Compiling C object src/libappstream.so.0.14.3.p/as-xml.c.o
[40/154] Compiling C object src/libappstream.so.0.14.3.p/as-cache.c.o
[41/154] Compiling C object src/libappstream.so.0.14.3.p/as-agreement.c.o
[42/154] Compiling C object src/libappstream.so.0.14.3.p/as-bundle.c.o
[43/154] Compiling C object src/libappstream.so.0.14.3.p/as-category.c.o
[44/154] Compiling C object src/libappstream.so.0.14.3.p/as-agreement-section.c.o
[45/154] Compiling C object src/libappstream.so.0.14.3.p/as-checksum.c.o
[46/154] Compiling C object src/libappstream.so.0.14.3.p/as-artifact.c.o
[47/154] Compiling C object src/libappstream.so.0.14.3.p/as-context.c.o
[48/154] Compiling C object src/libappstream.so.0.14.3.p/as-enums.c.o
[49/154] Compiling C object src/libappstream.so.0.14.3.p/as-distro-details.c.o
[50/154] Compiling C object src/libappstream.so.0.14.3.p/as-icon.c.o
[51/154] Compiling C object src/libappstream.so.0.14.3.p/as-image.c.o
[52/154] Compiling C object src/libappstream.so.0.14.3.p/as-content-rating.c.o
[53/154] Compiling C object src/libappstream.so.0.14.3.p/as-provided.c.o
[54/154] Compiling C object src/libappstream.so.0.14.3.p/as-issue.c.o
[55/154] Compiling C++ object qt/tests/as-test_qt.p/asqt-pool-test.cpp.o
[56/154] Compiling C object src/libappstream.so.0.14.3.p/as-launchable.c.o
[57/154] Compiling C object src/libappstream.so.0.14.3.p/as-metadata.c.o
[58/154] Compiling C object src/libappstream.so.0.14.3.p/as-relation.c.o
[59/154] Compiling C object src/libappstream.so.0.14.3.p/as-release.c.o
[60/154] Compiling C object src/libappstream.so.0.14.3.p/as-screenshot.c.o
[61/154] Compiling C object src/libappstream.so.0.14.3.p/as-review.c.o
[62/154] Compiling C object src/libappstream.so.0.14.3.p/as-translation.c.o
[63/154] Compiling C object src/libappstream.so.0.14.3.p/as-validator-issue.c.o
[64/154] Compiling C object src/libappstream.so.0.14.3.p/as-suggested.c.o
[65/154] Compiling C object src/libappstream.so.0.14.3.p/as-pool.c.o
[66/154] Compiling C object src/libappstream.so.0.14.3.p/as-spdx.c.o
[67/154] Compiling C object src/libappstream.so.0.14.3.p/as-version.c.o
[68/154] Compiling C object src/libappstream.so.0.14.3.p/as-vercmp.c.o
[69/154] Compiling C object src/libappstream.so.0.14.3.p/as-component.c.o
[70/154] Compiling C object tools/appstreamcli.p/ascli-actions-pkgmgr.c.o
[71/154] Compiling C object tools/appstreamcli.p/ascli-utils.c.o
[72/154] Compiling C object tools/appstreamcli.p/meson-generated_.._.._src_as-enum-types.c.o
[73/154] Compiling C object src/libappstream.so.0.14.3.p/as-video.c.o
[74/154] Compiling C object tools/appstreamcli.p/appstream-cli.c.o
[75/154] Compiling C object tools/appstreamcli.p/ascli-actions-mdata.c.o
[76/154] Compiling C object tools/appstreamcli.p/ascli-actions-misc.c.o
[77/154] Compiling C object tools/appstreamcli.p/ascli-actions-validate.c.o
[78/154] Compiling C object tests/as-test_basic.p/meson-generated_.._.._src_as-enum-types.c.o
[79/154] Compiling C object tests/as-test_basic.p/as-test-utils.c.o
[80/154] Compiling C object src/libappstream.so.0.14.3.p/as-validator.c.o
[81/154] Compiling C object tests/as-test_xml.p/as-test-utils.c.o
[82/154] Compiling C++ object qt/libAppStreamQt.so.0.14.3.p/meson-generated_moc_pool.cpp.o
[83/154] Compiling C object tests/as-test_xml.p/meson-generated_.._.._src_as-enum-types.c.o
[84/154] Linking target src/libappstream.so.0.14.3
[85/154] Compiling C object tests/as-test_yaml.p/meson-generated_.._.._src_as-enum-types.c.o
[86/154] Compiling C object tests/as-test_basic.p/test-basics.c.o
[87/154] Compiling C object tests/as-test_yaml.p/as-test-utils.c.o
[88/154] Compiling C object tests/as-test_pool.p/meson-generated_.._.._src_as-enum-types.c.o
[89/154] Compiling C object tests/as-test_pool.p/as-test-utils.c.o
[90/154] Compiling C object tests/as-test_validate.p/test-validate.c.o
[91/154] Compiling C object tests/as-test_yaml.p/test-yamldata.c.o
[92/154] Compiling C object tests/as-test_pool.p/test-pool.c.o
[93/154] Compiling C object tests/as-test_xml.p/test-xmldata.c.o
[94/154] Generating symbol file src/libappstream.so.0.14.3.p/libappstream.so.0.14.3.symbols
[95/154] Compiling C object tests/as-test_validate.p/meson-generated_.._.._src_as-enum-types.c.o
[96/154] Compiling C object tests/as-test_validate.p/as-test-utils.c.o
[97/154] Linking target tools/appstreamcli
[98/154] Generating gen-output with a custom command
[99/154] Compiling C object tests/as-test_perf.p/as-test-utils.c.o
[100/154] Linking target tests/as-test_basic
[101/154] Compiling C object tests/as-test_perf.p/test-performance.c.o
[102/154] Linking target tests/as-test_xml
[103/154] Linking target tests/as-test_pool
[104/154] Compiling C object tests/as-test_perf.p/meson-generated_.._.._src_as-enum-types.c.o
[105/154] Linking target tests/as-test_yaml
[106/154] Compiling C++ object qt/libAppStreamQt.so.0.14.3.p/meson-generated_moc_appstreamqt_export.cpp.o
[107/154] Linking target tests/as-test_validate
[108/154] Compiling C object tests/as-test_misc.p/meson-generated_.._.._src_as-enum-types.c.o
[109/154] Linking target tests/as-test_perf
[110/154] Compiling C object tests/as-test_misc.p/test-misc.c.o
[111/154] Compiling C object tests/as-test_misc.p/as-test-utils.c.o
[112/154] Linking target tests/as-test_misc
[113/154] Generating org.freedesktop.appstream.cli.metainfo.xml_merge with a custom command
[114/154] Compiling C++ object qt/libAppStreamQt.so.0.14.3.p/meson-generated_moc_category.cpp.o
[115/154] Compiling C++ object qt/libAppStreamQt.so.0.14.3.p/meson-generated_moc_bundle.cpp.o
[116/154] Compiling C++ object qt/libAppStreamQt.so.0.14.3.p/meson-generated_moc_contentrating.cpp.o
[117/154] Compiling C++ object qt/libAppStreamQt.so.0.14.3.p/meson-generated_moc_component.cpp.o
[118/154] Compiling C++ object qt/libAppStreamQt.so.0.14.3.p/meson-generated_moc_icon.cpp.o
[119/154] Generating AppStream-1.0.gir with a custom command
/usr/lib/gcc/i586-alt-linux/10/include/stddef.h:424: syntax error, unexpected identifier in '  __float128 __max_align_f128 __attribute__((__aligned__(__alignof(__float128))));' at '__float128'
../src/as-content-rating.c:591: Warning: AppStream: invalid "not" annotation option: "optional"
g-ir-scanner: link: i586-alt-linux-gcc -pthread -o /usr/src/RPM/BUILD/appstream-0.14.3/i586-alt-linux/tmp-introspectvg16js61/AppStream-1.0 -pipe -frecord-gcc-switches -Wall -g -O2 -march=i586 -mtune=generic /usr/src/RPM/BUILD/appstream-0.14.3/i586-alt-linux/tmp-introspectvg16js61/AppStream-1.0.o -L. -Wl,-rpath,. -Wl,--no-as-needed -L./src -lappstream -lglib-2.0 -lgobject-2.0 -lgio-2.0 -lcurl -lxml2 -lyaml -llmdb -lstemmer -lgirepository-1.0 -lgio-2.0 -lgobject-2.0 -Wl,--export-dynamic -lgmodule-2.0 -pthread -lglib-2.0
[120/154] Compiling C++ object qt/libAppStreamQt.so.0.14.3.p/meson-generated_moc_image.cpp.o
[121/154] Compiling C++ object qt/libAppStreamQt.so.0.14.3.p/meson-generated_moc_spdx.cpp.o
[122/154] Compiling C++ object qt/libAppStreamQt.so.0.14.3.p/meson-generated_moc_launchable.cpp.o
[123/154] Generating AppStream-1.0.typelib with a custom command
[124/154] Compiling C++ object qt/libAppStreamQt.so.0.14.3.p/meson-generated_moc_utils.cpp.o
[125/154] Compiling C++ object qt/libAppStreamQt.so.0.14.3.p/meson-generated_moc_provided.cpp.o
[126/154] Compiling C++ object qt/libAppStreamQt.so.0.14.3.p/meson-generated_moc_relation.cpp.o
[127/154] Compiling C++ object qt/libAppStreamQt.so.0.14.3.p/meson-generated_moc_screenshot.cpp.o
[128/154] Compiling C++ object qt/libAppStreamQt.so.0.14.3.p/meson-generated_moc_metadata.cpp.o
[129/154] Compiling C++ object qt/libAppStreamQt.so.0.14.3.p/meson-generated_moc_release.cpp.o
[130/154] Compiling C++ object qt/libAppStreamQt.so.0.14.3.p/meson-generated_moc_suggested.cpp.o
[131/154] Compiling C object qt/libAppStreamQt.so.0.14.3.p/meson-generated_.._.._src_as-enum-types.c.o
[132/154] Compiling C++ object qt/libAppStreamQt.so.0.14.3.p/meson-generated_moc_translation.cpp.o
[133/154] Compiling C++ object qt/libAppStreamQt.so.0.14.3.p/meson-generated_moc_video.cpp.o
[134/154] Compiling C++ object qt/libAppStreamQt.so.0.14.3.p/bundle.cpp.o
[135/154] Compiling C++ object qt/libAppStreamQt.so.0.14.3.p/icon.cpp.o
[136/154] Compiling C++ object qt/libAppStreamQt.so.0.14.3.p/contentrating.cpp.o
[137/154] Compiling C++ object qt/libAppStreamQt.so.0.14.3.p/image.cpp.o
[138/154] Compiling C++ object qt/libAppStreamQt.so.0.14.3.p/category.cpp.o
[139/154] Compiling C++ object qt/libAppStreamQt.so.0.14.3.p/launchable.cpp.o
[140/154] Compiling C++ object qt/libAppStreamQt.so.0.14.3.p/metadata.cpp.o
[141/154] Compiling C++ object qt/libAppStreamQt.so.0.14.3.p/pool.cpp.o
[142/154] Compiling C++ object qt/libAppStreamQt.so.0.14.3.p/component.cpp.o
[143/154] Compiling C++ object qt/libAppStreamQt.so.0.14.3.p/relation.cpp.o
[144/154] Compiling C++ object qt/libAppStreamQt.so.0.14.3.p/provided.cpp.o
[145/154] Compiling C++ object qt/libAppStreamQt.so.0.14.3.p/release.cpp.o
[146/154] Compiling C++ object qt/libAppStreamQt.so.0.14.3.p/spdx.cpp.o
[147/154] Compiling C++ object qt/libAppStreamQt.so.0.14.3.p/translation.cpp.o
[148/154] Compiling C++ object qt/libAppStreamQt.so.0.14.3.p/utils.cpp.o
[149/154] Compiling C++ object qt/libAppStreamQt.so.0.14.3.p/screenshot.cpp.o
[150/154] Compiling C++ object qt/libAppStreamQt.so.0.14.3.p/suggested.cpp.o
[151/154] Compiling C++ object qt/libAppStreamQt.so.0.14.3.p/video.cpp.o
[152/154] Linking target qt/libAppStreamQt.so.0.14.3
[153/154] Generating symbol file qt/libAppStreamQt.so.0.14.3.p/libAppStreamQt.so.0.14.3.symbols
[154/154] Linking target qt/tests/as-test_qt
+ exit 0
Executing(%install): /bin/sh -e /usr/src/tmp/rpm-tmp.97984
+ umask 022
+ /bin/mkdir -p /usr/src/RPM/BUILD
+ cd /usr/src/RPM/BUILD
+ /bin/chmod -Rf u+rwX -- /usr/src/tmp/appstream-buildroot
+ :
+ /bin/rm -rf -- /usr/src/tmp/appstream-buildroot
+ PATH=/usr/libexec/rpm-build:/usr/src/bin:/bin:/usr/bin:/usr/X11R6/bin:/usr/games
+ cd appstream-0.14.3
+ DESTDIR=/usr/src/tmp/appstream-buildroot
+ ninja-build -C i586-alt-linux install
ninja: Entering directory `i586-alt-linux'
[0/1] Installing files.
Installing src/as-enum-types.h to /usr/src/tmp/appstream-buildroot/usr/include/appstream
Installing src/libappstream.so.0.14.3 to /usr/src/tmp/appstream-buildroot/usr/lib
Installing src/AppStream-1.0.gir to /usr/src/tmp/appstream-buildroot/usr/share/gir-1.0
Installing src/AppStream-1.0.typelib to /usr/src/tmp/appstream-buildroot/usr/lib/girepository-1.0
Installing tools/appstreamcli to /usr/src/tmp/appstream-buildroot/usr/bin
Installing data/org.freedesktop.appstream.cli.metainfo.xml to /usr/src/tmp/appstream-buildroot/usr/share/metainfo
Installing docs/appstreamcli.1 to /usr/src/tmp/appstream-buildroot/usr/share/man/man1
Installing qt/libAppStreamQt.so.0.14.3 to /usr/src/tmp/appstream-buildroot/usr/lib
Installing /usr/src/RPM/BUILD/appstream-0.14.3/src/appstream.h to /usr/src/tmp/appstream-buildroot/usr/include/appstream
Installing /usr/src/RPM/BUILD/appstream-0.14.3/src/as-agreement.h to /usr/src/tmp/appstream-buildroot/usr/include/appstream
Installing /usr/src/RPM/BUILD/appstream-0.14.3/src/as-agreement-section.h to /usr/src/tmp/appstream-buildroot/usr/include/appstream
Installing /usr/src/RPM/BUILD/appstream-0.14.3/src/as-artifact.h to /usr/src/tmp/appstream-buildroot/usr/include/appstream
Installing /usr/src/RPM/BUILD/appstream-0.14.3/src/as-bundle.h to /usr/src/tmp/appstream-buildroot/usr/include/appstream
Installing /usr/src/RPM/BUILD/appstream-0.14.3/src/as-category.h to /usr/src/tmp/appstream-buildroot/usr/include/appstream
Installing /usr/src/RPM/BUILD/appstream-0.14.3/src/as-checksum.h to /usr/src/tmp/appstream-buildroot/usr/include/appstream
Installing /usr/src/RPM/BUILD/appstream-0.14.3/src/as-component.h to /usr/src/tmp/appstream-buildroot/usr/include/appstream
Installing /usr/src/RPM/BUILD/appstream-0.14.3/src/as-content-rating.h to /usr/src/tmp/appstream-buildroot/usr/include/appstream
Installing /usr/src/RPM/BUILD/appstream-0.14.3/src/as-context.h to /usr/src/tmp/appstream-buildroot/usr/include/appstream
Installing /usr/src/RPM/BUILD/appstream-0.14.3/src/as-distro-details.h to /usr/src/tmp/appstream-buildroot/usr/include/appstream
Installing /usr/src/RPM/BUILD/appstream-0.14.3/src/as-enums.h to /usr/src/tmp/appstream-buildroot/usr/include/appstream
Installing /usr/src/RPM/BUILD/appstream-0.14.3/src/as-icon.h to /usr/src/tmp/appstream-buildroot/usr/include/appstream
Installing /usr/src/RPM/BUILD/appstream-0.14.3/src/as-image.h to /usr/src/tmp/appstream-buildroot/usr/include/appstream
Installing /usr/src/RPM/BUILD/appstream-0.14.3/src/as-issue.h to /usr/src/tmp/appstream-buildroot/usr/include/appstream
Installing /usr/src/RPM/BUILD/appstream-0.14.3/src/as-launchable.h to /usr/src/tmp/appstream-buildroot/usr/include/appstream
Installing /usr/src/RPM/BUILD/appstream-0.14.3/src/as-metadata.h to /usr/src/tmp/appstream-buildroot/usr/include/appstream
Installing /usr/src/RPM/BUILD/appstream-0.14.3/src/as-pool.h to /usr/src/tmp/appstream-buildroot/usr/include/appstream
Installing /usr/src/RPM/BUILD/appstream-0.14.3/src/as-provided.h to /usr/src/tmp/appstream-buildroot/usr/include/appstream
Installing /usr/src/RPM/BUILD/appstream-0.14.3/src/as-relation.h to /usr/src/tmp/appstream-buildroot/usr/include/appstream
Installing /usr/src/RPM/BUILD/appstream-0.14.3/src/as-release.h to /usr/src/tmp/appstream-buildroot/usr/include/appstream
Installing /usr/src/RPM/BUILD/appstream-0.14.3/src/as-review.h to /usr/src/tmp/appstream-buildroot/usr/include/appstream
Installing /usr/src/RPM/BUILD/appstream-0.14.3/src/as-screenshot.h to /usr/src/tmp/appstream-buildroot/usr/include/appstream
Installing /usr/src/RPM/BUILD/appstream-0.14.3/src/as-spdx.h to /usr/src/tmp/appstream-buildroot/usr/include/appstream
Installing /usr/src/RPM/BUILD/appstream-0.14.3/src/as-suggested.h to /usr/src/tmp/appstream-buildroot/usr/include/appstream
Installing /usr/src/RPM/BUILD/appstream-0.14.3/src/as-translation.h to /usr/src/tmp/appstream-buildroot/usr/include/appstream
Installing /usr/src/RPM/BUILD/appstream-0.14.3/src/as-utils.h to /usr/src/tmp/appstream-buildroot/usr/include/appstream
Installing /usr/src/RPM/BUILD/appstream-0.14.3/src/as-validator.h to /usr/src/tmp/appstream-buildroot/usr/include/appstream
Installing /usr/src/RPM/BUILD/appstream-0.14.3/src/as-validator-issue.h to /usr/src/tmp/appstream-buildroot/usr/include/appstream
Installing /usr/src/RPM/BUILD/appstream-0.14.3/src/as-vercmp.h to /usr/src/tmp/appstream-buildroot/usr/include/appstream
Installing /usr/src/RPM/BUILD/appstream-0.14.3/src/as-video.h to /usr/src/tmp/appstream-buildroot/usr/include/appstream
Installing /usr/src/RPM/BUILD/appstream-0.14.3/qt/appstreamqt_export.h to /usr/src/tmp/appstream-buildroot/usr/include/AppStreamQt
Installing /usr/src/RPM/BUILD/appstream-0.14.3/qt/bundle.h to /usr/src/tmp/appstream-buildroot/usr/include/AppStreamQt
Installing /usr/src/RPM/BUILD/appstream-0.14.3/qt/category.h to /usr/src/tmp/appstream-buildroot/usr/include/AppStreamQt
Installing /usr/src/RPM/BUILD/appstream-0.14.3/qt/component.h to /usr/src/tmp/appstream-buildroot/usr/include/AppStreamQt
Installing /usr/src/RPM/BUILD/appstream-0.14.3/qt/contentrating.h to /usr/src/tmp/appstream-buildroot/usr/include/AppStreamQt
Installing /usr/src/RPM/BUILD/appstream-0.14.3/qt/icon.h to /usr/src/tmp/appstream-buildroot/usr/include/AppStreamQt
Installing /usr/src/RPM/BUILD/appstream-0.14.3/qt/image.h to /usr/src/tmp/appstream-buildroot/usr/include/AppStreamQt
Installing /usr/src/RPM/BUILD/appstream-0.14.3/qt/launchable.h to /usr/src/tmp/appstream-buildroot/usr/include/AppStreamQt
Installing /usr/src/RPM/BUILD/appstream-0.14.3/qt/metadata.h to /usr/src/tmp/appstream-buildroot/usr/include/AppStreamQt
Installing /usr/src/RPM/BUILD/appstream-0.14.3/qt/pool.h to /usr/src/tmp/appstream-buildroot/usr/include/AppStreamQt
Installing /usr/src/RPM/BUILD/appstream-0.14.3/qt/provided.h to /usr/src/tmp/appstream-buildroot/usr/include/AppStreamQt
Installing /usr/src/RPM/BUILD/appstream-0.14.3/qt/relation.h to /usr/src/tmp/appstream-buildroot/usr/include/AppStreamQt
Installing /usr/src/RPM/BUILD/appstream-0.14.3/qt/release.h to /usr/src/tmp/appstream-buildroot/usr/include/AppStreamQt
Installing /usr/src/RPM/BUILD/appstream-0.14.3/qt/screenshot.h to /usr/src/tmp/appstream-buildroot/usr/include/AppStreamQt
Installing /usr/src/RPM/BUILD/appstream-0.14.3/qt/spdx.h to /usr/src/tmp/appstream-buildroot/usr/include/AppStreamQt
Installing /usr/src/RPM/BUILD/appstream-0.14.3/qt/suggested.h to /usr/src/tmp/appstream-buildroot/usr/include/AppStreamQt
Installing /usr/src/RPM/BUILD/appstream-0.14.3/qt/translation.h to /usr/src/tmp/appstream-buildroot/usr/include/AppStreamQt
Installing /usr/src/RPM/BUILD/appstream-0.14.3/qt/utils.h to /usr/src/tmp/appstream-buildroot/usr/include/AppStreamQt
Installing /usr/src/RPM/BUILD/appstream-0.14.3/qt/video.h to /usr/src/tmp/appstream-buildroot/usr/include/AppStreamQt
Installing /usr/src/RPM/BUILD/appstream-0.14.3/i586-alt-linux/src/as-version.h to /usr/src/tmp/appstream-buildroot/usr/include/appstream
Installing /usr/src/RPM/BUILD/appstream-0.14.3/i586-alt-linux/meson-private/appstream.pc to /usr/src/tmp/appstream-buildroot/usr/lib/pkgconfig
Installing /usr/src/RPM/BUILD/appstream-0.14.3/data/its/metainfo.its to /usr/src/tmp/appstream-buildroot/usr/share/gettext/its
Installing /usr/src/RPM/BUILD/appstream-0.14.3/data/its/metainfo.loc to /usr/src/tmp/appstream-buildroot/usr/share/gettext/its
Installing /usr/src/RPM/BUILD/appstream-0.14.3/data/appstream.conf to /usr/src/tmp/appstream-buildroot/etc
Installing /usr/src/RPM/BUILD/appstream-0.14.3/i586-alt-linux/qt/AppStreamQtConfig.cmake to /usr/src/tmp/appstream-buildroot/usr/lib/cmake/AppStreamQt
Installing /usr/src/RPM/BUILD/appstream-0.14.3/i586-alt-linux/qt/AppStreamQtConfigVersion.cmake to /usr/src/tmp/appstream-buildroot/usr/lib/cmake/AppStreamQt
Running custom install script '/usr/bin/meson --internal gettext install --subdir=po/ --localedir=share/locale --pkgname=appstream'
Running custom install script '/usr/bin/meson --internal gtkdoc --sourcedir=/usr/src/RPM/BUILD/appstream-0.14.3 --builddir=/usr/src/RPM/BUILD/appstream-0.14.3/i586-alt-linux --subdir=docs/api/ --headerdirs=/usr/src/RPM/BUILD/appstream-0.14.3/src --mainfile=appstream-docs.xml --modulename=appstream --moduleversion= --mode=auto --gtkdoc-scan=/usr/bin/gtkdoc-scan --gtkdoc-scangobj=/usr/bin/gtkdoc-scangobj --gtkdoc-mkdb=/usr/bin/gtkdoc-mkdb --gtkdoc-mkhtml=/usr/bin/gtkdoc-mkhtml --gtkdoc-fixxref=/usr/bin/gtkdoc-fixxref --content-files=/usr/src/RPM/BUILD/appstream-0.14.3/docs/api/../xml/man/appstreamcli.1.xml --ignore-headers=as-agreement-private.h@@as-agreement-section-private.h@@as-bundle-private.h@@as-cache.h@@as-checksum-private.h@@as-component-private.h@@as-content-rating-private.h@@as-context-private.h@@as-curl.h@@as-desktop-entry.h@@as-distro-details-private.h@@as-distro-extras.h@@as-icon-private.h@@as-image-private.h@@as-issue-private.h@@as-launchable-private.h@@as-news-convert.h@@as-pool-private.h@@as-profile.h@@as-relation-private.h@@as-release-private.h@@as-review-private.h@@as-screenshot-private.h@@as-stemmer.h@@as-tag.h@@as-utils-private.h@@as-validator-issue-tag.h@@as-xml.h@@as-yaml.h --installdir=/usr/share/doc/appstream/html/api --cc=cc --ld=cc --cflags=-pipe -frecord-gcc-switches -Wall -g -O2 -march=i586 -mtune=generic -Werror=implicit-function-declaration -Wno-unused-parameter -DAS_COMPILATION -D_POSIX_C_SOURCE=200112L --ldflags=-pipe -frecord-gcc-switches -Wall -g -O2 -march=i586 -mtune=generic'
Running custom install script '/bin/sh -c mkdir -p $DESTDIR/usr/share/gtk-doc/html && ln -sf ../../../share/doc/appstream/html/api $DESTDIR//usr/share/gtk-doc/html/appstream'
+ mkdir -p /usr/src/tmp/appstream-buildroot/usr/share/app-info/icons /usr/src/tmp/appstream-buildroot/usr/share/app-info/xmls
+ mkdir -p /usr/src/tmp/appstream-buildroot/var/cache/app-info/icons /usr/src/tmp/appstream-buildroot/var/cache/app-info/xapian /usr/src/tmp/appstream-buildroot/var/cache/app-info/xmls
+ touch /usr/src/tmp/appstream-buildroot/var/cache/app-info/cache.watch
+ /usr/lib/rpm/find-lang appstream
+ /usr/lib/rpm/brp-alt
Cleaning files in /usr/src/tmp/appstream-buildroot (auto)
mode of './usr/lib/libAppStreamQt.so.0.14.3' changed from 0755 (rwxr-xr-x) to 0644 (rw-r--r--)
mode of './usr/lib/libappstream.so.0.14.3' changed from 0755 (rwxr-xr-x) to 0644 (rw-r--r--)
Verifying and fixing files in /usr/src/tmp/appstream-buildroot (binconfig,pkgconfig,libtool,desktop,gnuconfig)
/usr/lib/pkgconfig/appstream.pc: Libs: '-L${libdir} -lappstream' --> '-lappstream'
Checking contents of files in /usr/src/tmp/appstream-buildroot/ (default)
Compressing files in /usr/src/tmp/appstream-buildroot (auto)
Adjusting library links in /usr/src/tmp/appstream-buildroot
./usr/lib: (from <cmdline>:0)
	libappstream.so.4 -> libappstream.so.0.14.3
	libAppStreamQt.so.2 -> libAppStreamQt.so.0.14.3
Verifying ELF objects in /usr/src/tmp/appstream-buildroot (arch=normal,fhs=normal,lfs=relaxed,lint=relaxed,rpath=normal,stack=normal,textrel=normal,unresolved=normal)
Hardlinking identical .pyc and .pyo files
Executing(%check): /bin/sh -e /usr/src/tmp/rpm-tmp.72600
+ umask 022
+ /bin/mkdir -p /usr/src/RPM/BUILD
+ cd /usr/src/RPM/BUILD
+ cd appstream-0.14.3
+ exit 0
Processing files: appstream-0.14.3-alt1
Executing(%doc): /bin/sh -e /usr/src/tmp/rpm-tmp.41299
+ umask 022
+ /bin/mkdir -p /usr/src/RPM/BUILD
+ cd /usr/src/RPM/BUILD
+ cd appstream-0.14.3
+ DOCDIR=/usr/src/tmp/appstream-buildroot/usr/share/doc/appstream-0.14.3
+ export DOCDIR
+ rm -rf /usr/src/tmp/appstream-buildroot/usr/share/doc/appstream-0.14.3
+ /bin/mkdir -p /usr/src/tmp/appstream-buildroot/usr/share/doc/appstream-0.14.3
+ cp -prL AUTHORS LICENSE.GPLv2 LICENSE.LGPLv2.1 MAINTAINERS NEWS README.md RELEASE /usr/src/tmp/appstream-buildroot/usr/share/doc/appstream-0.14.3
+ chmod -R go-w /usr/src/tmp/appstream-buildroot/usr/share/doc/appstream-0.14.3
+ chmod -R a+rX /usr/src/tmp/appstream-buildroot/usr/share/doc/appstream-0.14.3
+ exit 0
Finding Provides (using /usr/lib/rpm/find-provides)
Executing: /bin/sh -e /usr/src/tmp/rpm-tmp.7GBQTR
find-provides: running scripts (alternatives,debuginfo,gir,lib,pam,perl,pkgconfig,python,shell,typelib,vala)
lib.prov: /usr/src/tmp/appstream-buildroot/usr/lib/libappstream.so.4: 727 symbols, 20 bpp
warning: hash collision: as_agreement_section_get_active_locale as_str_replace
Finding Requires (using /usr/lib/rpm/find-requires)
Executing: /bin/sh -e /usr/src/tmp/rpm-tmp.bMiCIO
find-requires: running scripts (cpp,debuginfo,files,gir-js,gir-python,gir,lib,pam,perl,pkgconfig,pkgconfiglib,python,rpmlib,shebang,shell,static,symlinks,systemd-services,typelib,vala)
Provides: libappstream.so.4 = set:ndZoCughZtdVSBZIQXsKlsraV6YVWDq4XLEE6kFHDEv7kjBTm1nRQExA3drbZ7e0SwUFXuttgbFZlZcbcb1Zgeozp9KK9im9fxPDz0Uxg4IR4m2t8lv4Lt8D0JFaPr2fSDRUmsW0dAmfxkM9bkkec1qKSfaiZ5WgFEeIC25wZea9EjfeAKJaZy4Z9BZp7CopwHfKF3Qs1z7Zg6IMZ8SkEaVusxFE6q2M1VAShi40cskwO1nRKt8iLYNGwcFHBbmfFPxTAL7DjwXZaC9vknKJdCIt9pqi98RwmlR7NewDhqxBWLP41uIy7GLqR9b6xzzAMWBWVxiFbbjLWn989Kr2wATCVF9W1KLw7nE6weDlnR7GJhE62GsLx3SbA8t20DMqpPWnxtwRjityMQAfobxgkVrJUVZt4Gxu5uFZwlZ5RZlsk1miBXvYV2Ynb2A9Iocvqc99q0HqZGhcNvvfO5Z1N3WylAgSM8HyOOHLZ3dvw1OMXapc9eUNV3ZINC41au5R7FXo6yhzn819ZdkVJd131Z6sbGK3wtf8DQJA162raGe3bpyM7S0pzuis8BBYGmQWy0u1nzfzvv0kbZ1mKPCia2z1OhTE97TPe9pScdeszdmXMzs25Ifp0qdxogD32Fv6CqR5dnMpDfM7gcRTqZEwyTYia7Tf5aSqsAgNGnoElMv3dwcgvkg0b6IjCe6ZjaDhLx4BAOrpeYmiZ8N4LDWRTnZ8r9qRefukWepEsIIPIBZnYuiGnZkJpgKWT0J8Wg165GBRuwoOd4ObTD5ICT54WW2VHp3I6XtS2RZFjgFVHfolBPrX2W8DxgRUT3l8ZdCB1PNdjAx3q0VBhLu6KWr9XOHdfZApZKxz7ZtI0IdHJjOL7n2Q0GpN3gHv3xb3mCh4Fak2vspkchpVHtzc3SDP4WUDihgq2Q6Hl8ZemcNfdh1LaMgMVS9weaBOvZkYrOIplsaSSbZ87yGMji2vdVtdIyK1a2gBKOzbidnMm31bVpnkN0Rtn7yZ1VXEkAKachghy4S8HWZ8eccvDK8iGKhzVLqgwrZ5EhwSNom32Z5XREIOuScATYLEDZCuPY68pZfhb9BGsxZzcC35Ab8Pl3xLHLsvsLAf7LfxhOnfijLG118epZ1RKZyeo4yWrV3O4qEgwXQFVbtb3Bicvmypcd1CNPaS6lnwuZfIhNkmqlgyVgkYia27d4rCVi3SZymE6yrrPpkwsM7BkNDAmFdwZ4bJ7BHR6IdvpheO75V04N8DXSzK2pdkzBaVNUrPv0MAC63Iit1VdpkpFfiRUaBZ7W8aU1tJMD3OGO92lnm4ugfG0X2fTbzZGl3VZLIhh0PHIdfaxJsPMb4DtIE6Ar0DlvrgR89oFRWaBIhRakBmuHaR0XMlPk4TU79XZGaz0Q5Fux0EHYljVjTYIY7Axu2vJRY2pZGLFMK1GbAo96RHCxwoMzvGJbb7ApxkbLnikxmy0, typelib(AppStream) = 1.0
Requires: /lib/ld-linux.so.2, libc.so.6(GLIBC_2.0), libc.so.6(GLIBC_2.1), libc.so.6(GLIBC_2.1.3), libc.so.6(GLIBC_2.2), libc.so.6(GLIBC_2.2.3), libc.so.6(GLIBC_2.28), libc.so.6(GLIBC_2.3.4), libc.so.6(GLIBC_2.4), libc.so.6(GLIBC_2.7), libcurl.so.4 >= set:kgZtd1JrWSuqTO0mIImUrM9vg, libgio-2.0.so.0 >= set:oi2bSX5jojBFEfMoZaIX1BpZ6oOlPYGo2oCAGloQowOypgiiizZduHto56ce2DQ0GbZx8eZvIqcZ9rEmVXcDbKDJg5PIn5OSz1Di2hIEv59e196AgZBXlqX1XMhvRWlWmd9bNRTYsw5XW3, libglib-2.0.so.0 >= set:ogZiCWVH7cVZjqfMOvjsuqC6mDaZ1qAQm7I3MHcCXEyYVe7tEHmNSsbZa6sRmN8m8tZnftfizZL7pZ9DkkCaghkuv4c6AsZvrf8ttqQEzEGcOhibu98h3XDjaSdfm6UXEcHoTof6ZjGPAjbFaNnRKQUDnTqBHw7iQwq3qmlz8br3AbDPys8B7d6RGPZzQNKdBIGCZc4HEkOFWmKCddADSdP9L0DQPPxCMy91y8WifZy32ro3So97o22VuiOSN2qHyxUJc0ieXZiAqm8yKN8jwJKEI9C1jXz9HyH52L04EPgOGipV44buT9nKGPILdH14XXL2W2xZ2m28fi86kAsCH24ndhjdDQOfRRC8qQPkZtzZ0MFh3GA6H6ZhFwNR9K8rhYJmG33auawxOO8ZFQXcNXuJXkCLcrOEN13k2AvVhvLlL0Z9x8ZhGYWFJpBp3mWZps6H1SolslLND84KTDGo4LOtMrSgjTrNSNjMBOLZ4vj2O8Yggqqd38snQSnM14s9tx0, libgobject-2.0.so.0 >= set:mg9fAxfN7ZjLQ345lkoZiDUCUmV4d3qn422KFqfmxkcBs8qItCW9fbZsNeeu3cqqcZeedpoRe8ZtKHgktRh3co6BlcweHXqrjCVx5e0, liblmdb.so.0 >= set:kfh1lBor8A6eAayeG00DTi9am0P3wmwTkktrbJ15xvIV6HJ0, libstemmer.so.0 >= set:lj9T6ZihEuM1, libxml2.so.2 >= set:ojK5kZ9WfYZJIqGsZ5Boau9PXHz4Bi8B7wpTy69NCA2NAOZ4pxs5ieWdi9EC6zrRPL2xWgvtPjBCgQ0B1kCzZkOQB, libxml2.so.2(LIBXML2_2.4.30), libxml2.so.2(LIBXML2_2.6.0), libxml2.so.2(LIBXML2_2.6.23), libxml2.so.2(LIBXML2_2.6.8), libxml2.so.2(LIBXML2_2.9.0), libyaml-0.so.2 >= set:jeDuSUERz1xrso2DQAS591Z1EGdAO0G3lJz5lBTkno9MDtoPne, rtld(GNU_HASH), typelib(GObject) = 2.0, typelib(Gio) = 2.0
Requires(rpmlib): rpmlib(SetVersions)
Finding debuginfo files (using /usr/lib/rpm/find-debuginfo-files)
Executing: /bin/sh -e /usr/src/tmp/rpm-tmp.pWuvlP
Creating appstream-debuginfo package
Processing files: appstream-devel-0.14.3-alt1
Finding Provides (using /usr/lib/rpm/find-provides)
Executing: /bin/sh -e /usr/src/tmp/rpm-tmp.1I229O
find-provides: running scripts (alternatives,debuginfo,gir,lib,pam,perl,pkgconfig,python,shell,typelib,vala)
Finding Requires (using /usr/lib/rpm/find-requires)
Executing: /bin/sh -e /usr/src/tmp/rpm-tmp.35dInQ
find-requires: running scripts (cpp,debuginfo,files,gir-js,gir-python,gir,lib,pam,perl,pkgconfig,pkgconfiglib,python,rpmlib,shebang,shell,static,symlinks,systemd-services,typelib,vala)
/usr/src/tmp/appstream-buildroot/usr/include/appstream/as-icon.h:22:2: error: #error "Only <appstream.h> can be included directly."
   22 | #error "Only <appstream.h> can be included directly."
      |  ^~~~~
cpp.req: /usr/src/tmp/appstream-buildroot/usr/include/appstream/as-icon.h: cpp failed, trying c++ mode
/usr/src/tmp/appstream-buildroot/usr/include/appstream/as-icon.h:22:2: error: #error "Only <appstream.h> can be included directly."
   22 | #error "Only <appstream.h> can be included directly."
      |  ^~~~~
cpp.req: WARNING: /usr/src/tmp/appstream-buildroot/usr/include/appstream/as-icon.h: cpp failed
/usr/src/tmp/appstream-buildroot/usr/include/appstream/as-pool.h:22:2: error: #error "Only <appstream.h> can be included directly."
   22 | #error "Only <appstream.h> can be included directly."
      |  ^~~~~
In file included from /usr/src/tmp/appstream-buildroot/usr/include/appstream/as-pool.h:30:
/usr/src/tmp/appstream-buildroot/usr/include/appstream/as-component.h:22:2: error: #error "Only <appstream.h> can be included directly."
   22 | #error "Only <appstream.h> can be included directly."
      |  ^~~~~
In file included from /usr/src/tmp/appstream-buildroot/usr/include/appstream/as-component.h:29,
                 from /usr/src/tmp/appstream-buildroot/usr/include/appstream/as-pool.h:30:
/usr/src/tmp/appstream-buildroot/usr/include/appstream/as-context.h:22:2: error: #error "Only <appstream.h> can be included directly."
   22 | #error "Only <appstream.h> can be included directly."
      |  ^~~~~
In file included from /usr/src/tmp/appstream-buildroot/usr/include/appstream/as-context.h:29,
                 from /usr/src/tmp/appstream-buildroot/usr/include/appstream/as-component.h:29,
                 from /usr/src/tmp/appstream-buildroot/usr/include/appstream/as-pool.h:30:
/usr/src/tmp/appstream-buildroot/usr/include/appstream/as-enums.h:22:2: error: #error "Only <appstream.h> can be included directly."
   22 | #error "Only <appstream.h> can be included directly."
      |  ^~~~~
In file included from /usr/src/tmp/appstream-buildroot/usr/include/appstream/as-component.h:30,
                 from /usr/src/tmp/appstream-buildroot/usr/include/appstream/as-pool.h:30:
/usr/src/tmp/appstream-buildroot/usr/include/appstream/as-enums.h:22:2: error: #error "Only <appstream.h> can be included directly."
   22 | #error "Only <appstream.h> can be included directly."
      |  ^~~~~
In file included from /usr/src/tmp/appstream-buildroot/usr/include/appstream/as-component.h:32,
                 from /usr/src/tmp/appstream-buildroot/usr/include/appstream/as-pool.h:30:
/usr/src/tmp/appstream-buildroot/usr/include/appstream/as-provided.h:22:2: error: #error "Only <appstream.h> can be included directly."
   22 | #error "Only <appstream.h> can be included directly."
      |  ^~~~~
In file included from /usr/src/tmp/appstream-buildroot/usr/include/appstream/as-component.h:33,
                 from /usr/src/tmp/appstream-buildroot/usr/include/appstream/as-pool.h:30:
/usr/src/tmp/appstream-buildroot/usr/include/appstream/as-icon.h:22:2: error: #error "Only <appstream.h> can be included directly."
   22 | #error "Only <appstream.h> can be included directly."
      |  ^~~~~
In file included from /usr/src/tmp/appstream-buildroot/usr/include/appstream/as-component.h:34,
                 from /usr/src/tmp/appstream-buildroot/usr/include/appstream/as-pool.h:30:
/usr/src/tmp/appstream-buildroot/usr/include/appstream/as-screenshot.h:23:2: error: #error "Only <appstream.h> can be included directly."
   23 | #error "Only <appstream.h> can be included directly."
      |  ^~~~~
In file included from /usr/src/tmp/appstream-buildroot/usr/include/appstream/as-screenshot.h:31,
                 from /usr/src/tmp/appstream-buildroot/usr/include/appstream/as-component.h:34,
                 from /usr/src/tmp/appstream-buildroot/usr/include/appstream/as-pool.h:30:
/usr/src/tmp/appstream-buildroot/usr/include/appstream/as-image.h:22:2: error: #error "Only <appstream.h> can be included directly."
   22 | #error "Only <appstream.h> can be included directly."
      |  ^~~~~
In file included from /usr/src/tmp/appstream-buildroot/usr/include/appstream/as-screenshot.h:32,
                 from /usr/src/tmp/appstream-buildroot/usr/include/appstream/as-component.h:34,
                 from /usr/src/tmp/appstream-buildroot/usr/include/appstream/as-pool.h:30:
/usr/src/tmp/appstream-buildroot/usr/include/appstream/as-video.h:22:2: error: #error "Only <appstream.h> can be included directly."
   22 | #error "Only <appstream.h> can be included directly."
      |  ^~~~~
In file included from /usr/src/tmp/appstream-buildroot/usr/include/appstream/as-component.h:35,
                 from /usr/src/tmp/appstream-buildroot/usr/include/appstream/as-pool.h:30:
/usr/src/tmp/appstream-buildroot/usr/include/appstream/as-release.h:22:2: error: #error "Only <appstream.h> can be included directly."
   22 | #error "Only <appstream.h> can be included directly."
      |  ^~~~~
In file included from /usr/src/tmp/appstream-buildroot/usr/include/appstream/as-release.h:29,
                 from /usr/src/tmp/appstream-buildroot/usr/include/appstream/as-component.h:35,
                 from /usr/src/tmp/appstream-buildroot/usr/include/appstream/as-pool.h:30:
/usr/src/tmp/appstream-buildroot/usr/include/appstream/as-enums.h:22:2: error: #error "Only <appstream.h> can be included directly."
   22 | #error "Only <appstream.h> can be included directly."
      |  ^~~~~
In file included from /usr/src/tmp/appstream-buildroot/usr/include/appstream/as-release.h:30,
                 from /usr/src/tmp/appstream-buildroot/usr/include/appstream/as-component.h:35,
                 from /usr/src/tmp/appstream-buildroot/usr/include/appstream/as-pool.h:30:
/usr/src/tmp/appstream-buildroot/usr/include/appstream/as-artifact.h:22:2: error: #error "Only <appstream.h> can be included directly."
   22 | #error "Only <appstream.h> can be included directly."
      |  ^~~~~
In file included from /usr/src/tmp/appstream-buildroot/usr/include/appstream/as-artifact.h:29,
                 from /usr/src/tmp/appstream-buildroot/usr/include/appstream/as-release.h:30,
                 from /usr/src/tmp/appstream-buildroot/usr/include/appstream/as-component.h:35,
                 from /usr/src/tmp/appstream-buildroot/usr/include/appstream/as-pool.h:30:
/usr/src/tmp/appstream-buildroot/usr/include/appstream/as-checksum.h:22:2: error: #error "Only <appstream.h> can be included directly."
   22 | #error "Only <appstream.h> can be included directly."
      |  ^~~~~
In file included from /usr/src/tmp/appstream-buildroot/usr/include/appstream/as-artifact.h:30,
                 from /usr/src/tmp/appstream-buildroot/usr/include/appstream/as-release.h:30,
                 from /usr/src/tmp/appstream-buildroot/usr/include/appstream/as-component.h:35,
                 from /usr/src/tmp/appstream-buildroot/usr/include/appstream/as-pool.h:30:
/usr/src/tmp/appstream-buildroot/usr/include/appstream/as-bundle.h:22:2: error: #error "Only <appstream.h> can be included directly."
   22 | #error "Only <appstream.h> can be included directly."
      |  ^~~~~
In file included from /usr/src/tmp/appstream-buildroot/usr/include/appstream/as-release.h:31,
                 from /usr/src/tmp/appstream-buildroot/usr/include/appstream/as-component.h:35,
                 from /usr/src/tmp/appstream-buildroot/usr/include/appstream/as-pool.h:30:
/usr/src/tmp/appstream-buildroot/usr/include/appstream/as-issue.h:22:2: error: #error "Only <appstream.h> can be included directly."
   22 | #error "Only <appstream.h> can be included directly."
      |  ^~~~~
In file included from /usr/src/tmp/appstream-buildroot/usr/include/appstream/as-component.h:36,
                 from /usr/src/tmp/appstream-buildroot/usr/include/appstream/as-pool.h:30:
/usr/src/tmp/appstream-buildroot/usr/include/appstream/as-translation.h:22:2: error: #error "Only <appstream.h> can be included directly."
   22 | #error "Only <appstream.h> can be included directly."
      |  ^~~~~
In file included from /usr/src/tmp/appstream-buildroot/usr/include/appstream/as-component.h:37,
                 from /usr/src/tmp/appstream-buildroot/usr/include/appstream/as-pool.h:30:
/usr/src/tmp/appstream-buildroot/usr/include/appstream/as-suggested.h:23:2: error: #error "Only <appstream.h> can be included directly."
   23 | #error "Only <appstream.h> can be included directly."
      |  ^~~~~
In file included from /usr/src/tmp/appstream-buildroot/usr/include/appstream/as-component.h:38,
                 from /usr/src/tmp/appstream-buildroot/usr/include/appstream/as-pool.h:30:
/usr/src/tmp/appstream-buildroot/usr/include/appstream/as-category.h:22:2: error: #error "Only <appstream.h> can be included directly."
   22 | #error "Only <appstream.h> can be included directly."
      |  ^~~~~
In file included from /usr/src/tmp/appstream-buildroot/usr/include/appstream/as-component.h:39,
                 from /usr/src/tmp/appstream-buildroot/usr/include/appstream/as-pool.h:30:
/usr/src/tmp/appstream-buildroot/usr/include/appstream/as-bundle.h:22:2: error: #error "Only <appstream.h> can be included directly."
   22 | #error "Only <appstream.h> can be included directly."
      |  ^~~~~
In file included from /usr/src/tmp/appstream-buildroot/usr/include/appstream/as-component.h:40,
                 from /usr/src/tmp/appstream-buildroot/usr/include/appstream/as-pool.h:30:
/usr/src/tmp/appstream-buildroot/usr/include/appstream/as-content-rating.h:24:2: error: #error "Only <appstream.h> can be included directly."
   24 | #error "Only <appstream.h> can be included directly."
      |  ^~~~~
In file included from /usr/src/tmp/appstream-buildroot/usr/include/appstream/as-component.h:41,
                 from /usr/src/tmp/appstream-buildroot/usr/include/appstream/as-pool.h:30:
/usr/src/tmp/appstream-buildroot/usr/include/appstream/as-launchable.h:22:2: error: #error "Only <appstream.h> can be included directly."
   22 | #error "Only <appstream.h> can be included directly."
      |  ^~~~~
In file included from /usr/src/tmp/appstream-buildroot/usr/include/appstream/as-component.h:42,
                 from /usr/src/tmp/appstream-buildroot/usr/include/appstream/as-pool.h:30:
/usr/src/tmp/appstream-buildroot/usr/include/appstream/as-relation.h:22:2: error: #error "Only <appstream.h> can be included directly."
   22 | #error "Only <appstream.h> can be included directly."
      |  ^~~~~
In file included from /usr/src/tmp/appstream-buildroot/usr/include/appstream/as-component.h:43,
                 from /usr/src/tmp/appstream-buildroot/usr/include/appstream/as-pool.h:30:
/usr/src/tmp/appstream-buildroot/usr/include/appstream/as-agreement.h:23:2: error: #error "Only <appstream.h> can be included directly."
   23 | #error "Only <appstream.h> can be included directly."
      |  ^~~~~
In file included from /usr/src/tmp/appstream-buildroot/usr/include/appstream/as-agreement.h:31,
                 from /usr/src/tmp/appstream-buildroot/usr/include/appstream/as-component.h:43,
                 from /usr/src/tmp/appstream-buildroot/usr/include/appstream/as-pool.h:30:
/usr/src/tmp/appstream-buildroot/usr/include/appstream/as-agreement-section.h:23:2: error: #error "Only <appstream.h> can be included directly."
   23 | #error "Only <appstream.h> can be included directly."
      |  ^~~~~
In file included from /usr/src/tmp/appstream-buildroot/usr/include/appstream/as-component.h:44,
                 from /usr/src/tmp/appstream-buildroot/usr/include/appstream/as-pool.h:30:
/usr/src/tmp/appstream-buildroot/usr/include/appstream/as-review.h:26:2: error: #error "Only <appstream.h> can be included directly."
   26 | #error "Only <appstream.h> can be included directly."
      |  ^~~~~
cpp.req: /usr/src/tmp/appstream-buildroot/usr/include/appstream/as-pool.h: cpp failed, trying c++ mode
/usr/src/tmp/appstream-buildroot/usr/include/appstream/as-pool.h:22:2: error: #error "Only <appstream.h> can be included directly."
   22 | #error "Only <appstream.h> can be included directly."
      |  ^~~~~
In file included from /usr/src/tmp/appstream-buildroot/usr/include/appstream/as-pool.h:30:
/usr/src/tmp/appstream-buildroot/usr/include/appstream/as-component.h:22:2: error: #error "Only <appstream.h> can be included directly."
   22 | #error "Only <appstream.h> can be included directly."
      |  ^~~~~
In file included from /usr/src/tmp/appstream-buildroot/usr/include/appstream/as-component.h:29,
                 from /usr/src/tmp/appstream-buildroot/usr/include/appstream/as-pool.h:30:
/usr/src/tmp/appstream-buildroot/usr/include/appstream/as-context.h:22:2: error: #error "Only <appstream.h> can be included directly."
   22 | #error "Only <appstream.h> can be included directly."
      |  ^~~~~
In file included from /usr/src/tmp/appstream-buildroot/usr/include/appstream/as-context.h:29,
                 from /usr/src/tmp/appstream-buildroot/usr/include/appstream/as-component.h:29,
                 from /usr/src/tmp/appstream-buildroot/usr/include/appstream/as-pool.h:30:
/usr/src/tmp/appstream-buildroot/usr/include/appstream/as-enums.h:22:2: error: #error "Only <appstream.h> can be included directly."
   22 | #error "Only <appstream.h> can be included directly."
      |  ^~~~~
In file included from /usr/src/tmp/appstream-buildroot/usr/include/appstream/as-component.h:30,
                 from /usr/src/tmp/appstream-buildroot/usr/include/appstream/as-pool.h:30:
/usr/src/tmp/appstream-buildroot/usr/include/appstream/as-enums.h:22:2: error: #error "Only <appstream.h> can be included directly."
   22 | #error "Only <appstream.h> can be included directly."
      |  ^~~~~
In file included from /usr/src/tmp/appstream-buildroot/usr/include/appstream/as-component.h:32,
                 from /usr/src/tmp/appstream-buildroot/usr/include/appstream/as-pool.h:30:
/usr/src/tmp/appstream-buildroot/usr/include/appstream/as-provided.h:22:2: error: #error "Only <appstream.h> can be included directly."
   22 | #error "Only <appstream.h> can be included directly."
      |  ^~~~~
In file included from /usr/src/tmp/appstream-buildroot/usr/include/appstream/as-component.h:33,
                 from /usr/src/tmp/appstream-buildroot/usr/include/appstream/as-pool.h:30:
/usr/src/tmp/appstream-buildroot/usr/include/appstream/as-icon.h:22:2: error: #error "Only <appstream.h> can be included directly."
   22 | #error "Only <appstream.h> can be included directly."
      |  ^~~~~
In file included from /usr/src/tmp/appstream-buildroot/usr/include/appstream/as-component.h:34,
                 from /usr/src/tmp/appstream-buildroot/usr/include/appstream/as-pool.h:30:
/usr/src/tmp/appstream-buildroot/usr/include/appstream/as-screenshot.h:23:2: error: #error "Only <appstream.h> can be included directly."
   23 | #error "Only <appstream.h> can be included directly."
      |  ^~~~~
In file included from /usr/src/tmp/appstream-buildroot/usr/include/appstream/as-screenshot.h:31,
                 from /usr/src/tmp/appstream-buildroot/usr/include/appstream/as-component.h:34,
                 from /usr/src/tmp/appstream-buildroot/usr/include/appstream/as-pool.h:30:
/usr/src/tmp/appstream-buildroot/usr/include/appstream/as-image.h:22:2: error: #error "Only <appstream.h> can be included directly."
   22 | #error "Only <appstream.h> can be included directly."
      |  ^~~~~
In file included from /usr/src/tmp/appstream-buildroot/usr/include/appstream/as-screenshot.h:32,
                 from /usr/src/tmp/appstream-buildroot/usr/include/appstream/as-component.h:34,
                 from /usr/src/tmp/appstream-buildroot/usr/include/appstream/as-pool.h:30:
/usr/src/tmp/appstream-buildroot/usr/include/appstream/as-video.h:22:2: error: #error "Only <appstream.h> can be included directly."
   22 | #error "Only <appstream.h> can be included directly."
      |  ^~~~~
In file included from /usr/src/tmp/appstream-buildroot/usr/include/appstream/as-component.h:35,
                 from /usr/src/tmp/appstream-buildroot/usr/include/appstream/as-pool.h:30:
/usr/src/tmp/appstream-buildroot/usr/include/appstream/as-release.h:22:2: error: #error "Only <appstream.h> can be included directly."
   22 | #error "Only <appstream.h> can be included directly."
      |  ^~~~~
In file included from /usr/src/tmp/appstream-buildroot/usr/include/appstream/as-release.h:29,
                 from /usr/src/tmp/appstream-buildroot/usr/include/appstream/as-component.h:35,
                 from /usr/src/tmp/appstream-buildroot/usr/include/appstream/as-pool.h:30:
/usr/src/tmp/appstream-buildroot/usr/include/appstream/as-enums.h:22:2: error: #error "Only <appstream.h> can be included directly."
   22 | #error "Only <appstream.h> can be included directly."
      |  ^~~~~
In file included from /usr/src/tmp/appstream-buildroot/usr/include/appstream/as-release.h:30,
                 from /usr/src/tmp/appstream-buildroot/usr/include/appstream/as-component.h:35,
                 from /usr/src/tmp/appstream-buildroot/usr/include/appstream/as-pool.h:30:
/usr/src/tmp/appstream-buildroot/usr/include/appstream/as-artifact.h:22:2: error: #error "Only <appstream.h> can be included directly."
   22 | #error "Only <appstream.h> can be included directly."
      |  ^~~~~
In file included from /usr/src/tmp/appstream-buildroot/usr/include/appstream/as-artifact.h:29,
                 from /usr/src/tmp/appstream-buildroot/usr/include/appstream/as-release.h:30,
                 from /usr/src/tmp/appstream-buildroot/usr/include/appstream/as-component.h:35,
                 from /usr/src/tmp/appstream-buildroot/usr/include/appstream/as-pool.h:30:
/usr/src/tmp/appstream-buildroot/usr/include/appstream/as-checksum.h:22:2: error: #error "Only <appstream.h> can be included directly."
   22 | #error "Only <appstream.h> can be included directly."
      |  ^~~~~
In file included from /usr/src/tmp/appstream-buildroot/usr/include/appstream/as-artifact.h:30,
                 from /usr/src/tmp/appstream-buildroot/usr/include/appstream/as-release.h:30,
                 from /usr/src/tmp/appstream-buildroot/usr/include/appstream/as-component.h:35,
                 from /usr/src/tmp/appstream-buildroot/usr/include/appstream/as-pool.h:30:
/usr/src/tmp/appstream-buildroot/usr/include/appstream/as-bundle.h:22:2: error: #error "Only <appstream.h> can be included directly."
   22 | #error "Only <appstream.h> can be included directly."
      |  ^~~~~
In file included from /usr/src/tmp/appstream-buildroot/usr/include/appstream/as-release.h:31,
                 from /usr/src/tmp/appstream-buildroot/usr/include/appstream/as-component.h:35,
                 from /usr/src/tmp/appstream-buildroot/usr/include/appstream/as-pool.h:30:
/usr/src/tmp/appstream-buildroot/usr/include/appstream/as-issue.h:22:2: error: #error "Only <appstream.h> can be included directly."
   22 | #error "Only <appstream.h> can be included directly."
      |  ^~~~~
In file included from /usr/src/tmp/appstream-buildroot/usr/include/appstream/as-component.h:36,
                 from /usr/src/tmp/appstream-buildroot/usr/include/appstream/as-pool.h:30:
/usr/src/tmp/appstream-buildroot/usr/include/appstream/as-translation.h:22:2: error: #error "Only <appstream.h> can be included directly."
   22 | #error "Only <appstream.h> can be included directly."
      |  ^~~~~
In file included from /usr/src/tmp/appstream-buildroot/usr/include/appstream/as-component.h:37,
                 from /usr/src/tmp/appstream-buildroot/usr/include/appstream/as-pool.h:30:
/usr/src/tmp/appstream-buildroot/usr/include/appstream/as-suggested.h:23:2: error: #error "Only <appstream.h> can be included directly."
   23 | #error "Only <appstream.h> can be included directly."
      |  ^~~~~
In file included from /usr/src/tmp/appstream-buildroot/usr/include/appstream/as-component.h:38,
                 from /usr/src/tmp/appstream-buildroot/usr/include/appstream/as-pool.h:30:
/usr/src/tmp/appstream-buildroot/usr/include/appstream/as-category.h:22:2: error: #error "Only <appstream.h> can be included directly."
   22 | #error "Only <appstream.h> can be included directly."
      |  ^~~~~
In file included from /usr/src/tmp/appstream-buildroot/usr/include/appstream/as-component.h:39,
                 from /usr/src/tmp/appstream-buildroot/usr/include/appstream/as-pool.h:30:
/usr/src/tmp/appstream-buildroot/usr/include/appstream/as-bundle.h:22:2: error: #error "Only <appstream.h> can be included directly."
   22 | #error "Only <appstream.h> can be included directly."
      |  ^~~~~
In file included from /usr/src/tmp/appstream-buildroot/usr/include/appstream/as-component.h:40,
                 from /usr/src/tmp/appstream-buildroot/usr/include/appstream/as-pool.h:30:
/usr/src/tmp/appstream-buildroot/usr/include/appstream/as-content-rating.h:24:2: error: #error "Only <appstream.h> can be included directly."
   24 | #error "Only <appstream.h> can be included directly."
      |  ^~~~~
In file included from /usr/src/tmp/appstream-buildroot/usr/include/appstream/as-component.h:41,
                 from /usr/src/tmp/appstream-buildroot/usr/include/appstream/as-pool.h:30:
/usr/src/tmp/appstream-buildroot/usr/include/appstream/as-launchable.h:22:2: error: #error "Only <appstream.h> can be included directly."
   22 | #error "Only <appstream.h> can be included directly."
      |  ^~~~~
In file included from /usr/src/tmp/appstream-buildroot/usr/include/appstream/as-component.h:42,
                 from /usr/src/tmp/appstream-buildroot/usr/include/appstream/as-pool.h:30:
/usr/src/tmp/appstream-buildroot/usr/include/appstream/as-relation.h:22:2: error: #error "Only <appstream.h> can be included directly."
   22 | #error "Only <appstream.h> can be included directly."
      |  ^~~~~
In file included from /usr/src/tmp/appstream-buildroot/usr/include/appstream/as-component.h:43,
                 from /usr/src/tmp/appstream-buildroot/usr/include/appstream/as-pool.h:30:
/usr/src/tmp/appstream-buildroot/usr/include/appstream/as-agreement.h:23:2: error: #error "Only <appstream.h> can be included directly."
   23 | #error "Only <appstream.h> can be included directly."
      |  ^~~~~
In file included from /usr/src/tmp/appstream-buildroot/usr/include/appstream/as-agreement.h:31,
                 from /usr/src/tmp/appstream-buildroot/usr/include/appstream/as-component.h:43,
                 from /usr/src/tmp/appstream-buildroot/usr/include/appstream/as-pool.h:30:
/usr/src/tmp/appstream-buildroot/usr/include/appstream/as-agreement-section.h:23:2: error: #error "Only <appstream.h> can be included directly."
   23 | #error "Only <appstream.h> can be included directly."
      |  ^~~~~
In file included from /usr/src/tmp/appstream-buildroot/usr/include/appstream/as-component.h:44,
                 from /usr/src/tmp/appstream-buildroot/usr/include/appstream/as-pool.h:30:
/usr/src/tmp/appstream-buildroot/usr/include/appstream/as-review.h:26:2: error: #error "Only <appstream.h> can be included directly."
   26 | #error "Only <appstream.h> can be included directly."
      |  ^~~~~
cpp.req: WARNING: /usr/src/tmp/appstream-buildroot/usr/include/appstream/as-pool.h: cpp failed
/usr/src/tmp/appstream-buildroot/usr/include/appstream/as-spdx.h:22:2: error: #error "Only <appstream.h> can be included directly."
   22 | #error "Only <appstream.h> can be included directly."
      |  ^~~~~
cpp.req: /usr/src/tmp/appstream-buildroot/usr/include/appstream/as-spdx.h: cpp failed, trying c++ mode
/usr/src/tmp/appstream-buildroot/usr/include/appstream/as-spdx.h:22:2: error: #error "Only <appstream.h> can be included directly."
   22 | #error "Only <appstream.h> can be included directly."
      |  ^~~~~
cpp.req: WARNING: /usr/src/tmp/appstream-buildroot/usr/include/appstream/as-spdx.h: cpp failed
/usr/src/tmp/appstream-buildroot/usr/include/appstream/as-enums.h:22:2: error: #error "Only <appstream.h> can be included directly."
   22 | #error "Only <appstream.h> can be included directly."
      |  ^~~~~
cpp.req: /usr/src/tmp/appstream-buildroot/usr/include/appstream/as-enums.h: cpp failed, trying c++ mode
/usr/src/tmp/appstream-buildroot/usr/include/appstream/as-enums.h:22:2: error: #error "Only <appstream.h> can be included directly."
   22 | #error "Only <appstream.h> can be included directly."
      |  ^~~~~
cpp.req: WARNING: /usr/src/tmp/appstream-buildroot/usr/include/appstream/as-enums.h: cpp failed
/usr/src/tmp/appstream-buildroot/usr/include/appstream/as-image.h:22:2: error: #error "Only <appstream.h> can be included directly."
   22 | #error "Only <appstream.h> can be included directly."
      |  ^~~~~
cpp.req: /usr/src/tmp/appstream-buildroot/usr/include/appstream/as-image.h: cpp failed, trying c++ mode
/usr/src/tmp/appstream-buildroot/usr/include/appstream/as-image.h:22:2: error: #error "Only <appstream.h> can be included directly."
   22 | #error "Only <appstream.h> can be included directly."
      |  ^~~~~
cpp.req: WARNING: /usr/src/tmp/appstream-buildroot/usr/include/appstream/as-image.h: cpp failed
/usr/src/tmp/appstream-buildroot/usr/include/appstream/as-issue.h:22:2: error: #error "Only <appstream.h> can be included directly."
   22 | #error "Only <appstream.h> can be included directly."
      |  ^~~~~
cpp.req: /usr/src/tmp/appstream-buildroot/usr/include/appstream/as-issue.h: cpp failed, trying c++ mode
/usr/src/tmp/appstream-buildroot/usr/include/appstream/as-issue.h:22:2: error: #error "Only <appstream.h> can be included directly."
   22 | #error "Only <appstream.h> can be included directly."
      |  ^~~~~
cpp.req: WARNING: /usr/src/tmp/appstream-buildroot/usr/include/appstream/as-issue.h: cpp failed
/usr/src/tmp/appstream-buildroot/usr/include/appstream/as-utils.h:22:2: error: #error "Only <appstream.h> can be included directly."
   22 | #error "Only <appstream.h> can be included directly."
      |  ^~~~~
In file included from /usr/src/tmp/appstream-buildroot/usr/include/appstream/as-utils.h:29:
/usr/src/tmp/appstream-buildroot/usr/include/appstream/as-component.h:22:2: error: #error "Only <appstream.h> can be included directly."
   22 | #error "Only <appstream.h> can be included directly."
      |  ^~~~~
In file included from /usr/src/tmp/appstream-buildroot/usr/include/appstream/as-component.h:29,
                 from /usr/src/tmp/appstream-buildroot/usr/include/appstream/as-utils.h:29:
/usr/src/tmp/appstream-buildroot/usr/include/appstream/as-context.h:22:2: error: #error "Only <appstream.h> can be included directly."
   22 | #error "Only <appstream.h> can be included directly."
      |  ^~~~~
In file included from /usr/src/tmp/appstream-buildroot/usr/include/appstream/as-context.h:29,
                 from /usr/src/tmp/appstream-buildroot/usr/include/appstream/as-component.h:29,
                 from /usr/src/tmp/appstream-buildroot/usr/include/appstream/as-utils.h:29:
/usr/src/tmp/appstream-buildroot/usr/include/appstream/as-enums.h:22:2: error: #error "Only <appstream.h> can be included directly."
   22 | #error "Only <appstream.h> can be included directly."
      |  ^~~~~
In file included from /usr/src/tmp/appstream-buildroot/usr/include/appstream/as-component.h:30,
                 from /usr/src/tmp/appstream-buildroot/usr/include/appstream/as-utils.h:29:
/usr/src/tmp/appstream-buildroot/usr/include/appstream/as-enums.h:22:2: error: #error "Only <appstream.h> can be included directly."
   22 | #error "Only <appstream.h> can be included directly."
      |  ^~~~~
In file included from /usr/src/tmp/appstream-buildroot/usr/include/appstream/as-component.h:32,
                 from /usr/src/tmp/appstream-buildroot/usr/include/appstream/as-utils.h:29:
/usr/src/tmp/appstream-buildroot/usr/include/appstream/as-provided.h:22:2: error: #error "Only <appstream.h> can be included directly."
   22 | #error "Only <appstream.h> can be included directly."
      |  ^~~~~
In file included from /usr/src/tmp/appstream-buildroot/usr/include/appstream/as-component.h:33,
                 from /usr/src/tmp/appstream-buildroot/usr/include/appstream/as-utils.h:29:
/usr/src/tmp/appstream-buildroot/usr/include/appstream/as-icon.h:22:2: error: #error "Only <appstream.h> can be included directly."
   22 | #error "Only <appstream.h> can be included directly."
      |  ^~~~~
In file included from /usr/src/tmp/appstream-buildroot/usr/include/appstream/as-component.h:34,
                 from /usr/src/tmp/appstream-buildroot/usr/include/appstream/as-utils.h:29:
/usr/src/tmp/appstream-buildroot/usr/include/appstream/as-screenshot.h:23:2: error: #error "Only <appstream.h> can be included directly."
   23 | #error "Only <appstream.h> can be included directly."
      |  ^~~~~
In file included from /usr/src/tmp/appstream-buildroot/usr/include/appstream/as-screenshot.h:31,
                 from /usr/src/tmp/appstream-buildroot/usr/include/appstream/as-component.h:34,
                 from /usr/src/tmp/appstream-buildroot/usr/include/appstream/as-utils.h:29:
/usr/src/tmp/appstream-buildroot/usr/include/appstream/as-image.h:22:2: error: #error "Only <appstream.h> can be included directly."
   22 | #error "Only <appstream.h> can be included directly."
      |  ^~~~~
In file included from /usr/src/tmp/appstream-buildroot/usr/include/appstream/as-screenshot.h:32,
                 from /usr/src/tmp/appstream-buildroot/usr/include/appstream/as-component.h:34,
                 from /usr/src/tmp/appstream-buildroot/usr/include/appstream/as-utils.h:29:
/usr/src/tmp/appstream-buildroot/usr/include/appstream/as-video.h:22:2: error: #error "Only <appstream.h> can be included directly."
   22 | #error "Only <appstream.h> can be included directly."
      |  ^~~~~
In file included from /usr/src/tmp/appstream-buildroot/usr/include/appstream/as-component.h:35,
                 from /usr/src/tmp/appstream-buildroot/usr/include/appstream/as-utils.h:29:
/usr/src/tmp/appstream-buildroot/usr/include/appstream/as-release.h:22:2: error: #error "Only <appstream.h> can be included directly."
   22 | #error "Only <appstream.h> can be included directly."
      |  ^~~~~
In file included from /usr/src/tmp/appstream-buildroot/usr/include/appstream/as-release.h:29,
                 from /usr/src/tmp/appstream-buildroot/usr/include/appstream/as-component.h:35,
                 from /usr/src/tmp/appstream-buildroot/usr/include/appstream/as-utils.h:29:
/usr/src/tmp/appstream-buildroot/usr/include/appstream/as-enums.h:22:2: error: #error "Only <appstream.h> can be included directly."
   22 | #error "Only <appstream.h> can be included directly."
      |  ^~~~~
In file included from /usr/src/tmp/appstream-buildroot/usr/include/appstream/as-release.h:30,
                 from /usr/src/tmp/appstream-buildroot/usr/include/appstream/as-component.h:35,
                 from /usr/src/tmp/appstream-buildroot/usr/include/appstream/as-utils.h:29:
/usr/src/tmp/appstream-buildroot/usr/include/appstream/as-artifact.h:22:2: error: #error "Only <appstream.h> can be included directly."
   22 | #error "Only <appstream.h> can be included directly."
      |  ^~~~~
In file included from /usr/src/tmp/appstream-buildroot/usr/include/appstream/as-artifact.h:29,
                 from /usr/src/tmp/appstream-buildroot/usr/include/appstream/as-release.h:30,
                 from /usr/src/tmp/appstream-buildroot/usr/include/appstream/as-component.h:35,
                 from /usr/src/tmp/appstream-buildroot/usr/include/appstream/as-utils.h:29:
/usr/src/tmp/appstream-buildroot/usr/include/appstream/as-checksum.h:22:2: error: #error "Only <appstream.h> can be included directly."
   22 | #error "Only <appstream.h> can be included directly."
      |  ^~~~~
In file included from /usr/src/tmp/appstream-buildroot/usr/include/appstream/as-artifact.h:30,
                 from /usr/src/tmp/appstream-buildroot/usr/include/appstream/as-release.h:30,
                 from /usr/src/tmp/appstream-buildroot/usr/include/appstream/as-component.h:35,
                 from /usr/src/tmp/appstream-buildroot/usr/include/appstream/as-utils.h:29:
/usr/src/tmp/appstream-buildroot/usr/include/appstream/as-bundle.h:22:2: error: #error "Only <appstream.h> can be included directly."
   22 | #error "Only <appstream.h> can be included directly."
      |  ^~~~~
In file included from /usr/src/tmp/appstream-buildroot/usr/include/appstream/as-release.h:31,
                 from /usr/src/tmp/appstream-buildroot/usr/include/appstream/as-component.h:35,
                 from /usr/src/tmp/appstream-buildroot/usr/include/appstream/as-utils.h:29:
/usr/src/tmp/appstream-buildroot/usr/include/appstream/as-issue.h:22:2: error: #error "Only <appstream.h> can be included directly."
   22 | #error "Only <appstream.h> can be included directly."
      |  ^~~~~
In file included from /usr/src/tmp/appstream-buildroot/usr/include/appstream/as-component.h:36,
                 from /usr/src/tmp/appstream-buildroot/usr/include/appstream/as-utils.h:29:
/usr/src/tmp/appstream-buildroot/usr/include/appstream/as-translation.h:22:2: error: #error "Only <appstream.h> can be included directly."
   22 | #error "Only <appstream.h> can be included directly."
      |  ^~~~~
In file included from /usr/src/tmp/appstream-buildroot/usr/include/appstream/as-component.h:37,
                 from /usr/src/tmp/appstream-buildroot/usr/include/appstream/as-utils.h:29:
/usr/src/tmp/appstream-buildroot/usr/include/appstream/as-suggested.h:23:2: error: #error "Only <appstream.h> can be included directly."
   23 | #error "Only <appstream.h> can be included directly."
      |  ^~~~~
In file included from /usr/src/tmp/appstream-buildroot/usr/include/appstream/as-component.h:38,
                 from /usr/src/tmp/appstream-buildroot/usr/include/appstream/as-utils.h:29:
/usr/src/tmp/appstream-buildroot/usr/include/appstream/as-category.h:22:2: error: #error "Only <appstream.h> can be included directly."
   22 | #error "Only <appstream.h> can be included directly."
      |  ^~~~~
In file included from /usr/src/tmp/appstream-buildroot/usr/include/appstream/as-component.h:39,
                 from /usr/src/tmp/appstream-buildroot/usr/include/appstream/as-utils.h:29:
/usr/src/tmp/appstream-buildroot/usr/include/appstream/as-bundle.h:22:2: error: #error "Only <appstream.h> can be included directly."
   22 | #error "Only <appstream.h> can be included directly."
      |  ^~~~~
In file included from /usr/src/tmp/appstream-buildroot/usr/include/appstream/as-component.h:40,
                 from /usr/src/tmp/appstream-buildroot/usr/include/appstream/as-utils.h:29:
/usr/src/tmp/appstream-buildroot/usr/include/appstream/as-content-rating.h:24:2: error: #error "Only <appstream.h> can be included directly."
   24 | #error "Only <appstream.h> can be included directly."
      |  ^~~~~
In file included from /usr/src/tmp/appstream-buildroot/usr/include/appstream/as-component.h:41,
                 from /usr/src/tmp/appstream-buildroot/usr/include/appstream/as-utils.h:29:
/usr/src/tmp/appstream-buildroot/usr/include/appstream/as-launchable.h:22:2: error: #error "Only <appstream.h> can be included directly."
   22 | #error "Only <appstream.h> can be included directly."
      |  ^~~~~
In file included from /usr/src/tmp/appstream-buildroot/usr/include/appstream/as-component.h:42,
                 from /usr/src/tmp/appstream-buildroot/usr/include/appstream/as-utils.h:29:
/usr/src/tmp/appstream-buildroot/usr/include/appstream/as-relation.h:22:2: error: #error "Only <appstream.h> can be included directly."
   22 | #error "Only <appstream.h> can be included directly."
      |  ^~~~~
In file included from /usr/src/tmp/appstream-buildroot/usr/include/appstream/as-component.h:43,
                 from /usr/src/tmp/appstream-buildroot/usr/include/appstream/as-utils.h:29:
/usr/src/tmp/appstream-buildroot/usr/include/appstream/as-agreement.h:23:2: error: #error "Only <appstream.h> can be included directly."
   23 | #error "Only <appstream.h> can be included directly."
      |  ^~~~~
In file included from /usr/src/tmp/appstream-buildroot/usr/include/appstream/as-agreement.h:31,
                 from /usr/src/tmp/appstream-buildroot/usr/include/appstream/as-component.h:43,
                 from /usr/src/tmp/appstream-buildroot/usr/include/appstream/as-utils.h:29:
/usr/src/tmp/appstream-buildroot/usr/include/appstream/as-agreement-section.h:23:2: error: #error "Only <appstream.h> can be included directly."
   23 | #error "Only <appstream.h> can be included directly."
      |  ^~~~~
In file included from /usr/src/tmp/appstream-buildroot/usr/include/appstream/as-component.h:44,
                 from /usr/src/tmp/appstream-buildroot/usr/include/appstream/as-utils.h:29:
/usr/src/tmp/appstream-buildroot/usr/include/appstream/as-review.h:26:2: error: #error "Only <appstream.h> can be included directly."
   26 | #error "Only <appstream.h> can be included directly."
      |  ^~~~~
cpp.req: /usr/src/tmp/appstream-buildroot/usr/include/appstream/as-utils.h: cpp failed, trying c++ mode
/usr/src/tmp/appstream-buildroot/usr/include/appstream/as-utils.h:22:2: error: #error "Only <appstream.h> can be included directly."
   22 | #error "Only <appstream.h> can be included directly."
      |  ^~~~~
In file included from /usr/src/tmp/appstream-buildroot/usr/include/appstream/as-utils.h:29:
/usr/src/tmp/appstream-buildroot/usr/include/appstream/as-component.h:22:2: error: #error "Only <appstream.h> can be included directly."
   22 | #error "Only <appstream.h> can be included directly."
      |  ^~~~~
In file included from /usr/src/tmp/appstream-buildroot/usr/include/appstream/as-component.h:29,
                 from /usr/src/tmp/appstream-buildroot/usr/include/appstream/as-utils.h:29:
/usr/src/tmp/appstream-buildroot/usr/include/appstream/as-context.h:22:2: error: #error "Only <appstream.h> can be included directly."
   22 | #error "Only <appstream.h> can be included directly."
      |  ^~~~~
In file included from /usr/src/tmp/appstream-buildroot/usr/include/appstream/as-context.h:29,
                 from /usr/src/tmp/appstream-buildroot/usr/include/appstream/as-component.h:29,
                 from /usr/src/tmp/appstream-buildroot/usr/include/appstream/as-utils.h:29:
/usr/src/tmp/appstream-buildroot/usr/include/appstream/as-enums.h:22:2: error: #error "Only <appstream.h> can be included directly."
   22 | #error "Only <appstream.h> can be included directly."
      |  ^~~~~
In file included from /usr/src/tmp/appstream-buildroot/usr/include/appstream/as-component.h:30,
                 from /usr/src/tmp/appstream-buildroot/usr/include/appstream/as-utils.h:29:
/usr/src/tmp/appstream-buildroot/usr/include/appstream/as-enums.h:22:2: error: #error "Only <appstream.h> can be included directly."
   22 | #error "Only <appstream.h> can be included directly."
      |  ^~~~~
In file included from /usr/src/tmp/appstream-buildroot/usr/include/appstream/as-component.h:32,
                 from /usr/src/tmp/appstream-buildroot/usr/include/appstream/as-utils.h:29:
/usr/src/tmp/appstream-buildroot/usr/include/appstream/as-provided.h:22:2: error: #error "Only <appstream.h> can be included directly."
   22 | #error "Only <appstream.h> can be included directly."
      |  ^~~~~
In file included from /usr/src/tmp/appstream-buildroot/usr/include/appstream/as-component.h:33,
                 from /usr/src/tmp/appstream-buildroot/usr/include/appstream/as-utils.h:29:
/usr/src/tmp/appstream-buildroot/usr/include/appstream/as-icon.h:22:2: error: #error "Only <appstream.h> can be included directly."
   22 | #error "Only <appstream.h> can be included directly."
      |  ^~~~~
In file included from /usr/src/tmp/appstream-buildroot/usr/include/appstream/as-component.h:34,
                 from /usr/src/tmp/appstream-buildroot/usr/include/appstream/as-utils.h:29:
/usr/src/tmp/appstream-buildroot/usr/include/appstream/as-screenshot.h:23:2: error: #error "Only <appstream.h> can be included directly."
   23 | #error "Only <appstream.h> can be included directly."
      |  ^~~~~
In file included from /usr/src/tmp/appstream-buildroot/usr/include/appstream/as-screenshot.h:31,
                 from /usr/src/tmp/appstream-buildroot/usr/include/appstream/as-component.h:34,
                 from /usr/src/tmp/appstream-buildroot/usr/include/appstream/as-utils.h:29:
/usr/src/tmp/appstream-buildroot/usr/include/appstream/as-image.h:22:2: error: #error "Only <appstream.h> can be included directly."
   22 | #error "Only <appstream.h> can be included directly."
      |  ^~~~~
In file included from /usr/src/tmp/appstream-buildroot/usr/include/appstream/as-screenshot.h:32,
                 from /usr/src/tmp/appstream-buildroot/usr/include/appstream/as-component.h:34,
                 from /usr/src/tmp/appstream-buildroot/usr/include/appstream/as-utils.h:29:
/usr/src/tmp/appstream-buildroot/usr/include/appstream/as-video.h:22:2: error: #error "Only <appstream.h> can be included directly."
   22 | #error "Only <appstream.h> can be included directly."
      |  ^~~~~
In file included from /usr/src/tmp/appstream-buildroot/usr/include/appstream/as-component.h:35,
                 from /usr/src/tmp/appstream-buildroot/usr/include/appstream/as-utils.h:29:
/usr/src/tmp/appstream-buildroot/usr/include/appstream/as-release.h:22:2: error: #error "Only <appstream.h> can be included directly."
   22 | #error "Only <appstream.h> can be included directly."
      |  ^~~~~
In file included from /usr/src/tmp/appstream-buildroot/usr/include/appstream/as-release.h:29,
                 from /usr/src/tmp/appstream-buildroot/usr/include/appstream/as-component.h:35,
                 from /usr/src/tmp/appstream-buildroot/usr/include/appstream/as-utils.h:29:
/usr/src/tmp/appstream-buildroot/usr/include/appstream/as-enums.h:22:2: error: #error "Only <appstream.h> can be included directly."
   22 | #error "Only <appstream.h> can be included directly."
      |  ^~~~~
In file included from /usr/src/tmp/appstream-buildroot/usr/include/appstream/as-release.h:30,
                 from /usr/src/tmp/appstream-buildroot/usr/include/appstream/as-component.h:35,
                 from /usr/src/tmp/appstream-buildroot/usr/include/appstream/as-utils.h:29:
/usr/src/tmp/appstream-buildroot/usr/include/appstream/as-artifact.h:22:2: error: #error "Only <appstream.h> can be included directly."
   22 | #error "Only <appstream.h> can be included directly."
      |  ^~~~~
In file included from /usr/src/tmp/appstream-buildroot/usr/include/appstream/as-artifact.h:29,
                 from /usr/src/tmp/appstream-buildroot/usr/include/appstream/as-release.h:30,
                 from /usr/src/tmp/appstream-buildroot/usr/include/appstream/as-component.h:35,
                 from /usr/src/tmp/appstream-buildroot/usr/include/appstream/as-utils.h:29:
/usr/src/tmp/appstream-buildroot/usr/include/appstream/as-checksum.h:22:2: error: #error "Only <appstream.h> can be included directly."
   22 | #error "Only <appstream.h> can be included directly."
      |  ^~~~~
In file included from /usr/src/tmp/appstream-buildroot/usr/include/appstream/as-artifact.h:30,
                 from /usr/src/tmp/appstream-buildroot/usr/include/appstream/as-release.h:30,
                 from /usr/src/tmp/appstream-buildroot/usr/include/appstream/as-component.h:35,
                 from /usr/src/tmp/appstream-buildroot/usr/include/appstream/as-utils.h:29:
/usr/src/tmp/appstream-buildroot/usr/include/appstream/as-bundle.h:22:2: error: #error "Only <appstream.h> can be included directly."
   22 | #error "Only <appstream.h> can be included directly."
      |  ^~~~~
In file included from /usr/src/tmp/appstream-buildroot/usr/include/appstream/as-release.h:31,
                 from /usr/src/tmp/appstream-buildroot/usr/include/appstream/as-component.h:35,
                 from /usr/src/tmp/appstream-buildroot/usr/include/appstream/as-utils.h:29:
/usr/src/tmp/appstream-buildroot/usr/include/appstream/as-issue.h:22:2: error: #error "Only <appstream.h> can be included directly."
   22 | #error "Only <appstream.h> can be included directly."
      |  ^~~~~
In file included from /usr/src/tmp/appstream-buildroot/usr/include/appstream/as-component.h:36,
                 from /usr/src/tmp/appstream-buildroot/usr/include/appstream/as-utils.h:29:
/usr/src/tmp/appstream-buildroot/usr/include/appstream/as-translation.h:22:2: error: #error "Only <appstream.h> can be included directly."
   22 | #error "Only <appstream.h> can be included directly."
      |  ^~~~~
In file included from /usr/src/tmp/appstream-buildroot/usr/include/appstream/as-component.h:37,
                 from /usr/src/tmp/appstream-buildroot/usr/include/appstream/as-utils.h:29:
/usr/src/tmp/appstream-buildroot/usr/include/appstream/as-suggested.h:23:2: error: #error "Only <appstream.h> can be included directly."
   23 | #error "Only <appstream.h> can be included directly."
      |  ^~~~~
In file included from /usr/src/tmp/appstream-buildroot/usr/include/appstream/as-component.h:38,
                 from /usr/src/tmp/appstream-buildroot/usr/include/appstream/as-utils.h:29:
/usr/src/tmp/appstream-buildroot/usr/include/appstream/as-category.h:22:2: error: #error "Only <appstream.h> can be included directly."
   22 | #error "Only <appstream.h> can be included directly."
      |  ^~~~~
In file included from /usr/src/tmp/appstream-buildroot/usr/include/appstream/as-component.h:39,
                 from /usr/src/tmp/appstream-buildroot/usr/include/appstream/as-utils.h:29:
/usr/src/tmp/appstream-buildroot/usr/include/appstream/as-bundle.h:22:2: error: #error "Only <appstream.h> can be included directly."
   22 | #error "Only <appstream.h> can be included directly."
      |  ^~~~~
In file included from /usr/src/tmp/appstream-buildroot/usr/include/appstream/as-component.h:40,
                 from /usr/src/tmp/appstream-buildroot/usr/include/appstream/as-utils.h:29:
/usr/src/tmp/appstream-buildroot/usr/include/appstream/as-content-rating.h:24:2: error: #error "Only <appstream.h> can be included directly."
   24 | #error "Only <appstream.h> can be included directly."
      |  ^~~~~
In file included from /usr/src/tmp/appstream-buildroot/usr/include/appstream/as-component.h:41,
                 from /usr/src/tmp/appstream-buildroot/usr/include/appstream/as-utils.h:29:
/usr/src/tmp/appstream-buildroot/usr/include/appstream/as-launchable.h:22:2: error: #error "Only <appstream.h> can be included directly."
   22 | #error "Only <appstream.h> can be included directly."
      |  ^~~~~
In file included from /usr/src/tmp/appstream-buildroot/usr/include/appstream/as-component.h:42,
                 from /usr/src/tmp/appstream-buildroot/usr/include/appstream/as-utils.h:29:
/usr/src/tmp/appstream-buildroot/usr/include/appstream/as-relation.h:22:2: error: #error "Only <appstream.h> can be included directly."
   22 | #error "Only <appstream.h> can be included directly."
      |  ^~~~~
In file included from /usr/src/tmp/appstream-buildroot/usr/include/appstream/as-component.h:43,
                 from /usr/src/tmp/appstream-buildroot/usr/include/appstream/as-utils.h:29:
/usr/src/tmp/appstream-buildroot/usr/include/appstream/as-agreement.h:23:2: error: #error "Only <appstream.h> can be included directly."
   23 | #error "Only <appstream.h> can be included directly."
      |  ^~~~~
In file included from /usr/src/tmp/appstream-buildroot/usr/include/appstream/as-agreement.h:31,
                 from /usr/src/tmp/appstream-buildroot/usr/include/appstream/as-component.h:43,
                 from /usr/src/tmp/appstream-buildroot/usr/include/appstream/as-utils.h:29:
/usr/src/tmp/appstream-buildroot/usr/include/appstream/as-agreement-section.h:23:2: error: #error "Only <appstream.h> can be included directly."
   23 | #error "Only <appstream.h> can be included directly."
      |  ^~~~~
In file included from /usr/src/tmp/appstream-buildroot/usr/include/appstream/as-component.h:44,
                 from /usr/src/tmp/appstream-buildroot/usr/include/appstream/as-utils.h:29:
/usr/src/tmp/appstream-buildroot/usr/include/appstream/as-review.h:26:2: error: #error "Only <appstream.h> can be included directly."
   26 | #error "Only <appstream.h> can be included directly."
      |  ^~~~~
cpp.req: WARNING: /usr/src/tmp/appstream-buildroot/usr/include/appstream/as-utils.h: cpp failed
/usr/src/tmp/appstream-buildroot/usr/include/appstream/as-video.h:22:2: error: #error "Only <appstream.h> can be included directly."
   22 | #error "Only <appstream.h> can be included directly."
      |  ^~~~~
cpp.req: /usr/src/tmp/appstream-buildroot/usr/include/appstream/as-video.h: cpp failed, trying c++ mode
/usr/src/tmp/appstream-buildroot/usr/include/appstream/as-video.h:22:2: error: #error "Only <appstream.h> can be included directly."
   22 | #error "Only <appstream.h> can be included directly."
      |  ^~~~~
cpp.req: WARNING: /usr/src/tmp/appstream-buildroot/usr/include/appstream/as-video.h: cpp failed
Provides: gir(AppStream) = 1.0, pkgconfig(appstream) = 0.14.3
Requires: appstream = 0.14.3-alt1, /usr/lib/libappstream.so.4, /usr/lib/pkgconfig, gir(GObject) = 2.0, gir(Gio) = 2.0, glib2-devel, libgio-devel, pkgconfig(gio-2.0), pkgconfig(glib-2.0) >= 2.58, pkgconfig(gobject-2.0) >= 2.58
Finding debuginfo files (using /usr/lib/rpm/find-debuginfo-files)
Executing: /bin/sh -e /usr/src/tmp/rpm-tmp.KzrDRO
Processing files: appstream-qt-0.14.3-alt1
Finding Provides (using /usr/lib/rpm/find-provides)
Executing: /bin/sh -e /usr/src/tmp/rpm-tmp.LksvLO
find-provides: running scripts (alternatives,debuginfo,gir,lib,pam,perl,pkgconfig,python,shell,typelib,vala)
lib.prov: /usr/src/tmp/appstream-buildroot/usr/lib/libAppStreamQt.so.2: 682 symbols, 20 bpp
warning: hash collision: _ZN18QSharedDataPointerIN9AppStream14LaunchableDataEED2Ev _ZN7QStringC2ERKS_
Finding Requires (using /usr/lib/rpm/find-requires)
Executing: /bin/sh -e /usr/src/tmp/rpm-tmp.5P6elR
find-requires: running scripts (cpp,debuginfo,files,gir-js,gir-python,gir,lib,pam,perl,pkgconfig,pkgconfiglib,python,rpmlib,shebang,shell,static,symlinks,systemd-services,typelib,vala)
Provides: libAppStreamQt.so.2 = set:ndgZ9sY75bAobvBT3d6ZJzR79HrAo9KKfZ7ME12kWRJZL3sksfm80Ir7jbN4PGl490akWt0fdIZupOr0j9341ygT3wKtQ1QED7QyQcKAX6bXdngzoVwWokwWqZwgiCR7OjoZhZ1mCM3cZy7Me5h4nytUv0BBVOOUEsWnRZq8YHTQjS4X7fmeIAKece0EI0Zssmrots2Ko5Z5W3eDqhmncmU2460fC4yn6c0IeVIYUwePLyDR4socntJLaHZ70v4Pg4RynoD2ky9N3AjH1yftxVGF7lvS69ZnIefNu7Zogz36n4nZe9mjxlmRq7V9GS6q846bNPLIsZ2aDjpSyuLf7R6ZkuPzfLTvFqKsk9wnNMDr5aHgt0PzaGvGGzM0PuXwfWuWPlQQPrhc1fBZ9pj9fKo0nNx2f8FDYMlGWsLBxommIr0h1hbqrZlyZ7eUj8rEry3hvctYkjm8vsiJj0u0EuZJhNXbwZDdNtkt0oD0H38jhL1pSIU6BC94SLKSmYZqHZltpBwj51cmDiWtvcq9X2lrBWGPr2VHxsOpGEDGqQtGKFlzz7XC5PmKRZ5o1Gh0dJkQZjZ4Z3W0pIsVmtqkMjDV8ZuUrk7ahWDF9S2ghavEyyW0tcz6aMaWth9zb9PiW5ttL3jHlUiex51ekS70fB9KNm0Z3zUjEVQmm4avawqDG0xkuAUCA7tBa2jPlhTreU3scbRD8Z9cxZrEW85U6mjEUwuk7pzaS4bm47jjJZ3XcZKyXfggXEagWNba1HjFO2rEIrAXYJeypAcM3G4EqGxvZ0O5t7vO2o9JX9Ci0XDdRQ1aQ0v0ObNGNZ9xwWVcewjUzHRTzpMlZ8McMCBmteOilTOGSBpxYemnZG6rZKMzttrM5CmV8P0AcLLaUIZH94sUMaGRA1KJZ97oxAei6TkXYXn3LJyU1q1LEYJS1oqkYxCFoe7dW4onoF0hnAogTm864dktZwl9HiB3JfD81MVkeeBZuE0gLsli5KOxGhx0iO4KsfC0v8ypk0LXQuE9uaAWJRawt7qnjwFzD61wX7E3lVc6nvGqdXTcuK0sP4PoBPHVr0ZgUP0OIgPUmTWm6rEC28o9ATO05ZkJNLTSv6pyNnsHEg8tR9D6P2SzpaPOuhS9XFVjZ6oC5eo52t5rYwPVaVBujkk8Iq9ajkDxc8PgVJoF1IZIyqskvhGbiORqEkMn8ySH6FgGSThs4z2ka38skoVIrlBCt78l9TSvggtY4mMrLPVPcHdZ9jg92bFG9ayisYVDhJ0pNFgn7YppyIAeFd1OjIwyc9FjRT6V9HlbyKHTQMDRXALSVm7ewBgtkJy4Z6CpM5HyxyLZG4aVlPSF9GZdXG8czO1BSL2p1MrD28T0ZwaR7bK8vVLNuv5Nj1
Requires: appstream = 0.14.3-alt1, libQt5Core.so.5 >= set:qkUnK2tr1PvBFd8absZhQQkk4LvaJsdCOemmFIqbYef53yAyEZnClpfiOOZpijLMdEfhGGaLpy84obLNABe8TpMOLw61YySXIFG4kJcNSfRcVY4lxtQnnk2ltoFitJPcZzMJecixu2Q8uj9kYTuRiD8Bq1nJOkXc95WJC0moum6cjMzG8RIJpYZd0, libQt5Core.so.5(Qt_5), libQt5Core.so.5(Qt_5.15), libappstream.so.4 >= set:ne7Ycj9TyhZvsctRKzLkG4mWve0ZiXW0CAD5b3BICY4enBTr7gNXOJzsi2wuj0e1bcC0tUyD8ePBdNgs60dkWYY1p4ZBsYlA0QyTh0b9Z8eBzSIP1dpMxZ4uGbZ53IkkZ9onUD5aIqRjm0DE1Fo64002ZANt2wjoIq0ELkTRf4njoQxZGb2A9ELFN89h3MGSLeFQaJugKoaiAdW6MO3RapozFQxYsM6Dn1t3Ncyh7L8ZuFhF1XuE5iIQM2HlWUxiezxOhiKsfxFoIRDZyqZhQb0KsY1YkDd7kauzu61K3J5sfkUqSBSfYrhyFNkzjC6KBg83CJQIP5xZHbkJaiuxNfQDFJo0SQEqSY6Z8cEW5ZdCBh6JRxLWtuhP1QkJdnrx9yi8EH5G1PE0xRUZ4AcMvcnfK485CWBrypzlxjxauZsDVF05CZkP7Z74lw7LIZG2MgclxRJqYpXQrwZqNCai8Scu3sclBPUANIg1V2OsGxUXilkabd7Ef63VqEqExVZJonyOoYDfH0WYAW9HcsTU0j4RM6YJdWUWj2Lv7G0qXoy4RUuc0SXpByjOBujlWg2WSLhcNB5AWjlZJDMkrSNyWwQ60AhZ3fZyLYYJmuf5xqogZIalPgrtQA6SfgXozvN7L6gk2XZ29axm, libc.so.6(GLIBC_2.0), libc.so.6(GLIBC_2.1.3), libc.so.6(GLIBC_2.4), libgcc_s.so.1(GCC_3.0), libgio-2.0.so.0 >= set:ontYj5, libglib-2.0.so.0 >= set:okfwelfjTPoAjCa3LLZHbceKbg3iifxJtwyBhBKc, libgobject-2.0.so.0 >= set:mjhfKZen5dqG5x4Kw1, libstdc++.so.6(CXXABI_1.3), libstdc++.so.6(CXXABI_1.3.9), libstdc++.so.6(GLIBCXX_3.4), rtld(GNU_HASH)
Requires(rpmlib): rpmlib(SetVersions)
Finding debuginfo files (using /usr/lib/rpm/find-debuginfo-files)
Executing: /bin/sh -e /usr/src/tmp/rpm-tmp.eT04TQ
Creating appstream-qt-debuginfo package
Processing files: appstream-qt-devel-0.14.3-alt1
Finding Provides (using /usr/lib/rpm/find-provides)
Executing: /bin/sh -e /usr/src/tmp/rpm-tmp.wH3mlR
find-provides: running scripts (alternatives,debuginfo,gir,lib,pam,perl,pkgconfig,python,shell,typelib,vala)
Finding Requires (using /usr/lib/rpm/find-requires)
Executing: /bin/sh -e /usr/src/tmp/rpm-tmp.EW54YQ
find-requires: running scripts (cpp,debuginfo,files,gir-js,gir-python,gir,lib,pam,perl,pkgconfig,pkgconfiglib,python,rpmlib,shebang,shell,static,symlinks,systemd-services,typelib,vala)
/usr/src/tmp/appstream-buildroot/usr/include/AppStreamQt/icon.h:23:10: fatal error: QSharedDataPointer: No such file or directory
   23 | #include <QSharedDataPointer>
      |          ^~~~~~~~~~~~~~~~~~~~
compilation terminated.
cpp.req: /usr/src/tmp/appstream-buildroot/usr/include/AppStreamQt/icon.h: cpp failed, trying c++ mode
/usr/src/tmp/appstream-buildroot/usr/include/AppStreamQt/icon.h:23:10: fatal error: QSharedDataPointer: No such file or directory
   23 | #include <QSharedDataPointer>
      |          ^~~~~~~~~~~~~~~~~~~~
compilation terminated.
cpp.req: WARNING: /usr/src/tmp/appstream-buildroot/usr/include/AppStreamQt/icon.h: cpp failed
/usr/src/tmp/appstream-buildroot/usr/include/AppStreamQt/pool.h:25:10: fatal error: QString: No such file or directory
   25 | #include <QString>
      |          ^~~~~~~~~
compilation terminated.
cpp.req: /usr/src/tmp/appstream-buildroot/usr/include/AppStreamQt/pool.h: cpp failed, trying c++ mode
/usr/src/tmp/appstream-buildroot/usr/include/AppStreamQt/pool.h:25:10: fatal error: QString: No such file or directory
   25 | #include <QString>
      |          ^~~~~~~~~
compilation terminated.
cpp.req: WARNING: /usr/src/tmp/appstream-buildroot/usr/include/AppStreamQt/pool.h: cpp failed
/usr/src/tmp/appstream-buildroot/usr/include/AppStreamQt/spdx.h:23:10: fatal error: QStringList: No such file or directory
   23 | #include <QStringList>
      |          ^~~~~~~~~~~~~
compilation terminated.
cpp.req: /usr/src/tmp/appstream-buildroot/usr/include/AppStreamQt/spdx.h: cpp failed, trying c++ mode
/usr/src/tmp/appstream-buildroot/usr/include/AppStreamQt/spdx.h:23:10: fatal error: QStringList: No such file or directory
   23 | #include <QStringList>
      |          ^~~~~~~~~~~~~
compilation terminated.
cpp.req: WARNING: /usr/src/tmp/appstream-buildroot/usr/include/AppStreamQt/spdx.h: cpp failed
/usr/src/tmp/appstream-buildroot/usr/include/AppStreamQt/image.h:24:10: fatal error: QSharedDataPointer: No such file or directory
   24 | #include <QSharedDataPointer>
      |          ^~~~~~~~~~~~~~~~~~~~
compilation terminated.
cpp.req: /usr/src/tmp/appstream-buildroot/usr/include/AppStreamQt/image.h: cpp failed, trying c++ mode
/usr/src/tmp/appstream-buildroot/usr/include/AppStreamQt/image.h:24:10: fatal error: QSharedDataPointer: No such file or directory
   24 | #include <QSharedDataPointer>
      |          ^~~~~~~~~~~~~~~~~~~~
compilation terminated.
cpp.req: WARNING: /usr/src/tmp/appstream-buildroot/usr/include/AppStreamQt/image.h: cpp failed
/usr/src/tmp/appstream-buildroot/usr/include/AppStreamQt/utils.h:23:10: fatal error: QStringList: No such file or directory
   23 | #include <QStringList>
      |          ^~~~~~~~~~~~~
compilation terminated.
cpp.req: /usr/src/tmp/appstream-buildroot/usr/include/AppStreamQt/utils.h: cpp failed, trying c++ mode
/usr/src/tmp/appstream-buildroot/usr/include/AppStreamQt/utils.h:23:10: fatal error: QStringList: No such file or directory
   23 | #include <QStringList>
      |          ^~~~~~~~~~~~~
compilation terminated.
cpp.req: WARNING: /usr/src/tmp/appstream-buildroot/usr/include/AppStreamQt/utils.h: cpp failed
/usr/src/tmp/appstream-buildroot/usr/include/AppStreamQt/video.h:23:10: fatal error: QSharedDataPointer: No such file or directory
   23 | #include <QSharedDataPointer>
      |          ^~~~~~~~~~~~~~~~~~~~
compilation terminated.
cpp.req: /usr/src/tmp/appstream-buildroot/usr/include/AppStreamQt/video.h: cpp failed, trying c++ mode
/usr/src/tmp/appstream-buildroot/usr/include/AppStreamQt/video.h:23:10: fatal error: QSharedDataPointer: No such file or directory
   23 | #include <QSharedDataPointer>
      |          ^~~~~~~~~~~~~~~~~~~~
compilation terminated.
cpp.req: WARNING: /usr/src/tmp/appstream-buildroot/usr/include/AppStreamQt/video.h: cpp failed
/usr/src/tmp/appstream-buildroot/usr/include/AppStreamQt/bundle.h:23:10: fatal error: QSharedDataPointer: No such file or directory
   23 | #include <QSharedDataPointer>
      |          ^~~~~~~~~~~~~~~~~~~~
compilation terminated.
cpp.req: /usr/src/tmp/appstream-buildroot/usr/include/AppStreamQt/bundle.h: cpp failed, trying c++ mode
/usr/src/tmp/appstream-buildroot/usr/include/AppStreamQt/bundle.h:23:10: fatal error: QSharedDataPointer: No such file or directory
   23 | #include <QSharedDataPointer>
      |          ^~~~~~~~~~~~~~~~~~~~
compilation terminated.
cpp.req: WARNING: /usr/src/tmp/appstream-buildroot/usr/include/AppStreamQt/bundle.h: cpp failed
/usr/src/tmp/appstream-buildroot/usr/include/AppStreamQt/release.h:24:10: fatal error: QSharedDataPointer: No such file or directory
   24 | #include <QSharedDataPointer>
      |          ^~~~~~~~~~~~~~~~~~~~
compilation terminated.
cpp.req: /usr/src/tmp/appstream-buildroot/usr/include/AppStreamQt/release.h: cpp failed, trying c++ mode
/usr/src/tmp/appstream-buildroot/usr/include/AppStreamQt/release.h:24:10: fatal error: QSharedDataPointer: No such file or directory
   24 | #include <QSharedDataPointer>
      |          ^~~~~~~~~~~~~~~~~~~~
compilation terminated.
cpp.req: WARNING: /usr/src/tmp/appstream-buildroot/usr/include/AppStreamQt/release.h: cpp failed
/usr/src/tmp/appstream-buildroot/usr/include/AppStreamQt/category.h:23:10: fatal error: QSharedDataPointer: No such file or directory
   23 | #include <QSharedDataPointer>
      |          ^~~~~~~~~~~~~~~~~~~~
compilation terminated.
cpp.req: /usr/src/tmp/appstream-buildroot/usr/include/AppStreamQt/category.h: cpp failed, trying c++ mode
/usr/src/tmp/appstream-buildroot/usr/include/AppStreamQt/category.h:23:10: fatal error: QSharedDataPointer: No such file or directory
   23 | #include <QSharedDataPointer>
      |          ^~~~~~~~~~~~~~~~~~~~
compilation terminated.
cpp.req: WARNING: /usr/src/tmp/appstream-buildroot/usr/include/AppStreamQt/category.h: cpp failed
/usr/src/tmp/appstream-buildroot/usr/include/AppStreamQt/metadata.h:24:10: fatal error: QSharedDataPointer: No such file or directory
   24 | #include <QSharedDataPointer>
      |          ^~~~~~~~~~~~~~~~~~~~
compilation terminated.
cpp.req: /usr/src/tmp/appstream-buildroot/usr/include/AppStreamQt/metadata.h: cpp failed, trying c++ mode
/usr/src/tmp/appstream-buildroot/usr/include/AppStreamQt/metadata.h:24:10: fatal error: QSharedDataPointer: No such file or directory
   24 | #include <QSharedDataPointer>
      |          ^~~~~~~~~~~~~~~~~~~~
compilation terminated.
cpp.req: WARNING: /usr/src/tmp/appstream-buildroot/usr/include/AppStreamQt/metadata.h: cpp failed
/usr/src/tmp/appstream-buildroot/usr/include/AppStreamQt/provided.h:24:10: fatal error: QSharedDataPointer: No such file or directory
   24 | #include <QSharedDataPointer>
      |          ^~~~~~~~~~~~~~~~~~~~
compilation terminated.
cpp.req: /usr/src/tmp/appstream-buildroot/usr/include/AppStreamQt/provided.h: cpp failed, trying c++ mode
/usr/src/tmp/appstream-buildroot/usr/include/AppStreamQt/provided.h:24:10: fatal error: QSharedDataPointer: No such file or directory
   24 | #include <QSharedDataPointer>
      |          ^~~~~~~~~~~~~~~~~~~~
compilation terminated.
cpp.req: WARNING: /usr/src/tmp/appstream-buildroot/usr/include/AppStreamQt/provided.h: cpp failed
/usr/src/tmp/appstream-buildroot/usr/include/AppStreamQt/relation.h:22:10: fatal error: QSharedDataPointer: No such file or directory
   22 | #include <QSharedDataPointer>
      |          ^~~~~~~~~~~~~~~~~~~~
compilation terminated.
cpp.req: /usr/src/tmp/appstream-buildroot/usr/include/AppStreamQt/relation.h: cpp failed, trying c++ mode
/usr/src/tmp/appstream-buildroot/usr/include/AppStreamQt/relation.h:22:10: fatal error: QSharedDataPointer: No such file or directory
   22 | #include <QSharedDataPointer>
      |          ^~~~~~~~~~~~~~~~~~~~
compilation terminated.
cpp.req: WARNING: /usr/src/tmp/appstream-buildroot/usr/include/AppStreamQt/relation.h: cpp failed
/usr/src/tmp/appstream-buildroot/usr/include/AppStreamQt/component.h:23:10: fatal error: QSharedDataPointer: No such file or directory
   23 | #include <QSharedDataPointer>
      |          ^~~~~~~~~~~~~~~~~~~~
compilation terminated.
cpp.req: /usr/src/tmp/appstream-buildroot/usr/include/AppStreamQt/component.h: cpp failed, trying c++ mode
/usr/src/tmp/appstream-buildroot/usr/include/AppStreamQt/component.h:23:10: fatal error: QSharedDataPointer: No such file or directory
   23 | #include <QSharedDataPointer>
      |          ^~~~~~~~~~~~~~~~~~~~
compilation terminated.
cpp.req: WARNING: /usr/src/tmp/appstream-buildroot/usr/include/AppStreamQt/component.h: cpp failed
/usr/src/tmp/appstream-buildroot/usr/include/AppStreamQt/suggested.h:23:10: fatal error: QSharedDataPointer: No such file or directory
   23 | #include <QSharedDataPointer>
      |          ^~~~~~~~~~~~~~~~~~~~
compilation terminated.
cpp.req: /usr/src/tmp/appstream-buildroot/usr/include/AppStreamQt/suggested.h: cpp failed, trying c++ mode
/usr/src/tmp/appstream-buildroot/usr/include/AppStreamQt/suggested.h:23:10: fatal error: QSharedDataPointer: No such file or directory
   23 | #include <QSharedDataPointer>
      |          ^~~~~~~~~~~~~~~~~~~~
compilation terminated.
cpp.req: WARNING: /usr/src/tmp/appstream-buildroot/usr/include/AppStreamQt/suggested.h: cpp failed
/usr/src/tmp/appstream-buildroot/usr/include/AppStreamQt/launchable.h:24:10: fatal error: QSharedDataPointer: No such file or directory
   24 | #include <QSharedDataPointer>
      |          ^~~~~~~~~~~~~~~~~~~~
compilation terminated.
cpp.req: /usr/src/tmp/appstream-buildroot/usr/include/AppStreamQt/launchable.h: cpp failed, trying c++ mode
/usr/src/tmp/appstream-buildroot/usr/include/AppStreamQt/launchable.h:24:10: fatal error: QSharedDataPointer: No such file or directory
   24 | #include <QSharedDataPointer>
      |          ^~~~~~~~~~~~~~~~~~~~
compilation terminated.
cpp.req: WARNING: /usr/src/tmp/appstream-buildroot/usr/include/AppStreamQt/launchable.h: cpp failed
/usr/src/tmp/appstream-buildroot/usr/include/AppStreamQt/screenshot.h:24:10: fatal error: QObject: No such file or directory
   24 | #include <QObject>
      |          ^~~~~~~~~
compilation terminated.
cpp.req: /usr/src/tmp/appstream-buildroot/usr/include/AppStreamQt/screenshot.h: cpp failed, trying c++ mode
/usr/src/tmp/appstream-buildroot/usr/include/AppStreamQt/screenshot.h:24:10: fatal error: QObject: No such file or directory
   24 | #include <QObject>
      |          ^~~~~~~~~
compilation terminated.
cpp.req: WARNING: /usr/src/tmp/appstream-buildroot/usr/include/AppStreamQt/screenshot.h: cpp failed
/usr/src/tmp/appstream-buildroot/usr/include/AppStreamQt/translation.h:24:10: fatal error: QSharedDataPointer: No such file or directory
   24 | #include <QSharedDataPointer>
      |          ^~~~~~~~~~~~~~~~~~~~
compilation terminated.
cpp.req: /usr/src/tmp/appstream-buildroot/usr/include/AppStreamQt/translation.h: cpp failed, trying c++ mode
/usr/src/tmp/appstream-buildroot/usr/include/AppStreamQt/translation.h:24:10: fatal error: QSharedDataPointer: No such file or directory
   24 | #include <QSharedDataPointer>
      |          ^~~~~~~~~~~~~~~~~~~~
compilation terminated.
cpp.req: WARNING: /usr/src/tmp/appstream-buildroot/usr/include/AppStreamQt/translation.h: cpp failed
/usr/src/tmp/appstream-buildroot/usr/include/AppStreamQt/contentrating.h:25:10: fatal error: QSharedDataPointer: No such file or directory
   25 | #include <QSharedDataPointer>
      |          ^~~~~~~~~~~~~~~~~~~~
compilation terminated.
cpp.req: /usr/src/tmp/appstream-buildroot/usr/include/AppStreamQt/contentrating.h: cpp failed, trying c++ mode
/usr/src/tmp/appstream-buildroot/usr/include/AppStreamQt/contentrating.h:25:10: fatal error: QSharedDataPointer: No such file or directory
   25 | #include <QSharedDataPointer>
      |          ^~~~~~~~~~~~~~~~~~~~
compilation terminated.
cpp.req: WARNING: /usr/src/tmp/appstream-buildroot/usr/include/AppStreamQt/contentrating.h: cpp failed
Requires: appstream-qt = 0.14.3-alt1, /usr/lib/libAppStreamQt.so.2
Finding debuginfo files (using /usr/lib/rpm/find-debuginfo-files)
Executing: /bin/sh -e /usr/src/tmp/rpm-tmp.OgtoQP
Processing files: appstream-doc-0.14.3-alt1
Finding Provides (using /usr/lib/rpm/find-provides)
Executing: /bin/sh -e /usr/src/tmp/rpm-tmp.E4iXES
find-provides: running scripts (alternatives,debuginfo,gir,lib,pam,perl,pkgconfig,python,shell,typelib,vala)
Finding Requires (using /usr/lib/rpm/find-requires)
Executing: /bin/sh -e /usr/src/tmp/rpm-tmp.EG7ZES
find-requires: running scripts (cpp,debuginfo,files,gir-js,gir-python,gir,lib,pam,perl,pkgconfig,pkgconfiglib,python,rpmlib,shebang,shell,static,symlinks,systemd-services,typelib,vala)
Processing files: appstream-debuginfo-0.14.3-alt1
Finding Provides (using /usr/lib/rpm/find-provides)
Executing: /bin/sh -e /usr/src/tmp/rpm-tmp.erpYcQ
find-provides: running scripts (debuginfo)
Finding Requires (using /usr/lib/rpm/find-requires)
Executing: /bin/sh -e /usr/src/tmp/rpm-tmp.csLQvQ
find-requires: running scripts (debuginfo)
Provides: debug(libappstream.so.4)
Requires: appstream = 0.14.3-alt1, /usr/lib/debug/lib/ld-linux.so.2.debug, debug(libc.so.6), debug(libcurl.so.4), debug(libgio-2.0.so.0), debug(libglib-2.0.so.0), debug(libgobject-2.0.so.0), debug(liblmdb.so.0), debug(libstemmer.so.0), debug(libxml2.so.2), debug(libyaml-0.so.2)
Processing files: appstream-qt-debuginfo-0.14.3-alt1
Finding Provides (using /usr/lib/rpm/find-provides)
Executing: /bin/sh -e /usr/src/tmp/rpm-tmp.g5JqYO
find-provides: running scripts (debuginfo)
Finding Requires (using /usr/lib/rpm/find-requires)
Executing: /bin/sh -e /usr/src/tmp/rpm-tmp.ELTI6Q
find-requires: running scripts (debuginfo)
Provides: debug(libAppStreamQt.so.2)
Requires: appstream-qt = 0.14.3-alt1, debug(libQt5Core.so.5), debug(libappstream.so.4), debug(libc.so.6), debug(libgcc_s.so.1), debug(libgio-2.0.so.0), debug(libglib-2.0.so.0), debug(libgobject-2.0.so.0), debug(libstdc++.so.6)
Adding to appstream-devel a strict dependency on appstream
Adding to appstream-qt a strict dependency on appstream
Adding to appstream-debuginfo a strict dependency on appstream
Adding to appstream-qt-devel a strict dependency on appstream-qt
Adding to appstream-qt-debuginfo a strict dependency on appstream-qt
Adding to appstream-qt-debuginfo a strict dependency on appstream-debuginfo
Removing from appstream-qt-debuginfo 30 sources provided by appstream-debuginfo
also prunning dir /usr/src/debug/appstream-0.14.3/i586-alt-linux/src
also prunning dir /usr/src/debug/appstream-0.14.3/src
Removing 1 extra deps from appstream-devel due to dependency on appstream
Removing 1 extra deps from appstream-qt due to dependency on appstream
Removing 1 extra deps from appstream-qt-devel due to dependency on appstream-qt
Removing 1 extra deps from appstream-qt-debuginfo due to dependency on appstream-debuginfo
Removing 7 extra deps from appstream-qt due to repentancy on appstream
Removing 4 extra deps from appstream-qt-debuginfo due to repentancy on appstream-debuginfo
Wrote: /usr/src/RPM/RPMS/i586/appstream-0.14.3-alt1.i586.rpm (w2.lzdio)
Wrote: /usr/src/RPM/RPMS/i586/appstream-devel-0.14.3-alt1.i586.rpm (w2.lzdio)
Wrote: /usr/src/RPM/RPMS/i586/appstream-qt-0.14.3-alt1.i586.rpm (w2.lzdio)
Wrote: /usr/src/RPM/RPMS/i586/appstream-qt-devel-0.14.3-alt1.i586.rpm (w2.lzdio)
Wrote: /usr/src/RPM/RPMS/noarch/appstream-doc-0.14.3-alt1.noarch.rpm (w2.lzdio)
Wrote: /usr/src/RPM/RPMS/i586/appstream-debuginfo-0.14.3-alt1.i586.rpm (w2.lzdio)
Wrote: /usr/src/RPM/RPMS/i586/appstream-qt-debuginfo-0.14.3-alt1.i586.rpm (w2.lzdio)
112.55user 9.93system 1:11.45elapsed 171%CPU (0avgtext+0avgdata 195736maxresident)k
0inputs+0outputs (0major+3661840minor)pagefaults 0swaps
131.66user 15.11system 1:39.37elapsed 147%CPU (0avgtext+0avgdata 195736maxresident)k
15624inputs+0outputs (0major+4384288minor)pagefaults 0swaps