<86>Mar  4 11:40:41 userdel[1244814]: delete user 'rooter'
<86>Mar  4 11:40:41 userdel[1244814]: removed group 'rooter' owned by 'rooter'
<86>Mar  4 11:40:41 userdel[1244814]: removed shadow group 'rooter' owned by 'rooter'
<86>Mar  4 11:40:41 groupadd[1244831]: group added to /etc/group: name=rooter, GID=663
<86>Mar  4 11:40:41 groupadd[1244831]: group added to /etc/gshadow: name=rooter
<86>Mar  4 11:40:41 groupadd[1244831]: new group: name=rooter, GID=663
<86>Mar  4 11:40:41 useradd[1244844]: new user: name=rooter, UID=663, GID=663, home=/root, shell=/bin/bash
<86>Mar  4 11:40:41 userdel[1244868]: delete user 'builder'
<86>Mar  4 11:40:41 userdel[1244868]: removed group 'builder' owned by 'builder'
<86>Mar  4 11:40:41 userdel[1244868]: removed shadow group 'builder' owned by 'builder'
<86>Mar  4 11:40:41 groupadd[1244881]: group added to /etc/group: name=builder, GID=664
<86>Mar  4 11:40:41 groupadd[1244881]: group added to /etc/gshadow: name=builder
<86>Mar  4 11:40:41 groupadd[1244881]: new group: name=builder, GID=664
<86>Mar  4 11:40:41 useradd[1244892]: new user: name=builder, UID=664, GID=664, home=/usr/src, shell=/bin/bash
/usr/src/in/srpm/telepathy-rakia-0.8.0-alt2.src.rpm: The use of such a license name is ambiguous: LGPL
/usr/src/in/srpm/telepathy-rakia-0.8.0-alt2.src.rpm: license not found in '/usr/share/license' directory: v2.1+
warning: user aris does not exist - using root
warning: group aris does not exist - using root
warning: user aris does not exist - using root
warning: group aris does not exist - using root
<13>Mar  4 11:40:43 rpmi: libexpat-2.2.10-alt1 sisyphus+259966.100.1.1 1602824518 installed
<13>Mar  4 11:40:43 rpmi: python-base-2.7.18-alt1 sisyphus+261841.60.9.1 1605563150 installed
<13>Mar  4 11:40:43 rpmi: libICE-1.0.10-alt1 sisyphus+247690.100.1.1 1584000387 installed
<13>Mar  4 11:40:43 rpmi: libgdbm-1.8.3-alt10 1454943334 installed
<13>Mar  4 11:40:43 rpmi: libSM-1.2.3-alt1 sisyphus+226734.100.2.1 1554586158 installed
<13>Mar  4 11:40:43 rpmi: python-module-z3c-3.0.0-alt3 sisyphus+220440.100.1.1 1549119447 installed
<13>Mar  4 11:40:43 rpmi: python-module-appdirs-1.4.3-alt2 sisyphus+246664.200.1.1 1582182774 installed
<13>Mar  4 11:40:43 rpmi: python-module-enum34-1.1.6-alt3 1527251693 installed
<13>Mar  4 11:40:43 rpmi: libusb-1.0.23-alt1 sisyphus+237317.100.1.1 1568059905 installed
<13>Mar  4 11:40:43 rpmi: libhidapi-0.10.1-alt1_2 sisyphus+265273.100.1.1 1611604280 installed
<13>Mar  4 11:40:43 rpmi: shared-mime-info-2.1-alt1 sisyphus+264261.100.1.1 1609507723 installed
<13>Mar  4 11:40:43 rpmi: gsettings-desktop-schemas-data-3.38.0-alt1 sisyphus+258314.500.14.2 1600843028 installed
<13>Mar  4 11:40:43 rpmi: libgio-2.66.7-alt1 sisyphus+265234.43160.49.1 1613777318 installed
<13>Mar  4 11:40:43 rpmi: gsettings-desktop-schemas-3.38.0-alt1 sisyphus+258314.500.14.2 1600843530 installed
<13>Mar  4 11:40:43 rpmi: xml-utils-1:2.9.10-alt6 sisyphus+265234.30740.49.1 1613765060 installed
<13>Mar  4 11:40:43 rpmi: rpm-build-gir-0.7.3-alt3 sisyphus+242150.100.1.1 1575312005 installed
<13>Mar  4 11:40:43 rpmi: libX11-locales-3:1.7.0-alt1 sisyphus+264667.100.1.2 1610655150 installed
<13>Mar  4 11:40:43 rpmi: libXdmcp-1.1.3-alt1 sisyphus+225206.600.1.2 1552949353 installed
<13>Mar  4 11:40:43 rpmi: libXau-1.0.9-alt1 sisyphus+223149.200.2.1 1551268152 installed
<13>Mar  4 11:40:43 rpmi: libxcb-1.14-alt1 sisyphus+247358.200.1.3 1583854228 installed
<13>Mar  4 11:40:43 rpmi: libX11-3:1.7.0-alt1 sisyphus+264667.100.1.2 1610655170 installed
<13>Mar  4 11:40:43 rpmi: liblz4-1:1.9.3-alt1 sisyphus+262305.100.1.1 1606099167 installed
<13>Mar  4 11:40:43 rpmi: libgpg-error-1.41-alt4 sisyphus+264254.200.1.1 1609440111 installed
<13>Mar  4 11:40:43 rpmi: libgcrypt20-1.9.2-alt1 sisyphus+266496.100.1.1 1613559234 installed
<13>Mar  4 11:40:43 rpmi: libsystemd-1:247.3-alt2 sisyphus+266129.100.1.3 1613012672 installed
<13>Mar  4 11:40:43 rpmi: libdbus-1.12.18-alt1 sisyphus+252758.100.1.1 1591203693 installed
<13>Mar  4 11:40:43 rpmi: libdbus-glib-1:0.110-alt1 sisyphus+261272.100.1.1 1604838952 installed
<13>Mar  4 11:40:44 rpmi: libtelepathy-glib-0.24.2-alt2 sisyphus+265811.200.1.1 1612475354 installed
<13>Mar  4 11:40:44 rpmi: dbus-tools-1.12.18-alt1 sisyphus+252758.100.1.1 1591203693 installed
<86>Mar  4 11:40:44 groupadd[1256083]: group added to /etc/group: name=messagebus, GID=499
<86>Mar  4 11:40:44 groupadd[1256083]: group added to /etc/gshadow: name=messagebus
<86>Mar  4 11:40:44 groupadd[1256083]: new group: name=messagebus, GID=499
<86>Mar  4 11:40:44 useradd[1256104]: new user: name=messagebus, UID=499, GID=499, home=/run/dbus, shell=/dev/null
<13>Mar  4 11:40:44 rpmi: dbus-1.12.18-alt1 sisyphus+252758.100.1.1 1591203693 installed
<13>Mar  4 11:40:44 rpmi: libdbus-devel-1.12.18-alt1 sisyphus+252758.100.1.1 1591203693 installed
<13>Mar  4 11:40:44 rpmi: libxslt-1.1.34-alt2 sisyphus+248264.100.1.1 1584829770 installed
<13>Mar  4 11:40:44 rpmi: python-modules-curses-2.7.18-alt4 sisyphus+266950.200.2.1 1614241383 installed
<13>Mar  4 11:40:44 rpmi: libp11-kit-0.23.15-alt2 sisyphus+252784.100.2.2 1591274901 installed
<13>Mar  4 11:40:44 rpmi: libtasn1-4.16.0-alt1 sisyphus+245480.100.1.1 1580825062 installed
<13>Mar  4 11:40:44 rpmi: rpm-macros-alternatives-0.5.1-alt1 sisyphus+226946.100.1.1 1554830426 installed
<13>Mar  4 11:40:44 rpmi: alternatives-0.5.1-alt1 sisyphus+226946.100.1.1 1554830426 installed
<13>Mar  4 11:40:44 rpmi: ca-certificates-2021.01.27-alt1 sisyphus+265371.200.1.1 1611759824 installed
<13>Mar  4 11:40:44 rpmi: ca-trust-0.1.2-alt1 sisyphus+233348.100.1.1 1561653823 installed
<13>Mar  4 11:40:44 rpmi: p11-kit-trust-0.23.15-alt2 sisyphus+252784.100.2.2 1591274901 installed
<13>Mar  4 11:40:44 rpmi: libcrypto1.1-1.1.1i-alt3 sisyphus+265605.200.2.1 1612202596 installed
<13>Mar  4 11:40:44 rpmi: libssl1.1-1.1.1i-alt3 sisyphus+265605.200.2.1 1612202596 installed
<13>Mar  4 11:40:44 rpmi: python-modules-compiler-2.7.18-alt4 sisyphus+266950.200.2.1 1614241383 installed
<13>Mar  4 11:40:44 rpmi: python-modules-email-2.7.18-alt4 sisyphus+266950.200.2.1 1614241383 installed
<13>Mar  4 11:40:44 rpmi: python-modules-unittest-2.7.18-alt4 sisyphus+266950.200.2.1 1614241383 installed
<13>Mar  4 11:40:44 rpmi: python-modules-encodings-2.7.18-alt4 sisyphus+266950.200.2.1 1614241383 installed
<13>Mar  4 11:40:44 rpmi: python-modules-2.7.18-alt4 sisyphus+266950.200.2.1 1614241383 installed
<13>Mar  4 11:40:44 rpmi: python-modules-ctypes-2.7.18-alt4 sisyphus+266950.200.2.1 1614241383 installed
<13>Mar  4 11:40:44 rpmi: python-module-six-1.15.0-alt1 sisyphus+255738.100.2.1 1596527214 installed
<13>Mar  4 11:40:44 rpmi: python-module-pkg_resources-1:42.0.0-alt3 sisyphus+257539.100.1.1 1599462744 installed
<13>Mar  4 11:40:44 rpmi: python-modules-xml-2.7.18-alt4 sisyphus+266950.200.2.1 1614241383 installed
<13>Mar  4 11:40:44 rpmi: python-modules-json-2.7.18-alt4 sisyphus+266950.200.2.1 1614241383 installed
<13>Mar  4 11:40:44 rpmi: libpython3-3.9.2-alt1 sisyphus+267062.100.1.1 1614381721 installed
<13>Mar  4 11:40:44 rpmi: python3-3.9.2-alt1 sisyphus+267062.100.1.1 1614381721 installed
<13>Mar  4 11:40:45 rpmi: python3-base-3.9.2-alt1 sisyphus+267062.100.1.1 1614381721 installed
<13>Mar  4 11:40:45 rpmi: glib2-devel-2.66.7-alt1 sisyphus+265234.43160.49.1 1613777318 installed
<13>Mar  4 11:40:45 rpmi: python-module-ipaddress-1.0.18-alt2 sisyphus+245673.200.1.1 1581087895 installed
<13>Mar  4 11:40:45 rpmi: libsofia-sip-1.13.1-alt0.d10a3d268c sisyphus+257101.100.1.1 1598964202 installed
<13>Mar  4 11:40:45 rpmi: libsofia-sip-devel-1.13.1-alt0.d10a3d268c sisyphus+257101.100.1.1 1598964202 installed
<13>Mar  4 11:40:45 rpmi: libsofia-sip-glib-1.13.1-alt0.d10a3d268c sisyphus+257101.100.1.1 1598964202 installed
<13>Mar  4 11:40:45 rpmi: libgio-devel-2.66.7-alt1 sisyphus+265234.43160.49.1 1613777318 installed
<13>Mar  4 11:40:45 rpmi: libdbus-glib-devel-1:0.110-alt1 sisyphus+261272.100.1.1 1604838952 installed
<13>Mar  4 11:40:45 rpmi: python-module-constantly-15.1.0-alt5.qa1 sisyphus+228353.1600.3.1 1556554115 installed
<13>Mar  4 11:40:45 rpmi: python-modules-multiprocessing-2.7.18-alt4 sisyphus+266950.200.2.1 1614241383 installed
<13>Mar  4 11:40:45 rpmi: python-modules-logging-2.7.18-alt4 sisyphus+266950.200.2.1 1614241383 installed
<13>Mar  4 11:40:45 rpmi: python-tools-2to3-2.7.18-alt4 sisyphus+266950.200.2.1 1614241383 installed
<13>Mar  4 11:40:45 rpmi: python-module-pyasn1-0.4.8-alt1 sisyphus+241541.100.2.1 1574620393 installed
<13>Mar  4 11:40:45 rpmi: python-module-pyasn1-modules-0.2.8-alt1 sisyphus+241541.200.2.1 1574620466 installed
<13>Mar  4 11:40:46 rpmi: python-module-future-0.16.0-alt2 sisyphus+228356.200.3.3 1556645013 installed
<13>Mar  4 11:40:46 rpmi: python-modules-hotshot-2.7.18-alt4 sisyphus+266950.200.2.1 1614241383 installed
<13>Mar  4 11:40:46 rpmi: python-modules-bsddb-2.7.18-alt4 sisyphus+266950.200.2.1 1614241383 installed
<13>Mar  4 11:40:46 rpmi: python-2.7.18-alt4 sisyphus+266950.200.2.1 1614241383 installed
<13>Mar  4 11:40:46 rpmi: python-strict-2.7.18-alt4 sisyphus+266950.200.2.1 1614241385 installed
<13>Mar  4 11:40:46 rpmi: python-module-attrs-19.3.0-alt2 sisyphus+257441.100.1.2 1599246895 installed
<13>Mar  4 11:40:46 rpmi: python-modules-distutils-2.7.18-alt4 sisyphus+266950.200.2.1 1614241383 installed
<13>Mar  4 11:40:46 rpmi: python-module-pycparser-2.20-alt1 sisyphus+260990.100.1.1 1604547209 installed
<13>Mar  4 11:40:46 rpmi: python-module-cffi-1.14.5-alt1 sisyphus+266847.100.1.1 1614157383 installed
<13>Mar  4 11:40:46 rpmi: python-module-cryptography-3.0-alt1 sisyphus+255181.100.1.1 1595326578 installed
<13>Mar  4 11:40:46 rpmi: python-module-OpenSSL-19.0.0-alt2 sisyphus+261134.140.3.1 1604671956 installed
<13>Mar  4 11:40:46 rpmi: python-module-idna-2.10-alt1 sisyphus+255040.100.1.1 1594995857 installed
<13>Mar  4 11:40:46 rpmi: python-module-hyperlink-19.0.0-alt1 sisyphus+231791.100.1.1 1560104463 installed
<13>Mar  4 11:40:46 rpmi: python-module-cython-hidapi-0.9.0-alt0.1 sisyphus+265234.34400.49.1 1613768638 installed
<13>Mar  4 11:40:46 rpmi: python-module-serial-3.5-alt1 sisyphus+266224.1000.1.1 1613128454 installed
<13>Mar  4 11:40:46 rpmi: python-module-zc-1.0.0-alt6.2 1458024175 installed
<13>Mar  4 11:40:46 rpmi: python-module-zope-3.3.0-alt8.5 sisyphus+225625.33400.91.1 1555314837 installed
<13>Mar  4 11:40:46 rpmi: python-module-zope.interface-5.1.0-alt3 sisyphus+265234.25100.49.1 1613760789 installed
<13>Mar  4 11:40:46 rpmi: python-module-pygobject-2.28.7-alt2 sisyphus+261797.100.1.1 1605440860 installed
<13>Mar  4 11:40:46 rpmi: python-module-incremental-17.5.0-alt5 sisyphus+261330.100.1.1 1604868862 installed
<13>Mar  4 11:40:46 rpmi: libtinfo-devel-6.2.20210123-alt1 sisyphus+265425.100.1.1 1611851433 installed
<13>Mar  4 11:40:46 rpmi: libncurses-devel-6.2.20210123-alt1 sisyphus+265425.100.1.1 1611851433 installed
<13>Mar  4 11:40:46 rpmi: python-dev-2.7.18-alt4 sisyphus+266950.200.2.1 1614241383 installed
<13>Mar  4 11:40:46 rpmi: python-module-setuptools-1:42.0.0-alt3 sisyphus+257539.100.1.1 1599462744 installed
<13>Mar  4 11:40:46 rpmi: python-module-pydoctor-16.3.0-alt1.qa1 sisyphus.214897.100 1539781872 installed
<13>Mar  4 11:40:46 rpmi: python-module-twisted-logger-18.9.0-alt2 sisyphus+261231.140.4.1 1604802815 installed
<13>Mar  4 11:40:46 rpmi: python-module-automat-20.2.0-alt2 sisyphus+261245.100.1.1 1604810415 installed
<13>Mar  4 11:40:46 rpmi: python-module-twisted-core-18.9.0-alt2 sisyphus+261231.140.4.1 1604802815 installed
<13>Mar  4 11:40:46 rpmi: python-module-twisted-core-gui-18.9.0-alt2 sisyphus+261231.140.4.1 1604802815 installed
<13>Mar  4 11:40:46 rpmi: python-module-twisted-words-18.9.0-alt2 sisyphus+261231.140.4.1 1604802815 installed
<13>Mar  4 11:40:46 rpmi: python-module-service-identity-18.1.0-alt1 sisyphus+221601.600.3.1 1550235163 installed
<13>Mar  4 11:40:46 rpmi: python-module-dbus-1.2.16-alt1 sisyphus+265234.42300.49.1 1613775687 installed
<13>Mar  4 11:40:46 rpmi: libtelepathy-glib-devel-0.24.2-alt2 sisyphus+265811.200.1.1 1612475354 installed
<13>Mar  4 11:40:46 rpmi: libsofia-sip-glib-devel-1.13.1-alt0.d10a3d268c sisyphus+257101.100.1.1 1598964202 installed
<13>Mar  4 11:40:46 rpmi: xsltproc-1.1.34-alt2 sisyphus+248264.100.1.1 1584829770 installed
<13>Mar  4 11:40:46 rpmi: dbus-tools-gui-1.12.18-alt1 sisyphus+252758.100.1.1 1591203693 installed
Building target platforms: i586
Building for target i586
Wrote: /usr/src/in/nosrpm/telepathy-rakia-0.8.0-alt2.nosrc.rpm (w1.gzdio)
Installing telepathy-rakia-0.8.0-alt2.src.rpm
Building target platforms: i586
Building for target i586
Executing(%prep): /bin/sh -e /usr/src/tmp/rpm-tmp.2314
+ umask 022
+ /bin/mkdir -p /usr/src/RPM/BUILD
+ cd /usr/src/RPM/BUILD
+ cd /usr/src/RPM/BUILD
+ rm -rf telepathy-rakia-0.8.0
+ echo 'Source #0 (telepathy-rakia-0.8.0.tar.gz):'
Source #0 (telepathy-rakia-0.8.0.tar.gz):
+ /bin/gzip -dc /usr/src/RPM/SOURCES/telepathy-rakia-0.8.0.tar.gz
+ /bin/tar -xf -
+ cd telepathy-rakia-0.8.0
+ /bin/chmod -c -Rf u+rwX,go-w .
+ exit 0
Executing(%build): /bin/sh -e /usr/src/tmp/rpm-tmp.2314
+ umask 022
+ /bin/mkdir -p /usr/src/RPM/BUILD
+ cd /usr/src/RPM/BUILD
+ cd telepathy-rakia-0.8.0
+ autoreconf -fisv
autoreconf-default: Entering directory `.'
autoreconf-default: configure.ac: not using Gettext
autoreconf-default: running: aclocal --force -I m4
autoreconf-default: configure.ac: tracing
autoreconf-default: running: libtoolize --force --install
libtoolize-default: putting auxiliary files in '.'.
libtoolize-default: linking file './config.guess'
libtoolize-default: linking file './config.sub'
libtoolize-default: linking file './install-sh'
libtoolize-default: linking file './ltmain.sh'
libtoolize-default: putting macros in AC_CONFIG_MACRO_DIRS, 'm4'.
libtoolize-default: linking file 'm4/libtool.m4'
libtoolize-default: linking file 'm4/ltoptions.m4'
libtoolize-default: linking file 'm4/ltsugar.m4'
libtoolize-default: linking file 'm4/ltversion.m4'
libtoolize-default: linking file 'm4/lt~obsolete.m4'
autoreconf-default: configure.ac: not using Intltool
autoreconf-default: configure.ac: not using gtk-doc
autoreconf-default: running: /usr/bin/autoconf-2.60 --force
autoreconf-default: running: /usr/bin/autoheader-2.60 --force
autoreconf-default: running: automake --add-missing --force-missing
configure.ac:28: installing './compile'
configure.ac:20: installing './missing'
extensions/Makefile.am:26: warning: source file '_gen/signals-marshal.c' is in a subdirectory,
extensions/Makefile.am:26: but option 'subdir-objects' is disabled
automake-default: warning: possible forward-incompatibility.
automake-default: At least a source file is in a subdirectory, but the 'subdir-objects'
automake-default: automake option hasn't been enabled.  For now, the corresponding output
automake-default: object file(s) will be placed in the top-level directory.  However,
automake-default: this behaviour will change in future Automake versions: they will
automake-default: unconditionally cause object files to be placed in the same subdirectory
automake-default: of the corresponding sources.
automake-default: You are advised to start using 'subdir-objects' option throughout your
automake-default: project, to avoid future incompatibilities.
extensions/Makefile.am:26: warning: source file '_gen/svc-channel.c' is in a subdirectory,
extensions/Makefile.am:26: but option 'subdir-objects' is disabled
extensions/Makefile.am: installing './depcomp'
autoreconf-default: Leaving directory `.'
+ CFLAGS='-pipe -frecord-gcc-switches -Wall -g -O2 -march=i586 -mtune=generic'
+ export CFLAGS
+ CXXFLAGS='-pipe -frecord-gcc-switches -Wall -g -O2 -march=i586 -mtune=generic'
+ export CXXFLAGS
+ FFLAGS='-pipe -frecord-gcc-switches -Wall -g -O2 -march=i586 -mtune=generic'
+ export FFLAGS
+ FCFLAGS='-pipe -frecord-gcc-switches -Wall -g -O2 -march=i586 -mtune=generic'
+ export FCFLAGS
+ '[' -n '' ']'
++ printf %s '-pipe -frecord-gcc-switches -Wall -g -O2 -march=i586 -mtune=generic'
++ sed -r 's/(^|[[:space:]]+)-[^m][^[:space:]]*//g'
+ ASFLAGS=' -march=i586 -mtune=generic'
+ export ASFLAGS
+ export lt_cv_deplibs_check_method=pass_all
+ lt_cv_deplibs_check_method=pass_all
+ readlink -e -- ./configure
+ xargs -ri find '{}' -type f '(' -name config.sub -or -name config.guess ')' -printf '%h/\n'
+ sort -u
+ xargs -ri dirname -- '{}'
+ xargs -rn1 install -pm755 -- /usr/share/gnu-config/config.sub /usr/share/gnu-config/config.guess
+ ./configure --build=i586-alt-linux --host=i586-alt-linux --prefix=/usr --exec-prefix=/usr --bindir=/usr/bin --sbindir=/usr/sbin --sysconfdir=/etc --datadir=/usr/share --includedir=/usr/include --libdir=/usr/lib --libexecdir=/usr/lib --localstatedir=/var/lib --sharedstatedir=/var/lib --mandir=/usr/share/man --infodir=/usr/share/info --disable-dependency-tracking --disable-silent-rules --without-included-gettext
configure: WARNING: unrecognized options: --without-included-gettext
configure: configuring telepathy-rakia for release
checking for a BSD-compatible install... /bin/install -c
checking whether build environment is sane... yes
checking for a thread-safe mkdir -p... /bin/mkdir -p
checking for gawk... gawk
checking whether make sets $(MAKE)... yes
checking whether make supports nested variables... yes
checking whether make supports nested variables... (cached) yes
checking for i586-alt-linux-gcc... i586-alt-linux-gcc
checking whether the C compiler works... yes
checking for C compiler default output file name... a.out
checking for suffix of executables... 
checking whether we are cross compiling... no
checking for suffix of object files... o
checking whether we are using the GNU C compiler... yes
checking whether i586-alt-linux-gcc accepts -g... yes
checking for i586-alt-linux-gcc option to accept ISO C89... none needed
checking whether i586-alt-linux-gcc understands -c and -o together... yes
checking whether make supports the include directive... yes (GNU style)
checking dependency style of i586-alt-linux-gcc... none
checking for i586-alt-linux-gcc option to accept ISO C99... none needed
checking for i586-alt-linux-gcc option to accept ISO Standard C... (cached) none needed
checking build system type... i586-alt-linux-gnu
checking host system type... i586-alt-linux-gnu
checking how to print strings... printf
checking for a sed that does not truncate output... /bin/sed
checking for grep that handles long lines and -e... /bin/grep
checking for egrep... /bin/grep -E
checking for fgrep... /bin/grep -F
checking for ld used by i586-alt-linux-gcc... /usr/bin/ld
checking if the linker (/usr/bin/ld) is GNU ld... yes
checking for BSD- or MS-compatible name lister (nm)... /usr/bin/nm -B
checking the name lister (/usr/bin/nm -B) interface... BSD nm
checking whether ln -s works... yes
checking the maximum length of command line arguments... 1572864
checking how to convert i586-alt-linux-gnu file names to i586-alt-linux-gnu format... func_convert_file_noop
checking how to convert i586-alt-linux-gnu file names to toolchain format... func_convert_file_noop
checking for /usr/bin/ld option to reload object files... -r
checking for i586-alt-linux-objdump... no
checking for objdump... objdump
checking how to recognize dependent libraries... (cached) pass_all
checking for i586-alt-linux-dlltool... no
checking for dlltool... no
checking how to associate runtime and link libraries... printf %s\n
checking for i586-alt-linux-ar... no
checking for ar... ar
checking for archiver @FILE support... @
checking for i586-alt-linux-strip... no
checking for strip... strip
checking for i586-alt-linux-ranlib... no
checking for ranlib... ranlib
checking command to parse /usr/bin/nm -B output from i586-alt-linux-gcc object... ok
checking for sysroot... no
checking for a working dd... /bin/dd
checking how to truncate binary pipes... /bin/dd bs=4096 count=1
checking for i586-alt-linux-mt... no
checking for mt... no
checking if : is a manifest tool... no
checking how to run the C preprocessor... i586-alt-linux-gcc -E
checking for ANSI C header files... yes
checking for sys/types.h... yes
checking for sys/stat.h... yes
checking for stdlib.h... yes
checking for string.h... yes
checking for memory.h... yes
checking for strings.h... yes
checking for inttypes.h... yes
checking for stdint.h... yes
checking for unistd.h... yes
checking for dlfcn.h... yes
checking for objdir... .libs
checking if i586-alt-linux-gcc supports -fno-rtti -fno-exceptions... no
checking for i586-alt-linux-gcc option to produce PIC... -fPIC -DPIC
checking if i586-alt-linux-gcc PIC flag -fPIC -DPIC works... yes
checking if i586-alt-linux-gcc static flag -static works... no
checking if i586-alt-linux-gcc supports -c -o file.o... yes
checking if i586-alt-linux-gcc supports -c -o file.o... (cached) yes
checking whether the i586-alt-linux-gcc linker (/usr/bin/ld) supports shared libraries... yes
checking dynamic linker characteristics... GNU/Linux ld.so
checking how to hardcode library paths into programs... immediate
checking whether stripping libraries is possible... yes
checking if libtool supports shared libraries... yes
checking whether to build shared libraries... no
checking whether to build static libraries... yes
checking to see if compiler understands ... yes
checking to see if compiler understands -Wall... yes
checking to see if compiler understands -Wextra... yes
checking to see if compiler understands -Wdeclaration-after-statement... yes
checking to see if compiler understands -Wshadow... yes
checking to see if compiler understands -Wmissing-prototypes... yes
checking to see if compiler understands -Wnested-externs... yes
checking to see if compiler understands -Wpointer-arith... yes
checking to see if compiler understands -Wsign-compare... yes
checking to see if compiler understands -Wstrict-prototypes... yes
checking to see if compiler understands -Wformat-security... yes
checking to see if compiler understands -Winit-self... yes
checking to see if compiler understands -Werror... yes
checking to see if compiler understands -Wno-missing-field-initializers... yes
checking to see if compiler understands -Wno-error=missing-field-initializers... yes
checking to see if compiler understands -Wno-unused-parameter... yes
checking to see if compiler understands -Wno-error=unused-parameter... yes
checking to see if compiler understands -Wno-deprecated-declarations... yes
checking to see if compiler understands -Wno-error=deprecated-declarations... yes
checking for inline... inline
./configure: line 12756: GTK_DOC_CHECK: command not found
checking for i586-alt-linux-pkg-config... no
checking for pkg-config... /usr/bin/pkg-config
checking pkg-config is at least version 0.9.0... yes
checking for gobject-2.0 >= 2.30, gio-2.0 >= 2.30... yes
checking for dbus-1 >= 0.60, dbus-glib-1 >= 0.60... yes
checking for sofia-sip-ua-glib >= 1.12.11... yes
checking for telepathy-glib >= 0.17.7... yes
checking for xsltproc... xsltproc
checking for a Python interpreter with version >= 2.3... python
checking for python... /usr/bin/python
checking for python version... 2.7
checking for python platform... linux2
checking for python script directory... ${prefix}/lib/python2.7/site-packages
checking for python extension module directory... ${exec_prefix}/lib/python2.7/site-packages
checking for TwistedPython with SIP protocol support... yes
checking that generated files are newer than configure... done
configure: creating ./config.status
config.status: creating Makefile
config.status: creating rakia/Makefile
config.status: creating extensions/Makefile
config.status: creating src/Makefile
config.status: creating m4/Makefile
config.status: creating data/Makefile
config.status: creating tests/Makefile
config.status: creating tests/twisted/Makefile
config.status: creating tests/twisted/tools/Makefile
config.status: creating tools/Makefile
config.status: creating docs/Makefile
config.status: creating config.h
config.status: executing depfiles commands
config.status: executing libtool commands
configure: WARNING: unrecognized options: --without-included-gettext
+ make -j8
make  all-recursive
Making all in tools
make[2]: Nothing to be done for 'all'.
Making all in rakia
make[2]: Entering directory '/usr/src/RPM/BUILD/telepathy-rakia-0.8.0/rakia'
glib-genmarshal --header --prefix=_rakia_marshal signals-marshal.list >signals-marshal.h || rm -f signals-marshal.h
INFO: Reading signals-marshal.list...
make[2]: Leaving directory '/usr/src/RPM/BUILD/telepathy-rakia-0.8.0/rakia'
make[2]: Entering directory '/usr/src/RPM/BUILD/telepathy-rakia-0.8.0/rakia'
( echo '#include "signals-marshal.h"' && \
glib-genmarshal --body --prefix=_rakia_marshal signals-marshal.list ) >signals-marshal.c || rm -f signals-marshal.c
INFO: Reading signals-marshal.list...
make[2]: Leaving directory '/usr/src/RPM/BUILD/telepathy-rakia-0.8.0/rakia'
make  all-am
make[3]: Entering directory '/usr/src/RPM/BUILD/telepathy-rakia-0.8.0/rakia'
/bin/sh ../libtool  --tag=CC   --mode=compile i586-alt-linux-gcc -DHAVE_CONFIG_H -I. -I..  -pthread -I/usr/include/glib-2.0 -I/usr/lib/glib-2.0/include -pthread -I/usr/include/telepathy-1.0 -I/usr/include/dbus-1.0 -I/usr/lib/dbus-1.0/include -I/usr/include/glib-2.0 -I/usr/lib/glib-2.0/include -I/usr/include/sofia-sip-1.13 -I/usr/include/glib-2.0 -I/usr/lib/glib-2.0/include -I.. -I..  -Wall -Wextra -Wdeclaration-after-statement -Wshadow -Wmissing-prototypes -Wnested-externs -Wpointer-arith -Wsign-compare -Wstrict-prototypes -Wformat-security -Winit-self -Wno-missing-field-initializers -Wno-unused-parameter -Wno-deprecated-declarations  -pipe -frecord-gcc-switches -Wall -g -O2 -march=i586 -mtune=generic -c -o event-target.lo event-target.c
libtool: compile:  i586-alt-linux-gcc -DHAVE_CONFIG_H -I. -I.. -pthread -I/usr/include/glib-2.0 -I/usr/lib/glib-2.0/include -pthread -I/usr/include/telepathy-1.0 -I/usr/include/dbus-1.0 -I/usr/lib/dbus-1.0/include -I/usr/include/glib-2.0 -I/usr/lib/glib-2.0/include -I/usr/include/sofia-sip-1.13 -I/usr/include/glib-2.0 -I/usr/lib/glib-2.0/include -I.. -I.. -Wall -Wextra -Wdeclaration-after-statement -Wshadow -Wmissing-prototypes -Wnested-externs -Wpointer-arith -Wsign-compare -Wstrict-prototypes -Wformat-security -Winit-self -Wno-missing-field-initializers -Wno-unused-parameter -Wno-deprecated-declarations -pipe -frecord-gcc-switches -Wall -g -O2 -march=i586 -mtune=generic -c event-target.c -o event-target.o
make[3]: Leaving directory '/usr/src/RPM/BUILD/telepathy-rakia-0.8.0/rakia'
make[3]: Entering directory '/usr/src/RPM/BUILD/telepathy-rakia-0.8.0/rakia'
/bin/sh ../libtool  --tag=CC   --mode=compile i586-alt-linux-gcc -DHAVE_CONFIG_H -I. -I..  -pthread -I/usr/include/glib-2.0 -I/usr/lib/glib-2.0/include -pthread -I/usr/include/telepathy-1.0 -I/usr/include/dbus-1.0 -I/usr/lib/dbus-1.0/include -I/usr/include/glib-2.0 -I/usr/lib/glib-2.0/include -I/usr/include/sofia-sip-1.13 -I/usr/include/glib-2.0 -I/usr/lib/glib-2.0/include -I.. -I..  -Wall -Wextra -Wdeclaration-after-statement -Wshadow -Wmissing-prototypes -Wnested-externs -Wpointer-arith -Wsign-compare -Wstrict-prototypes -Wformat-security -Winit-self -Wno-missing-field-initializers -Wno-unused-parameter -Wno-deprecated-declarations  -pipe -frecord-gcc-switches -Wall -g -O2 -march=i586 -mtune=generic -c -o base-connection-sofia.lo base-connection-sofia.c
libtool: compile:  i586-alt-linux-gcc -DHAVE_CONFIG_H -I. -I.. -pthread -I/usr/include/glib-2.0 -I/usr/lib/glib-2.0/include -pthread -I/usr/include/telepathy-1.0 -I/usr/include/dbus-1.0 -I/usr/lib/dbus-1.0/include -I/usr/include/glib-2.0 -I/usr/lib/glib-2.0/include -I/usr/include/sofia-sip-1.13 -I/usr/include/glib-2.0 -I/usr/lib/glib-2.0/include -I.. -I.. -Wall -Wextra -Wdeclaration-after-statement -Wshadow -Wmissing-prototypes -Wnested-externs -Wpointer-arith -Wsign-compare -Wstrict-prototypes -Wformat-security -Winit-self -Wno-missing-field-initializers -Wno-unused-parameter -Wno-deprecated-declarations -pipe -frecord-gcc-switches -Wall -g -O2 -march=i586 -mtune=generic -c base-connection-sofia.c -o base-connection-sofia.o
make[3]: Leaving directory '/usr/src/RPM/BUILD/telepathy-rakia-0.8.0/rakia'
make[3]: Entering directory '/usr/src/RPM/BUILD/telepathy-rakia-0.8.0/rakia'
/bin/sh ../libtool  --tag=CC   --mode=compile i586-alt-linux-gcc -DHAVE_CONFIG_H -I. -I..  -pthread -I/usr/include/glib-2.0 -I/usr/lib/glib-2.0/include -pthread -I/usr/include/telepathy-1.0 -I/usr/include/dbus-1.0 -I/usr/lib/dbus-1.0/include -I/usr/include/glib-2.0 -I/usr/lib/glib-2.0/include -I/usr/include/sofia-sip-1.13 -I/usr/include/glib-2.0 -I/usr/lib/glib-2.0/include -I.. -I..  -Wall -Wextra -Wdeclaration-after-statement -Wshadow -Wmissing-prototypes -Wnested-externs -Wpointer-arith -Wsign-compare -Wstrict-prototypes -Wformat-security -Winit-self -Wno-missing-field-initializers -Wno-unused-parameter -Wno-deprecated-declarations  -pipe -frecord-gcc-switches -Wall -g -O2 -march=i586 -mtune=generic -c -o base-connection.lo base-connection.c
libtool: compile:  i586-alt-linux-gcc -DHAVE_CONFIG_H -I. -I.. -pthread -I/usr/include/glib-2.0 -I/usr/lib/glib-2.0/include -pthread -I/usr/include/telepathy-1.0 -I/usr/include/dbus-1.0 -I/usr/lib/dbus-1.0/include -I/usr/include/glib-2.0 -I/usr/lib/glib-2.0/include -I/usr/include/sofia-sip-1.13 -I/usr/include/glib-2.0 -I/usr/lib/glib-2.0/include -I.. -I.. -Wall -Wextra -Wdeclaration-after-statement -Wshadow -Wmissing-prototypes -Wnested-externs -Wpointer-arith -Wsign-compare -Wstrict-prototypes -Wformat-security -Winit-self -Wno-missing-field-initializers -Wno-unused-parameter -Wno-deprecated-declarations -pipe -frecord-gcc-switches -Wall -g -O2 -march=i586 -mtune=generic -c base-connection.c -o base-connection.o
make[3]: Leaving directory '/usr/src/RPM/BUILD/telepathy-rakia-0.8.0/rakia'
make[3]: Entering directory '/usr/src/RPM/BUILD/telepathy-rakia-0.8.0/rakia'
/bin/sh ../libtool  --tag=CC   --mode=compile i586-alt-linux-gcc -DHAVE_CONFIG_H -I. -I..  -pthread -I/usr/include/glib-2.0 -I/usr/lib/glib-2.0/include -pthread -I/usr/include/telepathy-1.0 -I/usr/include/dbus-1.0 -I/usr/lib/dbus-1.0/include -I/usr/include/glib-2.0 -I/usr/lib/glib-2.0/include -I/usr/include/sofia-sip-1.13 -I/usr/include/glib-2.0 -I/usr/lib/glib-2.0/include -I.. -I..  -Wall -Wextra -Wdeclaration-after-statement -Wshadow -Wmissing-prototypes -Wnested-externs -Wpointer-arith -Wsign-compare -Wstrict-prototypes -Wformat-security -Winit-self -Wno-missing-field-initializers -Wno-unused-parameter -Wno-deprecated-declarations  -pipe -frecord-gcc-switches -Wall -g -O2 -march=i586 -mtune=generic -c -o call-stream.lo call-stream.c
libtool: compile:  i586-alt-linux-gcc -DHAVE_CONFIG_H -I. -I.. -pthread -I/usr/include/glib-2.0 -I/usr/lib/glib-2.0/include -pthread -I/usr/include/telepathy-1.0 -I/usr/include/dbus-1.0 -I/usr/lib/dbus-1.0/include -I/usr/include/glib-2.0 -I/usr/lib/glib-2.0/include -I/usr/include/sofia-sip-1.13 -I/usr/include/glib-2.0 -I/usr/lib/glib-2.0/include -I.. -I.. -Wall -Wextra -Wdeclaration-after-statement -Wshadow -Wmissing-prototypes -Wnested-externs -Wpointer-arith -Wsign-compare -Wstrict-prototypes -Wformat-security -Winit-self -Wno-missing-field-initializers -Wno-unused-parameter -Wno-deprecated-declarations -pipe -frecord-gcc-switches -Wall -g -O2 -march=i586 -mtune=generic -c call-stream.c -o call-stream.o
make[3]: Leaving directory '/usr/src/RPM/BUILD/telepathy-rakia-0.8.0/rakia'
make[3]: Entering directory '/usr/src/RPM/BUILD/telepathy-rakia-0.8.0/rakia'
/bin/sh ../libtool  --tag=CC   --mode=compile i586-alt-linux-gcc -DHAVE_CONFIG_H -I. -I..  -pthread -I/usr/include/glib-2.0 -I/usr/lib/glib-2.0/include -pthread -I/usr/include/telepathy-1.0 -I/usr/include/dbus-1.0 -I/usr/lib/dbus-1.0/include -I/usr/include/glib-2.0 -I/usr/lib/glib-2.0/include -I/usr/include/sofia-sip-1.13 -I/usr/include/glib-2.0 -I/usr/lib/glib-2.0/include -I.. -I..  -Wall -Wextra -Wdeclaration-after-statement -Wshadow -Wmissing-prototypes -Wnested-externs -Wpointer-arith -Wsign-compare -Wstrict-prototypes -Wformat-security -Winit-self -Wno-missing-field-initializers -Wno-unused-parameter -Wno-deprecated-declarations  -pipe -frecord-gcc-switches -Wall -g -O2 -march=i586 -mtune=generic -c -o call-content.lo call-content.c
libtool: compile:  i586-alt-linux-gcc -DHAVE_CONFIG_H -I. -I.. -pthread -I/usr/include/glib-2.0 -I/usr/lib/glib-2.0/include -pthread -I/usr/include/telepathy-1.0 -I/usr/include/dbus-1.0 -I/usr/lib/dbus-1.0/include -I/usr/include/glib-2.0 -I/usr/lib/glib-2.0/include -I/usr/include/sofia-sip-1.13 -I/usr/include/glib-2.0 -I/usr/lib/glib-2.0/include -I.. -I.. -Wall -Wextra -Wdeclaration-after-statement -Wshadow -Wmissing-prototypes -Wnested-externs -Wpointer-arith -Wsign-compare -Wstrict-prototypes -Wformat-security -Winit-self -Wno-missing-field-initializers -Wno-unused-parameter -Wno-deprecated-declarations -pipe -frecord-gcc-switches -Wall -g -O2 -march=i586 -mtune=generic -c call-content.c -o call-content.o
make[3]: Leaving directory '/usr/src/RPM/BUILD/telepathy-rakia-0.8.0/rakia'
make[3]: Entering directory '/usr/src/RPM/BUILD/telepathy-rakia-0.8.0/rakia'
/bin/sh ../libtool  --tag=CC   --mode=compile i586-alt-linux-gcc -DHAVE_CONFIG_H -I. -I..  -pthread -I/usr/include/glib-2.0 -I/usr/lib/glib-2.0/include -pthread -I/usr/include/telepathy-1.0 -I/usr/include/dbus-1.0 -I/usr/lib/dbus-1.0/include -I/usr/include/glib-2.0 -I/usr/lib/glib-2.0/include -I/usr/include/sofia-sip-1.13 -I/usr/include/glib-2.0 -I/usr/lib/glib-2.0/include -I.. -I..  -Wall -Wextra -Wdeclaration-after-statement -Wshadow -Wmissing-prototypes -Wnested-externs -Wpointer-arith -Wsign-compare -Wstrict-prototypes -Wformat-security -Winit-self -Wno-missing-field-initializers -Wno-unused-parameter -Wno-deprecated-declarations  -pipe -frecord-gcc-switches -Wall -g -O2 -march=i586 -mtune=generic -c -o debug.lo debug.c
libtool: compile:  i586-alt-linux-gcc -DHAVE_CONFIG_H -I. -I.. -pthread -I/usr/include/glib-2.0 -I/usr/lib/glib-2.0/include -pthread -I/usr/include/telepathy-1.0 -I/usr/include/dbus-1.0 -I/usr/lib/dbus-1.0/include -I/usr/include/glib-2.0 -I/usr/lib/glib-2.0/include -I/usr/include/sofia-sip-1.13 -I/usr/include/glib-2.0 -I/usr/lib/glib-2.0/include -I.. -I.. -Wall -Wextra -Wdeclaration-after-statement -Wshadow -Wmissing-prototypes -Wnested-externs -Wpointer-arith -Wsign-compare -Wstrict-prototypes -Wformat-security -Winit-self -Wno-missing-field-initializers -Wno-unused-parameter -Wno-deprecated-declarations -pipe -frecord-gcc-switches -Wall -g -O2 -march=i586 -mtune=generic -c debug.c -o debug.o
make[3]: Leaving directory '/usr/src/RPM/BUILD/telepathy-rakia-0.8.0/rakia'
make[3]: Entering directory '/usr/src/RPM/BUILD/telepathy-rakia-0.8.0/rakia'
/bin/sh ../libtool  --tag=CC   --mode=compile i586-alt-linux-gcc -DHAVE_CONFIG_H -I. -I..  -pthread -I/usr/include/glib-2.0 -I/usr/lib/glib-2.0/include -pthread -I/usr/include/telepathy-1.0 -I/usr/include/dbus-1.0 -I/usr/lib/dbus-1.0/include -I/usr/include/glib-2.0 -I/usr/lib/glib-2.0/include -I/usr/include/sofia-sip-1.13 -I/usr/include/glib-2.0 -I/usr/lib/glib-2.0/include -I.. -I..  -Wall -Wextra -Wdeclaration-after-statement -Wshadow -Wmissing-prototypes -Wnested-externs -Wpointer-arith -Wsign-compare -Wstrict-prototypes -Wformat-security -Winit-self -Wno-missing-field-initializers -Wno-unused-parameter -Wno-deprecated-declarations  -pipe -frecord-gcc-switches -Wall -g -O2 -march=i586 -mtune=generic -c -o connection-aliasing.lo connection-aliasing.c
libtool: compile:  i586-alt-linux-gcc -DHAVE_CONFIG_H -I. -I.. -pthread -I/usr/include/glib-2.0 -I/usr/lib/glib-2.0/include -pthread -I/usr/include/telepathy-1.0 -I/usr/include/dbus-1.0 -I/usr/lib/dbus-1.0/include -I/usr/include/glib-2.0 -I/usr/lib/glib-2.0/include -I/usr/include/sofia-sip-1.13 -I/usr/include/glib-2.0 -I/usr/lib/glib-2.0/include -I.. -I.. -Wall -Wextra -Wdeclaration-after-statement -Wshadow -Wmissing-prototypes -Wnested-externs -Wpointer-arith -Wsign-compare -Wstrict-prototypes -Wformat-security -Winit-self -Wno-missing-field-initializers -Wno-unused-parameter -Wno-deprecated-declarations -pipe -frecord-gcc-switches -Wall -g -O2 -march=i586 -mtune=generic -c connection-aliasing.c -o connection-aliasing.o
make[3]: Leaving directory '/usr/src/RPM/BUILD/telepathy-rakia-0.8.0/rakia'
make[3]: Entering directory '/usr/src/RPM/BUILD/telepathy-rakia-0.8.0/rakia'
/bin/sh ../libtool  --tag=CC   --mode=compile i586-alt-linux-gcc -DHAVE_CONFIG_H -I. -I..  -pthread -I/usr/include/glib-2.0 -I/usr/lib/glib-2.0/include -pthread -I/usr/include/telepathy-1.0 -I/usr/include/dbus-1.0 -I/usr/lib/dbus-1.0/include -I/usr/include/glib-2.0 -I/usr/lib/glib-2.0/include -I/usr/include/sofia-sip-1.13 -I/usr/include/glib-2.0 -I/usr/lib/glib-2.0/include -I.. -I..  -Wall -Wextra -Wdeclaration-after-statement -Wshadow -Wmissing-prototypes -Wnested-externs -Wpointer-arith -Wsign-compare -Wstrict-prototypes -Wformat-security -Winit-self -Wno-missing-field-initializers -Wno-unused-parameter -Wno-deprecated-declarations  -pipe -frecord-gcc-switches -Wall -g -O2 -march=i586 -mtune=generic -c -o codec-param-formats.lo codec-param-formats.c
libtool: compile:  i586-alt-linux-gcc -DHAVE_CONFIG_H -I. -I.. -pthread -I/usr/include/glib-2.0 -I/usr/lib/glib-2.0/include -pthread -I/usr/include/telepathy-1.0 -I/usr/include/dbus-1.0 -I/usr/lib/dbus-1.0/include -I/usr/include/glib-2.0 -I/usr/lib/glib-2.0/include -I/usr/include/sofia-sip-1.13 -I/usr/include/glib-2.0 -I/usr/lib/glib-2.0/include -I.. -I.. -Wall -Wextra -Wdeclaration-after-statement -Wshadow -Wmissing-prototypes -Wnested-externs -Wpointer-arith -Wsign-compare -Wstrict-prototypes -Wformat-security -Winit-self -Wno-missing-field-initializers -Wno-unused-parameter -Wno-deprecated-declarations -pipe -frecord-gcc-switches -Wall -g -O2 -march=i586 -mtune=generic -c codec-param-formats.c -o codec-param-formats.o
make[3]: Leaving directory '/usr/src/RPM/BUILD/telepathy-rakia-0.8.0/rakia'
make[3]: Entering directory '/usr/src/RPM/BUILD/telepathy-rakia-0.8.0/rakia'
/bin/sh ../libtool  --tag=CC   --mode=compile i586-alt-linux-gcc -DHAVE_CONFIG_H -I. -I..  -pthread -I/usr/include/glib-2.0 -I/usr/lib/glib-2.0/include -pthread -I/usr/include/telepathy-1.0 -I/usr/include/dbus-1.0 -I/usr/lib/dbus-1.0/include -I/usr/include/glib-2.0 -I/usr/lib/glib-2.0/include -I/usr/include/sofia-sip-1.13 -I/usr/include/glib-2.0 -I/usr/lib/glib-2.0/include -I.. -I..  -Wall -Wextra -Wdeclaration-after-statement -Wshadow -Wmissing-prototypes -Wnested-externs -Wpointer-arith -Wsign-compare -Wstrict-prototypes -Wformat-security -Winit-self -Wno-missing-field-initializers -Wno-unused-parameter -Wno-deprecated-declarations  -pipe -frecord-gcc-switches -Wall -g -O2 -march=i586 -mtune=generic -c -o call-channel.lo call-channel.c
libtool: compile:  i586-alt-linux-gcc -DHAVE_CONFIG_H -I. -I.. -pthread -I/usr/include/glib-2.0 -I/usr/lib/glib-2.0/include -pthread -I/usr/include/telepathy-1.0 -I/usr/include/dbus-1.0 -I/usr/lib/dbus-1.0/include -I/usr/include/glib-2.0 -I/usr/lib/glib-2.0/include -I/usr/include/sofia-sip-1.13 -I/usr/include/glib-2.0 -I/usr/lib/glib-2.0/include -I.. -I.. -Wall -Wextra -Wdeclaration-after-statement -Wshadow -Wmissing-prototypes -Wnested-externs -Wpointer-arith -Wsign-compare -Wstrict-prototypes -Wformat-security -Winit-self -Wno-missing-field-initializers -Wno-unused-parameter -Wno-deprecated-declarations -pipe -frecord-gcc-switches -Wall -g -O2 -march=i586 -mtune=generic -c call-channel.c -o call-channel.o
call-channel.c: In function 'rakia_call_channel_add_content':
call-channel.c:385:19: warning: implicit conversion from 'TpMediaStreamDirection' to 'RakiaDirection' [-Wenum-conversion]
  385 |       type, name, initial_direction);
      |                   ^~~~~~~~~~~~~~~~~
make[3]: Leaving directory '/usr/src/RPM/BUILD/telepathy-rakia-0.8.0/rakia'
make[3]: Entering directory '/usr/src/RPM/BUILD/telepathy-rakia-0.8.0/rakia'
/bin/sh ../libtool  --tag=CC   --mode=compile i586-alt-linux-gcc -DHAVE_CONFIG_H -I. -I..  -pthread -I/usr/include/glib-2.0 -I/usr/lib/glib-2.0/include -pthread -I/usr/include/telepathy-1.0 -I/usr/include/dbus-1.0 -I/usr/lib/dbus-1.0/include -I/usr/include/glib-2.0 -I/usr/lib/glib-2.0/include -I/usr/include/sofia-sip-1.13 -I/usr/include/glib-2.0 -I/usr/lib/glib-2.0/include -I.. -I..  -Wall -Wextra -Wdeclaration-after-statement -Wshadow -Wmissing-prototypes -Wnested-externs -Wpointer-arith -Wsign-compare -Wstrict-prototypes -Wformat-security -Winit-self -Wno-missing-field-initializers -Wno-unused-parameter -Wno-deprecated-declarations  -pipe -frecord-gcc-switches -Wall -g -O2 -march=i586 -mtune=generic -c -o handles.lo handles.c
libtool: compile:  i586-alt-linux-gcc -DHAVE_CONFIG_H -I. -I.. -pthread -I/usr/include/glib-2.0 -I/usr/lib/glib-2.0/include -pthread -I/usr/include/telepathy-1.0 -I/usr/include/dbus-1.0 -I/usr/lib/dbus-1.0/include -I/usr/include/glib-2.0 -I/usr/lib/glib-2.0/include -I/usr/include/sofia-sip-1.13 -I/usr/include/glib-2.0 -I/usr/lib/glib-2.0/include -I.. -I.. -Wall -Wextra -Wdeclaration-after-statement -Wshadow -Wmissing-prototypes -Wnested-externs -Wpointer-arith -Wsign-compare -Wstrict-prototypes -Wformat-security -Winit-self -Wno-missing-field-initializers -Wno-unused-parameter -Wno-deprecated-declarations -pipe -frecord-gcc-switches -Wall -g -O2 -march=i586 -mtune=generic -c handles.c -o handles.o
make[3]: Leaving directory '/usr/src/RPM/BUILD/telepathy-rakia-0.8.0/rakia'
make[3]: Entering directory '/usr/src/RPM/BUILD/telepathy-rakia-0.8.0/rakia'
/bin/sh ../libtool  --tag=CC   --mode=compile i586-alt-linux-gcc -DHAVE_CONFIG_H -I. -I..  -pthread -I/usr/include/glib-2.0 -I/usr/lib/glib-2.0/include -pthread -I/usr/include/telepathy-1.0 -I/usr/include/dbus-1.0 -I/usr/lib/dbus-1.0/include -I/usr/include/glib-2.0 -I/usr/lib/glib-2.0/include -I/usr/include/sofia-sip-1.13 -I/usr/include/glib-2.0 -I/usr/lib/glib-2.0/include -I.. -I..  -Wall -Wextra -Wdeclaration-after-statement -Wshadow -Wmissing-prototypes -Wnested-externs -Wpointer-arith -Wsign-compare -Wstrict-prototypes -Wformat-security -Winit-self -Wno-missing-field-initializers -Wno-unused-parameter -Wno-deprecated-declarations  -pipe -frecord-gcc-switches -Wall -g -O2 -march=i586 -mtune=generic -c -o util.lo util.c
libtool: compile:  i586-alt-linux-gcc -DHAVE_CONFIG_H -I. -I.. -pthread -I/usr/include/glib-2.0 -I/usr/lib/glib-2.0/include -pthread -I/usr/include/telepathy-1.0 -I/usr/include/dbus-1.0 -I/usr/lib/dbus-1.0/include -I/usr/include/glib-2.0 -I/usr/lib/glib-2.0/include -I/usr/include/sofia-sip-1.13 -I/usr/include/glib-2.0 -I/usr/lib/glib-2.0/include -I.. -I.. -Wall -Wextra -Wdeclaration-after-statement -Wshadow -Wmissing-prototypes -Wnested-externs -Wpointer-arith -Wsign-compare -Wstrict-prototypes -Wformat-security -Winit-self -Wno-missing-field-initializers -Wno-unused-parameter -Wno-deprecated-declarations -pipe -frecord-gcc-switches -Wall -g -O2 -march=i586 -mtune=generic -c util.c -o util.o
make[3]: Leaving directory '/usr/src/RPM/BUILD/telepathy-rakia-0.8.0/rakia'
make[3]: Entering directory '/usr/src/RPM/BUILD/telepathy-rakia-0.8.0/rakia'
/bin/sh ../libtool  --tag=CC   --mode=compile i586-alt-linux-gcc -DHAVE_CONFIG_H -I. -I..  -pthread -I/usr/include/glib-2.0 -I/usr/lib/glib-2.0/include -pthread -I/usr/include/telepathy-1.0 -I/usr/include/dbus-1.0 -I/usr/lib/dbus-1.0/include -I/usr/include/glib-2.0 -I/usr/lib/glib-2.0/include -I/usr/include/sofia-sip-1.13 -I/usr/include/glib-2.0 -I/usr/lib/glib-2.0/include -I.. -I..  -Wall -Wextra -Wdeclaration-after-statement -Wshadow -Wmissing-prototypes -Wnested-externs -Wpointer-arith -Wsign-compare -Wstrict-prototypes -Wformat-security -Winit-self -Wno-missing-field-initializers -Wno-unused-parameter -Wno-deprecated-declarations  -pipe -frecord-gcc-switches -Wall -g -O2 -march=i586 -mtune=generic -c -o signals-marshal.lo signals-marshal.c
libtool: compile:  i586-alt-linux-gcc -DHAVE_CONFIG_H -I. -I.. -pthread -I/usr/include/glib-2.0 -I/usr/lib/glib-2.0/include -pthread -I/usr/include/telepathy-1.0 -I/usr/include/dbus-1.0 -I/usr/lib/dbus-1.0/include -I/usr/include/glib-2.0 -I/usr/lib/glib-2.0/include -I/usr/include/sofia-sip-1.13 -I/usr/include/glib-2.0 -I/usr/lib/glib-2.0/include -I.. -I.. -Wall -Wextra -Wdeclaration-after-statement -Wshadow -Wmissing-prototypes -Wnested-externs -Wpointer-arith -Wsign-compare -Wstrict-prototypes -Wformat-security -Winit-self -Wno-missing-field-initializers -Wno-unused-parameter -Wno-deprecated-declarations -pipe -frecord-gcc-switches -Wall -g -O2 -march=i586 -mtune=generic -c signals-marshal.c -o signals-marshal.o
make[3]: Leaving directory '/usr/src/RPM/BUILD/telepathy-rakia-0.8.0/rakia'
make[3]: Entering directory '/usr/src/RPM/BUILD/telepathy-rakia-0.8.0/rakia'
/bin/sh ../libtool  --tag=CC   --mode=compile i586-alt-linux-gcc -DHAVE_CONFIG_H -I. -I..  -pthread -I/usr/include/glib-2.0 -I/usr/lib/glib-2.0/include -pthread -I/usr/include/telepathy-1.0 -I/usr/include/dbus-1.0 -I/usr/lib/dbus-1.0/include -I/usr/include/glib-2.0 -I/usr/lib/glib-2.0/include -I/usr/include/sofia-sip-1.13 -I/usr/include/glib-2.0 -I/usr/lib/glib-2.0/include -I.. -I..  -Wall -Wextra -Wdeclaration-after-statement -Wshadow -Wmissing-prototypes -Wnested-externs -Wpointer-arith -Wsign-compare -Wstrict-prototypes -Wformat-security -Winit-self -Wno-missing-field-initializers -Wno-unused-parameter -Wno-deprecated-declarations  -pipe -frecord-gcc-switches -Wall -g -O2 -march=i586 -mtune=generic -c -o text-manager.lo text-manager.c
libtool: compile:  i586-alt-linux-gcc -DHAVE_CONFIG_H -I. -I.. -pthread -I/usr/include/glib-2.0 -I/usr/lib/glib-2.0/include -pthread -I/usr/include/telepathy-1.0 -I/usr/include/dbus-1.0 -I/usr/lib/dbus-1.0/include -I/usr/include/glib-2.0 -I/usr/lib/glib-2.0/include -I/usr/include/sofia-sip-1.13 -I/usr/include/glib-2.0 -I/usr/lib/glib-2.0/include -I.. -I.. -Wall -Wextra -Wdeclaration-after-statement -Wshadow -Wmissing-prototypes -Wnested-externs -Wpointer-arith -Wsign-compare -Wstrict-prototypes -Wformat-security -Winit-self -Wno-missing-field-initializers -Wno-unused-parameter -Wno-deprecated-declarations -pipe -frecord-gcc-switches -Wall -g -O2 -march=i586 -mtune=generic -c text-manager.c -o text-manager.o
make[3]: Leaving directory '/usr/src/RPM/BUILD/telepathy-rakia-0.8.0/rakia'
make[3]: Entering directory '/usr/src/RPM/BUILD/telepathy-rakia-0.8.0/rakia'
/bin/sh ../libtool  --tag=CC   --mode=compile i586-alt-linux-gcc -DHAVE_CONFIG_H -I. -I..  -pthread -I/usr/include/glib-2.0 -I/usr/lib/glib-2.0/include -pthread -I/usr/include/telepathy-1.0 -I/usr/include/dbus-1.0 -I/usr/lib/dbus-1.0/include -I/usr/include/glib-2.0 -I/usr/lib/glib-2.0/include -I/usr/include/sofia-sip-1.13 -I/usr/include/glib-2.0 -I/usr/lib/glib-2.0/include -I.. -I..  -Wall -Wextra -Wdeclaration-after-statement -Wshadow -Wmissing-prototypes -Wnested-externs -Wpointer-arith -Wsign-compare -Wstrict-prototypes -Wformat-security -Winit-self -Wno-missing-field-initializers -Wno-unused-parameter -Wno-deprecated-declarations  -pipe -frecord-gcc-switches -Wall -g -O2 -march=i586 -mtune=generic -c -o media-manager.lo media-manager.c
libtool: compile:  i586-alt-linux-gcc -DHAVE_CONFIG_H -I. -I.. -pthread -I/usr/include/glib-2.0 -I/usr/lib/glib-2.0/include -pthread -I/usr/include/telepathy-1.0 -I/usr/include/dbus-1.0 -I/usr/lib/dbus-1.0/include -I/usr/include/glib-2.0 -I/usr/lib/glib-2.0/include -I/usr/include/sofia-sip-1.13 -I/usr/include/glib-2.0 -I/usr/lib/glib-2.0/include -I.. -I.. -Wall -Wextra -Wdeclaration-after-statement -Wshadow -Wmissing-prototypes -Wnested-externs -Wpointer-arith -Wsign-compare -Wstrict-prototypes -Wformat-security -Winit-self -Wno-missing-field-initializers -Wno-unused-parameter -Wno-deprecated-declarations -pipe -frecord-gcc-switches -Wall -g -O2 -march=i586 -mtune=generic -c media-manager.c -o media-manager.o
media-manager.c:530:28: warning: 'anon_channel_allowed_properties' defined but not used [-Wunused-const-variable=]
  530 | static const gchar * const anon_channel_allowed_properties[] = {
      |                            ^~~~~~~~~~~~~~~~~~~~~~~~~~~~~~~
make[3]: Leaving directory '/usr/src/RPM/BUILD/telepathy-rakia-0.8.0/rakia'
make[3]: Entering directory '/usr/src/RPM/BUILD/telepathy-rakia-0.8.0/rakia'
/bin/sh ../libtool  --tag=CC   --mode=compile i586-alt-linux-gcc -DHAVE_CONFIG_H -I. -I..  -pthread -I/usr/include/glib-2.0 -I/usr/lib/glib-2.0/include -pthread -I/usr/include/telepathy-1.0 -I/usr/include/dbus-1.0 -I/usr/lib/dbus-1.0/include -I/usr/include/glib-2.0 -I/usr/lib/glib-2.0/include -I/usr/include/sofia-sip-1.13 -I/usr/include/glib-2.0 -I/usr/lib/glib-2.0/include -I.. -I..  -Wall -Wextra -Wdeclaration-after-statement -Wshadow -Wmissing-prototypes -Wnested-externs -Wpointer-arith -Wsign-compare -Wstrict-prototypes -Wformat-security -Winit-self -Wno-missing-field-initializers -Wno-unused-parameter -Wno-deprecated-declarations  -pipe -frecord-gcc-switches -Wall -g -O2 -march=i586 -mtune=generic -c -o text-channel.lo text-channel.c
libtool: compile:  i586-alt-linux-gcc -DHAVE_CONFIG_H -I. -I.. -pthread -I/usr/include/glib-2.0 -I/usr/lib/glib-2.0/include -pthread -I/usr/include/telepathy-1.0 -I/usr/include/dbus-1.0 -I/usr/lib/dbus-1.0/include -I/usr/include/glib-2.0 -I/usr/lib/glib-2.0/include -I/usr/include/sofia-sip-1.13 -I/usr/include/glib-2.0 -I/usr/lib/glib-2.0/include -I.. -I.. -Wall -Wextra -Wdeclaration-after-statement -Wshadow -Wmissing-prototypes -Wnested-externs -Wpointer-arith -Wsign-compare -Wstrict-prototypes -Wformat-security -Winit-self -Wno-missing-field-initializers -Wno-unused-parameter -Wno-deprecated-declarations -pipe -frecord-gcc-switches -Wall -g -O2 -march=i586 -mtune=generic -c text-channel.c -o text-channel.o
text-channel.c: In function 'zap_pending_messages':
text-channel.c:470:7: warning: cast between incompatible function types from 'void (*)(RakiaTextPendingMessage *)' {aka 'void (*)(struct _RakiaTextPendingMessage *)'} to 'void (*)(void *, void *)' [-Wcast-function-type]
  470 |       (GFunc) rakia_text_pending_free, NULL);
      |       ^
make[3]: Leaving directory '/usr/src/RPM/BUILD/telepathy-rakia-0.8.0/rakia'
make[3]: Entering directory '/usr/src/RPM/BUILD/telepathy-rakia-0.8.0/rakia'
/bin/sh ../libtool  --tag=CC   --mode=compile i586-alt-linux-gcc -DHAVE_CONFIG_H -I. -I..  -pthread -I/usr/include/glib-2.0 -I/usr/lib/glib-2.0/include -pthread -I/usr/include/telepathy-1.0 -I/usr/include/dbus-1.0 -I/usr/lib/dbus-1.0/include -I/usr/include/glib-2.0 -I/usr/lib/glib-2.0/include -I/usr/include/sofia-sip-1.13 -I/usr/include/glib-2.0 -I/usr/lib/glib-2.0/include -I.. -I..  -Wall -Wextra -Wdeclaration-after-statement -Wshadow -Wmissing-prototypes -Wnested-externs -Wpointer-arith -Wsign-compare -Wstrict-prototypes -Wformat-security -Winit-self -Wno-missing-field-initializers -Wno-unused-parameter -Wno-deprecated-declarations  -pipe -frecord-gcc-switches -Wall -g -O2 -march=i586 -mtune=generic -c -o sip-media.lo sip-media.c
libtool: compile:  i586-alt-linux-gcc -DHAVE_CONFIG_H -I. -I.. -pthread -I/usr/include/glib-2.0 -I/usr/lib/glib-2.0/include -pthread -I/usr/include/telepathy-1.0 -I/usr/include/dbus-1.0 -I/usr/lib/dbus-1.0/include -I/usr/include/glib-2.0 -I/usr/lib/glib-2.0/include -I/usr/include/sofia-sip-1.13 -I/usr/include/glib-2.0 -I/usr/lib/glib-2.0/include -I.. -I.. -Wall -Wextra -Wdeclaration-after-statement -Wshadow -Wmissing-prototypes -Wnested-externs -Wpointer-arith -Wsign-compare -Wstrict-prototypes -Wformat-security -Winit-self -Wno-missing-field-initializers -Wno-unused-parameter -Wno-deprecated-declarations -pipe -frecord-gcc-switches -Wall -g -O2 -march=i586 -mtune=generic -c sip-media.c -o sip-media.o
make[3]: Leaving directory '/usr/src/RPM/BUILD/telepathy-rakia-0.8.0/rakia'
make[3]: Entering directory '/usr/src/RPM/BUILD/telepathy-rakia-0.8.0/rakia'
/bin/sh ../libtool  --tag=CC   --mode=compile i586-alt-linux-gcc -DHAVE_CONFIG_H -I. -I..  -pthread -I/usr/include/glib-2.0 -I/usr/lib/glib-2.0/include -pthread -I/usr/include/telepathy-1.0 -I/usr/include/dbus-1.0 -I/usr/lib/dbus-1.0/include -I/usr/include/glib-2.0 -I/usr/lib/glib-2.0/include -I/usr/include/sofia-sip-1.13 -I/usr/include/glib-2.0 -I/usr/lib/glib-2.0/include -I.. -I..  -Wall -Wextra -Wdeclaration-after-statement -Wshadow -Wmissing-prototypes -Wnested-externs -Wpointer-arith -Wsign-compare -Wstrict-prototypes -Wformat-security -Winit-self -Wno-missing-field-initializers -Wno-unused-parameter -Wno-deprecated-declarations  -pipe -frecord-gcc-switches -Wall -g -O2 -march=i586 -mtune=generic -c -o sip-session.lo sip-session.c
libtool: compile:  i586-alt-linux-gcc -DHAVE_CONFIG_H -I. -I.. -pthread -I/usr/include/glib-2.0 -I/usr/lib/glib-2.0/include -pthread -I/usr/include/telepathy-1.0 -I/usr/include/dbus-1.0 -I/usr/lib/dbus-1.0/include -I/usr/include/glib-2.0 -I/usr/lib/glib-2.0/include -I/usr/include/sofia-sip-1.13 -I/usr/include/glib-2.0 -I/usr/lib/glib-2.0/include -I.. -I.. -Wall -Wextra -Wdeclaration-after-statement -Wshadow -Wmissing-prototypes -Wnested-externs -Wpointer-arith -Wsign-compare -Wstrict-prototypes -Wformat-security -Winit-self -Wno-missing-field-initializers -Wno-unused-parameter -Wno-deprecated-declarations -pipe -frecord-gcc-switches -Wall -g -O2 -march=i586 -mtune=generic -c sip-session.c -o sip-session.o
sip-session.c: In function 'rakia_sip_session_media_changed':
sip-session.c:854:10: warning: this statement may fall through [-Wimplicit-fallthrough=]
  854 |       if (priv->immutable_streams) {
      |          ^
sip-session.c:860:5: note: here
  860 |     case RAKIA_SIP_SESSION_STATE_REINVITE_PENDING:
      |     ^~~~
make[3]: Leaving directory '/usr/src/RPM/BUILD/telepathy-rakia-0.8.0/rakia'
make[3]: Entering directory '/usr/src/RPM/BUILD/telepathy-rakia-0.8.0/rakia'
/bin/sh ../libtool  --tag=CC   --mode=link i586-alt-linux-gcc -Wall -Wextra -Wdeclaration-after-statement -Wshadow -Wmissing-prototypes -Wnested-externs -Wpointer-arith -Wsign-compare -Wstrict-prototypes -Wformat-security -Winit-self -Wno-missing-field-initializers -Wno-unused-parameter -Wno-deprecated-declarations  -pipe -frecord-gcc-switches -Wall -g -O2 -march=i586 -mtune=generic   -o librakia.la  base-connection.lo base-connection-sofia.lo connection-aliasing.lo call-channel.lo call-content.lo call-stream.lo codec-param-formats.lo event-target.lo handles.lo debug.lo media-manager.lo sip-media.lo sip-session.lo text-channel.lo text-manager.lo util.lo signals-marshal.lo  
libtool: link: ar cr .libs/librakia.a  base-connection.o base-connection-sofia.o connection-aliasing.o call-channel.o call-content.o call-stream.o codec-param-formats.o event-target.o handles.o debug.o media-manager.o sip-media.o sip-session.o text-channel.o text-manager.o util.o signals-marshal.o
libtool: link: ranlib .libs/librakia.a
libtool: link: ( cd ".libs" && rm -f "librakia.la" && ln -s "../librakia.la" "librakia.la" )
make[3]: Leaving directory '/usr/src/RPM/BUILD/telepathy-rakia-0.8.0/rakia'
Making all in extensions
make[2]: Entering directory '/usr/src/RPM/BUILD/telepathy-rakia-0.8.0/extensions'
/bin/mkdir -p _gen
xsltproc --nonet --novalid --xinclude ../tools/identity.xsl \
	all.xml > _gen/all.xml
make[2]: Leaving directory '/usr/src/RPM/BUILD/telepathy-rakia-0.8.0/extensions'
make[2]: Entering directory '/usr/src/RPM/BUILD/telepathy-rakia-0.8.0/extensions'
/bin/mkdir -p _gen
xsltproc --nonet --novalid --xinclude ../tools/identity.xsl \
	channel.xml > _gen/channel.xml
make[2]: Leaving directory '/usr/src/RPM/BUILD/telepathy-rakia-0.8.0/extensions'
make[2]: Entering directory '/usr/src/RPM/BUILD/telepathy-rakia-0.8.0/extensions'
xsltproc --nonet --novalid \
	--stringparam mixed-case-prefix Rakia \
	../tools/c-constants-generator.xsl \
	_gen/all.xml > _gen/enums.h
make[2]: Leaving directory '/usr/src/RPM/BUILD/telepathy-rakia-0.8.0/extensions'
make[2]: Entering directory '/usr/src/RPM/BUILD/telepathy-rakia-0.8.0/extensions'
xsltproc --nonet --novalid \
	--stringparam mixed-case-prefix Rakia \
	../tools/glib-interfaces-generator.xsl \
	_gen/all.xml > _gen/interfaces.h
make[2]: Leaving directory '/usr/src/RPM/BUILD/telepathy-rakia-0.8.0/extensions'
make[2]: Entering directory '/usr/src/RPM/BUILD/telepathy-rakia-0.8.0/extensions'
xsltproc --nonet --novalid \
	--stringparam mixed-case-prefix Rakia \
	../tools/glib-interfaces-body-generator.xsl \
	_gen/all.xml > _gen/interfaces-body.h
make[2]: Leaving directory '/usr/src/RPM/BUILD/telepathy-rakia-0.8.0/extensions'
make[2]: Entering directory '/usr/src/RPM/BUILD/telepathy-rakia-0.8.0/extensions'
xsltproc --nonet --novalid \
	../tools/doc-generator.xsl \
	_gen/all.xml > extensions.html
make[2]: Leaving directory '/usr/src/RPM/BUILD/telepathy-rakia-0.8.0/extensions'
make[2]: Entering directory '/usr/src/RPM/BUILD/telepathy-rakia-0.8.0/extensions'
/usr/bin/python ../tools/glib-signals-marshal-gen.py _gen/all.xml > _gen/signals-marshal.list
make[2]: Leaving directory '/usr/src/RPM/BUILD/telepathy-rakia-0.8.0/extensions'
make[2]: Entering directory '/usr/src/RPM/BUILD/telepathy-rakia-0.8.0/extensions'
/usr/bin/python ../tools/glib-gtypes-generator.py \
	_gen/all.xml _gen/gtypes RAKIA
make[2]: Leaving directory '/usr/src/RPM/BUILD/telepathy-rakia-0.8.0/extensions'
make[2]: Entering directory '/usr/src/RPM/BUILD/telepathy-rakia-0.8.0/extensions'
/usr/bin/python ../tools/glib-client-marshaller-gen.py _gen/all.xml \
	_rakia_ext > _gen/register-dbus-glib-marshallers-body.h
make[2]: Leaving directory '/usr/src/RPM/BUILD/telepathy-rakia-0.8.0/extensions'
make[2]: Entering directory '/usr/src/RPM/BUILD/telepathy-rakia-0.8.0/extensions'
/usr/bin/python ../tools/glib-ginterface-gen.py \
	--filename=_gen/svc-channel \
	--signal-marshal-prefix=_rakia_ext \
	--include='<telepathy-glib/dbus.h>' \
	--include='"_gen/signals-marshal.h"' \
	--not-implemented-func='tp_dbus_g_method_return_not_implemented' \
	--allow-unstable \
	_gen/channel.xml Rakia_Svc_
make[2]: Leaving directory '/usr/src/RPM/BUILD/telepathy-rakia-0.8.0/extensions'
make[2]: Entering directory '/usr/src/RPM/BUILD/telepathy-rakia-0.8.0/extensions'
/usr/bin/glib-genmarshal --header --prefix=_rakia_ext_marshal _gen/signals-marshal.list > _gen/signals-marshal.h
INFO: Reading _gen/signals-marshal.list...
make[2]: Leaving directory '/usr/src/RPM/BUILD/telepathy-rakia-0.8.0/extensions'
make[2]: Entering directory '/usr/src/RPM/BUILD/telepathy-rakia-0.8.0/extensions'
/usr/bin/glib-genmarshal --body --prefix=_rakia_ext_marshal _gen/signals-marshal.list > _gen/signals-marshal.c
INFO: Reading _gen/signals-marshal.list...
make[2]: Leaving directory '/usr/src/RPM/BUILD/telepathy-rakia-0.8.0/extensions'
make  all-am
make[3]: Entering directory '/usr/src/RPM/BUILD/telepathy-rakia-0.8.0/extensions'
/bin/sh ../libtool  --tag=CC   --mode=compile i586-alt-linux-gcc -DHAVE_CONFIG_H -I. -I..    -Wall -Wextra -Wdeclaration-after-statement -Wshadow -Wmissing-prototypes -Wnested-externs -Wpointer-arith -Wsign-compare -Wstrict-prototypes -Wformat-security -Winit-self -Wno-missing-field-initializers -Wno-unused-parameter -Wno-deprecated-declarations -I/usr/include/dbus-1.0 -I/usr/lib/dbus-1.0/include -I/usr/include/glib-2.0 -I/usr/lib/glib-2.0/include -pthread -I/usr/include/glib-2.0 -I/usr/lib/glib-2.0/include -pthread -I/usr/include/telepathy-1.0 -I/usr/include/dbus-1.0 -I/usr/lib/dbus-1.0/include -I/usr/include/glib-2.0 -I/usr/lib/glib-2.0/include -pipe -frecord-gcc-switches -Wall -g -O2 -march=i586 -mtune=generic -c -o signals-marshal.lo `test -f '_gen/signals-marshal.c' || echo './'`_gen/signals-marshal.c
libtool: compile:  i586-alt-linux-gcc -DHAVE_CONFIG_H -I. -I.. -Wall -Wextra -Wdeclaration-after-statement -Wshadow -Wmissing-prototypes -Wnested-externs -Wpointer-arith -Wsign-compare -Wstrict-prototypes -Wformat-security -Winit-self -Wno-missing-field-initializers -Wno-unused-parameter -Wno-deprecated-declarations -I/usr/include/dbus-1.0 -I/usr/lib/dbus-1.0/include -I/usr/include/glib-2.0 -I/usr/lib/glib-2.0/include -pthread -I/usr/include/glib-2.0 -I/usr/lib/glib-2.0/include -pthread -I/usr/include/telepathy-1.0 -I/usr/include/dbus-1.0 -I/usr/lib/dbus-1.0/include -I/usr/include/glib-2.0 -I/usr/lib/glib-2.0/include -pipe -frecord-gcc-switches -Wall -g -O2 -march=i586 -mtune=generic -c _gen/signals-marshal.c -o signals-marshal.o
make[3]: Leaving directory '/usr/src/RPM/BUILD/telepathy-rakia-0.8.0/extensions'
make[3]: Entering directory '/usr/src/RPM/BUILD/telepathy-rakia-0.8.0/extensions'
/bin/sh ../libtool  --tag=CC   --mode=compile i586-alt-linux-gcc -DHAVE_CONFIG_H -I. -I..    -Wall -Wextra -Wdeclaration-after-statement -Wshadow -Wmissing-prototypes -Wnested-externs -Wpointer-arith -Wsign-compare -Wstrict-prototypes -Wformat-security -Winit-self -Wno-missing-field-initializers -Wno-unused-parameter -Wno-deprecated-declarations -I/usr/include/dbus-1.0 -I/usr/lib/dbus-1.0/include -I/usr/include/glib-2.0 -I/usr/lib/glib-2.0/include -pthread -I/usr/include/glib-2.0 -I/usr/lib/glib-2.0/include -pthread -I/usr/include/telepathy-1.0 -I/usr/include/dbus-1.0 -I/usr/lib/dbus-1.0/include -I/usr/include/glib-2.0 -I/usr/lib/glib-2.0/include -pipe -frecord-gcc-switches -Wall -g -O2 -march=i586 -mtune=generic -c -o svc-channel.lo `test -f '_gen/svc-channel.c' || echo './'`_gen/svc-channel.c
libtool: compile:  i586-alt-linux-gcc -DHAVE_CONFIG_H -I. -I.. -Wall -Wextra -Wdeclaration-after-statement -Wshadow -Wmissing-prototypes -Wnested-externs -Wpointer-arith -Wsign-compare -Wstrict-prototypes -Wformat-security -Winit-self -Wno-missing-field-initializers -Wno-unused-parameter -Wno-deprecated-declarations -I/usr/include/dbus-1.0 -I/usr/lib/dbus-1.0/include -I/usr/include/glib-2.0 -I/usr/lib/glib-2.0/include -pthread -I/usr/include/glib-2.0 -I/usr/lib/glib-2.0/include -pthread -I/usr/include/telepathy-1.0 -I/usr/include/dbus-1.0 -I/usr/lib/dbus-1.0/include -I/usr/include/glib-2.0 -I/usr/lib/glib-2.0/include -pipe -frecord-gcc-switches -Wall -g -O2 -march=i586 -mtune=generic -c _gen/svc-channel.c -o svc-channel.o
make[3]: Leaving directory '/usr/src/RPM/BUILD/telepathy-rakia-0.8.0/extensions'
make[3]: Entering directory '/usr/src/RPM/BUILD/telepathy-rakia-0.8.0/extensions'
/bin/sh ../libtool  --tag=CC   --mode=compile i586-alt-linux-gcc -DHAVE_CONFIG_H -I. -I..    -Wall -Wextra -Wdeclaration-after-statement -Wshadow -Wmissing-prototypes -Wnested-externs -Wpointer-arith -Wsign-compare -Wstrict-prototypes -Wformat-security -Winit-self -Wno-missing-field-initializers -Wno-unused-parameter -Wno-deprecated-declarations -I/usr/include/dbus-1.0 -I/usr/lib/dbus-1.0/include -I/usr/include/glib-2.0 -I/usr/lib/glib-2.0/include -pthread -I/usr/include/glib-2.0 -I/usr/lib/glib-2.0/include -pthread -I/usr/include/telepathy-1.0 -I/usr/include/dbus-1.0 -I/usr/lib/dbus-1.0/include -I/usr/include/glib-2.0 -I/usr/lib/glib-2.0/include -pipe -frecord-gcc-switches -Wall -g -O2 -march=i586 -mtune=generic -c -o extensions.lo extensions.c
libtool: compile:  i586-alt-linux-gcc -DHAVE_CONFIG_H -I. -I.. -Wall -Wextra -Wdeclaration-after-statement -Wshadow -Wmissing-prototypes -Wnested-externs -Wpointer-arith -Wsign-compare -Wstrict-prototypes -Wformat-security -Winit-self -Wno-missing-field-initializers -Wno-unused-parameter -Wno-deprecated-declarations -I/usr/include/dbus-1.0 -I/usr/lib/dbus-1.0/include -I/usr/include/glib-2.0 -I/usr/lib/glib-2.0/include -pthread -I/usr/include/glib-2.0 -I/usr/lib/glib-2.0/include -pthread -I/usr/include/telepathy-1.0 -I/usr/include/dbus-1.0 -I/usr/lib/dbus-1.0/include -I/usr/include/glib-2.0 -I/usr/lib/glib-2.0/include -pipe -frecord-gcc-switches -Wall -g -O2 -march=i586 -mtune=generic -c extensions.c -o extensions.o
make[3]: Leaving directory '/usr/src/RPM/BUILD/telepathy-rakia-0.8.0/extensions'
make[3]: Entering directory '/usr/src/RPM/BUILD/telepathy-rakia-0.8.0/extensions'
/bin/sh ../libtool  --tag=CC   --mode=link i586-alt-linux-gcc -Wall -Wextra -Wdeclaration-after-statement -Wshadow -Wmissing-prototypes -Wnested-externs -Wpointer-arith -Wsign-compare -Wstrict-prototypes -Wformat-security -Winit-self -Wno-missing-field-initializers -Wno-unused-parameter -Wno-deprecated-declarations -I/usr/include/dbus-1.0 -I/usr/lib/dbus-1.0/include -I/usr/include/glib-2.0 -I/usr/lib/glib-2.0/include -pthread -I/usr/include/glib-2.0 -I/usr/lib/glib-2.0/include -pthread -I/usr/include/telepathy-1.0 -I/usr/include/dbus-1.0 -I/usr/lib/dbus-1.0/include -I/usr/include/glib-2.0 -I/usr/lib/glib-2.0/include -pipe -frecord-gcc-switches -Wall -g -O2 -march=i586 -mtune=generic   -o librakia-extensions.la  extensions.lo signals-marshal.lo svc-channel.lo -ltelepathy-glib 
libtool: link: ar cr .libs/librakia-extensions.a  extensions.o signals-marshal.o svc-channel.o
libtool: link: ranlib .libs/librakia-extensions.a
libtool: link: ( cd ".libs" && rm -f "librakia-extensions.la" && ln -s "../librakia-extensions.la" "librakia-extensions.la" )
make[3]: Leaving directory '/usr/src/RPM/BUILD/telepathy-rakia-0.8.0/extensions'
Making all in data
Making all in docs
make[2]: Entering directory '/usr/src/RPM/BUILD/telepathy-rakia-0.8.0/docs'
sed -e 's,[@]libexecdir[@],/usr/lib,' < telepathy-rakia.8.in > telepathy-rakia.8
make[2]: Leaving directory '/usr/src/RPM/BUILD/telepathy-rakia-0.8.0/docs'
Making all in m4
make[2]: Nothing to be done for 'all'.
Making all in src
make[2]: Entering directory '/usr/src/RPM/BUILD/telepathy-rakia-0.8.0/src'
glib-mkenums \
--fhead "#ifndef __SIP_CONNECTION_ENUM_TYPES_H__\n#define __SIP_CONNECTION_ENUM_TYPES_H__\n\n#include <glib-object.h>\n\nG_BEGIN_DECLS\n" \
--fprod "/* enumerations from \"@filename@\" */\n" \
--vhead "GType @enum_name@_get_type (void);\n#define RAKIA_TYPE_@ENUMSHORT@ (@enum_name@_get_type())\n"         \
--ftail "G_END_DECLS\n\n#endif /* __SIP_CONNECTION_ENUM_TYPES_H__ */" \
sip-connection.h > sip-connection-enumtypes.h || rm -f sip-connection-enumtypes.h
make[2]: Leaving directory '/usr/src/RPM/BUILD/telepathy-rakia-0.8.0/src'
make[2]: Entering directory '/usr/src/RPM/BUILD/telepathy-rakia-0.8.0/src'
glib-mkenums \
--fhead "#include <sip-connection-enumtypes.h>\n#include <sip-connection.h>" \
--fprod "\n/* enumerations from \"@filename@\" */" \
--vhead "GType\n@enum_name@_get_type (void)\n{\n  static GType etype = 0;\n  if (etype == 0) {\n    static const G@Type@Value values[] = {"     \
--vprod "      { @VALUENAME@, \"@VALUENAME@\", \"@valuenick@\" }," \
--vtail "      { 0, NULL, NULL }\n    };\n    etype = g_@type@_register_static (\"@EnumName@\", values);\n  }\n  return etype;\n}\n" \
sip-connection.h > sip-connection-enumtypes.c || rm -f sip-connection-enumtypes.c
make[2]: Leaving directory '/usr/src/RPM/BUILD/telepathy-rakia-0.8.0/src'
make  all-am
make[3]: Entering directory '/usr/src/RPM/BUILD/telepathy-rakia-0.8.0/src'
i586-alt-linux-gcc -DHAVE_CONFIG_H -I. -I..  -I/usr/include/dbus-1.0 -I/usr/lib/dbus-1.0/include -I/usr/include/glib-2.0 -I/usr/lib/glib-2.0/include -pthread -I/usr/include/glib-2.0 -I/usr/lib/glib-2.0/include -I/usr/include/sofia-sip-1.13 -I/usr/include/glib-2.0 -I/usr/lib/glib-2.0/include -pthread -I/usr/include/telepathy-1.0 -I/usr/include/dbus-1.0 -I/usr/lib/dbus-1.0/include -I/usr/include/glib-2.0 -I/usr/lib/glib-2.0/include  -I.. -I.. -DG_LOG_DOMAIN=\"rakia\"  -Wall -Wextra -Wdeclaration-after-statement -Wshadow -Wmissing-prototypes -Wnested-externs -Wpointer-arith -Wsign-compare -Wstrict-prototypes -Wformat-security -Winit-self -Wno-missing-field-initializers -Wno-unused-parameter -Wno-deprecated-declarations  -pipe -frecord-gcc-switches -Wall -g -O2 -march=i586 -mtune=generic -c -o telepathy-rakia.o telepathy-rakia.c
make[3]: Leaving directory '/usr/src/RPM/BUILD/telepathy-rakia-0.8.0/src'
make[3]: Entering directory '/usr/src/RPM/BUILD/telepathy-rakia-0.8.0/src'
/bin/sh ../libtool  --tag=CC   --mode=compile i586-alt-linux-gcc -DHAVE_CONFIG_H -I. -I..  -I/usr/include/dbus-1.0 -I/usr/lib/dbus-1.0/include -I/usr/include/glib-2.0 -I/usr/lib/glib-2.0/include -pthread -I/usr/include/glib-2.0 -I/usr/lib/glib-2.0/include -I/usr/include/sofia-sip-1.13 -I/usr/include/glib-2.0 -I/usr/lib/glib-2.0/include -pthread -I/usr/include/telepathy-1.0 -I/usr/include/dbus-1.0 -I/usr/lib/dbus-1.0/include -I/usr/include/glib-2.0 -I/usr/lib/glib-2.0/include  -I.. -I.. -DG_LOG_DOMAIN=\"rakia\"  -Wall -Wextra -Wdeclaration-after-statement -Wshadow -Wmissing-prototypes -Wnested-externs -Wpointer-arith -Wsign-compare -Wstrict-prototypes -Wformat-security -Winit-self -Wno-missing-field-initializers -Wno-unused-parameter -Wno-deprecated-declarations  -pipe -frecord-gcc-switches -Wall -g -O2 -march=i586 -mtune=generic -c -o sip-connection-manager.lo sip-connection-manager.c
libtool: compile:  i586-alt-linux-gcc -DHAVE_CONFIG_H -I. -I.. -I/usr/include/dbus-1.0 -I/usr/lib/dbus-1.0/include -I/usr/include/glib-2.0 -I/usr/lib/glib-2.0/include -pthread -I/usr/include/glib-2.0 -I/usr/lib/glib-2.0/include -I/usr/include/sofia-sip-1.13 -I/usr/include/glib-2.0 -I/usr/lib/glib-2.0/include -pthread -I/usr/include/telepathy-1.0 -I/usr/include/dbus-1.0 -I/usr/lib/dbus-1.0/include -I/usr/include/glib-2.0 -I/usr/lib/glib-2.0/include -I.. -I.. -DG_LOG_DOMAIN=\"rakia\" -Wall -Wextra -Wdeclaration-after-statement -Wshadow -Wmissing-prototypes -Wnested-externs -Wpointer-arith -Wsign-compare -Wstrict-prototypes -Wformat-security -Winit-self -Wno-missing-field-initializers -Wno-unused-parameter -Wno-deprecated-declarations -pipe -frecord-gcc-switches -Wall -g -O2 -march=i586 -mtune=generic -c sip-connection-manager.c -o sip-connection-manager.o
make[3]: Leaving directory '/usr/src/RPM/BUILD/telepathy-rakia-0.8.0/src'
make[3]: Entering directory '/usr/src/RPM/BUILD/telepathy-rakia-0.8.0/src'
i586-alt-linux-gcc -DHAVE_CONFIG_H -I. -I..  -I/usr/include/dbus-1.0 -I/usr/lib/dbus-1.0/include -I/usr/include/glib-2.0 -I/usr/lib/glib-2.0/include -pthread -I/usr/include/glib-2.0 -I/usr/lib/glib-2.0/include -I/usr/include/sofia-sip-1.13 -I/usr/include/glib-2.0 -I/usr/lib/glib-2.0/include -pthread -I/usr/include/telepathy-1.0 -I/usr/include/dbus-1.0 -I/usr/lib/dbus-1.0/include -I/usr/include/glib-2.0 -I/usr/lib/glib-2.0/include  -I.. -I.. -DG_LOG_DOMAIN=\"rakia\"  -Wall -Wextra -Wdeclaration-after-statement -Wshadow -Wmissing-prototypes -Wnested-externs -Wpointer-arith -Wsign-compare -Wstrict-prototypes -Wformat-security -Winit-self -Wno-missing-field-initializers -Wno-unused-parameter -Wno-deprecated-declarations  -pipe -frecord-gcc-switches -Wall -g -O2 -march=i586 -mtune=generic -c -o write-mgr-file.o write-mgr-file.c
make[3]: Leaving directory '/usr/src/RPM/BUILD/telepathy-rakia-0.8.0/src'
make[3]: Entering directory '/usr/src/RPM/BUILD/telepathy-rakia-0.8.0/src'
/bin/sh ../libtool  --tag=CC   --mode=compile i586-alt-linux-gcc -DHAVE_CONFIG_H -I. -I..  -I/usr/include/dbus-1.0 -I/usr/lib/dbus-1.0/include -I/usr/include/glib-2.0 -I/usr/lib/glib-2.0/include -pthread -I/usr/include/glib-2.0 -I/usr/lib/glib-2.0/include -I/usr/include/sofia-sip-1.13 -I/usr/include/glib-2.0 -I/usr/lib/glib-2.0/include -pthread -I/usr/include/telepathy-1.0 -I/usr/include/dbus-1.0 -I/usr/lib/dbus-1.0/include -I/usr/include/glib-2.0 -I/usr/lib/glib-2.0/include  -I.. -I.. -DG_LOG_DOMAIN=\"rakia\"  -Wall -Wextra -Wdeclaration-after-statement -Wshadow -Wmissing-prototypes -Wnested-externs -Wpointer-arith -Wsign-compare -Wstrict-prototypes -Wformat-security -Winit-self -Wno-missing-field-initializers -Wno-unused-parameter -Wno-deprecated-declarations  -pipe -frecord-gcc-switches -Wall -g -O2 -march=i586 -mtune=generic -c -o sip-connection-enumtypes.lo sip-connection-enumtypes.c
libtool: compile:  i586-alt-linux-gcc -DHAVE_CONFIG_H -I. -I.. -I/usr/include/dbus-1.0 -I/usr/lib/dbus-1.0/include -I/usr/include/glib-2.0 -I/usr/lib/glib-2.0/include -pthread -I/usr/include/glib-2.0 -I/usr/lib/glib-2.0/include -I/usr/include/sofia-sip-1.13 -I/usr/include/glib-2.0 -I/usr/lib/glib-2.0/include -pthread -I/usr/include/telepathy-1.0 -I/usr/include/dbus-1.0 -I/usr/lib/dbus-1.0/include -I/usr/include/glib-2.0 -I/usr/lib/glib-2.0/include -I.. -I.. -DG_LOG_DOMAIN=\"rakia\" -Wall -Wextra -Wdeclaration-after-statement -Wshadow -Wmissing-prototypes -Wnested-externs -Wpointer-arith -Wsign-compare -Wstrict-prototypes -Wformat-security -Winit-self -Wno-missing-field-initializers -Wno-unused-parameter -Wno-deprecated-declarations -pipe -frecord-gcc-switches -Wall -g -O2 -march=i586 -mtune=generic -c sip-connection-enumtypes.c -o sip-connection-enumtypes.o
make[3]: Leaving directory '/usr/src/RPM/BUILD/telepathy-rakia-0.8.0/src'
make[3]: Entering directory '/usr/src/RPM/BUILD/telepathy-rakia-0.8.0/src'
/bin/sh ../libtool  --tag=CC   --mode=compile i586-alt-linux-gcc -DHAVE_CONFIG_H -I. -I..  -I/usr/include/dbus-1.0 -I/usr/lib/dbus-1.0/include -I/usr/include/glib-2.0 -I/usr/lib/glib-2.0/include -pthread -I/usr/include/glib-2.0 -I/usr/lib/glib-2.0/include -I/usr/include/sofia-sip-1.13 -I/usr/include/glib-2.0 -I/usr/lib/glib-2.0/include -pthread -I/usr/include/telepathy-1.0 -I/usr/include/dbus-1.0 -I/usr/lib/dbus-1.0/include -I/usr/include/glib-2.0 -I/usr/lib/glib-2.0/include  -I.. -I.. -DG_LOG_DOMAIN=\"rakia\"  -Wall -Wextra -Wdeclaration-after-statement -Wshadow -Wmissing-prototypes -Wnested-externs -Wpointer-arith -Wsign-compare -Wstrict-prototypes -Wformat-security -Winit-self -Wno-missing-field-initializers -Wno-unused-parameter -Wno-deprecated-declarations  -pipe -frecord-gcc-switches -Wall -g -O2 -march=i586 -mtune=generic -c -o protocol.lo protocol.c
libtool: compile:  i586-alt-linux-gcc -DHAVE_CONFIG_H -I. -I.. -I/usr/include/dbus-1.0 -I/usr/lib/dbus-1.0/include -I/usr/include/glib-2.0 -I/usr/lib/glib-2.0/include -pthread -I/usr/include/glib-2.0 -I/usr/lib/glib-2.0/include -I/usr/include/sofia-sip-1.13 -I/usr/include/glib-2.0 -I/usr/lib/glib-2.0/include -pthread -I/usr/include/telepathy-1.0 -I/usr/include/dbus-1.0 -I/usr/lib/dbus-1.0/include -I/usr/include/glib-2.0 -I/usr/lib/glib-2.0/include -I.. -I.. -DG_LOG_DOMAIN=\"rakia\" -Wall -Wextra -Wdeclaration-after-statement -Wshadow -Wmissing-prototypes -Wnested-externs -Wpointer-arith -Wsign-compare -Wstrict-prototypes -Wformat-security -Winit-self -Wno-missing-field-initializers -Wno-unused-parameter -Wno-deprecated-declarations -pipe -frecord-gcc-switches -Wall -g -O2 -march=i586 -mtune=generic -c protocol.c -o protocol.o
make[3]: Leaving directory '/usr/src/RPM/BUILD/telepathy-rakia-0.8.0/src'
make[3]: Entering directory '/usr/src/RPM/BUILD/telepathy-rakia-0.8.0/src'
/bin/sh ../libtool  --tag=CC   --mode=compile i586-alt-linux-gcc -DHAVE_CONFIG_H -I. -I..  -I/usr/include/dbus-1.0 -I/usr/lib/dbus-1.0/include -I/usr/include/glib-2.0 -I/usr/lib/glib-2.0/include -pthread -I/usr/include/glib-2.0 -I/usr/lib/glib-2.0/include -I/usr/include/sofia-sip-1.13 -I/usr/include/glib-2.0 -I/usr/lib/glib-2.0/include -pthread -I/usr/include/telepathy-1.0 -I/usr/include/dbus-1.0 -I/usr/lib/dbus-1.0/include -I/usr/include/glib-2.0 -I/usr/lib/glib-2.0/include  -I.. -I.. -DG_LOG_DOMAIN=\"rakia\"  -Wall -Wextra -Wdeclaration-after-statement -Wshadow -Wmissing-prototypes -Wnested-externs -Wpointer-arith -Wsign-compare -Wstrict-prototypes -Wformat-security -Winit-self -Wno-missing-field-initializers -Wno-unused-parameter -Wno-deprecated-declarations  -pipe -frecord-gcc-switches -Wall -g -O2 -march=i586 -mtune=generic -c -o sip-connection.lo sip-connection.c
libtool: compile:  i586-alt-linux-gcc -DHAVE_CONFIG_H -I. -I.. -I/usr/include/dbus-1.0 -I/usr/lib/dbus-1.0/include -I/usr/include/glib-2.0 -I/usr/lib/glib-2.0/include -pthread -I/usr/include/glib-2.0 -I/usr/lib/glib-2.0/include -I/usr/include/sofia-sip-1.13 -I/usr/include/glib-2.0 -I/usr/lib/glib-2.0/include -pthread -I/usr/include/telepathy-1.0 -I/usr/include/dbus-1.0 -I/usr/lib/dbus-1.0/include -I/usr/include/glib-2.0 -I/usr/lib/glib-2.0/include -I.. -I.. -DG_LOG_DOMAIN=\"rakia\" -Wall -Wextra -Wdeclaration-after-statement -Wshadow -Wmissing-prototypes -Wnested-externs -Wpointer-arith -Wsign-compare -Wstrict-prototypes -Wformat-security -Winit-self -Wno-missing-field-initializers -Wno-unused-parameter -Wno-deprecated-declarations -pipe -frecord-gcc-switches -Wall -g -O2 -march=i586 -mtune=generic -c sip-connection.c -o sip-connection.o
make[3]: Leaving directory '/usr/src/RPM/BUILD/telepathy-rakia-0.8.0/src'
make[3]: Entering directory '/usr/src/RPM/BUILD/telepathy-rakia-0.8.0/src'
/bin/sh ../libtool  --tag=CC   --mode=compile i586-alt-linux-gcc -DHAVE_CONFIG_H -I. -I..  -I/usr/include/dbus-1.0 -I/usr/lib/dbus-1.0/include -I/usr/include/glib-2.0 -I/usr/lib/glib-2.0/include -pthread -I/usr/include/glib-2.0 -I/usr/lib/glib-2.0/include -I/usr/include/sofia-sip-1.13 -I/usr/include/glib-2.0 -I/usr/lib/glib-2.0/include -pthread -I/usr/include/telepathy-1.0 -I/usr/include/dbus-1.0 -I/usr/lib/dbus-1.0/include -I/usr/include/glib-2.0 -I/usr/lib/glib-2.0/include  -I.. -I.. -DG_LOG_DOMAIN=\"rakia\"  -Wall -Wextra -Wdeclaration-after-statement -Wshadow -Wmissing-prototypes -Wnested-externs -Wpointer-arith -Wsign-compare -Wstrict-prototypes -Wformat-security -Winit-self -Wno-missing-field-initializers -Wno-unused-parameter -Wno-deprecated-declarations  -pipe -frecord-gcc-switches -Wall -g -O2 -march=i586 -mtune=generic -c -o sip-connection-helpers.lo sip-connection-helpers.c
libtool: compile:  i586-alt-linux-gcc -DHAVE_CONFIG_H -I. -I.. -I/usr/include/dbus-1.0 -I/usr/lib/dbus-1.0/include -I/usr/include/glib-2.0 -I/usr/lib/glib-2.0/include -pthread -I/usr/include/glib-2.0 -I/usr/lib/glib-2.0/include -I/usr/include/sofia-sip-1.13 -I/usr/include/glib-2.0 -I/usr/lib/glib-2.0/include -pthread -I/usr/include/telepathy-1.0 -I/usr/include/dbus-1.0 -I/usr/lib/dbus-1.0/include -I/usr/include/glib-2.0 -I/usr/lib/glib-2.0/include -I.. -I.. -DG_LOG_DOMAIN=\"rakia\" -Wall -Wextra -Wdeclaration-after-statement -Wshadow -Wmissing-prototypes -Wnested-externs -Wpointer-arith -Wsign-compare -Wstrict-prototypes -Wformat-security -Winit-self -Wno-missing-field-initializers -Wno-unused-parameter -Wno-deprecated-declarations -pipe -frecord-gcc-switches -Wall -g -O2 -march=i586 -mtune=generic -c sip-connection-helpers.c -o sip-connection-helpers.o
make[3]: Leaving directory '/usr/src/RPM/BUILD/telepathy-rakia-0.8.0/src'
make[3]: Entering directory '/usr/src/RPM/BUILD/telepathy-rakia-0.8.0/src'
/bin/sh ../libtool  --tag=CC   --mode=link i586-alt-linux-gcc -Wall -Wextra -Wdeclaration-after-statement -Wshadow -Wmissing-prototypes -Wnested-externs -Wpointer-arith -Wsign-compare -Wstrict-prototypes -Wformat-security -Winit-self -Wno-missing-field-initializers -Wno-unused-parameter -Wno-deprecated-declarations  -pipe -frecord-gcc-switches -Wall -g -O2 -march=i586 -mtune=generic   -o librakia-convenience.la  sip-connection.lo sip-connection-manager.lo protocol.lo sip-connection-helpers.lo sip-connection-enumtypes.lo ../rakia/librakia.la ../extensions/librakia-extensions.la 
libtool: link: (cd .libs/librakia-convenience.lax/librakia.a && ar x "/usr/src/RPM/BUILD/telepathy-rakia-0.8.0/src/../rakia/.libs/librakia.a")
libtool: link: (cd .libs/librakia-convenience.lax/librakia-extensions.a && ar x "/usr/src/RPM/BUILD/telepathy-rakia-0.8.0/src/../extensions/.libs/librakia-extensions.a")
copying selected object files to avoid basename conflicts...
libtool: link: ln .libs/librakia-convenience.lax/librakia-extensions.a/signals-marshal.o .libs/librakia-convenience.lax/lt1-signals-marshal.o || cp .libs/librakia-convenience.lax/librakia-extensions.a/signals-marshal.o .libs/librakia-convenience.lax/lt1-signals-marshal.o
libtool: link: ar cr .libs/librakia-convenience.a sip-connection.o sip-connection-manager.o protocol.o sip-connection-helpers.o sip-connection-enumtypes.o .libs/librakia-convenience.lax/librakia.a/base-connection-sofia.o .libs/librakia-convenience.lax/librakia.a/base-connection.o .libs/librakia-convenience.lax/librakia.a/call-channel.o .libs/librakia-convenience.lax/librakia.a/call-content.o .libs/librakia-convenience.lax/librakia.a/call-stream.o .libs/librakia-convenience.lax/librakia.a/codec-param-formats.o .libs/librakia-convenience.lax/librakia.a/connection-aliasing.o .libs/librakia-convenience.lax/librakia.a/debug.o .libs/librakia-convenience.lax/librakia.a/event-target.o .libs/librakia-convenience.lax/librakia.a/handles.o .libs/librakia-convenience.lax/librakia.a/media-manager.o .libs/librakia-convenience.lax/librakia.a/signals-marshal.o .libs/librakia-convenience.lax/librakia.a/sip-media.o .libs/librakia-convenience.lax/librakia.a/sip-session.o .libs/librakia-convenience.lax/librakia.a/text-channel.o .libs/librakia-convenience.lax/librakia.a/text-manager.o .libs/librakia-convenience.lax/librakia.a/util.o .libs/librakia-convenience.lax/librakia-extensions.a/extensions.o .libs/librakia-convenience.lax/lt1-signals-marshal.o .libs/librakia-convenience.lax/librakia-extensions.a/svc-channel.o
libtool: link: ranlib .libs/librakia-convenience.a
libtool: link: rm -fr .libs/librakia-convenience.lax .libs/librakia-convenience.lax
libtool: link: ( cd ".libs" && rm -f "librakia-convenience.la" && ln -s "../librakia-convenience.la" "librakia-convenience.la" )
make[3]: Leaving directory '/usr/src/RPM/BUILD/telepathy-rakia-0.8.0/src'
make[3]: Entering directory '/usr/src/RPM/BUILD/telepathy-rakia-0.8.0/src'
/bin/sh ../libtool  --tag=CC   --mode=link i586-alt-linux-gcc -Wall -Wextra -Wdeclaration-after-statement -Wshadow -Wmissing-prototypes -Wnested-externs -Wpointer-arith -Wsign-compare -Wstrict-prototypes -Wformat-security -Winit-self -Wno-missing-field-initializers -Wno-unused-parameter -Wno-deprecated-declarations  -pipe -frecord-gcc-switches -Wall -g -O2 -march=i586 -mtune=generic   -o telepathy-rakia telepathy-rakia.o librakia-convenience.la -ldbus-glib-1 -ldbus-1 -lgobject-2.0 -lglib-2.0 -lgio-2.0 -lgobject-2.0 -lglib-2.0 -lsofia-sip-ua-glib -lsofia-sip-ua -lglib-2.0 -ltelepathy-glib  
libtool: link: i586-alt-linux-gcc -Wall -Wextra -Wdeclaration-after-statement -Wshadow -Wmissing-prototypes -Wnested-externs -Wpointer-arith -Wsign-compare -Wstrict-prototypes -Wformat-security -Winit-self -Wno-missing-field-initializers -Wno-unused-parameter -Wno-deprecated-declarations -pipe -frecord-gcc-switches -Wall -g -O2 -march=i586 -mtune=generic -o telepathy-rakia telepathy-rakia.o  ./.libs/librakia-convenience.a -ldbus-glib-1 -ldbus-1 -lgio-2.0 -lgobject-2.0 -lsofia-sip-ua-glib -lsofia-sip-ua -lglib-2.0 -ltelepathy-glib -pthread
make[3]: Leaving directory '/usr/src/RPM/BUILD/telepathy-rakia-0.8.0/src'
make[3]: Entering directory '/usr/src/RPM/BUILD/telepathy-rakia-0.8.0/src'
/bin/sh ../libtool  --tag=CC   --mode=link i586-alt-linux-gcc -Wall -Wextra -Wdeclaration-after-statement -Wshadow -Wmissing-prototypes -Wnested-externs -Wpointer-arith -Wsign-compare -Wstrict-prototypes -Wformat-security -Winit-self -Wno-missing-field-initializers -Wno-unused-parameter -Wno-deprecated-declarations  -pipe -frecord-gcc-switches -Wall -g -O2 -march=i586 -mtune=generic   -o write-mgr-file write-mgr-file.o librakia-convenience.la -ldbus-glib-1 -ldbus-1 -lgobject-2.0 -lglib-2.0 -lgio-2.0 -lgobject-2.0 -lglib-2.0 -lsofia-sip-ua-glib -lsofia-sip-ua -lglib-2.0 -ltelepathy-glib  
libtool: link: i586-alt-linux-gcc -Wall -Wextra -Wdeclaration-after-statement -Wshadow -Wmissing-prototypes -Wnested-externs -Wpointer-arith -Wsign-compare -Wstrict-prototypes -Wformat-security -Winit-self -Wno-missing-field-initializers -Wno-unused-parameter -Wno-deprecated-declarations -pipe -frecord-gcc-switches -Wall -g -O2 -march=i586 -mtune=generic -o write-mgr-file write-mgr-file.o  ./.libs/librakia-convenience.a -ldbus-glib-1 -ldbus-1 -lgio-2.0 -lgobject-2.0 -lsofia-sip-ua-glib -lsofia-sip-ua -lglib-2.0 -ltelepathy-glib -pthread
make[3]: Leaving directory '/usr/src/RPM/BUILD/telepathy-rakia-0.8.0/src'
make[3]: Entering directory '/usr/src/RPM/BUILD/telepathy-rakia-0.8.0/src'
if ./write-mgr-file > rakia.manager.tmp; then \
	mv -f rakia.manager.tmp rakia.manager;\
else \
	rm -f rakia.manager.tmp; \
fi
make[3]: Leaving directory '/usr/src/RPM/BUILD/telepathy-rakia-0.8.0/src'
Making all in tests
Making all in twisted
make[3]: Entering directory '/usr/src/RPM/BUILD/telepathy-rakia-0.8.0/tests/twisted'
{ \
	echo "PACKAGE_STRING = \"telepathy-rakia 0.8.0\""; \
	echo "DEBUGGING = True"; \
} > config.py
make[3]: Leaving directory '/usr/src/RPM/BUILD/telepathy-rakia-0.8.0/tests/twisted'
make[3]: Entering directory '/usr/src/RPM/BUILD/telepathy-rakia-0.8.0/tests/twisted'
echo cm/protocol.py test-register.py test-register-fail.py test-register-sasl.py test-debug.py test-handle-normalisation.py test-message.py test-self-alias.py text/initiate-requestotron.py voip/calltest.py voip/ringing-queued.py voip/requestable-classes.py voip/direction-change.py voip/add-remove-content.py  > rakia-twisted-tests.list
make[3]: Leaving directory '/usr/src/RPM/BUILD/telepathy-rakia-0.8.0/tests/twisted'
make[3]: Entering directory '/usr/src/RPM/BUILD/telepathy-rakia-0.8.0/tests/twisted'
sed \
		-e 's![@]rakiatestsdir[@]!/usr/lib/telepathy-rakia/tests!' \
		-e 's![@]TEST_PYTHON[@]!/usr/bin/python!' \
		< run-test.sh.in > run-test.sh.tmp && \
	chmod +x run-test.sh.tmp && \
	mv run-test.sh.tmp run-test.sh
make[3]: Leaving directory '/usr/src/RPM/BUILD/telepathy-rakia-0.8.0/tests/twisted'
make  all-recursive
Making all in tools
make[5]: Entering directory '/usr/src/RPM/BUILD/telepathy-rakia-0.8.0/tests/twisted/tools'
sed -e "s|[@]abs_top_builddir[@]|/usr/src/RPM/BUILD/telepathy-rakia-0.8.0|g" sofiasip.service.in > org.freedesktop.Telepathy.ConnectionManager.sofiasip.service
make[5]: Leaving directory '/usr/src/RPM/BUILD/telepathy-rakia-0.8.0/tests/twisted/tools'
make[5]: Entering directory '/usr/src/RPM/BUILD/telepathy-rakia-0.8.0/tests/twisted/tools'
sed -e "s|[@]abs_top_builddir[@]|/usr/src/RPM/BUILD/telepathy-rakia-0.8.0|g" tmp-session-bus.conf.in > tmp-session-bus.conf
make[5]: Leaving directory '/usr/src/RPM/BUILD/telepathy-rakia-0.8.0/tests/twisted/tools'
make[5]: Entering directory '/usr/src/RPM/BUILD/telepathy-rakia-0.8.0/tests/twisted/tools'
sed -e "s|[@]abs_top_builddir[@]|/usr/src/RPM/BUILD/telepathy-rakia-0.8.0|g" \
	-e "s|[@]abs_top_srcdir[@]|/usr/src/RPM/BUILD/telepathy-rakia-0.8.0|g" exec-with-log.sh.in > exec-with-log.sh
chmod +x exec-with-log.sh
make[5]: Leaving directory '/usr/src/RPM/BUILD/telepathy-rakia-0.8.0/tests/twisted/tools'
make  all-am
make[6]: Nothing to be done for 'all-am'.
make[5]: Nothing to be done for 'all-am'.
make[3]: Nothing to be done for 'all-am'.
+ exit 0
Executing(%install): /bin/sh -e /usr/src/tmp/rpm-tmp.75995
+ umask 022
+ /bin/mkdir -p /usr/src/RPM/BUILD
+ cd /usr/src/RPM/BUILD
+ /bin/chmod -Rf u+rwX -- /usr/src/tmp/telepathy-rakia-buildroot
+ :
+ /bin/rm -rf -- /usr/src/tmp/telepathy-rakia-buildroot
+ PATH=/usr/libexec/rpm-build:/usr/src/bin:/bin:/usr/bin:/usr/X11R6/bin:/usr/games
+ cd telepathy-rakia-0.8.0
+ make 'INSTALL=/usr/libexec/rpm-build/install -p' install DESTDIR=/usr/src/tmp/telepathy-rakia-buildroot
make: Entering directory '/usr/src/RPM/BUILD/telepathy-rakia-0.8.0'
Making install in tools
make[1]: Entering directory '/usr/src/RPM/BUILD/telepathy-rakia-0.8.0/tools'
make[2]: Entering directory '/usr/src/RPM/BUILD/telepathy-rakia-0.8.0/tools'
make[2]: Nothing to be done for 'install-exec-am'.
make[2]: Nothing to be done for 'install-data-am'.
make[2]: Leaving directory '/usr/src/RPM/BUILD/telepathy-rakia-0.8.0/tools'
make[1]: Leaving directory '/usr/src/RPM/BUILD/telepathy-rakia-0.8.0/tools'
Making install in rakia
make[1]: Entering directory '/usr/src/RPM/BUILD/telepathy-rakia-0.8.0/rakia'
make  install-am
make[2]: Entering directory '/usr/src/RPM/BUILD/telepathy-rakia-0.8.0/rakia'
make[3]: Entering directory '/usr/src/RPM/BUILD/telepathy-rakia-0.8.0/rakia'
make[3]: Nothing to be done for 'install-exec-am'.
 /bin/mkdir -p '/usr/src/tmp/telepathy-rakia-buildroot/usr/include/telepathy-rakia-0.7/rakia'
 /usr/libexec/rpm-build/install -p -m 644 base-connection.h connection-aliasing.h sofia-decls.h codec-param-formats.h event-target.h handles.h debug.h media-manager.h text-manager.h util.h '/usr/src/tmp/telepathy-rakia-buildroot/usr/include/telepathy-rakia-0.7/rakia'
make[3]: Leaving directory '/usr/src/RPM/BUILD/telepathy-rakia-0.8.0/rakia'
make[2]: Leaving directory '/usr/src/RPM/BUILD/telepathy-rakia-0.8.0/rakia'
make[1]: Leaving directory '/usr/src/RPM/BUILD/telepathy-rakia-0.8.0/rakia'
Making install in extensions
make[1]: Entering directory '/usr/src/RPM/BUILD/telepathy-rakia-0.8.0/extensions'
make  install-am
make[2]: Entering directory '/usr/src/RPM/BUILD/telepathy-rakia-0.8.0/extensions'
make[3]: Entering directory '/usr/src/RPM/BUILD/telepathy-rakia-0.8.0/extensions'
make[3]: Nothing to be done for 'install-exec-am'.
make[3]: Nothing to be done for 'install-data-am'.
make[3]: Leaving directory '/usr/src/RPM/BUILD/telepathy-rakia-0.8.0/extensions'
make[2]: Leaving directory '/usr/src/RPM/BUILD/telepathy-rakia-0.8.0/extensions'
make[1]: Leaving directory '/usr/src/RPM/BUILD/telepathy-rakia-0.8.0/extensions'
Making install in data
make[1]: Entering directory '/usr/src/RPM/BUILD/telepathy-rakia-0.8.0/data'
make[2]: Entering directory '/usr/src/RPM/BUILD/telepathy-rakia-0.8.0/data'
make[2]: Nothing to be done for 'install-exec-am'.
 /bin/mkdir -p '/usr/src/tmp/telepathy-rakia-buildroot/usr/share/dbus-1/services'
 /usr/libexec/rpm-build/install -p -m 644 org.freedesktop.Telepathy.ConnectionManager.sofiasip.service '/usr/src/tmp/telepathy-rakia-buildroot/usr/share/dbus-1/services'
make[2]: Leaving directory '/usr/src/RPM/BUILD/telepathy-rakia-0.8.0/data'
make[1]: Leaving directory '/usr/src/RPM/BUILD/telepathy-rakia-0.8.0/data'
Making install in docs
make[1]: Entering directory '/usr/src/RPM/BUILD/telepathy-rakia-0.8.0/docs'
make[2]: Entering directory '/usr/src/RPM/BUILD/telepathy-rakia-0.8.0/docs'
make[2]: Nothing to be done for 'install-exec-am'.
 /bin/mkdir -p '/usr/src/tmp/telepathy-rakia-buildroot/usr/share/man/man8'
 /usr/libexec/rpm-build/install -p -m 644 telepathy-rakia.8 '/usr/src/tmp/telepathy-rakia-buildroot/usr/share/man/man8'
make[2]: Leaving directory '/usr/src/RPM/BUILD/telepathy-rakia-0.8.0/docs'
make[1]: Leaving directory '/usr/src/RPM/BUILD/telepathy-rakia-0.8.0/docs'
Making install in m4
make[1]: Entering directory '/usr/src/RPM/BUILD/telepathy-rakia-0.8.0/m4'
make[2]: Entering directory '/usr/src/RPM/BUILD/telepathy-rakia-0.8.0/m4'
make[2]: Nothing to be done for 'install-exec-am'.
make[2]: Nothing to be done for 'install-data-am'.
make[2]: Leaving directory '/usr/src/RPM/BUILD/telepathy-rakia-0.8.0/m4'
make[1]: Leaving directory '/usr/src/RPM/BUILD/telepathy-rakia-0.8.0/m4'
Making install in src
make[1]: Entering directory '/usr/src/RPM/BUILD/telepathy-rakia-0.8.0/src'
make  install-am
make[2]: Entering directory '/usr/src/RPM/BUILD/telepathy-rakia-0.8.0/src'
make[3]: Entering directory '/usr/src/RPM/BUILD/telepathy-rakia-0.8.0/src'
 /bin/mkdir -p '/usr/src/tmp/telepathy-rakia-buildroot/usr/lib'
  /bin/sh ../libtool   --mode=install /usr/libexec/rpm-build/install -p telepathy-rakia '/usr/src/tmp/telepathy-rakia-buildroot/usr/lib'
libtool: install: /usr/libexec/rpm-build/install -p telepathy-rakia /usr/src/tmp/telepathy-rakia-buildroot/usr/lib/telepathy-rakia
 /bin/mkdir -p '/usr/src/tmp/telepathy-rakia-buildroot/usr/share/telepathy/managers'
 /usr/libexec/rpm-build/install -p -m 644 rakia.manager '/usr/src/tmp/telepathy-rakia-buildroot/usr/share/telepathy/managers'
make[3]: Leaving directory '/usr/src/RPM/BUILD/telepathy-rakia-0.8.0/src'
make[2]: Leaving directory '/usr/src/RPM/BUILD/telepathy-rakia-0.8.0/src'
make[1]: Leaving directory '/usr/src/RPM/BUILD/telepathy-rakia-0.8.0/src'
Making install in tests
make[1]: Entering directory '/usr/src/RPM/BUILD/telepathy-rakia-0.8.0/tests'
Making install in twisted
make[2]: Entering directory '/usr/src/RPM/BUILD/telepathy-rakia-0.8.0/tests/twisted'
make  install-recursive
make[3]: Entering directory '/usr/src/RPM/BUILD/telepathy-rakia-0.8.0/tests/twisted'
Making install in tools
make[4]: Entering directory '/usr/src/RPM/BUILD/telepathy-rakia-0.8.0/tests/twisted/tools'
make  install-am
make[5]: Entering directory '/usr/src/RPM/BUILD/telepathy-rakia-0.8.0/tests/twisted/tools'
make[6]: Entering directory '/usr/src/RPM/BUILD/telepathy-rakia-0.8.0/tests/twisted/tools'
make[6]: Nothing to be done for 'install-exec-am'.
make[6]: Nothing to be done for 'install-data-am'.
make[6]: Leaving directory '/usr/src/RPM/BUILD/telepathy-rakia-0.8.0/tests/twisted/tools'
make[5]: Leaving directory '/usr/src/RPM/BUILD/telepathy-rakia-0.8.0/tests/twisted/tools'
make[4]: Leaving directory '/usr/src/RPM/BUILD/telepathy-rakia-0.8.0/tests/twisted/tools'
make[4]: Entering directory '/usr/src/RPM/BUILD/telepathy-rakia-0.8.0/tests/twisted'
make[5]: Entering directory '/usr/src/RPM/BUILD/telepathy-rakia-0.8.0/tests/twisted'
make[5]: Nothing to be done for 'install-exec-am'.
make[5]: Nothing to be done for 'install-data-am'.
make[5]: Leaving directory '/usr/src/RPM/BUILD/telepathy-rakia-0.8.0/tests/twisted'
make[4]: Leaving directory '/usr/src/RPM/BUILD/telepathy-rakia-0.8.0/tests/twisted'
make[3]: Leaving directory '/usr/src/RPM/BUILD/telepathy-rakia-0.8.0/tests/twisted'
make[2]: Leaving directory '/usr/src/RPM/BUILD/telepathy-rakia-0.8.0/tests/twisted'
make[2]: Entering directory '/usr/src/RPM/BUILD/telepathy-rakia-0.8.0/tests'
make[3]: Entering directory '/usr/src/RPM/BUILD/telepathy-rakia-0.8.0/tests'
make[3]: Nothing to be done for 'install-exec-am'.
make[3]: Nothing to be done for 'install-data-am'.
make[3]: Leaving directory '/usr/src/RPM/BUILD/telepathy-rakia-0.8.0/tests'
make[2]: Leaving directory '/usr/src/RPM/BUILD/telepathy-rakia-0.8.0/tests'
make[1]: Leaving directory '/usr/src/RPM/BUILD/telepathy-rakia-0.8.0/tests'
make[1]: Entering directory '/usr/src/RPM/BUILD/telepathy-rakia-0.8.0'
make[2]: Entering directory '/usr/src/RPM/BUILD/telepathy-rakia-0.8.0'
make[2]: Nothing to be done for 'install-exec-am'.
make[2]: Nothing to be done for 'install-data-am'.
make[2]: Leaving directory '/usr/src/RPM/BUILD/telepathy-rakia-0.8.0'
make[1]: Leaving directory '/usr/src/RPM/BUILD/telepathy-rakia-0.8.0'
make: Leaving directory '/usr/src/RPM/BUILD/telepathy-rakia-0.8.0'
+ /usr/lib/rpm/brp-alt
Cleaning files in /usr/src/tmp/telepathy-rakia-buildroot (auto)
Verifying and fixing files in /usr/src/tmp/telepathy-rakia-buildroot (binconfig,pkgconfig,libtool,desktop,gnuconfig)
Checking contents of files in /usr/src/tmp/telepathy-rakia-buildroot/ (default)
Compressing files in /usr/src/tmp/telepathy-rakia-buildroot (auto)
Adjusting library links in /usr/src/tmp/telepathy-rakia-buildroot
./usr/lib: (from <cmdline>:0)
Verifying ELF objects in /usr/src/tmp/telepathy-rakia-buildroot (arch=normal,fhs=normal,lfs=relaxed,lint=relaxed,rpath=normal,stack=normal,textrel=normal,unresolved=normal)
Hardlinking identical .pyc and .pyo files
Executing(%check): /bin/sh -e /usr/src/tmp/rpm-tmp.45281
Check is turned off by --disable check
Processing files: telepathy-rakia-0.8.0-alt2
Executing(%doc): /bin/sh -e /usr/src/tmp/rpm-tmp.45281
+ umask 022
+ /bin/mkdir -p /usr/src/RPM/BUILD
+ cd /usr/src/RPM/BUILD
+ cd telepathy-rakia-0.8.0
+ DOCDIR=/usr/src/tmp/telepathy-rakia-buildroot/usr/share/doc/telepathy-rakia-0.8.0
+ export DOCDIR
+ rm -rf /usr/src/tmp/telepathy-rakia-buildroot/usr/share/doc/telepathy-rakia-0.8.0
+ /bin/mkdir -p /usr/src/tmp/telepathy-rakia-buildroot/usr/share/doc/telepathy-rakia-0.8.0
+ cp -prL AUTHORS NEWS README TODO /usr/src/tmp/telepathy-rakia-buildroot/usr/share/doc/telepathy-rakia-0.8.0
+ chmod -R go-w /usr/src/tmp/telepathy-rakia-buildroot/usr/share/doc/telepathy-rakia-0.8.0
+ chmod -R a+rX /usr/src/tmp/telepathy-rakia-buildroot/usr/share/doc/telepathy-rakia-0.8.0
+ exit 0
Finding Provides (using /usr/lib/rpm/find-provides)
Executing: /bin/sh -e /usr/src/tmp/rpm-tmp.s11fJw
find-provides: running scripts (alternatives,debuginfo,gir,lib,pam,perl,pkgconfig,python,shell,typelib)
lib.prov: /usr/src/tmp/telepathy-rakia-buildroot/usr/lib/telepathy-rakia: 1 symbols, 10 bpp
warning: ignored self-provides: telepathy-rakia = set:dcyf
Finding Requires (using /usr/lib/rpm/find-requires)
Executing: /bin/sh -e /usr/src/tmp/rpm-tmp.3281Ux
find-requires: running scripts (cpp,debuginfo,files,gir-js,gir-python,gir,lib,pam,perl,pkgconfig,pkgconfiglib,python,rpmlib,shebang,shell,static,symlinks,systemd-services,typelib)
Provides: telepathy-sofiasip = 0.8.0-alt2
Requires: /lib/ld-linux.so.2, libc.so.6(GLIBC_2.0), libc.so.6(GLIBC_2.1.3), libc.so.6(GLIBC_2.4), libdbus-1.so.3 >= set:nmNXG1, libdbus-1.so.3(LIBDBUS_1_3), libdbus-glib-1.so.2 >= set:khyQmmeD652ac, libgio-2.0.so.0 >= set:on7dM6, libglib-2.0.so.0 >= set:oh6JPs6TvgQMsqOLOpRv2tEiJLqU4PTq47yDAvwpX2uz1FAo32eQsbpt90N6q5ryEZydlngkO7BNlvyA11S1grw4zodAXDyPCLEkgX6OyVZgVUlxin6xa2YEI6mM0jkYG0cTlF99ZbHHjRgGGar7hdV9eKZgF0T3tV46cU21l4jHgcCZ7yHogbVIn5cKWZtvbRknpOiaxudJAKL6ZsVff2xgITVA11WgDiU6OFYiv6yFJ3TtV8HJpK8uothFkWwnElsHba8zPVaA3ocrG42, libgobject-2.0.so.0 >= set:mf9fSpa99SmFRngMZJ36a16KIs2T4rBjQchPWkF0x2juCoBZcPgZ9nSPhlsFqgTHp8Z5QZw5YZAyXrCumfG53AI3KCoOzjucENl30roLG62kcZcZmtqHw83HS11nhPsCpxcmMSfXytKHUK1QwPYQnoYW0g4PDeY, libsofia-sip-ua-glib.so.3 >= set:fdt4Pr, libsofia-sip-ua.so.0 >= set:pivhNZsA7vJqCZnNQA23FF1g7e3EuRiZHBqM8EVcfZeCQMsnmZ7QOxUAHACwEUXRhdzEZqtzcZ0lFWk0MHVeEjZD0FqWSLHwc80SGi212wE9phFEbibweZA5vssuyCwlBSHqdsCVXiwQrjoZmS3Zodi3PuWj1OZBjc34nmLd6eMTlpHUMZf82qAC9pZfeTH9Ddlxs5A1LZHAuZtHCAZg8c5FZDXLDeNRGGSBrZkFNcyEH1BXHty6hFyZcHoCFKwWDMbZICKeotccin9wrNakrWF5xrNadggBLdc3plU6mlZKA04OLtXznjuDE0, libtelepathy-glib.so.0 >= set:phLDNqHcZwK2EKjJ7jeANgC3RzVgMNOHC4yCSeLQ77UT8X7H4bmHPmyZ3XRLmw92wxwGC3MEidZKyp2ZfqvAjJEj1kvmr0fEyHgz6AtPmX1jvz0ZfTTqcksGwnF4hZay5oeyZcYWixZHQvE6WIIV2BCD6HTrjItA3Z6l1dY2iOiMs8d4hmsDeQTZ3yOtSAfjwoLtQ6uE5REA4k4ZtLCPITIInwFDoVdXYC5sw2cSxxpHik1Omnnnfm618lMH0SpIlL6d2WtNNl1vtj4e9Og8Ksri3y0fOZA76Eb3CR0PTN85WllHXe2udw4X1XKUEl3KeVc0oJJE9Tiv8Nib8OaZpuriHR3Q5877gZG0eJlcUFtUyRz2cpS7A1Q8mUXhBTVBlAvSsIc8hT3qHEBgT2Z4pajNa, libtelepathy-glib.so.0(TELEPATHY_GLIB_0.11.0), libtelepathy-glib.so.0(TELEPATHY_GLIB_0.11.11), libtelepathy-glib.so.0(TELEPATHY_GLIB_0.11.13), libtelepathy-glib.so.0(TELEPATHY_GLIB_0.11.14), libtelepathy-glib.so.0(TELEPATHY_GLIB_0.11.3), libtelepathy-glib.so.0(TELEPATHY_GLIB_0.13.13), libtelepathy-glib.so.0(TELEPATHY_GLIB_0.13.8), libtelepathy-glib.so.0(TELEPATHY_GLIB_0.13.9), libtelepathy-glib.so.0(TELEPATHY_GLIB_0.17.5), libtelepathy-glib.so.0(TELEPATHY_GLIB_0.17.6), libtelepathy-glib.so.0(TELEPATHY_GLIB_0.19.1), libtelepathy-glib.so.0(TELEPATHY_GLIB_0.7.0), libtelepathy-glib.so.0(TELEPATHY_GLIB_0.7.1), libtelepathy-glib.so.0(TELEPATHY_GLIB_0.7.14), libtelepathy-glib.so.0(TELEPATHY_GLIB_0.7.15), libtelepathy-glib.so.0(TELEPATHY_GLIB_0.7.18), libtelepathy-glib.so.0(TELEPATHY_GLIB_0.7.2), libtelepathy-glib.so.0(TELEPATHY_GLIB_0.7.20), libtelepathy-glib.so.0(TELEPATHY_GLIB_0.7.21), libtelepathy-glib.so.0(TELEPATHY_GLIB_0.7.27), libtelepathy-glib.so.0(TELEPATHY_GLIB_0.7.29), libtelepathy-glib.so.0(TELEPATHY_GLIB_0.7.3), libtelepathy-glib.so.0(TELEPATHY_GLIB_0.7.36), libtelepathy-glib.so.0(TELEPATHY_GLIB_0.7.9), libtelepathy-glib.so.0(TELEPATHY_GLIB_0.9.2), rtld(GNU_HASH)
Requires(rpmlib): rpmlib(SetVersions)
Obsoletes: telepathy-sofiasip
Finding debuginfo files (using /usr/lib/rpm/find-debuginfo-files)
Executing: /bin/sh -e /usr/src/tmp/rpm-tmp.QkUzAv
Creating telepathy-rakia-debuginfo package
Processing files: telepathy-rakia-devel-0.8.0-alt2
Finding Provides (using /usr/lib/rpm/find-provides)
Executing: /bin/sh -e /usr/src/tmp/rpm-tmp.TPSG5v
find-provides: running scripts (alternatives,debuginfo,gir,lib,pam,perl,pkgconfig,python,shell,typelib)
Finding Requires (using /usr/lib/rpm/find-requires)
Executing: /bin/sh -e /usr/src/tmp/rpm-tmp.YS5WEv
find-requires: running scripts (cpp,debuginfo,files,gir-js,gir-python,gir,lib,pam,perl,pkgconfig,pkgconfiglib,python,rpmlib,shebang,shell,static,symlinks,systemd-services,typelib)
/usr/src/tmp/telepathy-rakia-buildroot/usr/include/telepathy-rakia-0.7/rakia/util.h:24:10: fatal error: glib.h: No such file or directory
   24 | #include <glib.h>
      |          ^~~~~~~~
compilation terminated.
cpp.req: /usr/src/tmp/telepathy-rakia-buildroot/usr/include/telepathy-rakia-0.7/rakia/util.h: cpp failed, trying c++ mode
i586-alt-linux-cpp: fatal error: cannot execute 'cc1plus': execvp: No such file or directory
compilation terminated.
cpp.req: WARNING: /usr/src/tmp/telepathy-rakia-buildroot/usr/include/telepathy-rakia-0.7/rakia/util.h: cpp failed
/usr/src/tmp/telepathy-rakia-buildroot/usr/include/telepathy-rakia-0.7/rakia/debug.h:25:10: fatal error: glib.h: No such file or directory
   25 | #include <glib.h>
      |          ^~~~~~~~
compilation terminated.
cpp.req: WARNING: /usr/src/tmp/telepathy-rakia-buildroot/usr/include/telepathy-rakia-0.7/rakia/debug.h: cpp failed
/usr/src/tmp/telepathy-rakia-buildroot/usr/include/telepathy-rakia-0.7/rakia/handles.h:24:10: fatal error: telepathy-glib/base-connection.h: No such file or directory
   24 | #include <telepathy-glib/base-connection.h>
      |          ^~~~~~~~~~~~~~~~~~~~~~~~~~~~~~~~~~
compilation terminated.
cpp.req: WARNING: /usr/src/tmp/telepathy-rakia-buildroot/usr/include/telepathy-rakia-0.7/rakia/handles.h: cpp failed
/usr/src/tmp/telepathy-rakia-buildroot/usr/include/telepathy-rakia-0.7/rakia/sofia-decls.h:47:10: fatal error: sofia-sip/nua.h: No such file or directory
   47 | #include <sofia-sip/nua.h>
      |          ^~~~~~~~~~~~~~~~~
compilation terminated.
cpp.req: WARNING: /usr/src/tmp/telepathy-rakia-buildroot/usr/include/telepathy-rakia-0.7/rakia/sofia-decls.h: cpp failed
/usr/src/tmp/telepathy-rakia-buildroot/usr/include/telepathy-rakia-0.7/rakia/event-target.h:24:10: fatal error: glib-object.h: No such file or directory
   24 | #include <glib-object.h>
      |          ^~~~~~~~~~~~~~~
compilation terminated.
cpp.req: WARNING: /usr/src/tmp/telepathy-rakia-buildroot/usr/include/telepathy-rakia-0.7/rakia/event-target.h: cpp failed
/usr/src/tmp/telepathy-rakia-buildroot/usr/include/telepathy-rakia-0.7/rakia/text-manager.h:24:10: fatal error: glib-object.h: No such file or directory
   24 | #include <glib-object.h>
      |          ^~~~~~~~~~~~~~~
compilation terminated.
cpp.req: WARNING: /usr/src/tmp/telepathy-rakia-buildroot/usr/include/telepathy-rakia-0.7/rakia/text-manager.h: cpp failed
/usr/src/tmp/telepathy-rakia-buildroot/usr/include/telepathy-rakia-0.7/rakia/media-manager.h:24:10: fatal error: glib-object.h: No such file or directory
   24 | #include <glib-object.h>
      |          ^~~~~~~~~~~~~~~
compilation terminated.
cpp.req: WARNING: /usr/src/tmp/telepathy-rakia-buildroot/usr/include/telepathy-rakia-0.7/rakia/media-manager.h: cpp failed
/usr/src/tmp/telepathy-rakia-buildroot/usr/include/telepathy-rakia-0.7/rakia/base-connection.h:24:10: fatal error: glib-object.h: No such file or directory
   24 | #include <glib-object.h>
      |          ^~~~~~~~~~~~~~~
compilation terminated.
cpp.req: WARNING: /usr/src/tmp/telepathy-rakia-buildroot/usr/include/telepathy-rakia-0.7/rakia/base-connection.h: cpp failed
/usr/src/tmp/telepathy-rakia-buildroot/usr/include/telepathy-rakia-0.7/rakia/codec-param-formats.h:24:10: fatal error: glib.h: No such file or directory
   24 | #include <glib.h>
      |          ^~~~~~~~
compilation terminated.
cpp.req: WARNING: /usr/src/tmp/telepathy-rakia-buildroot/usr/include/telepathy-rakia-0.7/rakia/codec-param-formats.h: cpp failed
/usr/src/tmp/telepathy-rakia-buildroot/usr/include/telepathy-rakia-0.7/rakia/connection-aliasing.h:24:10: fatal error: glib-object.h: No such file or directory
   24 | #include <glib-object.h>
      |          ^~~~~~~~~~~~~~~
compilation terminated.
cpp.req: WARNING: /usr/src/tmp/telepathy-rakia-buildroot/usr/include/telepathy-rakia-0.7/rakia/connection-aliasing.h: cpp failed
Provides: telepathy-sofiasip-devel = 0.8.0-alt2
Requires: telepathy-rakia = 0.8.0-alt2
Obsoletes: telepathy-sofiasip-devel
Processing files: telepathy-rakia-debuginfo-0.8.0-alt2
Finding Provides (using /usr/lib/rpm/find-provides)
Executing: /bin/sh -e /usr/src/tmp/rpm-tmp.QEBbvt
find-provides: running scripts (debuginfo)
Finding Requires (using /usr/lib/rpm/find-requires)
Executing: /bin/sh -e /usr/src/tmp/rpm-tmp.I3b1wt
find-requires: running scripts (debuginfo)
Provides: debug(telepathy-rakia)
Requires: telepathy-rakia = 0.8.0-alt2, /usr/lib/debug/lib/ld-linux.so.2.debug, debug(libc.so.6), debug(libdbus-1.so.3), debug(libdbus-glib-1.so.2), debug(libgio-2.0.so.0), debug(libglib-2.0.so.0), debug(libgobject-2.0.so.0), debug(libsofia-sip-ua-glib.so.3), debug(libsofia-sip-ua.so.0), debug(libtelepathy-glib.so.0)
Adding to telepathy-rakia-devel a strict dependency on telepathy-rakia
Adding to telepathy-rakia-debuginfo a strict dependency on telepathy-rakia
Wrote: /usr/src/RPM/RPMS/i586/telepathy-rakia-0.8.0-alt2.i586.rpm (w2.lzdio)
Wrote: /usr/src/RPM/RPMS/noarch/telepathy-rakia-devel-0.8.0-alt2.noarch.rpm (w2.lzdio)
Wrote: /usr/src/RPM/RPMS/i586/telepathy-rakia-debuginfo-0.8.0-alt2.i586.rpm (w2.lzdio)
22.17user 3.55system 0:24.24elapsed 106%CPU (0avgtext+0avgdata 51440maxresident)k
0inputs+0outputs (0major+1426552minor)pagefaults 0swaps
/.out/telepathy-rakia-devel-0.8.0-alt2.noarch.rpm: The use of such a license name is ambiguous: LGPL
/.out/telepathy-rakia-devel-0.8.0-alt2.noarch.rpm: license not found in '/usr/share/license' directory: v2.1+
/.out/telepathy-rakia-0.8.0-alt2.i586.rpm: The use of such a license name is ambiguous: LGPL
/.out/telepathy-rakia-0.8.0-alt2.i586.rpm: license not found in '/usr/share/license' directory: v2.1+
/.out/telepathy-rakia-debuginfo-0.8.0-alt2.i586.rpm: The use of such a license name is ambiguous: LGPL
/.out/telepathy-rakia-debuginfo-0.8.0-alt2.i586.rpm: license not found in '/usr/share/license' directory: v2.1+
29.51user 7.00system 0:35.19elapsed 103%CPU (0avgtext+0avgdata 107244maxresident)k
8936inputs+0outputs (0major+1827306minor)pagefaults 0swaps
--- telepathy-rakia-0.8.0-alt2.i586.rpm.repo	2019-04-06 19:11:50.000000000 +0000
+++ telepathy-rakia-0.8.0-alt2.i586.rpm.hasher	2021-03-04 11:41:14.373649776 +0000
@@ -10,2 +10,4 @@
 Requires: libc.so.6(GLIBC_2.0)  
+Requires: libc.so.6(GLIBC_2.1.3)  
+Requires: libc.so.6(GLIBC_2.4)  
 Requires: libdbus-1.so.3 >= set:nmNXG1
@@ -15,3 +17,3 @@
 Requires: libgio-2.0.so.0 >= set:on7dM6
-Requires: libglib-2.0.so.0 >= set:oh6JPs6TvgQMsqOLOpRv2tEiJLqU4PTqAW1oOXAY3crnMrc8B4rgMxCr9Hb18SgHoj4Z7FFW2yiZoOUGfhOw0X0EdgyhI6OZ35DdvhFwSdA5PZ1ONH2BKc2l4UhpdIw1CEUl1oKHijiWTRRFq8llBJzECY47nv85UuEbDMw1n8Eyoq5yNIZAs53q9DZa26ntZKLBqGHcp9BgLCmiTn3veZF7xg8SXsOw0tEj9s3VkuFf3NQSxXKsARScn4fIKEkatMbQaKR55ANVs5O1cCdl21
+Requires: libglib-2.0.so.0 >= set:oh6JPs6TvgQMsqOLOpRv2tEiJLqU4PTq47yDAvwpX2uz1FAo32eQsbpt90N6q5ryEZydlngkO7BNlvyA11S1grw4zodAXDyPCLEkgX6OyVZgVUlxin6xa2YEI6mM0jkYG0cTlF99ZbHHjRgGGar7hdV9eKZgF0T3tV46cU21l4jHgcCZ7yHogbVIn5cKWZtvbRknpOiaxudJAKL6ZsVff2xgITVA11WgDiU6OFYiv6yFJ3TtV8HJpK8uothFkWwnElsHba8zPVaA3ocrG42
 Requires: libgobject-2.0.so.0 >= set:mf9fSpa99SmFRngMZJ36a16KIs2T4rBjQchPWkF0x2juCoBZcPgZ9nSPhlsFqgTHp8Z5QZw5YZAyXrCumfG53AI3KCoOzjucENl30roLG62kcZcZmtqHw83HS11nhPsCpxcmMSfXytKHUK1QwPYQnoYW0g4PDeY
--- telepathy-rakia-debuginfo-0.8.0-alt2.i586.rpm.repo	2019-04-06 19:11:50.000000000 +0000
+++ telepathy-rakia-debuginfo-0.8.0-alt2.i586.rpm.hasher	2021-03-04 11:41:14.396649933 +0000
@@ -60,2 +60,3 @@
 Requires: rpmlib(PayloadIsLzma)  
+Provides: debug(telepathy-rakia)  
 Provides: telepathy-rakia-debuginfo = 0.8.0-alt2:sisyphus+226509.100.2.1