<86>Dec 22 12:50:06 userdel[416252]: delete user 'rooter'
<86>Dec 22 12:50:06 userdel[416252]: removed group 'rooter' owned by 'rooter'
<86>Dec 22 12:50:06 userdel[416252]: removed shadow group 'rooter' owned by 'rooter'
<86>Dec 22 12:50:06 groupadd[416257]: group added to /etc/group: name=rooter, GID=621
<86>Dec 22 12:50:06 groupadd[416257]: group added to /etc/gshadow: name=rooter
<86>Dec 22 12:50:06 groupadd[416257]: new group: name=rooter, GID=621
<86>Dec 22 12:50:06 useradd[416261]: new user: name=rooter, UID=621, GID=621, home=/root, shell=/bin/bash
<86>Dec 22 12:50:06 userdel[416267]: delete user 'builder'
<86>Dec 22 12:50:06 userdel[416267]: removed group 'builder' owned by 'builder'
<86>Dec 22 12:50:06 userdel[416267]: removed shadow group 'builder' owned by 'builder'
<86>Dec 22 12:50:06 groupadd[416272]: group added to /etc/group: name=builder, GID=622
<86>Dec 22 12:50:06 groupadd[416272]: group added to /etc/gshadow: name=builder
<86>Dec 22 12:50:06 groupadd[416272]: new group: name=builder, GID=622
<86>Dec 22 12:50:06 useradd[416276]: new user: name=builder, UID=622, GID=622, home=/usr/src, shell=/bin/bash
<13>Dec 22 12:50:09 rpmi: libruby-2.7.2-alt1.1 sisyphus+262971.100.1.1 1607192190 installed
<13>Dec 22 12:50:09 rpmi: libidn2-2.3.0-alt1 sisyphus+240846.100.1.2 1573870475 installed
<13>Dec 22 12:50:09 rpmi: libgdbm-1.8.3-alt10 1454943334 installed
<13>Dec 22 12:50:09 rpmi: libyaml2-0.2.5-alt1 sisyphus+253672.100.1.1 1592583137 installed
<13>Dec 22 12:50:09 rpmi: libyaml-devel-0.2.5-alt1 sisyphus+253672.100.1.1 1592583137 installed
<13>Dec 22 12:50:09 rpmi: libgdbm-devel-1.8.3-alt10 1454943334 installed
<13>Dec 22 12:50:09 rpmi: rpm-macros-ruby-1:1.0.0-alt12 sisyphus+249590.100.1.1 1586343887 installed
<13>Dec 22 12:50:13 rpmi: valgrind-3.16.1-alt1 sisyphus+254328.100.1.1 1598044621 installed
<13>Dec 22 12:50:13 rpmi: valgrind-devel-3.16.1-alt1 sisyphus+254328.100.1.1 1598044621 installed
<13>Dec 22 12:50:13 rpmi: zlib-devel-1.2.11-alt1 sisyphus+221902.6000.4.1 1550601058 installed
<13>Dec 22 12:50:13 rpmi: libreadline-devel-7.0.3-alt3 sisyphus+222164.300.1.1 1550686330 installed
<13>Dec 22 12:50:13 rpmi: groff-base-1.22.3-alt2 1502488686 installed
<13>Dec 22 12:50:13 rpmi: libtinfo-devel-6.2.20201107-alt1 sisyphus+261749.100.1.1 1605292929 installed
<13>Dec 22 12:50:13 rpmi: libncurses-devel-6.2.20201107-alt1 sisyphus+261749.100.1.1 1605292929 installed
<13>Dec 22 12:50:13 rpmi: libncursesw-devel-6.2.20201107-alt1 sisyphus+261749.100.1.1 1605292929 installed
<13>Dec 22 12:50:13 rpmi: libffi-devel-1:3.3-alt1 sisyphus+251953.40.2.1 1589891229 installed
<13>Dec 22 12:50:13 rpmi: libdb4.7-devel-4.7.25-alt10 sisyphus+263675.100.1.1 1608462007 installed
<13>Dec 22 12:50:13 rpmi: libexpat-2.2.10-alt1 sisyphus+259966.100.1.1 1602824518 installed
<13>Dec 22 12:50:13 rpmi: publicsuffix-list-dafsa-20201117-alt1 sisyphus+262026.100.1.1 1605704486 installed
<13>Dec 22 12:50:13 rpmi: libpsl-0.21.1-alt1 sisyphus+255206.100.1.1 1595348938 installed
<13>Dec 22 12:50:13 rpmi: libnghttp2-1.41.0-alt1 sisyphus+253680.100.1.1 1592642271 installed
<13>Dec 22 12:50:13 rpmi: libbrotlicommon-1.0.9-alt2 sisyphus+257777.100.1.1 1599688017 installed
<13>Dec 22 12:50:13 rpmi: libbrotlidec-1.0.9-alt2 sisyphus+257777.100.1.1 1599688017 installed
<13>Dec 22 12:50:14 rpmi: rsync-3.1.3-alt2 sisyphus+262850.200.1.1 1606957848 installed
<13>Dec 22 12:50:14 rpmi: libverto-0.3.0-alt1_7 sisyphus+225932.100.1.1 1553994919 installed
<13>Dec 22 12:50:14 rpmi: liblmdb-0.9.23-alt1 sisyphus+225277.100.2.1 1553001679 installed
<13>Dec 22 12:50:14 rpmi: libkeyutils-1.6.1-alt1 sisyphus+256015.100.1.1 1596820124 installed
<13>Dec 22 12:50:14 rpmi: libcom_err-1.45.6.0.24.af1a-alt1 sisyphus+262279.100.1.1 1606088229 installed
<13>Dec 22 12:50:14 rpmi: libedit3-3.1.20191231-alt1 sisyphus+262996.100.1.1 1607274935 installed
<13>Dec 22 12:50:14 rpmi: less-530-alt1 sisyphus+226367.200.2.2 1554151813 installed
<13>Dec 22 12:50:14 rpmi: doxygen-1:1.8.17-alt2 sisyphus+251932.100.4.1 1589893423 installed
<13>Dec 22 12:50:14 rpmi: diffstat-1.63-alt1 sisyphus+243663.100.1.1 1577480060 installed
<13>Dec 22 12:50:14 rpmi: chrpath-0.16-alt1 1453066316 installed
<13>Dec 22 12:50:14 rpmi: libp11-kit-0.23.15-alt2 sisyphus+252784.100.2.2 1591274901 installed
<13>Dec 22 12:50:14 rpmi: libtasn1-4.16.0-alt1 sisyphus+245480.100.1.1 1580825062 installed
<13>Dec 22 12:50:14 rpmi: rpm-macros-alternatives-0.5.1-alt1 sisyphus+226946.100.1.1 1554830426 installed
<13>Dec 22 12:50:14 rpmi: alternatives-0.5.1-alt1 sisyphus+226946.100.1.1 1554830426 installed
<13>Dec 22 12:50:14 rpmi: ca-certificates-2020.10.22-alt1 sisyphus+260224.300.2.1 1603549301 installed
<13>Dec 22 12:50:14 rpmi: ca-trust-0.1.2-alt1 sisyphus+233348.100.1.1 1561653823 installed
<13>Dec 22 12:50:14 rpmi: p11-kit-trust-0.23.15-alt2 sisyphus+252784.100.2.2 1591274901 installed
<13>Dec 22 12:50:14 rpmi: libcrypto1.1-1.1.1i-alt1 sisyphus+263103.100.1.1 1607445576 installed
<13>Dec 22 12:50:14 rpmi: libssl1.1-1.1.1i-alt1 sisyphus+263103.100.1.1 1607445576 installed
<13>Dec 22 12:50:14 rpmi: gem-minitest-5.14.1-alt0.1 sisyphus+249637.100.1.1 1586421683 installed
<13>Dec 22 12:50:14 rpmi: ruby-net-telnet-0.2.0-alt1 sisyphus+219345.2700.8.1 1547631566 installed
<13>Dec 22 12:50:14 rpmi: gem-rake-13.0.1-alt1 sisyphus+248971.320.47.1 1586259947 installed
<13>Dec 22 12:50:14 rpmi: ruby-xmlrpc-0.3.0-alt1 sisyphus+219345.3300.8.1 1547631818 installed
<13>Dec 22 12:50:14 rpmi: gem-2:3.1.2-alt1.1 sisyphus+262971.100.1.1 1607192116 installed
<13>Dec 22 12:50:14 rpmi: ri-6.1.1-alt3 sisyphus+220149.7500.44.1 1552167568 installed
<13>Dec 22 12:50:14 rpmi: rdoc-6.1.1-alt3 sisyphus+220149.7500.44.1 1552167568 installed
<13>Dec 22 12:50:15 rpmi: ruby-rdoc-6.1.1-alt3 sisyphus+220149.7500.44.1 1552167568 installed
<13>Dec 22 12:50:15 rpmi: rake-13.0.1-alt1 sisyphus+248971.320.47.1 1586259947 installed
<13>Dec 22 12:50:15 rpmi: erb-0:2.7.2-alt1.1 sisyphus+262971.100.1.1 1607192116 installed
<13>Dec 22 12:50:15 rpmi: irb-2.7.2-alt1.1 sisyphus+262971.100.1.1 1607192116 installed
<13>Dec 22 12:50:15 rpmi: gem-test-unit-3.3.5-alt1 sisyphus+248971.620.47.1 1586260035 installed
<13>Dec 22 12:50:15 rpmi: gem-power-assert-1.1.7-alt1 sisyphus+248971.220.47.1 1586259894 installed
<13>Dec 22 12:50:15 rpmi: bundle-2.1.4-alt1 sisyphus+247301.1100.3.2 1583840910 installed
<13>Dec 22 12:50:16 rpmi: gem-bundler-2.1.4-alt1 sisyphus+247301.1100.3.2 1583840910 installed
<13>Dec 22 12:50:16 rpmi: ruby-2.7.2-alt1.1 sisyphus+262971.100.1.1 1607192190 installed
<13>Dec 22 12:50:17 rpmi: ruby-stdlibs-2.7.2-alt1.1 sisyphus+262971.100.1.1 1607192190 installed
<86>Dec 22 12:50:17 groupadd[417869]: group added to /etc/group: name=_keytab, GID=499
<86>Dec 22 12:50:17 groupadd[417869]: new group: name=_keytab, GID=499
<13>Dec 22 12:50:17 rpmi: libkrb5-1.18.3-alt1 sisyphus+262109.100.1.1 1605777180 installed
<86>Dec 22 12:50:17 groupadd[417924]: group added to /etc/group: name=sasl, GID=498
<86>Dec 22 12:50:17 groupadd[417924]: group added to /etc/gshadow: name=sasl
<86>Dec 22 12:50:17 groupadd[417924]: new group: name=sasl, GID=498
<13>Dec 22 12:50:17 rpmi: libsasl2-3-2.1.27-alt2.1 sisyphus+255909.100.2.1 1597199456 installed
<13>Dec 22 12:50:17 rpmi: libldap-2.4.54-alt1 sisyphus+260267.100.2.1 1603571517 installed
<13>Dec 22 12:50:17 rpmi: libcurl-7.73.0-alt1 sisyphus+260186.100.1.1 1603294039 installed
<13>Dec 22 12:50:17 rpmi: setup-rb-5.999.4-alt6 sisyphus+262808.40.2.1 1606924451 installed
<13>Dec 22 12:50:17 rpmi: gem-setup-5.999.4-alt6 sisyphus+262808.40.2.1 1606924451 installed
<13>Dec 22 12:50:17 rpmi: libssl-devel-1.1.1i-alt1 sisyphus+263103.100.1.1 1607445576 installed
<13>Dec 22 12:50:17 rpmi: libruby-devel-2.7.2-alt1.1 sisyphus+262971.100.1.1 1607192190 installed
<13>Dec 22 12:50:17 rpmi: openssh-common-7.9p1-alt2 sisyphus+263609.100.1.1 1608251321 installed
<86>Dec 22 12:50:17 groupadd[417955]: group added to /etc/group: name=sshagent, GID=497
<86>Dec 22 12:50:17 groupadd[417955]: group added to /etc/gshadow: name=sshagent
<86>Dec 22 12:50:17 groupadd[417955]: new group: name=sshagent, GID=497
<13>Dec 22 12:50:17 rpmi: openssh-clients-7.9p1-alt2 sisyphus+263609.100.1.1 1608251321 installed
<13>Dec 22 12:50:18 rpmi: git-core-2.29.2-alt2 sisyphus+262938.100.1.1 1607121200 installed
<13>Dec 22 12:50:18 rpmi: ruby-tool-setup-3.4.1-alt15 sisyphus+224756.300.2.1 1552290808 installed
<13>Dec 22 12:50:18 rpmi: rpm-build-ruby-1:1.0.0-alt12 sisyphus+249590.100.1.1 1586343887 installed
Building target platforms: i586
Building for target i586
Wrote: /usr/src/in/nosrpm/gem-posix-mq-2.4.1-alt3.nosrc.rpm (w1.gzdio)
Installing gem-posix-mq-2.4.1-alt3.src.rpm
Building target platforms: i586
Building for target i586
Executing(%prep): /bin/sh -e /usr/src/tmp/rpm-tmp.70043
+ umask 022
+ /bin/mkdir -p /usr/src/RPM/BUILD
+ cd /usr/src/RPM/BUILD
+ cd /usr/src/RPM/BUILD
+ rm -rf gem-posix-mq-2.4.1
+ echo 'Source #0 (gem-posix-mq-2.4.1.tar):'
Source #0 (gem-posix-mq-2.4.1.tar):
+ /bin/tar -xf /usr/src/RPM/SOURCES/gem-posix-mq-2.4.1.tar
+ cd gem-posix-mq-2.4.1
+ /bin/chmod -c -Rf u+rwX,go-w .
+ exit 0
Executing(%build): /bin/sh -e /usr/src/tmp/rpm-tmp.70043
+ umask 022
+ /bin/mkdir -p /usr/src/RPM/BUILD
+ cd /usr/src/RPM/BUILD
+ cd gem-posix-mq-2.4.1
+ /usr/bin/ruby -rvendor-specific /usr/bin/setup.rb build --shebang=auto --prefixes=gem,ruby,rails-engine --gem-version-replace=
GIT_VERSION = 2.4.1
/bin/sh: pandoc: command not found
make: *** [GNUmakefile:27: posix-mq-rb.1.html] Error 127
gem 'posix_mq' at /usr/src/RPM/BUILD/gem-posix-mq-2.4.1
(ruby 2.7.2 i586-linux)
WARN [LoadError]: cannot load such file -- Rakefile

- - PRECONFIG - - - - - - - - - - - - - - - - - - - - - - - - - - - - 

SetupConfig was saved. Edit to customize configuration.

- - COMPILE - - - - - - - - - - - - - - - - - - - - - - - - - - - - - 

checking for sys/select.h... yes
checking for signal.h... yes
checking for mqueue.h... yes
checking for pthread.h... yes
checking for rb_str_set_len()... yes
checking for rb_thread_blocking_region()... no
checking for rb_thread_call_without_gvl()... yes
checking for -lm... yes
checking for -lrt... yes
checking for -lpthread... yes
checking for __mq_oshandle()... no
checking for mq_timedsend()... yes
checking for mq_timedreceive()... yes
creating Makefile
[/usr/src/RPM/BUILD/gem-posix-mq-2.4.1/ext/posix_mq/.]$ make make
make: Entering directory '/usr/src/RPM/BUILD/gem-posix-mq-2.4.1/ext/posix_mq'
compiling posix_mq.c
linking shared-object posix_mq_ext.so
make: Leaving directory '/usr/src/RPM/BUILD/gem-posix-mq-2.4.1/ext/posix_mq'
make: Entering directory '/usr/src/RPM/BUILD/gem-posix-mq-2.4.1/ext/posix_mq'
/bin/install -c -m 0755 posix_mq_ext.so /usr/src/RPM/BUILD/gem-posix-mq-2.4.1/.so.posix_mq/usr/lib/ruby/site_ruby/2.7.2/i586-linux
make: Leaving directory '/usr/src/RPM/BUILD/gem-posix-mq-2.4.1/ext/posix_mq'

- - DOCUMENT- - - - - - - - - - - - - - - - - - - - - - - - - - - - - 


+ exit 0
Executing(%install): /bin/sh -e /usr/src/tmp/rpm-tmp.58959
+ umask 022
+ /bin/mkdir -p /usr/src/RPM/BUILD
+ cd /usr/src/RPM/BUILD
+ /bin/chmod -Rf u+rwX -- /usr/src/tmp/gem-posix-mq-buildroot
+ :
+ /bin/rm -rf -- /usr/src/tmp/gem-posix-mq-buildroot
+ PATH=/usr/libexec/rpm-build:/usr/src/bin:/bin:/usr/bin:/usr/X11R6/bin:/usr/games
+ cd gem-posix-mq-2.4.1
+ /usr/bin/ruby -rvendor-specific /usr/bin/setup.rb install --install_prefix=/usr/src/tmp/gem-posix-mq-buildroot --gem-version-replace=
/bin/sh: pandoc: command not found
make: *** [GNUmakefile:27: posix-mq-rb.1.html] Error 127
gem 'posix_mq' at /usr/src/RPM/BUILD/gem-posix-mq-2.4.1
(ruby 2.7.2 i586-linux)
WARN [LoadError]: cannot load such file -- Rakefile

- - INSTALL - - - - - - - - - - - - - - - - - - - - - - - - - - - - - 

* {exe} ->
  % posix_mq < bin
    posix-mq-rb -> [/usr/src/tmp/gem-posix-mq-buildroot]/usr/lib/ruby/gems/2.7.0/gems/posix_mq-2.4.1/bin/posix-mq-rb
  % posix_mq
    /usr/lib/ruby/gems/2.7.0/gems/posix_mq-2.4.1/bin/posix-mq-rb -> [/usr/src/tmp/gem-posix-mq-buildroot]/usr/bin/posix-mq-rb
* {lib} ->
  % posix_mq < lib
    posix_mq.rb => [/usr/src/tmp/gem-posix-mq-buildroot]/usr/lib/ruby/gems/2.7.0/gems/posix_mq-2.4.1/lib/posix_mq.rb
* {man} ->
  % posix_mq < Documentation
* {ri} ->
  % posix_mq < .ri.posix_mq
    cache.ri => [/usr/src/tmp/gem-posix-mq-buildroot]/usr/lib/ruby/gems/2.7.0/doc/posix_mq-2.4.1/ri/cache.ri
    POSIX_MQ/notify-i.ri => [/usr/src/tmp/gem-posix-mq-buildroot]/usr/lib/ruby/gems/2.7.0/doc/posix_mq-2.4.1/ri/POSIX_MQ/notify-i.ri
    POSIX_MQ/dup-i.ri => [/usr/src/tmp/gem-posix-mq-buildroot]/usr/lib/ruby/gems/2.7.0/doc/posix_mq-2.4.1/ri/POSIX_MQ/dup-i.ri
    POSIX_MQ/clone-i.ri => [/usr/src/tmp/gem-posix-mq-buildroot]/usr/lib/ruby/gems/2.7.0/doc/posix_mq-2.4.1/ri/POSIX_MQ/clone-i.ri
    POSIX_MQ/open-c.ri => [/usr/src/tmp/gem-posix-mq-buildroot]/usr/lib/ruby/gems/2.7.0/doc/posix_mq-2.4.1/ri/POSIX_MQ/open-c.ri
    POSIX_MQ/cdesc-POSIX_MQ.ri => [/usr/src/tmp/gem-posix-mq-buildroot]/usr/lib/ruby/gems/2.7.0/doc/posix_mq-2.4.1/ri/POSIX_MQ/cdesc-POSIX_MQ.ri
* {inc} ->
  % posix_mq < ext
    /usr/include -> [/usr/src/tmp/gem-posix-mq-buildroot]/usr/lib/ruby/gems/2.7.0/gems/posix_mq-2.4.1/ext
* {app} ->
* {log} ->
* {state} ->
* {test} ->
  % posix_mq < test
    test_posix_mq.rb => [/usr/src/tmp/gem-posix-mq-buildroot]/usr/lib/ruby/gems/2.7.0/gems/posix_mq-2.4.1/test/test_posix_mq.rb
* {sup} ->
* {conf} ->
* {data} ->
  % posix_mq < .
    .document => [/usr/src/tmp/gem-posix-mq-buildroot]/usr/lib/ruby/gems/2.7.0/gems/posix_mq-2.4.1/.document
    .olddoc.yml => [/usr/src/tmp/gem-posix-mq-buildroot]/usr/lib/ruby/gems/2.7.0/gems/posix_mq-2.4.1/.olddoc.yml
    COPYING => [/usr/src/tmp/gem-posix-mq-buildroot]/usr/lib/ruby/gems/2.7.0/gems/posix_mq-2.4.1/COPYING
    COPYING-GPL2 => [/usr/src/tmp/gem-posix-mq-buildroot]/usr/lib/ruby/gems/2.7.0/gems/posix_mq-2.4.1/COPYING-GPL2
    GIT-VERSION-FILE => [/usr/src/tmp/gem-posix-mq-buildroot]/usr/lib/ruby/gems/2.7.0/gems/posix_mq-2.4.1/GIT-VERSION-FILE
    GIT-VERSION-GEN => [/usr/src/tmp/gem-posix-mq-buildroot]/usr/lib/ruby/gems/2.7.0/gems/posix_mq-2.4.1/GIT-VERSION-GEN
    GNUmakefile => [/usr/src/tmp/gem-posix-mq-buildroot]/usr/lib/ruby/gems/2.7.0/gems/posix_mq-2.4.1/GNUmakefile
    LICENSE => [/usr/src/tmp/gem-posix-mq-buildroot]/usr/lib/ruby/gems/2.7.0/gems/posix_mq-2.4.1/LICENSE
    README => [/usr/src/tmp/gem-posix-mq-buildroot]/usr/lib/ruby/gems/2.7.0/gems/posix_mq-2.4.1/README
    archive/slrnpull.conf => [/usr/src/tmp/gem-posix-mq-buildroot]/usr/lib/ruby/gems/2.7.0/gems/posix_mq-2.4.1/archive/slrnpull.conf
    pkg.mk => [/usr/src/tmp/gem-posix-mq-buildroot]/usr/lib/ruby/gems/2.7.0/gems/posix_mq-2.4.1/pkg.mk
    posix_mq.gemspec => [/usr/src/tmp/gem-posix-mq-buildroot]/usr/lib/ruby/gems/2.7.0/gems/posix_mq-2.4.1/posix_mq.gemspec
    setup.rb => [/usr/src/tmp/gem-posix-mq-buildroot]/usr/lib/ruby/gems/2.7.0/gems/posix_mq-2.4.1/setup.rb
* {.gemspec} ->
  %posix_mq
    /usr/src/tmp/gem.20201222-426104-1817kkq => [/usr/src/tmp/gem-posix-mq-buildroot]/usr/lib/ruby/gems/2.7.0/specifications/posix_mq-2.4.1.gemspec
* {gemfile} ->
* scheme
{posix_mq}
  /usr/src/RPM/BUILD/gem-posix-mq-2.4.1/.so.posix_mq/usr/lib/ruby/site_ruby/2.7.2/i586-linux/posix_mq_ext.so => /usr/src/tmp/gem-posix-mq-buildroot/usr/lib/ruby/gems/2.7.0/extensions/x86-linux/2.7.0/posix_mq-2.4.1/posix_mq_ext.so
  /usr/lib/ruby/gems/2.7.0/extensions/x86-linux/2.7.0/posix_mq-2.4.1/posix_mq_ext.so -> /usr/src/tmp/gem-posix-mq-buildroot/usr/lib/ruby/gems/2.7.0/gems/posix_mq-2.4.1/lib/posix_mq_ext.so
  >> /usr/src/tmp/gem-posix-mq-buildroot/usr/lib/ruby/gems/2.7.0/extensions/x86-linux/2.7.0/posix_mq-2.4.1/./gem.build_complete

+ /usr/lib/rpm/brp-alt
Cleaning files in /usr/src/tmp/gem-posix-mq-buildroot (auto)
mode of './usr/lib/ruby/gems/2.7.0/extensions/x86-linux/2.7.0/posix_mq-2.4.1/posix_mq_ext.so' changed from 0755 (rwxr-xr-x) to 0644 (rw-r--r--)
Verifying and fixing files in /usr/src/tmp/gem-posix-mq-buildroot (binconfig,pkgconfig,libtool,desktop,gnuconfig)
Checking contents of files in /usr/src/tmp/gem-posix-mq-buildroot/ (default)
Compressing files in /usr/src/tmp/gem-posix-mq-buildroot (auto)
Adjusting library links in /usr/src/tmp/gem-posix-mq-buildroot
./usr/lib: (from <cmdline>:0)
./usr/lib/ruby/gems/2.7.0/gems/posix_mq-2.4.1/lib: (from <cmdline>:0)
/usr/lib/rpm/debugedit: ./usr/lib/ruby/gems/2.7.0/extensions/x86-linux/2.7.0/posix_mq-2.4.1/posix_mq_ext.so: DWARF version 19153 unhandled
Verifying ELF objects in /usr/src/tmp/gem-posix-mq-buildroot (arch=normal,fhs=normal,lfs=relaxed,lint=relaxed,rpath=normal,stack=normal,textrel=normal,unresolved=normal)
Hardlinking identical .pyc and .pyo files
Executing(%check): /bin/sh -e /usr/src/tmp/rpm-tmp.94814
+ umask 022
+ /bin/mkdir -p /usr/src/RPM/BUILD
+ cd /usr/src/RPM/BUILD
+ cd gem-posix-mq-2.4.1
+ /usr/bin/ruby -rvendor-specific /usr/bin/setup.rb test
/bin/sh: pandoc: command not found
make: *** [GNUmakefile:27: posix-mq-rb.1.html] Error 127
gem 'posix_mq' at /usr/src/RPM/BUILD/gem-posix-mq-2.4.1
(ruby 2.7.2 i586-linux)
WARN [LoadError]: cannot load such file -- Rakefile

+ exit 0
Processing files: gem-posix-mq-2.4.1-alt3
Executing(%doc): /bin/sh -e /usr/src/tmp/rpm-tmp.55015
+ umask 022
+ /bin/mkdir -p /usr/src/RPM/BUILD
+ cd /usr/src/RPM/BUILD
+ cd gem-posix-mq-2.4.1
+ DOCDIR=/usr/src/tmp/gem-posix-mq-buildroot/usr/share/doc/gem-posix-mq-2.4.1
+ export DOCDIR
+ rm -rf /usr/src/tmp/gem-posix-mq-buildroot/usr/share/doc/gem-posix-mq-2.4.1
+ /bin/mkdir -p /usr/src/tmp/gem-posix-mq-buildroot/usr/share/doc/gem-posix-mq-2.4.1
+ cp -prL README /usr/src/tmp/gem-posix-mq-buildroot/usr/share/doc/gem-posix-mq-2.4.1
+ chmod -R go-w /usr/src/tmp/gem-posix-mq-buildroot/usr/share/doc/gem-posix-mq-2.4.1
+ chmod -R a+rX /usr/src/tmp/gem-posix-mq-buildroot/usr/share/doc/gem-posix-mq-2.4.1
+ exit 0
warning: absolute symlink: /usr/src/tmp/gem-posix-mq-buildroot/usr/lib/ruby/gems/2.7.0/gems/posix_mq-2.4.1/ext -> /usr/include
warning: absolute symlink: /usr/src/tmp/gem-posix-mq-buildroot/usr/lib/ruby/gems/2.7.0/gems/posix_mq-2.4.1/lib/posix_mq_ext.so -> /usr/lib/ruby/gems/2.7.0/extensions/x86-linux/2.7.0/posix_mq-2.4.1/posix_mq_ext.so
Finding Provides (using /usr/lib/rpm/find-provides)
Executing: /bin/sh -e /usr/src/tmp/rpm-tmp.Q5V1wC
find-provides: running scripts (alternatives,debuginfo,lib,pam,perl,pkgconfig,python,ruby,shell)
ruby.prov: detecting ruby provides for gem-posix-mq...
ruby.prov: project file is '/usr/src/RPM/BUILD/gem-posix-mq-2.4.1/SetupConfig'
ruby.prov: setup.rb provides --install_prefix=/usr/src/tmp/gem-posix-mq-buildroot --package=gem-posix-mq -q
/bin/sh: pandoc: command not found
make: *** [GNUmakefile:27: posix-mq-rb.1.html] Error 127
gem 'posix_mq' at /usr/src/RPM/BUILD/gem-posix-mq-2.4.1
(ruby 2.7.2 i586-linux)
WARN [LoadError]: cannot load such file -- Rakefile
* provs ->
  - [posix_mq]
    [lib]:
      gem(posix_mq) = 2.4.1
      ruby-gem(posix_mq) = 2.4.1
      rubygem(posix_mq) = 2.4.1
Finding Requires (using /usr/lib/rpm/find-requires)
Executing: /bin/sh -e /usr/src/tmp/rpm-tmp.b6IckA
find-requires: running scripts (cpp,debuginfo,files,lib,pam,perl,pkgconfig,pkgconfiglib,python,rpmlib,ruby,shebang,shell,static,symlinks,systemd-services)
ruby.req: detecting ruby requires for gem-posix-mq...
ruby.req: ruby project file is '/usr/src/RPM/BUILD/gem-posix-mq-2.4.1/SetupConfig'
ruby.req: setup.rb requires --install_prefix=/usr/src/tmp/gem-posix-mq-buildroot --package=gem-posix-mq -q
/bin/sh: pandoc: command not found
make: *** [GNUmakefile:27: posix-mq-rb.1.html] Error 127
gem 'posix_mq' at /usr/src/RPM/BUILD/gem-posix-mq-2.4.1
(ruby 2.7.2 i586-linux)
WARN [LoadError]: cannot load such file -- Rakefile
* reqs ->
  - [posix_mq]
    [lib]:
      ruby(2.7.0)
      ruby >= 0
      rubygems >= 0
Provides: ruby-posix_mq = 2.4.1-alt3, gem(posix_mq) = 2.4.1, ruby-gem(posix_mq) = 2.4.1, rubygem(posix_mq) = 2.4.1
Requires: libc.so.6(GLIBC_2.0), libc.so.6(GLIBC_2.1), libc.so.6(GLIBC_2.1.3), libc.so.6(GLIBC_2.17), libc.so.6(GLIBC_2.4), libm.so.6(GLIBC_2.0), libpthread.so.0(GLIBC_2.0), libpthread.so.0(GLIBC_2.1), librt.so.1(GLIBC_2.3.4), librt.so.1(GLIBC_2.7), libruby.so.2.7 >= set:oiMZAnOtQCuH9ZqvDQj3b91VngUvxkrhqyJP5JisPqZaXN82bAw4Ym2S38p6AlAFogzXJJgyqOEAYGCkoZj9oiEHxZovlZ7N8cdiQ2PDxqQj5qQ43Mx1cLAxKw0S0L5whGJTZv2LBhkZq8MLEAPKftTP40, rtld(GNU_HASH), ruby >= 0, ruby(2.7.0), rubygems >= 0
Requires(rpmlib): rpmlib(SetVersions)
Obsoletes: ruby-posix_mq < 2.4.1-alt3
Finding debuginfo files (using /usr/lib/rpm/find-debuginfo-files)
Executing: /bin/sh -e /usr/src/tmp/rpm-tmp.syqROC
Creating gem-posix-mq-debuginfo package
Processing files: posix-mq-rb-2.4.1-alt3
warning: absolute symlink: /usr/src/tmp/gem-posix-mq-buildroot/usr/bin/posix-mq-rb -> /usr/lib/ruby/gems/2.7.0/gems/posix_mq-2.4.1/bin/posix-mq-rb
Finding Provides (using /usr/lib/rpm/find-provides)
Executing: /bin/sh -e /usr/src/tmp/rpm-tmp.8qurXy
find-provides: absolute symbolic link /usr/src/tmp/gem-posix-mq-buildroot/usr/bin/posix-mq-rb -> /usr/lib/ruby/gems/2.7.0/gems/posix_mq-2.4.1/bin/posix-mq-rb is not going to provide anything
find-provides: running scripts (alternatives,debuginfo,lib,pam,perl,pkgconfig,python,ruby,shell)
Finding Requires (using /usr/lib/rpm/find-requires)
Executing: /bin/sh -e /usr/src/tmp/rpm-tmp.TPnSpC
find-requires: running scripts (cpp,debuginfo,files,lib,pam,perl,pkgconfig,pkgconfiglib,python,rpmlib,ruby,shebang,shell,static,symlinks,systemd-services)
ruby.req: detecting ruby requires for posix-mq-rb...
ruby.req: ruby project file is '/usr/src/RPM/BUILD/gem-posix-mq-2.4.1/SetupConfig'
ruby.req: setup.rb requires --install_prefix=/usr/src/tmp/gem-posix-mq-buildroot --package=posix-mq-rb -q
/bin/sh: pandoc: command not found
make: *** [GNUmakefile:27: posix-mq-rb.1.html] Error 127
gem 'posix_mq' at /usr/src/RPM/BUILD/gem-posix-mq-2.4.1
(ruby 2.7.2 i586-linux)
WARN [LoadError]: cannot load such file -- Rakefile
* reqs ->
  - [posix_mq]
    [bin]:
      /usr/bin/ruby
      gem(posix_mq) = 2.4.1
Requires: /usr/bin/ruby, /usr/lib/ruby/gems/2.7.0/gems/posix_mq-2.4.1/bin/posix-mq-rb, gem(posix_mq) = 2.4.1
Processing files: gem-posix-mq-doc-2.4.1-alt3
Finding Provides (using /usr/lib/rpm/find-provides)
Executing: /bin/sh -e /usr/src/tmp/rpm-tmp.VTXzcA
find-provides: running scripts (alternatives,debuginfo,lib,pam,perl,pkgconfig,python,ruby,shell)
ruby.prov: detecting ruby provides for gem-posix-mq-doc...
ruby.prov: project file is '/usr/src/RPM/BUILD/gem-posix-mq-2.4.1/SetupConfig'
ruby.prov: setup.rb provides --install_prefix=/usr/src/tmp/gem-posix-mq-buildroot --package=gem-posix-mq-doc -q
/bin/sh: pandoc: command not found
make: *** [GNUmakefile:27: posix-mq-rb.1.html] Error 127
gem 'posix_mq' at /usr/src/RPM/BUILD/gem-posix-mq-2.4.1
(ruby 2.7.2 i586-linux)
WARN [LoadError]: cannot load such file -- Rakefile
* provs ->
  - [posix_mq]
Finding Requires (using /usr/lib/rpm/find-requires)
Executing: /bin/sh -e /usr/src/tmp/rpm-tmp.zZ3GTA
find-requires: running scripts (cpp,debuginfo,files,lib,pam,perl,pkgconfig,pkgconfiglib,python,rpmlib,ruby,shebang,shell,static,symlinks,systemd-services)
ruby.req: detecting ruby requires for gem-posix-mq-doc...
ruby.req: ruby project file is '/usr/src/RPM/BUILD/gem-posix-mq-2.4.1/SetupConfig'
ruby.req: setup.rb requires --install_prefix=/usr/src/tmp/gem-posix-mq-buildroot --package=gem-posix-mq-doc -q
/bin/sh: pandoc: command not found
make: *** [GNUmakefile:27: posix-mq-rb.1.html] Error 127
gem 'posix_mq' at /usr/src/RPM/BUILD/gem-posix-mq-2.4.1
(ruby 2.7.2 i586-linux)
WARN [LoadError]: cannot load such file -- Rakefile
* reqs ->
  - [posix_mq]
    [doc]:
      gem(posix_mq) = 2.4.1
Requires: gem(posix_mq) = 2.4.1
Processing files: gem-posix-mq-debuginfo-2.4.1-alt3
Finding Provides (using /usr/lib/rpm/find-provides)
Executing: /bin/sh -e /usr/src/tmp/rpm-tmp.L57uJz
find-provides: running scripts (debuginfo)
Finding Requires (using /usr/lib/rpm/find-requires)
Executing: /bin/sh -e /usr/src/tmp/rpm-tmp.PKXSKC
find-requires: running scripts (debuginfo)
objdump: '/usr/src/tmp/gem-posix-mq-buildroot/usr/lib/ruby/gems/2.7.0/gems/posix_mq-2.4.1/lib/posix_mq_ext.so': No such file
debuginfo.req: WARNING: /usr/src/tmp/gem-posix-mq-buildroot/usr/lib/ruby/gems/2.7.0/gems/posix_mq-2.4.1/lib/posix_mq_ext.so: objdump failed
Requires: gem-posix-mq = 2.4.1-alt3, debug(libc.so.6), debug(libm.so.6), debug(libpthread.so.0), debug(librt.so.1), debug(libruby.so.2.7)
Adding to gem-posix-mq-debuginfo a strict dependency on gem-posix-mq
Adding to posix-mq-rb a strict dependency on gem-posix-mq
Adding to gem-posix-mq-doc a strict dependency on gem-posix-mq
Removing 2 extra deps from posix-mq-rb due to dependency on gem-posix-mq
Removing 1 extra deps from gem-posix-mq-doc due to dependency on gem-posix-mq
Wrote: /usr/src/RPM/RPMS/i586/gem-posix-mq-2.4.1-alt3.i586.rpm (w2.lzdio)
Wrote: /usr/src/RPM/RPMS/noarch/posix-mq-rb-2.4.1-alt3.noarch.rpm (w2.lzdio)
Wrote: /usr/src/RPM/RPMS/noarch/gem-posix-mq-doc-2.4.1-alt3.noarch.rpm (w2.lzdio)
Wrote: /usr/src/RPM/RPMS/i586/gem-posix-mq-debuginfo-2.4.1-alt3.i586.rpm (w2.lzdio)
20.66user 3.88system 0:29.20elapsed 84%CPU (0avgtext+0avgdata 38988maxresident)k
0inputs+0outputs (0major+539531minor)pagefaults 0swaps
39.31user 11.19system 0:53.77elapsed 93%CPU (0avgtext+0avgdata 109128maxresident)k
0inputs+0outputs (0major+990170minor)pagefaults 0swaps
--- gem-posix-mq-2.4.1-alt3.i586.rpm.repo	2020-04-07 13:12:32.000000000 +0000
+++ gem-posix-mq-2.4.1-alt3.i586.rpm.hasher	2020-12-22 12:50:56.283138361 +0000
@@ -1,3 +1,3 @@
 /usr/lib/ruby/gems/2.7.0/extensions/x86-linux/2.7.0/posix_mq-2.4.1	40755	
-/usr/lib/ruby/gems/2.7.0/extensions/x86-linux/2.7.0/posix_mq-2.4.1/gem.build_complete	100755	
+/usr/lib/ruby/gems/2.7.0/extensions/x86-linux/2.7.0/posix_mq-2.4.1/gem.build_complete	100644	
 /usr/lib/ruby/gems/2.7.0/extensions/x86-linux/2.7.0/posix_mq-2.4.1/posix_mq_ext.so	100644	
@@ -18,5 +18,5 @@
 /usr/lib/ruby/gems/2.7.0/gems/posix_mq-2.4.1/ext	120777	/usr/include
-/usr/lib/ruby/gems/2.7.0/gems/posix_mq-2.4.1/i586-linux	120777	/usr/lib/ruby/gems/2.7.0/extensions/x86-linux/2.7.0/posix_mq-2.4.1
 /usr/lib/ruby/gems/2.7.0/gems/posix_mq-2.4.1/lib	40755	
 /usr/lib/ruby/gems/2.7.0/gems/posix_mq-2.4.1/lib/posix_mq.rb	100755	
+/usr/lib/ruby/gems/2.7.0/gems/posix_mq-2.4.1/lib/posix_mq_ext.so	120777	/usr/lib/ruby/gems/2.7.0/extensions/x86-linux/2.7.0/posix_mq-2.4.1/posix_mq_ext.so
 /usr/lib/ruby/gems/2.7.0/gems/posix_mq-2.4.1/pkg.mk	100644	
@@ -30,2 +30,3 @@
 Requires: libc.so.6(GLIBC_2.0)  
+Requires: libc.so.6(GLIBC_2.1)  
 Requires: libc.so.6(GLIBC_2.1.3)  
--- gem-posix-mq-debuginfo-2.4.1-alt3.i586.rpm.repo	2020-04-07 13:12:32.000000000 +0000
+++ gem-posix-mq-debuginfo-2.4.1-alt3.i586.rpm.hasher	2020-12-22 12:50:56.318137145 +0000
@@ -8,2 +8,10 @@
 /usr/lib/debug/usr/lib/ruby/gems/2.7.0/extensions/x86-linux/2.7.0/posix_mq-2.4.1/posix_mq_ext.so.debug	100644	
+/usr/lib/debug/usr/lib/ruby/gems/2.7.0/gems	40755	
+/usr/lib/debug/usr/lib/ruby/gems/2.7.0/gems/posix_mq-2.4.1	40755	
+/usr/lib/debug/usr/lib/ruby/gems/2.7.0/gems/posix_mq-2.4.1/lib	40755	
+/usr/lib/debug/usr/lib/ruby/gems/2.7.0/gems/posix_mq-2.4.1/lib/posix_mq_ext.so.debug	120777	../../../extensions/x86-linux/2.7.0/posix_mq-2.4.1/posix_mq_ext.so.debug
+/usr/src/debug/gem-posix-mq-2.4.1	40755	
+/usr/src/debug/gem-posix-mq-2.4.1/ext	40755	
+/usr/src/debug/gem-posix-mq-2.4.1/ext/posix_mq	40755	
+/usr/src/debug/gem-posix-mq-2.4.1/ext/posix_mq/posix_mq.c	100644	
 Requires: debug(libc.so.6)