<86>Nov 23 10:04:32 userdel[275431]: delete user 'rooter'
<86>Nov 23 10:04:32 userdel[275431]: removed group 'rooter' owned by 'rooter'
<86>Nov 23 10:04:32 userdel[275431]: removed shadow group 'rooter' owned by 'rooter'
<86>Nov 23 10:04:32 groupadd[275457]: group added to /etc/group: name=rooter, GID=597
<86>Nov 23 10:04:32 groupadd[275457]: group added to /etc/gshadow: name=rooter
<86>Nov 23 10:04:32 groupadd[275457]: new group: name=rooter, GID=597
<86>Nov 23 10:04:32 useradd[275479]: new user: name=rooter, UID=597, GID=597, home=/root, shell=/bin/bash
<86>Nov 23 10:04:32 userdel[275510]: delete user 'builder'
<86>Nov 23 10:04:32 userdel[275510]: removed group 'builder' owned by 'builder'
<86>Nov 23 10:04:32 userdel[275510]: removed shadow group 'builder' owned by 'builder'
<86>Nov 23 10:04:32 groupadd[275538]: group added to /etc/group: name=builder, GID=598
<86>Nov 23 10:04:32 groupadd[275538]: group added to /etc/gshadow: name=builder
<86>Nov 23 10:04:32 groupadd[275538]: new group: name=builder, GID=598
<86>Nov 23 10:04:32 useradd[275561]: new user: name=builder, UID=598, GID=598, home=/usr/src, shell=/bin/bash
warning: Macro %cmake_insource not found
<13>Nov 23 10:04:37 rpmi: libjpeg-2:2.0.2-alt1 sisyphus+226996.100.1.1 1554902907 installed
<13>Nov 23 10:04:37 rpmi: libpng16-1.6.37-alt1 sisyphus+236677.100.2.1 1566917998 installed
<13>Nov 23 10:04:37 rpmi: qt5-base-common-5.15.1-alt3 sisyphus+262098.100.1.1 1605773495 installed
<13>Nov 23 10:04:37 rpmi: qt5-declarative-common-5.15.1-alt1 sisyphus+257838.200.3.1 1600068979 installed
<13>Nov 23 10:04:37 rpmi: libexpat-2.2.10-alt1 sisyphus+259966.100.1.1 1602824518 installed
<13>Nov 23 10:04:37 rpmi: libxkbcommon-1.0.2-alt1 sisyphus+262214.100.1.1 1605972038 installed
<13>Nov 23 10:04:37 rpmi: libwebp7-1.1.0-alt1 sisyphus+243895.100.1.1 1578410873 installed
<13>Nov 23 10:04:37 rpmi: libglvnd-7:1.3.2-alt1 sisyphus+254610.100.1.1 1594124268 installed
<13>Nov 23 10:04:37 rpmi: libgomp1-9.3.1-alt1 sisyphus+251917.40.3.1 1589812684 installed
<13>Nov 23 10:04:37 rpmi: libICE-1.0.10-alt1 sisyphus+247690.100.1.1 1584000387 installed
<13>Nov 23 10:04:37 rpmi: libSM-1.2.3-alt1 sisyphus+226734.100.2.1 1554586158 installed
<13>Nov 23 10:04:37 rpmi: qt5-tools-common-5.15.1-alt1 sisyphus+257838.400.3.1 1600069260 installed
<13>Nov 23 10:04:37 rpmi: libsqlite3-3.33.0-alt1 sisyphus+256344.100.1.1 1597522272 installed
<13>Nov 23 10:04:37 rpmi: libts0-1.22-alt3 sisyphus+259302.100.1.1 1601981878 installed
<13>Nov 23 10:04:37 rpmi: libmtdev-1.1.6-alt1 sisyphus+250141.100.1.1 1587131316 installed
<13>Nov 23 10:04:37 rpmi: udev-rules-1:246.6-alt5 sisyphus+261229.100.1.1 1604798321 installed
<13>Nov 23 10:04:38 rpmi: libicu67-1:6.7.1-alt2 sisyphus+252432.100.2.2 1590796126 installed
<13>Nov 23 10:04:38 rpmi: liblcms2-2.11-alt1 sisyphus+253499.100.1.1 1592287020 installed
<13>Nov 23 10:04:38 rpmi: libltdl7-2.4.6-alt1 sisyphus+226971.100.2.1 1554906368 installed
<13>Nov 23 10:04:38 rpmi: libopenjpeg2.0-2.3.1-alt1 sisyphus+226454.100.1.1 1554284337 installed
<13>Nov 23 10:04:38 rpmi: libjbig-2.1-alt1 1401380926 installed
<13>Nov 23 10:04:38 rpmi: libtiff5-4.1.0-alt1 sisyphus+240802.100.1.1 1573743635 installed
<13>Nov 23 10:04:38 rpmi: libfribidi-1.0.10-alt1 sisyphus+254557.100.1.1 1594020362 installed
<13>Nov 23 10:04:38 rpmi: libwayland-server-1.18.0-alt1 sisyphus+255795.100.1.1 1596475648 installed
<13>Nov 23 10:04:38 rpmi: ilmbase25-common-2.5.3-alt1 sisyphus+260406.100.1.1 1603706892 installed
<13>Nov 23 10:04:38 rpmi: libiex25-2.5.3-alt1 sisyphus+260406.100.1.1 1603706892 installed
<13>Nov 23 10:04:38 rpmi: libilmthread25-2.5.3-alt1 sisyphus+260406.100.1.1 1603706892 installed
<13>Nov 23 10:04:38 rpmi: libimath25-2.5.3-alt1 sisyphus+260406.100.1.1 1603706892 installed
<13>Nov 23 10:04:38 rpmi: libhalf25-2.5.3-alt1 sisyphus+260406.100.1.1 1603706892 installed
<13>Nov 23 10:04:38 rpmi: libGLES-7:1.3.2-alt1 sisyphus+254610.100.1.1 1594124268 installed
<13>Nov 23 10:04:38 rpmi: libOpenGL-7:1.3.2-alt1 sisyphus+254610.100.1.1 1594124268 installed
<13>Nov 23 10:04:38 rpmi: qt5-svg-common-5.15.1-alt1 sisyphus+257838.2000.3.1 1600071295 installed
<13>Nov 23 10:04:38 rpmi: qt5-webchannel-common-5.15.1-alt1 sisyphus+257838.1300.3.1 1600070732 installed
<13>Nov 23 10:04:38 rpmi: qt5-webkit-common-5.212.0-alt18 sisyphus+257838.4500.3.1 1600078953 installed
<13>Nov 23 10:04:38 rpmi: rpm-macros-qt5-5.15.1-alt3 sisyphus+262098.100.1.1 1605772699 installed
<13>Nov 23 10:04:38 rpmi: libflif-0.3-alt3 sisyphus+248230.100.1.1 1584818790 installed
<13>Nov 23 10:04:39 rpmi: libjasper-2.0.22-alt1 sisyphus+259396.40.3.1 1602110527 installed
<13>Nov 23 10:04:39 rpmi: libraw-0.20.2-alt1 sisyphus+258819.40.9.1 1604414258 installed
<13>Nov 23 10:04:39 rpmi: xxd-4:8.2.0011-alt2 sisyphus+258375.2100.14.3 1600986704 installed
<13>Nov 23 10:04:39 rpmi: vulkan-filesystem-1.2.152-alt1 sisyphus+257666.300.3.1 1599632436 installed
<13>Nov 23 10:04:39 rpmi: libvulkan1-1.2.152-alt1 sisyphus+257666.300.3.1 1599632437 installed
<13>Nov 23 10:04:39 rpmi: libssl-devel-1.1.1g-alt1 sisyphus+249982.60.8.1 1587743711 installed
<13>Nov 23 10:04:39 rpmi: libproxy-0.4.15-alt5 sisyphus+261556.100.1.1 1605106716 installed
<13>Nov 23 10:04:39 rpmi: libpcre2-10.35-alt1 sisyphus+251510.100.1.1 1589115526 installed
<13>Nov 23 10:04:39 rpmi: libqt5-core-5.15.1-alt3 sisyphus+262098.100.1.1 1605773495 installed
<13>Nov 23 10:04:39 rpmi: libqt5-sql-5.15.1-alt3 sisyphus+262098.100.1.1 1605773495 installed
<13>Nov 23 10:04:39 rpmi: libqt5-xml-5.15.1-alt3 sisyphus+262098.100.1.1 1605773495 installed
<13>Nov 23 10:04:39 rpmi: libqt5-test-5.15.1-alt3 sisyphus+262098.100.1.1 1605773495 installed
<13>Nov 23 10:04:39 rpmi: libqt5-concurrent-5.15.1-alt3 sisyphus+262098.100.1.1 1605773495 installed
<13>Nov 23 10:04:39 rpmi: libwacom-data-1.6-alt1 sisyphus+260872.100.1.1 1604391467 installed
<13>Nov 23 10:04:39 rpmi: libgudev-1:234-alt1 sisyphus+258314.700.14.2 1600844807 installed
<13>Nov 23 10:04:39 rpmi: libwacom-1.6-alt1 sisyphus+260872.100.1.1 1604391471 installed
<13>Nov 23 10:04:39 rpmi: libgdbm-1.8.3-alt10 1454943334 installed
<13>Nov 23 10:04:39 rpmi: python3-3.8.6-alt1 sisyphus+259085.100.2.1 1601904174 installed
<13>Nov 23 10:04:40 rpmi: python3-base-3.8.6-alt1 sisyphus+259085.100.2.1 1601904174 installed
<13>Nov 23 10:04:40 rpmi: libpython3-3.8.6-alt1 sisyphus+259085.100.2.1 1601904174 installed
<13>Nov 23 10:04:40 rpmi: libvulkan-devel-1.2.152-alt1 sisyphus+257666.300.3.1 1599632437 installed
<13>Nov 23 10:04:40 rpmi: libevdev-1.10.0-alt1 sisyphus+260476.100.1.1 1603764233 installed
<13>Nov 23 10:04:40 rpmi: libinput-1.16.3-alt1 sisyphus+260871.100.1.2 1604391932 installed
<13>Nov 23 10:04:41 rpmi: xorg-proto-devel-2020.1-alt1 sisyphus+250406.100.1.1 1587554810 installed
<13>Nov 23 10:04:41 rpmi: libSDL2-2.0.12-alt4 sisyphus+261827.100.1.1 1605520031 installed
<13>Nov 23 10:04:41 rpmi: tslib-1.22-alt3 sisyphus+259302.100.1.1 1601981878 installed
<13>Nov 23 10:04:41 rpmi: gcc-c++-common-1.4.25-alt1 sisyphus+255450.100.1.1 1595851517 installed
<13>Nov 23 10:04:41 rpmi: libstdc++9-devel-9.3.1-alt1 sisyphus+251917.40.3.1 1589812684 installed
<13>Nov 23 10:04:42 rpmi: gcc9-c++-9.3.1-alt1 sisyphus+251917.40.3.1 1589812684 installed
<13>Nov 23 10:04:42 rpmi: gcc-c++-9-alt2 sisyphus+251923.100.2.2 1589881401 installed
<13>Nov 23 10:04:42 rpmi: rpm-macros-cmake-3.18.5-alt1 sisyphus+262074.100.1.1 1605723168 installed
<13>Nov 23 10:04:42 rpmi: rmt-0.4b44-alt2 sisyphus+250767.100.1.1 1588080613 installed
<13>Nov 23 10:04:42 rpmi: libe2fs-1.45.6.0.24.af1a-alt1 sisyphus+262279.100.1.1 1606088229 installed
<13>Nov 23 10:04:42 rpmi: dump-0.4b44-alt2 sisyphus+250767.100.1.1 1588080613 installed
<13>Nov 23 10:04:43 rpmi: cmake-modules-3.18.5-alt1 sisyphus+262074.100.1.1 1605723138 installed
<13>Nov 23 10:04:43 rpmi: libuv-1.40.0-alt1 sisyphus+259303.100.2.1 1602003324 installed
<13>Nov 23 10:04:43 rpmi: librhash-1.3.5-alt2 1505156279 installed
<13>Nov 23 10:04:43 rpmi: libjsoncpp19-1.8.4-alt5 sisyphus+243670.100.1.1 1577521267 installed
<13>Nov 23 10:04:43 rpmi: libarchive13-3.4.3-alt1 sisyphus+258566.100.1.2 1600916107 installed
<13>Nov 23 10:04:43 rpmi: alsa-ucm-conf-1.2.4-alt1 sisyphus+260180.200.1.1 1603282405 installed
<13>Nov 23 10:04:43 rpmi: alsa-topology-conf-1.2.4-alt1 sisyphus+260180.100.1.1 1603282384 installed
<13>Nov 23 10:04:43 rpmi: libalsa-1:1.2.4-alt1 sisyphus+260180.300.1.1 1603282509 installed
<13>Nov 23 10:04:43 rpmi: libImageMagick6-common-6.9.11.35-alt1 sisyphus+258819.160.9.1 1604414668 installed
<13>Nov 23 10:04:43 rpmi: libwmflite-0.2.8.4-alt13 1506519339 installed
<13>Nov 23 10:04:43 rpmi: liblqr-0.4.2-alt1 1383038438 installed
<13>Nov 23 10:04:43 rpmi: libx265-192-3.4-alt1 sisyphus+254160.100.7.1 1593756037 installed
<13>Nov 23 10:04:43 rpmi: libde265-1.0.7-alt1 sisyphus+258615.100.1.1 1600957231 installed
<13>Nov 23 10:04:43 rpmi: libaom2-2.0.0-alt1 sisyphus+254346.100.1.1 1593682592 installed
<13>Nov 23 10:04:43 rpmi: libfftw3-common-3.3.8-alt1 sisyphus+247390.100.1.1 1583426835 installed
<13>Nov 23 10:04:43 rpmi: libfftw3-3.3.8-alt1 sisyphus+247390.100.1.1 1583426459 installed
<13>Nov 23 10:04:43 rpmi: djvu-common-3.5.27-alt1 sisyphus+252709.100.1.1 1591173068 installed
<13>Nov 23 10:04:43 rpmi: libdjvu-3.5.27-alt1 sisyphus+252709.100.1.1 1591173066 installed
<13>Nov 23 10:04:43 rpmi: libgts-0.7.6-alt2.drc20130205.1 sisyphus+225727.500.8.1 1553672623 installed
<13>Nov 23 10:04:43 rpmi: libpaper-1.1.28-alt1 sisyphus+259176.100.1.1 1601738993 installed
<13>Nov 23 10:04:43 rpmi: liblz4-1:1.9.2-alt1 sisyphus+238585.100.2.2 1570066927 installed
<13>Nov 23 10:04:43 rpmi: libgpg-error-1.36-alt1 sisyphus+225621.300.1.1 1553521082 installed
<13>Nov 23 10:04:43 rpmi: libgcrypt20-1.8.5-alt3 sisyphus+239622.100.1.1 1571746654 installed
<13>Nov 23 10:04:43 rpmi: libsystemd-1:246.6-alt5 sisyphus+261229.100.1.1 1604798416 installed
<13>Nov 23 10:04:43 rpmi: libdbus-1.12.18-alt1 sisyphus+252758.100.1.1 1591203693 installed
<13>Nov 23 10:04:43 rpmi: libavahi-0.8-alt1 sisyphus+255349.240.4.1 1595604514 installed
<13>Nov 23 10:04:44 rpmi: libcups-2.3.1-alt2 sisyphus+255816.100.2.1 1596533556 installed
<13>Nov 23 10:04:44 rpmi: libqt5-dbus-5.15.1-alt3 sisyphus+262098.100.1.1 1605773495 installed
<13>Nov 23 10:04:44 rpmi: libqt5-network-5.15.1-alt3 sisyphus+262098.100.1.1 1605773495 installed
<13>Nov 23 10:04:44 rpmi: libxslt-1.1.34-alt2 sisyphus+248264.100.1.1 1584829770 installed
<13>Nov 23 10:04:44 rpmi: icon-theme-hicolor-0.17-alt2 sisyphus+248343.100.1.1 1584979043 installed
<13>Nov 23 10:04:44 rpmi: libgdk-pixbuf-locales-2.42.0-alt1 sisyphus+261999.200.2.1 1605722003 installed
<13>Nov 23 10:04:44 rpmi: libgtk+2-locales-2.24.32-alt4 sisyphus+255972.200.2.1 1596837957 installed
<13>Nov 23 10:04:44 rpmi: libatk-locales-2.36.0-alt1 sisyphus+249208.100.1.1 1585840405 installed
<13>Nov 23 10:04:44 rpmi: libatk-2.36.0-alt1 sisyphus+249208.100.1.1 1585840406 installed
<13>Nov 23 10:04:44 rpmi: libdatrie-0.2.9-alt1_6 1511686676 installed
<13>Nov 23 10:04:44 rpmi: libthai-0.1.28-alt1_1 sisyphus+226107.100.1.1 1554123079 installed
<13>Nov 23 10:04:44 rpmi: shared-mime-info-2.0-alt1 sisyphus+251302.100.1.1 1588847607 installed
<13>Nov 23 10:04:44 rpmi: gsettings-desktop-schemas-data-3.38.0-alt1 sisyphus+258314.500.14.2 1600843028 installed
<13>Nov 23 10:04:45 rpmi: libgio-2.66.3-alt1 sisyphus+261863.100.1.1 1605540253 installed
<13>Nov 23 10:04:45 rpmi: gsettings-desktop-schemas-3.38.0-alt1 sisyphus+258314.500.14.2 1600843530 installed
<13>Nov 23 10:04:45 rpmi: libgdk-pixbuf-2.42.0-alt1 sisyphus+261999.200.2.1 1605722034 installed
<13>Nov 23 10:04:45 rpmi: gtk-update-icon-cache-3.24.23-alt2 sisyphus+258314.2000.14.2 1600845597 installed
<13>Nov 23 10:04:45 rpmi: libheif-1.9.0-alt1 sisyphus+258615.200.1.1 1600957299 installed
<13>Nov 23 10:04:45 rpmi: libpixman-3:0.40.0-alt1 sisyphus+250700.100.1.1 1587971055 installed
<13>Nov 23 10:04:45 rpmi: libgraphite2-1.3.14-alt2 sisyphus+250009.100.1.1 1586943065 installed
<13>Nov 23 10:04:45 rpmi: libharfbuzz-2.6.8-alt1 sisyphus+254028.100.1.1 1593106819 installed
<13>Nov 23 10:04:45 rpmi: libfreetype-2.10.4-alt2 sisyphus+260293.100.2.1 1604479496 installed
<13>Nov 23 10:04:45 rpmi: fontconfig-2.13.1-alt1 sisyphus+257555.100.1.1 1599475160 installed
Updating fonts cache: <29>Nov 23 10:04:46 fontconfig: Updating fonts cache: succeeded
[ DONE ]
<13>Nov 23 10:04:47 rpmi: libgs-9.53.3-alt1 sisyphus+260366.100.1.1 1603614538 installed
<13>Nov 23 10:04:47 rpmi: libraqm-0.7.0-alt1 sisyphus+235164.100.2.1 1564651518 installed
<13>Nov 23 10:04:47 rpmi: libxshmfence-1.3-alt1 sisyphus+223149.1000.2.1 1551268571 installed
<13>Nov 23 10:04:47 rpmi: libwayland-client-1.18.0-alt1 sisyphus+255795.100.1.1 1596475648 installed
<13>Nov 23 10:04:47 rpmi: libpciaccess-1:0.16-alt1 sisyphus+234814.100.1.1 1563438291 installed
<13>Nov 23 10:04:47 rpmi: libdrm-1:2.4.103-alt1 sisyphus+261080.100.1.1 1604598368 installed
<13>Nov 23 10:04:47 rpmi: libgbm-4:20.2.2-alt1 sisyphus+261341.100.1.1 1604901712 installed
<13>Nov 23 10:04:47 rpmi: libX11-locales-3:1.6.12-alt1 sisyphus+256796.100.1.1 1598422159 installed
<13>Nov 23 10:04:47 rpmi: libXdmcp-1.1.3-alt1 sisyphus+225206.600.1.2 1552949353 installed
<13>Nov 23 10:04:47 rpmi: libXau-1.0.9-alt1 sisyphus+223149.200.2.1 1551268152 installed
<13>Nov 23 10:04:47 rpmi: libxcb-1.14-alt1 sisyphus+247358.200.1.3 1583854228 installed
<13>Nov 23 10:04:48 rpmi: libX11-3:1.6.12-alt1 sisyphus+256796.100.1.1 1598422166 installed
<13>Nov 23 10:04:48 rpmi: libXext-1.3.4-alt1 sisyphus+225206.700.1.2 1552949429 installed
<13>Nov 23 10:04:48 rpmi: libXrender-0.9.10-alt1 sisyphus+261890.100.1.1 1605595177 installed
<13>Nov 23 10:04:48 rpmi: libXfixes-5.0.3-alt1 sisyphus+226736.100.2.2 1554614841 installed
<13>Nov 23 10:04:48 rpmi: libXdamage-1.1.5-alt1 sisyphus+225206.500.1.2 1552949286 installed
<13>Nov 23 10:04:50 rpmi: libxcb-devel-1.14-alt1 sisyphus+247358.200.1.3 1583854228 installed
<13>Nov 23 10:04:50 rpmi: libX11-devel-3:1.6.12-alt1 sisyphus+256796.100.1.1 1598422166 installed
<13>Nov 23 10:04:50 rpmi: libXcursor-1.2.0-alt1 sisyphus+225206.400.1.2 1552949218 installed
<13>Nov 23 10:04:50 rpmi: libXft-2.3.3-alt1 sisyphus+225206.1000.3.2 1552987708 installed
<13>Nov 23 10:04:50 rpmi: libXrandr-1.5.2-alt1 sisyphus+225206.1300.1.2 1552949710 installed
<13>Nov 23 10:04:50 rpmi: libXxf86vm-1.1.4-alt2 1527672187 installed
<13>Nov 23 10:04:50 rpmi: libGLX-mesa-4:20.2.2-alt1 sisyphus+261341.100.1.1 1604901712 installed
<13>Nov 23 10:04:50 rpmi: libEGL-mesa-4:20.2.2-alt1 sisyphus+261341.100.1.1 1604901712 installed
<13>Nov 23 10:04:50 rpmi: libEGL-7:1.3.2-alt1 sisyphus+254610.100.1.1 1594124268 installed
<13>Nov 23 10:04:50 rpmi: libGLX-7:1.3.2-alt1 sisyphus+254610.100.1.1 1594124268 installed
<13>Nov 23 10:04:50 rpmi: libGL-7:1.3.2-alt1 sisyphus+254610.100.1.1 1594124268 installed
<13>Nov 23 10:04:50 rpmi: libcairo-1:1.16.0-alt1 sisyphus+226534.100.2.3 1554515535 installed
<13>Nov 23 10:04:50 rpmi: libpango-1.48.0-alt1 sisyphus+261300.100.2.1 1604868816 installed
<13>Nov 23 10:04:50 rpmi: liblasi-1.1.3-alt2 sisyphus+239300.100.1.1 1571209616 installed
<13>Nov 23 10:04:50 rpmi: libcairo-gobject-1:1.16.0-alt1 sisyphus+226534.100.2.3 1554515535 installed
<13>Nov 23 10:04:50 rpmi: librsvg-1:2.50.2-alt1 sisyphus+262203.100.1.2 1605908464 installed
<13>Nov 23 10:04:51 rpmi: libglvnd-devel-7:1.3.2-alt1 sisyphus+254610.100.1.1 1594124268 installed
<13>Nov 23 10:04:51 rpmi: libXi-1.7.10-alt1 sisyphus+232786.300.1.1 1561106978 installed
<13>Nov 23 10:04:51 rpmi: libXinerama-1.1.4-alt1 sisyphus+223149.300.2.1 1551268216 installed
<13>Nov 23 10:04:51 rpmi: libXt-1.2.0-alt1 sisyphus+247690.400.1.1 1584000596 installed
<13>Nov 23 10:04:51 rpmi: libXpm-3.5.13-alt1 sisyphus+247690.300.1.1 1584000526 installed
<13>Nov 23 10:04:51 rpmi: libgd3-2.3.0-alt2 sisyphus+250375.100.2.1 1587542909 installed
<13>Nov 23 10:04:51 rpmi: libXcomposite-0.4.5-alt1 sisyphus+225206.300.1.2 1552949137 installed
<13>Nov 23 10:04:51 rpmi: libgtk+2-2.24.32-alt4 sisyphus+255972.200.2.1 1596837989 installed
<13>Nov 23 10:04:51 rpmi: libgraphviz-2.41.2-alt4 sisyphus+258874.100.1.1 1601381242 installed
<13>Nov 23 10:04:51 rpmi: libxcbutil-icccm-0.4.1-alt2 sisyphus+229000.100.1.1 1557152221 installed
<13>Nov 23 10:04:51 rpmi: libxcbutil-1:0.4.0-alt1 1413392888 installed
<13>Nov 23 10:04:51 rpmi: libxcbutil-image-0.4.0-alt1 1446204182 installed
<13>Nov 23 10:04:51 rpmi: libxcbutil-keysyms-0.4.0-alt1 1446204124 installed
<13>Nov 23 10:04:51 rpmi: libxcb-render-util-0.3.9-alt3 sisyphus+222674.100.1.1 1550989886 installed
<13>Nov 23 10:04:51 rpmi: libxkbcommon-x11-1.0.2-alt1 sisyphus+262214.100.1.1 1605972038 installed
<13>Nov 23 10:04:51 rpmi: libqt5-eglfsdeviceintegration-5.15.1-alt3 sisyphus+262098.100.1.1 1605773495 installed
<13>Nov 23 10:04:51 rpmi: libqt5-xcbqpa-5.15.1-alt3 sisyphus+262098.100.1.1 1605773495 installed
<13>Nov 23 10:04:51 rpmi: libqt5-eglfskmssupport-5.15.1-alt3 sisyphus+262098.100.1.1 1605773495 installed
<13>Nov 23 10:04:52 rpmi: libqt5-gui-5.15.1-alt3 sisyphus+262098.100.1.1 1605773495 installed
<13>Nov 23 10:04:52 rpmi: libqt5-widgets-5.15.1-alt3 sisyphus+262098.100.1.1 1605773495 installed
<13>Nov 23 10:04:52 rpmi: libqt5-qmlmodels-5.15.1-alt1 sisyphus+257838.200.3.1 1600068979 installed
<13>Nov 23 10:04:52 rpmi: libqt5-qmlworkerscript-5.15.1-alt1 sisyphus+257838.200.3.1 1600068979 installed
<13>Nov 23 10:04:52 rpmi: libqt5-quick-5.15.1-alt1 sisyphus+257838.200.3.1 1600068979 installed
<13>Nov 23 10:04:52 rpmi: libqt5-quickshapes-5.15.1-alt1 sisyphus+257838.200.3.1 1600068979 installed
<13>Nov 23 10:04:52 rpmi: libqt5-qml-5.15.1-alt1 sisyphus+257838.200.3.1 1600068979 installed
<13>Nov 23 10:04:52 rpmi: libqt5-printsupport-5.15.1-alt3 sisyphus+262098.100.1.1 1605773495 installed
<13>Nov 23 10:04:52 rpmi: libqt5-quickparticles-5.15.1-alt1 sisyphus+257838.200.3.1 1600068979 installed
<13>Nov 23 10:04:52 rpmi: libqt5-quicktest-5.15.1-alt1 sisyphus+257838.200.3.1 1600068979 installed
<13>Nov 23 10:04:52 rpmi: libqt5-quickwidgets-5.15.1-alt1 sisyphus+257838.200.3.1 1600068979 installed
<13>Nov 23 10:04:52 rpmi: libqt5-webchannel-5.15.1-alt1 sisyphus+257838.1300.3.1 1600071421 installed
<13>Nov 23 10:04:54 rpmi: libqt5-webkit-5.212.0-alt18 sisyphus+257838.4500.3.1 1600080719 installed
<13>Nov 23 10:04:54 rpmi: libqt5-webkitwidgets-5.212.0-alt18 sisyphus+257838.4500.3.1 1600080719 installed
<13>Nov 23 10:04:54 rpmi: rpm-build-qml-5.15.1-alt1 sisyphus+257838.200.3.1 1600068979 installed
<13>Nov 23 10:04:54 rpmi: libqt5-designer-5.15.1-alt1 sisyphus+257838.400.3.1 1600069754 installed
<13>Nov 23 10:04:54 rpmi: libqt5-designercomponents-5.15.1-alt1 sisyphus+257838.400.3.1 1600069754 installed
<13>Nov 23 10:04:54 rpmi: libqt5-help-5.15.1-alt1 sisyphus+257838.400.3.1 1600069754 installed
<13>Nov 23 10:04:54 rpmi: libqt5-opengl-5.15.1-alt3 sisyphus+262098.100.1.1 1605773495 installed
<13>Nov 23 10:04:55 rpmi: qt5-base-devel-5.15.1-alt3 sisyphus+262098.100.1.1 1605773495 installed
<13>Nov 23 10:04:55 rpmi: qt5-declarative-devel-5.15.1-alt1 sisyphus+257838.200.3.1 1600068979 installed
<13>Nov 23 10:04:55 rpmi: libqt5-svg-5.15.1-alt1 sisyphus+257838.2000.3.1 1600072089 installed
<13>Nov 23 10:04:55 rpmi: openexr25-common-2.5.3-alt1 sisyphus+260406.200.2.1 1603719730 installed
<13>Nov 23 10:04:56 rpmi: libilmimf25-2.5.3-alt1 sisyphus+260406.200.2.1 1603719730 installed
<13>Nov 23 10:04:56 rpmi: libImageMagick6.6-6.9.11.35-alt1 sisyphus+258819.160.9.1 1604414668 installed
<13>Nov 23 10:04:58 rpmi: llvm10.0-libs-10.0.1-alt2 sisyphus+256264.100.7.1 1598866876 installed
<13>Nov 23 10:05:02 rpmi: clang10.0-libs-10.0.1-alt2 sisyphus+256264.100.7.1 1598866876 installed
<13>Nov 23 10:05:03 rpmi: qt5-tools-5.15.1-alt1 sisyphus+257838.400.3.1 1600069754 installed
<13>Nov 23 10:05:03 rpmi: qt5-tools-devel-5.15.1-alt1 sisyphus+257838.400.3.1 1600069754 installed
<13>Nov 23 10:05:03 rpmi: ImageMagick-tools-6.9.11.35-alt1 sisyphus+258819.160.9.1 1604414668 installed
<13>Nov 23 10:05:03 rpmi: qt5-svg-devel-5.15.1-alt1 sisyphus+257838.2000.3.1 1600072089 installed
<13>Nov 23 10:05:03 rpmi: qt5-webkit-devel-5.212.0-alt18 sisyphus+257838.4500.3.1 1600080719 installed
<13>Nov 23 10:05:03 rpmi: libalsa-devel-1:1.2.4-alt1 sisyphus+260180.300.1.1 1603282509 installed
<13>Nov 23 10:05:03 rpmi: cmake-3.18.5-alt1 sisyphus+262074.100.1.1 1605723168 installed
<13>Nov 23 10:05:03 rpmi: desktop-file-utils-0.23-alt2 sisyphus+226879.100.1.1 1554744356 installed
<13>Nov 23 10:05:03 rpmi: zlib-devel-1.2.11-alt1 sisyphus+221902.6000.4.1 1550601058 installed
Building target platforms: i586
Building for target i586
Wrote: /usr/src/in/nosrpm/canorus-0.7.3.git3a25392-alt1.nosrc.rpm
Installing canorus-0.7.3.git3a25392-alt1.src.rpm
Building target platforms: i586
Building for target i586
Executing(%prep): /bin/sh -e /usr/src/tmp/rpm-tmp.82415
+ umask 022
+ /bin/mkdir -p /usr/src/RPM/BUILD
+ cd /usr/src/RPM/BUILD
+ cd /usr/src/RPM/BUILD
+ rm -rf canorus-0.7.3.git3a25392
+ echo 'Source #0 (canorus-0.7.3.git3a25392.tar):'
Source #0 (canorus-0.7.3.git3a25392.tar):
+ /bin/tar -xf /usr/src/RPM/SOURCES/canorus-0.7.3.git3a25392.tar
+ cd canorus-0.7.3.git3a25392
+ /bin/chmod -c -Rf u+rwX,go-w .
+ exit 0
Executing(%build): /bin/sh -e /usr/src/tmp/rpm-tmp.71403
+ umask 022
+ /bin/mkdir -p /usr/src/RPM/BUILD
+ cd /usr/src/RPM/BUILD
+ cd canorus-0.7.3.git3a25392
+ cmake . -DCMAKE_SKIP_RPATH:BOOL=ON -DCMAKE_SKIP_INSTALL_RPATH:BOOL=yes '-DCMAKE_C_FLAGS:STRING=-pipe -frecord-gcc-switches -Wall -g -O2 -march=i586 -mtune=generic' '-DCMAKE_CXX_FLAGS:STRING=-pipe -frecord-gcc-switches -Wall -g -O2 -march=i586 -mtune=generic' '-DCMAKE_Fortran_FLAGS:STRING=-pipe -frecord-gcc-switches -Wall -g -O2 -march=i586 -mtune=generic' -DCMAKE_INSTALL_PREFIX=/usr -DINCLUDE_INSTALL_DIR:PATH=/usr/include -DLIB_INSTALL_DIR:PATH=/usr/lib -DSYSCONF_INSTALL_DIR:PATH=/etc -DSHARE_INSTALL_PREFIX:PATH=/usr/share -DLIB_SUFFIX= -DLIB_DESTINATION=lib
-- The C compiler identification is GNU 9.3.1
-- The CXX compiler identification is GNU 9.3.1
-- Detecting C compiler ABI info
-- Detecting C compiler ABI info - done
-- Check for working C compiler: /usr/bin/cc - skipped
-- Detecting C compile features
-- Detecting C compile features - done
-- Detecting CXX compiler ABI info
-- Detecting CXX compiler ABI info - done
-- Check for working CXX compiler: /usr/bin/c++ - skipped
-- Detecting CXX compile features
-- Detecting CXX compile features - done
CMake Warning at CMakeLists.txt:102 (FIND_PACKAGE):
  By not providing "FindQt5WebEngineWidgets.cmake" in CMAKE_MODULE_PATH this
  project has asked CMake to find a package configuration file provided by
  "Qt5WebEngineWidgets", but CMake did not find one.

  Could not find a package configuration file provided by
  "Qt5WebEngineWidgets" with any of the following names:

    Qt5WebEngineWidgetsConfig.cmake
    qt5webenginewidgets-config.cmake

  Add the installation prefix of "Qt5WebEngineWidgets" to CMAKE_PREFIX_PATH
  or set "Qt5WebEngineWidgets_DIR" to a directory containing one of the above
  files.  If "Qt5WebEngineWidgets" provides a separate development package or
  SDK, be sure it has been installed.


-- Found ALSA: /usr/lib/libasound.so (found version "1.2.4") 
SWIG version >= 3.0.8 *not* found, version is , disabling SWIG!
-- Could NOT find Ruby (missing: Ruby_EXECUTABLE Ruby_INCLUDE_DIR Ruby_LIBRARY) (Required is at least version "1.8.0")
Ruby Library and Development files *not* found. Ruby extensions disabled!
-- Could NOT find PythonLibs (missing: PYTHON_LIBRARIES PYTHON_INCLUDE_DIRS) (Required is at least version "3")
Python Library and Development files *not* found. Python extensions disabled!
-- Configuring done
-- Generating done
CMake Warning:
  Manually-specified variables were not used by the project:

    CMAKE_Fortran_FLAGS
    CMAKE_SKIP_INSTALL_RPATH
    INCLUDE_INSTALL_DIR
    LIB_DESTINATION
    LIB_INSTALL_DIR
    LIB_SUFFIX
    SHARE_INSTALL_PREFIX
    SYSCONF_INSTALL_DIR


-- Build files have been written to: /usr/src/RPM/BUILD/canorus-0.7.3.git3a25392
+ make -j8 VERBOSE=1
make: Entering directory '/usr/src/RPM/BUILD/canorus-0.7.3.git3a25392'
/usr/bin/cmake -S/usr/src/RPM/BUILD/canorus-0.7.3.git3a25392 -B/usr/src/RPM/BUILD/canorus-0.7.3.git3a25392 --check-build-system CMakeFiles/Makefile.cmake 0
make: Leaving directory '/usr/src/RPM/BUILD/canorus-0.7.3.git3a25392'
make: Entering directory '/usr/src/RPM/BUILD/canorus-0.7.3.git3a25392'
/usr/bin/cmake -E cmake_progress_start /usr/src/RPM/BUILD/canorus-0.7.3.git3a25392/CMakeFiles /usr/src/RPM/BUILD/canorus-0.7.3.git3a25392//CMakeFiles/progress.marks
make: Leaving directory '/usr/src/RPM/BUILD/canorus-0.7.3.git3a25392'
make  -f CMakeFiles/Makefile2 all
make  -f src/CMakeFiles/canorus_qm.dir/build.make src/CMakeFiles/canorus_qm.dir/depend
make[2]: Entering directory '/usr/src/RPM/BUILD/canorus-0.7.3.git3a25392'
cd /usr/src/RPM/BUILD/canorus-0.7.3.git3a25392 && /usr/bin/cmake -E cmake_depends "Unix Makefiles" /usr/src/RPM/BUILD/canorus-0.7.3.git3a25392 /usr/src/RPM/BUILD/canorus-0.7.3.git3a25392/src /usr/src/RPM/BUILD/canorus-0.7.3.git3a25392 /usr/src/RPM/BUILD/canorus-0.7.3.git3a25392/src /usr/src/RPM/BUILD/canorus-0.7.3.git3a25392/src/CMakeFiles/canorus_qm.dir/DependInfo.cmake --color=
Dependee "/usr/src/RPM/BUILD/canorus-0.7.3.git3a25392/src/CMakeFiles/canorus_qm.dir/DependInfo.cmake" is newer than depender "/usr/src/RPM/BUILD/canorus-0.7.3.git3a25392/src/CMakeFiles/canorus_qm.dir/depend.internal".
Dependee "/usr/src/RPM/BUILD/canorus-0.7.3.git3a25392/src/CMakeFiles/CMakeDirectoryInformation.cmake" is newer than depender "/usr/src/RPM/BUILD/canorus-0.7.3.git3a25392/src/CMakeFiles/canorus_qm.dir/depend.internal".
Scanning dependencies of target canorus_qm
make[2]: Leaving directory '/usr/src/RPM/BUILD/canorus-0.7.3.git3a25392'
make  -f src/CMakeFiles/canorus_qm.dir/build.make src/CMakeFiles/canorus_qm.dir/build
make[2]: Entering directory '/usr/src/RPM/BUILD/canorus-0.7.3.git3a25392'
[  1%] Generating lang/cs.qm
cd /usr/src/RPM/BUILD/canorus-0.7.3.git3a25392/src && /usr/share/qt5/bin/lrelease /usr/src/RPM/BUILD/canorus-0.7.3.git3a25392/src/lang/cs.ts -qm /usr/src/RPM/BUILD/canorus-0.7.3.git3a25392/src/lang/cs.qm
Updating '/usr/src/RPM/BUILD/canorus-0.7.3.git3a25392/src/lang/cs.qm'...
    Generated 729 translation(s) (729 finished and 0 unfinished)
    Ignored 49 untranslated source text(s)
make[2]: Leaving directory '/usr/src/RPM/BUILD/canorus-0.7.3.git3a25392'
make[2]: Entering directory '/usr/src/RPM/BUILD/canorus-0.7.3.git3a25392'
[  1%] Generating lang/he.qm
cd /usr/src/RPM/BUILD/canorus-0.7.3.git3a25392/src && /usr/share/qt5/bin/lrelease /usr/src/RPM/BUILD/canorus-0.7.3.git3a25392/src/lang/he.ts -qm /usr/src/RPM/BUILD/canorus-0.7.3.git3a25392/src/lang/he.qm
Updating '/usr/src/RPM/BUILD/canorus-0.7.3.git3a25392/src/lang/he.qm'...
    Generated 529 translation(s) (529 finished and 0 unfinished)
    Ignored 249 untranslated source text(s)
make[2]: Leaving directory '/usr/src/RPM/BUILD/canorus-0.7.3.git3a25392'
make[2]: Entering directory '/usr/src/RPM/BUILD/canorus-0.7.3.git3a25392'
[  2%] Generating lang/hu.qm
cd /usr/src/RPM/BUILD/canorus-0.7.3.git3a25392/src && /usr/share/qt5/bin/lrelease /usr/src/RPM/BUILD/canorus-0.7.3.git3a25392/src/lang/hu.ts -qm /usr/src/RPM/BUILD/canorus-0.7.3.git3a25392/src/lang/hu.qm
Updating '/usr/src/RPM/BUILD/canorus-0.7.3.git3a25392/src/lang/hu.qm'...
    Generated 487 translation(s) (487 finished and 0 unfinished)
    Ignored 291 untranslated source text(s)
make[2]: Leaving directory '/usr/src/RPM/BUILD/canorus-0.7.3.git3a25392'
make[2]: Entering directory '/usr/src/RPM/BUILD/canorus-0.7.3.git3a25392'
[  1%] Generating lang/da.qm
cd /usr/src/RPM/BUILD/canorus-0.7.3.git3a25392/src && /usr/share/qt5/bin/lrelease /usr/src/RPM/BUILD/canorus-0.7.3.git3a25392/src/lang/da.ts -qm /usr/src/RPM/BUILD/canorus-0.7.3.git3a25392/src/lang/da.qm
Updating '/usr/src/RPM/BUILD/canorus-0.7.3.git3a25392/src/lang/da.qm'...
    Generated 552 translation(s) (552 finished and 0 unfinished)
    Ignored 226 untranslated source text(s)
make[2]: Leaving directory '/usr/src/RPM/BUILD/canorus-0.7.3.git3a25392'
make[2]: Entering directory '/usr/src/RPM/BUILD/canorus-0.7.3.git3a25392'
[  1%] Generating lang/de.qm
cd /usr/src/RPM/BUILD/canorus-0.7.3.git3a25392/src && /usr/share/qt5/bin/lrelease /usr/src/RPM/BUILD/canorus-0.7.3.git3a25392/src/lang/de.ts -qm /usr/src/RPM/BUILD/canorus-0.7.3.git3a25392/src/lang/de.qm
Updating '/usr/src/RPM/BUILD/canorus-0.7.3.git3a25392/src/lang/de.qm'...
    Generated 590 translation(s) (590 finished and 0 unfinished)
    Ignored 188 untranslated source text(s)
make[2]: Leaving directory '/usr/src/RPM/BUILD/canorus-0.7.3.git3a25392'
make[2]: Entering directory '/usr/src/RPM/BUILD/canorus-0.7.3.git3a25392'
[  3%] Generating lang/it.qm
cd /usr/src/RPM/BUILD/canorus-0.7.3.git3a25392/src && /usr/share/qt5/bin/lrelease /usr/src/RPM/BUILD/canorus-0.7.3.git3a25392/src/lang/it.ts -qm /usr/src/RPM/BUILD/canorus-0.7.3.git3a25392/src/lang/it.qm
Updating '/usr/src/RPM/BUILD/canorus-0.7.3.git3a25392/src/lang/it.qm'...
    Generated 406 translation(s) (406 finished and 0 unfinished)
    Ignored 372 untranslated source text(s)
make[2]: Leaving directory '/usr/src/RPM/BUILD/canorus-0.7.3.git3a25392'
make[2]: Entering directory '/usr/src/RPM/BUILD/canorus-0.7.3.git3a25392'
[  2%] Generating lang/fr.qm
cd /usr/src/RPM/BUILD/canorus-0.7.3.git3a25392/src && /usr/share/qt5/bin/lrelease /usr/src/RPM/BUILD/canorus-0.7.3.git3a25392/src/lang/fr.ts -qm /usr/src/RPM/BUILD/canorus-0.7.3.git3a25392/src/lang/fr.qm
Updating '/usr/src/RPM/BUILD/canorus-0.7.3.git3a25392/src/lang/fr.qm'...
    Generated 576 translation(s) (576 finished and 0 unfinished)
    Ignored 202 untranslated source text(s)
make[2]: Leaving directory '/usr/src/RPM/BUILD/canorus-0.7.3.git3a25392'
make[2]: Entering directory '/usr/src/RPM/BUILD/canorus-0.7.3.git3a25392'
[  3%] Generating lang/nb.qm
cd /usr/src/RPM/BUILD/canorus-0.7.3.git3a25392/src && /usr/share/qt5/bin/lrelease /usr/src/RPM/BUILD/canorus-0.7.3.git3a25392/src/lang/nb.ts -qm /usr/src/RPM/BUILD/canorus-0.7.3.git3a25392/src/lang/nb.qm
Updating '/usr/src/RPM/BUILD/canorus-0.7.3.git3a25392/src/lang/nb.qm'...
    Generated 682 translation(s) (682 finished and 0 unfinished)
    Ignored 96 untranslated source text(s)
make[2]: Leaving directory '/usr/src/RPM/BUILD/canorus-0.7.3.git3a25392'
make[2]: Entering directory '/usr/src/RPM/BUILD/canorus-0.7.3.git3a25392'
[  4%] Generating lang/nl.qm
cd /usr/src/RPM/BUILD/canorus-0.7.3.git3a25392/src && /usr/share/qt5/bin/lrelease /usr/src/RPM/BUILD/canorus-0.7.3.git3a25392/src/lang/nl.ts -qm /usr/src/RPM/BUILD/canorus-0.7.3.git3a25392/src/lang/nl.qm
Updating '/usr/src/RPM/BUILD/canorus-0.7.3.git3a25392/src/lang/nl.qm'...
    Generated 333 translation(s) (333 finished and 0 unfinished)
    Ignored 445 untranslated source text(s)
make[2]: Leaving directory '/usr/src/RPM/BUILD/canorus-0.7.3.git3a25392'
make[2]: Entering directory '/usr/src/RPM/BUILD/canorus-0.7.3.git3a25392'
[  5%] Generating lang/uk.qm
cd /usr/src/RPM/BUILD/canorus-0.7.3.git3a25392/src && /usr/share/qt5/bin/lrelease /usr/src/RPM/BUILD/canorus-0.7.3.git3a25392/src/lang/uk.ts -qm /usr/src/RPM/BUILD/canorus-0.7.3.git3a25392/src/lang/uk.qm
Updating '/usr/src/RPM/BUILD/canorus-0.7.3.git3a25392/src/lang/uk.qm'...
    Generated 232 translation(s) (232 finished and 0 unfinished)
    Ignored 546 untranslated source text(s)
make[2]: Leaving directory '/usr/src/RPM/BUILD/canorus-0.7.3.git3a25392'
make[2]: Entering directory '/usr/src/RPM/BUILD/canorus-0.7.3.git3a25392'
[  5%] Generating lang/template.qm
cd /usr/src/RPM/BUILD/canorus-0.7.3.git3a25392/src && /usr/share/qt5/bin/lrelease /usr/src/RPM/BUILD/canorus-0.7.3.git3a25392/src/lang/template.ts -qm /usr/src/RPM/BUILD/canorus-0.7.3.git3a25392/src/lang/template.qm
Updating '/usr/src/RPM/BUILD/canorus-0.7.3.git3a25392/src/lang/template.qm'...
    Generated 0 translation(s) (0 finished and 0 unfinished)
    Ignored 778 untranslated source text(s)
make[2]: Leaving directory '/usr/src/RPM/BUILD/canorus-0.7.3.git3a25392'
make[2]: Entering directory '/usr/src/RPM/BUILD/canorus-0.7.3.git3a25392'
[  4%] Generating lang/ru.qm
cd /usr/src/RPM/BUILD/canorus-0.7.3.git3a25392/src && /usr/share/qt5/bin/lrelease /usr/src/RPM/BUILD/canorus-0.7.3.git3a25392/src/lang/ru.ts -qm /usr/src/RPM/BUILD/canorus-0.7.3.git3a25392/src/lang/ru.qm
Updating '/usr/src/RPM/BUILD/canorus-0.7.3.git3a25392/src/lang/ru.qm'...
    Generated 778 translation(s) (778 finished and 0 unfinished)
make[2]: Leaving directory '/usr/src/RPM/BUILD/canorus-0.7.3.git3a25392'
make[2]: Entering directory '/usr/src/RPM/BUILD/canorus-0.7.3.git3a25392'
[  4%] Generating lang/sl.qm
cd /usr/src/RPM/BUILD/canorus-0.7.3.git3a25392/src && /usr/share/qt5/bin/lrelease /usr/src/RPM/BUILD/canorus-0.7.3.git3a25392/src/lang/sl.ts -qm /usr/src/RPM/BUILD/canorus-0.7.3.git3a25392/src/lang/sl.qm
Updating '/usr/src/RPM/BUILD/canorus-0.7.3.git3a25392/src/lang/sl.qm'...
    Generated 786 translation(s) (786 finished and 0 unfinished)
make[2]: Leaving directory '/usr/src/RPM/BUILD/canorus-0.7.3.git3a25392'
make[2]: Entering directory '/usr/src/RPM/BUILD/canorus-0.7.3.git3a25392'
[  5%] Generating lang/sv.qm
cd /usr/src/RPM/BUILD/canorus-0.7.3.git3a25392/src && /usr/share/qt5/bin/lrelease /usr/src/RPM/BUILD/canorus-0.7.3.git3a25392/src/lang/sv.ts -qm /usr/src/RPM/BUILD/canorus-0.7.3.git3a25392/src/lang/sv.qm
Updating '/usr/src/RPM/BUILD/canorus-0.7.3.git3a25392/src/lang/sv.qm'...
    Generated 568 translation(s) (568 finished and 0 unfinished)
    Ignored 210 untranslated source text(s)
make[2]: Leaving directory '/usr/src/RPM/BUILD/canorus-0.7.3.git3a25392'
make[2]: Entering directory '/usr/src/RPM/BUILD/canorus-0.7.3.git3a25392'
[  6%] Generating lang/zh.qm
cd /usr/src/RPM/BUILD/canorus-0.7.3.git3a25392/src && /usr/share/qt5/bin/lrelease /usr/src/RPM/BUILD/canorus-0.7.3.git3a25392/src/lang/zh.ts -qm /usr/src/RPM/BUILD/canorus-0.7.3.git3a25392/src/lang/zh.qm
Updating '/usr/src/RPM/BUILD/canorus-0.7.3.git3a25392/src/lang/zh.qm'...
    Generated 552 translation(s) (552 finished and 0 unfinished)
    Ignored 226 untranslated source text(s)
make[2]: Leaving directory '/usr/src/RPM/BUILD/canorus-0.7.3.git3a25392'
make[1]: Entering directory '/usr/src/RPM/BUILD/canorus-0.7.3.git3a25392'
[  6%] Built target canorus_qm
make[1]: Leaving directory '/usr/src/RPM/BUILD/canorus-0.7.3.git3a25392'
make  -f src/CMakeFiles/canorus.dir/build.make src/CMakeFiles/canorus.dir/depend
make[2]: Entering directory '/usr/src/RPM/BUILD/canorus-0.7.3.git3a25392'
[  6%] Generating scorectl/moc_keysignaturectl.cpp
cd /usr/src/RPM/BUILD/canorus-0.7.3.git3a25392/src/scorectl && /usr/share/qt5/bin/moc @/usr/src/RPM/BUILD/canorus-0.7.3.git3a25392/src/scorectl/moc_keysignaturectl.cpp_parameters
make[2]: Leaving directory '/usr/src/RPM/BUILD/canorus-0.7.3.git3a25392'
make[2]: Entering directory '/usr/src/RPM/BUILD/canorus-0.7.3.git3a25392'
[  7%] Generating ui_propertiesdialog.h
cd /usr/src/RPM/BUILD/canorus-0.7.3.git3a25392/src && /usr/share/qt5/bin/uic -o /usr/src/RPM/BUILD/canorus-0.7.3.git3a25392/src/ui_propertiesdialog.h /usr/src/RPM/BUILD/canorus-0.7.3.git3a25392/src/ui/propertiesdialog.ui
make[2]: Leaving directory '/usr/src/RPM/BUILD/canorus-0.7.3.git3a25392'
make[2]: Entering directory '/usr/src/RPM/BUILD/canorus-0.7.3.git3a25392'
[  7%] Generating ui_documentproperties.h
cd /usr/src/RPM/BUILD/canorus-0.7.3.git3a25392/src && /usr/share/qt5/bin/uic -o /usr/src/RPM/BUILD/canorus-0.7.3.git3a25392/src/ui_documentproperties.h /usr/src/RPM/BUILD/canorus-0.7.3.git3a25392/src/ui/documentproperties.ui
make[2]: Leaving directory '/usr/src/RPM/BUILD/canorus-0.7.3.git3a25392'
make[2]: Entering directory '/usr/src/RPM/BUILD/canorus-0.7.3.git3a25392'
[  6%] Generating ui_mainwin.h
cd /usr/src/RPM/BUILD/canorus-0.7.3.git3a25392/src && /usr/share/qt5/bin/uic -o /usr/src/RPM/BUILD/canorus-0.7.3.git3a25392/src/ui_mainwin.h /usr/src/RPM/BUILD/canorus-0.7.3.git3a25392/src/ui/mainwin.ui
make[2]: Leaving directory '/usr/src/RPM/BUILD/canorus-0.7.3.git3a25392'
make[2]: Entering directory '/usr/src/RPM/BUILD/canorus-0.7.3.git3a25392'
[  7%] Generating ui_settingsdialog.h
cd /usr/src/RPM/BUILD/canorus-0.7.3.git3a25392/src && /usr/share/qt5/bin/uic -o /usr/src/RPM/BUILD/canorus-0.7.3.git3a25392/src/ui_settingsdialog.h /usr/src/RPM/BUILD/canorus-0.7.3.git3a25392/src/ui/settingsdialog.ui
make[2]: Leaving directory '/usr/src/RPM/BUILD/canorus-0.7.3.git3a25392'
make[2]: Entering directory '/usr/src/RPM/BUILD/canorus-0.7.3.git3a25392'
[  7%] Generating ui_sheetproperties.h
cd /usr/src/RPM/BUILD/canorus-0.7.3.git3a25392/src && /usr/share/qt5/bin/uic -o /usr/src/RPM/BUILD/canorus-0.7.3.git3a25392/src/ui_sheetproperties.h /usr/src/RPM/BUILD/canorus-0.7.3.git3a25392/src/ui/sheetproperties.ui
make[2]: Leaving directory '/usr/src/RPM/BUILD/canorus-0.7.3.git3a25392'
make[2]: Entering directory '/usr/src/RPM/BUILD/canorus-0.7.3.git3a25392'
[  8%] Generating ui_voiceproperties.h
cd /usr/src/RPM/BUILD/canorus-0.7.3.git3a25392/src && /usr/share/qt5/bin/uic -o /usr/src/RPM/BUILD/canorus-0.7.3.git3a25392/src/ui_voiceproperties.h /usr/src/RPM/BUILD/canorus-0.7.3.git3a25392/src/ui/voiceproperties.ui
make[2]: Leaving directory '/usr/src/RPM/BUILD/canorus-0.7.3.git3a25392'
make[2]: Entering directory '/usr/src/RPM/BUILD/canorus-0.7.3.git3a25392'
[  8%] Generating ui_staffproperties.h
cd /usr/src/RPM/BUILD/canorus-0.7.3.git3a25392/src && /usr/share/qt5/bin/uic -o /usr/src/RPM/BUILD/canorus-0.7.3.git3a25392/src/ui_staffproperties.h /usr/src/RPM/BUILD/canorus-0.7.3.git3a25392/src/ui/staffproperties.ui
make[2]: Leaving directory '/usr/src/RPM/BUILD/canorus-0.7.3.git3a25392'
make[2]: Entering directory '/usr/src/RPM/BUILD/canorus-0.7.3.git3a25392'
[  8%] Generating ui_lyricscontextproperties.h
cd /usr/src/RPM/BUILD/canorus-0.7.3.git3a25392/src && /usr/share/qt5/bin/uic -o /usr/src/RPM/BUILD/canorus-0.7.3.git3a25392/src/ui_lyricscontextproperties.h /usr/src/RPM/BUILD/canorus-0.7.3.git3a25392/src/ui/lyricscontextproperties.ui
make[2]: Leaving directory '/usr/src/RPM/BUILD/canorus-0.7.3.git3a25392'
make[2]: Entering directory '/usr/src/RPM/BUILD/canorus-0.7.3.git3a25392'
[  9%] Generating ui_functionmarkcontextproperties.h
cd /usr/src/RPM/BUILD/canorus-0.7.3.git3a25392/src && /usr/share/qt5/bin/uic -o /usr/src/RPM/BUILD/canorus-0.7.3.git3a25392/src/ui_functionmarkcontextproperties.h /usr/src/RPM/BUILD/canorus-0.7.3.git3a25392/src/ui/functionmarkcontextproperties.ui
make[2]: Leaving directory '/usr/src/RPM/BUILD/canorus-0.7.3.git3a25392'
make[2]: Entering directory '/usr/src/RPM/BUILD/canorus-0.7.3.git3a25392'
[  9%] Generating ui_chordnamecontextproperties.h
cd /usr/src/RPM/BUILD/canorus-0.7.3.git3a25392/src && /usr/share/qt5/bin/uic -o /usr/src/RPM/BUILD/canorus-0.7.3.git3a25392/src/ui_chordnamecontextproperties.h /usr/src/RPM/BUILD/canorus-0.7.3.git3a25392/src/ui/chordnamecontextproperties.ui
make[2]: Leaving directory '/usr/src/RPM/BUILD/canorus-0.7.3.git3a25392'
make[2]: Entering directory '/usr/src/RPM/BUILD/canorus-0.7.3.git3a25392'
[ 10%] Generating ui_midirecorder.h
cd /usr/src/RPM/BUILD/canorus-0.7.3.git3a25392/src && /usr/share/qt5/bin/uic -o /usr/src/RPM/BUILD/canorus-0.7.3.git3a25392/src/ui_midirecorder.h /usr/src/RPM/BUILD/canorus-0.7.3.git3a25392/src/ui/midirecorder.ui
make[2]: Leaving directory '/usr/src/RPM/BUILD/canorus-0.7.3.git3a25392'
make[2]: Entering directory '/usr/src/RPM/BUILD/canorus-0.7.3.git3a25392'
[ 10%] Generating ui_transposeview.h
cd /usr/src/RPM/BUILD/canorus-0.7.3.git3a25392/src && /usr/share/qt5/bin/uic -o /usr/src/RPM/BUILD/canorus-0.7.3.git3a25392/src/ui_transposeview.h /usr/src/RPM/BUILD/canorus-0.7.3.git3a25392/src/ui/transposeview.ui
make[2]: Leaving directory '/usr/src/RPM/BUILD/canorus-0.7.3.git3a25392'
make[2]: Entering directory '/usr/src/RPM/BUILD/canorus-0.7.3.git3a25392'
[ 10%] Generating ui_jumptoview.h
cd /usr/src/RPM/BUILD/canorus-0.7.3.git3a25392/src && /usr/share/qt5/bin/uic -o /usr/src/RPM/BUILD/canorus-0.7.3.git3a25392/src/ui_jumptoview.h /usr/src/RPM/BUILD/canorus-0.7.3.git3a25392/src/ui/jumptoview.ui
make[2]: Leaving directory '/usr/src/RPM/BUILD/canorus-0.7.3.git3a25392'
make[2]: Entering directory '/usr/src/RPM/BUILD/canorus-0.7.3.git3a25392'
[ 11%] Generating import/moc_import.cpp
cd /usr/src/RPM/BUILD/canorus-0.7.3.git3a25392/src/import && /usr/share/qt5/bin/moc @/usr/src/RPM/BUILD/canorus-0.7.3.git3a25392/src/import/moc_import.cpp_parameters
make[2]: Leaving directory '/usr/src/RPM/BUILD/canorus-0.7.3.git3a25392'
make[2]: Entering directory '/usr/src/RPM/BUILD/canorus-0.7.3.git3a25392'
[ 11%] Generating import/moc_lilypondimport.cpp
cd /usr/src/RPM/BUILD/canorus-0.7.3.git3a25392/src/import && /usr/share/qt5/bin/moc @/usr/src/RPM/BUILD/canorus-0.7.3.git3a25392/src/import/moc_lilypondimport.cpp_parameters
make[2]: Leaving directory '/usr/src/RPM/BUILD/canorus-0.7.3.git3a25392'
make[2]: Entering directory '/usr/src/RPM/BUILD/canorus-0.7.3.git3a25392'
[ 12%] Generating import/moc_musicxmlimport.cpp
cd /usr/src/RPM/BUILD/canorus-0.7.3.git3a25392/src/import && /usr/share/qt5/bin/moc @/usr/src/RPM/BUILD/canorus-0.7.3.git3a25392/src/import/moc_musicxmlimport.cpp_parameters
make[2]: Leaving directory '/usr/src/RPM/BUILD/canorus-0.7.3.git3a25392'
make[2]: Entering directory '/usr/src/RPM/BUILD/canorus-0.7.3.git3a25392'
[ 11%] Generating import/moc_midiimport.cpp
cd /usr/src/RPM/BUILD/canorus-0.7.3.git3a25392/src/import && /usr/share/qt5/bin/moc @/usr/src/RPM/BUILD/canorus-0.7.3.git3a25392/src/import/moc_midiimport.cpp_parameters
make[2]: Leaving directory '/usr/src/RPM/BUILD/canorus-0.7.3.git3a25392'
make[2]: Entering directory '/usr/src/RPM/BUILD/canorus-0.7.3.git3a25392'
[ 12%] Generating export/moc_export.cpp
cd /usr/src/RPM/BUILD/canorus-0.7.3.git3a25392/src/export && /usr/share/qt5/bin/moc @/usr/src/RPM/BUILD/canorus-0.7.3.git3a25392/src/export/moc_export.cpp_parameters
make[2]: Leaving directory '/usr/src/RPM/BUILD/canorus-0.7.3.git3a25392'
make[2]: Entering directory '/usr/src/RPM/BUILD/canorus-0.7.3.git3a25392'
[ 12%] Generating export/moc_lilypondexport.cpp
cd /usr/src/RPM/BUILD/canorus-0.7.3.git3a25392/src/export && /usr/share/qt5/bin/moc @/usr/src/RPM/BUILD/canorus-0.7.3.git3a25392/src/export/moc_lilypondexport.cpp_parameters
make[2]: Leaving directory '/usr/src/RPM/BUILD/canorus-0.7.3.git3a25392'
make[2]: Entering directory '/usr/src/RPM/BUILD/canorus-0.7.3.git3a25392'
[ 13%] Generating export/moc_pdfexport.cpp
cd /usr/src/RPM/BUILD/canorus-0.7.3.git3a25392/src/export && /usr/share/qt5/bin/moc @/usr/src/RPM/BUILD/canorus-0.7.3.git3a25392/src/export/moc_pdfexport.cpp_parameters
make[2]: Leaving directory '/usr/src/RPM/BUILD/canorus-0.7.3.git3a25392'
make[2]: Entering directory '/usr/src/RPM/BUILD/canorus-0.7.3.git3a25392'
[ 13%] Generating export/moc_svgexport.cpp
cd /usr/src/RPM/BUILD/canorus-0.7.3.git3a25392/src/export && /usr/share/qt5/bin/moc @/usr/src/RPM/BUILD/canorus-0.7.3.git3a25392/src/export/moc_svgexport.cpp_parameters
make[2]: Leaving directory '/usr/src/RPM/BUILD/canorus-0.7.3.git3a25392'
make[2]: Entering directory '/usr/src/RPM/BUILD/canorus-0.7.3.git3a25392'
[ 14%] Generating control/moc_externprogram.cpp
cd /usr/src/RPM/BUILD/canorus-0.7.3.git3a25392/src/control && /usr/share/qt5/bin/moc @/usr/src/RPM/BUILD/canorus-0.7.3.git3a25392/src/control/moc_externprogram.cpp_parameters
make[2]: Leaving directory '/usr/src/RPM/BUILD/canorus-0.7.3.git3a25392'
make[2]: Entering directory '/usr/src/RPM/BUILD/canorus-0.7.3.git3a25392'
[ 14%] Generating control/moc_typesetctl.cpp
cd /usr/src/RPM/BUILD/canorus-0.7.3.git3a25392/src/control && /usr/share/qt5/bin/moc @/usr/src/RPM/BUILD/canorus-0.7.3.git3a25392/src/control/moc_typesetctl.cpp_parameters
make[2]: Leaving directory '/usr/src/RPM/BUILD/canorus-0.7.3.git3a25392'
make[2]: Entering directory '/usr/src/RPM/BUILD/canorus-0.7.3.git3a25392'
[ 14%] Generating interface/moc_mididevice.cpp
cd /usr/src/RPM/BUILD/canorus-0.7.3.git3a25392/src/interface && /usr/share/qt5/bin/moc @/usr/src/RPM/BUILD/canorus-0.7.3.git3a25392/src/interface/moc_mididevice.cpp_parameters
make[2]: Leaving directory '/usr/src/RPM/BUILD/canorus-0.7.3.git3a25392'
make[2]: Entering directory '/usr/src/RPM/BUILD/canorus-0.7.3.git3a25392'
[ 15%] Generating interface/moc_playback.cpp
cd /usr/src/RPM/BUILD/canorus-0.7.3.git3a25392/src/interface && /usr/share/qt5/bin/moc @/usr/src/RPM/BUILD/canorus-0.7.3.git3a25392/src/interface/moc_playback.cpp_parameters
make[2]: Leaving directory '/usr/src/RPM/BUILD/canorus-0.7.3.git3a25392'
make[2]: Entering directory '/usr/src/RPM/BUILD/canorus-0.7.3.git3a25392'
[ 14%] Generating core/moc_midirecorder.cpp
cd /usr/src/RPM/BUILD/canorus-0.7.3.git3a25392/src/core && /usr/share/qt5/bin/moc @/usr/src/RPM/BUILD/canorus-0.7.3.git3a25392/src/core/moc_midirecorder.cpp_parameters
make[2]: Leaving directory '/usr/src/RPM/BUILD/canorus-0.7.3.git3a25392'
make[2]: Entering directory '/usr/src/RPM/BUILD/canorus-0.7.3.git3a25392'
[ 16%] Generating core/moc_settings.cpp
cd /usr/src/RPM/BUILD/canorus-0.7.3.git3a25392/src/core && /usr/share/qt5/bin/moc @/usr/src/RPM/BUILD/canorus-0.7.3.git3a25392/src/core/moc_settings.cpp_parameters
make[2]: Leaving directory '/usr/src/RPM/BUILD/canorus-0.7.3.git3a25392'
make[2]: Entering directory '/usr/src/RPM/BUILD/canorus-0.7.3.git3a25392'
[ 16%] Generating core/moc_autorecovery.cpp
cd /usr/src/RPM/BUILD/canorus-0.7.3.git3a25392/src/core && /usr/share/qt5/bin/moc @/usr/src/RPM/BUILD/canorus-0.7.3.git3a25392/src/core/moc_autorecovery.cpp_parameters
make[2]: Leaving directory '/usr/src/RPM/BUILD/canorus-0.7.3.git3a25392'
make[2]: Entering directory '/usr/src/RPM/BUILD/canorus-0.7.3.git3a25392'
[ 16%] Generating interface/moc_pluginaction.cpp
cd /usr/src/RPM/BUILD/canorus-0.7.3.git3a25392/src/interface && /usr/share/qt5/bin/moc @/usr/src/RPM/BUILD/canorus-0.7.3.git3a25392/src/interface/moc_pluginaction.cpp_parameters
make[2]: Leaving directory '/usr/src/RPM/BUILD/canorus-0.7.3.git3a25392'
make[2]: Entering directory '/usr/src/RPM/BUILD/canorus-0.7.3.git3a25392'
[ 17%] Generating scoreui/moc_keysignatureui.cpp
cd /usr/src/RPM/BUILD/canorus-0.7.3.git3a25392/src/scoreui && /usr/share/qt5/bin/moc @/usr/src/RPM/BUILD/canorus-0.7.3.git3a25392/src/scoreui/moc_keysignatureui.cpp_parameters
make[2]: Leaving directory '/usr/src/RPM/BUILD/canorus-0.7.3.git3a25392'
make[2]: Entering directory '/usr/src/RPM/BUILD/canorus-0.7.3.git3a25392'
[ 18%] Generating ui/moc_propertiesdialog.cpp
cd /usr/src/RPM/BUILD/canorus-0.7.3.git3a25392/src/ui && /usr/share/qt5/bin/moc @/usr/src/RPM/BUILD/canorus-0.7.3.git3a25392/src/ui/moc_propertiesdialog.cpp_parameters
make[2]: Leaving directory '/usr/src/RPM/BUILD/canorus-0.7.3.git3a25392'
make[2]: Entering directory '/usr/src/RPM/BUILD/canorus-0.7.3.git3a25392'
[ 17%] Generating ui/moc_transposeview.cpp
cd /usr/src/RPM/BUILD/canorus-0.7.3.git3a25392/src/ui && /usr/share/qt5/bin/moc @/usr/src/RPM/BUILD/canorus-0.7.3.git3a25392/src/ui/moc_transposeview.cpp_parameters
make[2]: Leaving directory '/usr/src/RPM/BUILD/canorus-0.7.3.git3a25392'
make[2]: Entering directory '/usr/src/RPM/BUILD/canorus-0.7.3.git3a25392'
[ 18%] Generating ui/moc_jumptoview.cpp
cd /usr/src/RPM/BUILD/canorus-0.7.3.git3a25392/src/ui && /usr/share/qt5/bin/moc @/usr/src/RPM/BUILD/canorus-0.7.3.git3a25392/src/ui/moc_jumptoview.cpp_parameters
make[2]: Leaving directory '/usr/src/RPM/BUILD/canorus-0.7.3.git3a25392'
make[2]: Entering directory '/usr/src/RPM/BUILD/canorus-0.7.3.git3a25392'
[ 20%] Generating widgets/moc_lcdnumber.cpp
cd /usr/src/RPM/BUILD/canorus-0.7.3.git3a25392/src/widgets && /usr/share/qt5/bin/moc @/usr/src/RPM/BUILD/canorus-0.7.3.git3a25392/src/widgets/moc_lcdnumber.cpp_parameters
make[2]: Leaving directory '/usr/src/RPM/BUILD/canorus-0.7.3.git3a25392'
make[2]: Entering directory '/usr/src/RPM/BUILD/canorus-0.7.3.git3a25392'
[ 20%] Generating widgets/moc_view.cpp
cd /usr/src/RPM/BUILD/canorus-0.7.3.git3a25392/src/widgets && /usr/share/qt5/bin/moc @/usr/src/RPM/BUILD/canorus-0.7.3.git3a25392/src/widgets/moc_view.cpp_parameters
make[2]: Leaving directory '/usr/src/RPM/BUILD/canorus-0.7.3.git3a25392'
make[2]: Entering directory '/usr/src/RPM/BUILD/canorus-0.7.3.git3a25392'
[ 20%] Generating widgets/moc_viewcontainer.cpp
cd /usr/src/RPM/BUILD/canorus-0.7.3.git3a25392/src/widgets && /usr/share/qt5/bin/moc @/usr/src/RPM/BUILD/canorus-0.7.3.git3a25392/src/widgets/moc_viewcontainer.cpp_parameters
make[2]: Leaving directory '/usr/src/RPM/BUILD/canorus-0.7.3.git3a25392'
make[2]: Entering directory '/usr/src/RPM/BUILD/canorus-0.7.3.git3a25392'
[ 17%] Generating ui/moc_settingsdialog.cpp
cd /usr/src/RPM/BUILD/canorus-0.7.3.git3a25392/src/ui && /usr/share/qt5/bin/moc @/usr/src/RPM/BUILD/canorus-0.7.3.git3a25392/src/ui/moc_settingsdialog.cpp_parameters
make[2]: Leaving directory '/usr/src/RPM/BUILD/canorus-0.7.3.git3a25392'
make[2]: Entering directory '/usr/src/RPM/BUILD/canorus-0.7.3.git3a25392'
[ 17%] Generating ui/moc_mainwin.cpp
cd /usr/src/RPM/BUILD/canorus-0.7.3.git3a25392/src/ui && /usr/share/qt5/bin/moc @/usr/src/RPM/BUILD/canorus-0.7.3.git3a25392/src/ui/moc_mainwin.cpp_parameters
make[2]: Leaving directory '/usr/src/RPM/BUILD/canorus-0.7.3.git3a25392'
make[2]: Entering directory '/usr/src/RPM/BUILD/canorus-0.7.3.git3a25392'
[ 21%] Generating widgets/moc_sourceview.cpp
cd /usr/src/RPM/BUILD/canorus-0.7.3.git3a25392/src/widgets && /usr/share/qt5/bin/moc @/usr/src/RPM/BUILD/canorus-0.7.3.git3a25392/src/widgets/moc_sourceview.cpp_parameters
make[2]: Leaving directory '/usr/src/RPM/BUILD/canorus-0.7.3.git3a25392'
make[2]: Entering directory '/usr/src/RPM/BUILD/canorus-0.7.3.git3a25392'
[ 22%] Generating widgets/moc_toolbutton.cpp
cd /usr/src/RPM/BUILD/canorus-0.7.3.git3a25392/src/widgets && /usr/share/qt5/bin/moc @/usr/src/RPM/BUILD/canorus-0.7.3.git3a25392/src/widgets/moc_toolbutton.cpp_parameters
make[2]: Leaving directory '/usr/src/RPM/BUILD/canorus-0.7.3.git3a25392'
make[2]: Entering directory '/usr/src/RPM/BUILD/canorus-0.7.3.git3a25392'
[ 21%] Generating widgets/moc_scoreview.cpp
cd /usr/src/RPM/BUILD/canorus-0.7.3.git3a25392/src/widgets && /usr/share/qt5/bin/moc @/usr/src/RPM/BUILD/canorus-0.7.3.git3a25392/src/widgets/moc_scoreview.cpp_parameters
make[2]: Leaving directory '/usr/src/RPM/BUILD/canorus-0.7.3.git3a25392'
make[2]: Entering directory '/usr/src/RPM/BUILD/canorus-0.7.3.git3a25392'
[ 22%] Generating widgets/moc_toolbuttonpopup.cpp
cd /usr/src/RPM/BUILD/canorus-0.7.3.git3a25392/src/widgets && /usr/share/qt5/bin/moc @/usr/src/RPM/BUILD/canorus-0.7.3.git3a25392/src/widgets/moc_toolbuttonpopup.cpp_parameters
make[2]: Leaving directory '/usr/src/RPM/BUILD/canorus-0.7.3.git3a25392'
make[2]: Entering directory '/usr/src/RPM/BUILD/canorus-0.7.3.git3a25392'
[ 22%] Generating widgets/moc_menutoolbutton.cpp
cd /usr/src/RPM/BUILD/canorus-0.7.3.git3a25392/src/widgets && /usr/share/qt5/bin/moc @/usr/src/RPM/BUILD/canorus-0.7.3.git3a25392/src/widgets/moc_menutoolbutton.cpp_parameters
make[2]: Leaving directory '/usr/src/RPM/BUILD/canorus-0.7.3.git3a25392'
make[2]: Entering directory '/usr/src/RPM/BUILD/canorus-0.7.3.git3a25392'
[ 23%] Generating widgets/moc_undotoolbutton.cpp
cd /usr/src/RPM/BUILD/canorus-0.7.3.git3a25392/src/widgets && /usr/share/qt5/bin/moc @/usr/src/RPM/BUILD/canorus-0.7.3.git3a25392/src/widgets/moc_undotoolbutton.cpp_parameters
make[2]: Leaving directory '/usr/src/RPM/BUILD/canorus-0.7.3.git3a25392'
make[2]: Entering directory '/usr/src/RPM/BUILD/canorus-0.7.3.git3a25392'
[ 23%] Generating widgets/moc_pyconsole.cpp
cd /usr/src/RPM/BUILD/canorus-0.7.3.git3a25392/src/widgets && /usr/share/qt5/bin/moc @/usr/src/RPM/BUILD/canorus-0.7.3.git3a25392/src/widgets/moc_pyconsole.cpp_parameters
make[2]: Leaving directory '/usr/src/RPM/BUILD/canorus-0.7.3.git3a25392'
make[2]: Entering directory '/usr/src/RPM/BUILD/canorus-0.7.3.git3a25392'
[ 23%] Generating widgets/moc_midirecorderview.cpp
cd /usr/src/RPM/BUILD/canorus-0.7.3.git3a25392/src/widgets && /usr/share/qt5/bin/moc @/usr/src/RPM/BUILD/canorus-0.7.3.git3a25392/src/widgets/moc_midirecorderview.cpp_parameters
make[2]: Leaving directory '/usr/src/RPM/BUILD/canorus-0.7.3.git3a25392'
make[2]: Entering directory '/usr/src/RPM/BUILD/canorus-0.7.3.git3a25392'
[ 24%] Generating widgets/moc_resourceview.cpp
cd /usr/src/RPM/BUILD/canorus-0.7.3.git3a25392/src/widgets && /usr/share/qt5/bin/moc @/usr/src/RPM/BUILD/canorus-0.7.3.git3a25392/src/widgets/moc_resourceview.cpp_parameters
make[2]: Leaving directory '/usr/src/RPM/BUILD/canorus-0.7.3.git3a25392'
make[2]: Entering directory '/usr/src/RPM/BUILD/canorus-0.7.3.git3a25392'
[ 24%] Generating widgets/moc_actionseditor.cpp
cd /usr/src/RPM/BUILD/canorus-0.7.3.git3a25392/src/widgets && /usr/share/qt5/bin/moc @/usr/src/RPM/BUILD/canorus-0.7.3.git3a25392/src/widgets/moc_actionseditor.cpp_parameters
make[2]: Leaving directory '/usr/src/RPM/BUILD/canorus-0.7.3.git3a25392'
make[2]: Entering directory '/usr/src/RPM/BUILD/canorus-0.7.3.git3a25392'
[ 25%] Generating widgets/moc_progressstatusbar.cpp
cd /usr/src/RPM/BUILD/canorus-0.7.3.git3a25392/src/widgets && /usr/share/qt5/bin/moc @/usr/src/RPM/BUILD/canorus-0.7.3.git3a25392/src/widgets/moc_progressstatusbar.cpp_parameters
make[2]: Leaving directory '/usr/src/RPM/BUILD/canorus-0.7.3.git3a25392'
make[2]: Entering directory '/usr/src/RPM/BUILD/canorus-0.7.3.git3a25392'
[ 25%] Generating control/moc_previewctl.cpp
cd /usr/src/RPM/BUILD/canorus-0.7.3.git3a25392/src/control && /usr/share/qt5/bin/moc @/usr/src/RPM/BUILD/canorus-0.7.3.git3a25392/src/control/moc_previewctl.cpp_parameters
make[2]: Leaving directory '/usr/src/RPM/BUILD/canorus-0.7.3.git3a25392'
make[2]: Entering directory '/usr/src/RPM/BUILD/canorus-0.7.3.git3a25392'
[ 25%] Generating widgets/moc_tabwidget.cpp
cd /usr/src/RPM/BUILD/canorus-0.7.3.git3a25392/src/widgets && /usr/share/qt5/bin/moc @/usr/src/RPM/BUILD/canorus-0.7.3.git3a25392/src/widgets/moc_tabwidget.cpp_parameters
make[2]: Leaving directory '/usr/src/RPM/BUILD/canorus-0.7.3.git3a25392'
make[2]: Entering directory '/usr/src/RPM/BUILD/canorus-0.7.3.git3a25392'
[ 26%] Generating control/moc_printctl.cpp
cd /usr/src/RPM/BUILD/canorus-0.7.3.git3a25392/src/control && /usr/share/qt5/bin/moc @/usr/src/RPM/BUILD/canorus-0.7.3.git3a25392/src/control/moc_printctl.cpp_parameters
make[2]: Leaving directory '/usr/src/RPM/BUILD/canorus-0.7.3.git3a25392'
make[2]: Entering directory '/usr/src/RPM/BUILD/canorus-0.7.3.git3a25392'
[ 26%] Generating control/moc_mainwinprogressctl.cpp
cd /usr/src/RPM/BUILD/canorus-0.7.3.git3a25392/src/control && /usr/share/qt5/bin/moc @/usr/src/RPM/BUILD/canorus-0.7.3.git3a25392/src/control/moc_mainwinprogressctl.cpp_parameters
make[2]: Leaving directory '/usr/src/RPM/BUILD/canorus-0.7.3.git3a25392'
make[2]: Entering directory '/usr/src/RPM/BUILD/canorus-0.7.3.git3a25392'
cd /usr/src/RPM/BUILD/canorus-0.7.3.git3a25392 && /usr/bin/cmake -E cmake_depends "Unix Makefiles" /usr/src/RPM/BUILD/canorus-0.7.3.git3a25392 /usr/src/RPM/BUILD/canorus-0.7.3.git3a25392/src /usr/src/RPM/BUILD/canorus-0.7.3.git3a25392 /usr/src/RPM/BUILD/canorus-0.7.3.git3a25392/src /usr/src/RPM/BUILD/canorus-0.7.3.git3a25392/src/CMakeFiles/canorus.dir/DependInfo.cmake --color=
Dependee "/usr/src/RPM/BUILD/canorus-0.7.3.git3a25392/src/CMakeFiles/canorus.dir/DependInfo.cmake" is newer than depender "/usr/src/RPM/BUILD/canorus-0.7.3.git3a25392/src/CMakeFiles/canorus.dir/depend.internal".
Dependee "/usr/src/RPM/BUILD/canorus-0.7.3.git3a25392/src/CMakeFiles/CMakeDirectoryInformation.cmake" is newer than depender "/usr/src/RPM/BUILD/canorus-0.7.3.git3a25392/src/CMakeFiles/canorus.dir/depend.internal".
Scanning dependencies of target canorus
make[2]: Leaving directory '/usr/src/RPM/BUILD/canorus-0.7.3.git3a25392'
make  -f src/CMakeFiles/canorus.dir/build.make src/CMakeFiles/canorus.dir/build
make[2]: Entering directory '/usr/src/RPM/BUILD/canorus-0.7.3.git3a25392'
[ 29%] Building CXX object src/CMakeFiles/canorus.dir/core/mimedata.cpp.o
cd /usr/src/RPM/BUILD/canorus-0.7.3.git3a25392/src && /usr/bin/c++ -DCANORUS_VERSION=\"0.8.0rc1\" -DDEFAULT_DATA_DIR=\"/usr/share/canorus\" -DQT_CORE_LIB -DQT_GUI_LIB -DQT_PRINTSUPPORT_LIB -DQT_SVG_LIB -DQT_WIDGETS_LIB -DQT_XML_LIB -D__LINUX_ALSA__ -I/usr/src/RPM/BUILD/canorus-0.7.3.git3a25392/src -I/usr/src/RPM/BUILD/canorus-0.7.3.git3a25392/src/zlib -I/usr/src/RPM/BUILD/canorus-0.7.3.git3a25392/src/core -I/usr/src/RPM/BUILD/canorus-0.7.3.git3a25392/src/ui -I/usr/src/RPM/BUILD/canorus-0.7.3.git3a25392/src/widgets -I/usr/src/RPM/BUILD/canorus-0.7.3.git3a25392/src/import -isystem /usr/include/qt5 -isystem /usr/include/qt5/QtCore -isystem /usr/share/qt5/../../lib/qt5/mkspecs/linux-g++ -isystem /usr/include/qt5/QtGui -isystem /usr/include/qt5/QtSvg -isystem /usr/include/qt5/QtWidgets -isystem /usr/include/qt5/QtXml -isystem /usr/include/qt5/QtPrintSupport -pipe -frecord-gcc-switches -Wall -g -O2 -march=i586 -mtune=generic -O0 -g -fstack-protector-all -Wall -Werror -Wuninitialized -Wtype-limits -Wstack-protector -fPIE -fPIC -std=gnu++14 -o CMakeFiles/canorus.dir/core/mimedata.cpp.o -c /usr/src/RPM/BUILD/canorus-0.7.3.git3a25392/src/core/mimedata.cpp
make[2]: Leaving directory '/usr/src/RPM/BUILD/canorus-0.7.3.git3a25392'
make[2]: Entering directory '/usr/src/RPM/BUILD/canorus-0.7.3.git3a25392'
[ 28%] Building CXX object src/CMakeFiles/canorus.dir/core/undo.cpp.o
cd /usr/src/RPM/BUILD/canorus-0.7.3.git3a25392/src && /usr/bin/c++ -DCANORUS_VERSION=\"0.8.0rc1\" -DDEFAULT_DATA_DIR=\"/usr/share/canorus\" -DQT_CORE_LIB -DQT_GUI_LIB -DQT_PRINTSUPPORT_LIB -DQT_SVG_LIB -DQT_WIDGETS_LIB -DQT_XML_LIB -D__LINUX_ALSA__ -I/usr/src/RPM/BUILD/canorus-0.7.3.git3a25392/src -I/usr/src/RPM/BUILD/canorus-0.7.3.git3a25392/src/zlib -I/usr/src/RPM/BUILD/canorus-0.7.3.git3a25392/src/core -I/usr/src/RPM/BUILD/canorus-0.7.3.git3a25392/src/ui -I/usr/src/RPM/BUILD/canorus-0.7.3.git3a25392/src/widgets -I/usr/src/RPM/BUILD/canorus-0.7.3.git3a25392/src/import -isystem /usr/include/qt5 -isystem /usr/include/qt5/QtCore -isystem /usr/share/qt5/../../lib/qt5/mkspecs/linux-g++ -isystem /usr/include/qt5/QtGui -isystem /usr/include/qt5/QtSvg -isystem /usr/include/qt5/QtWidgets -isystem /usr/include/qt5/QtXml -isystem /usr/include/qt5/QtPrintSupport -pipe -frecord-gcc-switches -Wall -g -O2 -march=i586 -mtune=generic -O0 -g -fstack-protector-all -Wall -Werror -Wuninitialized -Wtype-limits -Wstack-protector -fPIE -fPIC -std=gnu++14 -o CMakeFiles/canorus.dir/core/undo.cpp.o -c /usr/src/RPM/BUILD/canorus-0.7.3.git3a25392/src/core/undo.cpp
make[2]: Leaving directory '/usr/src/RPM/BUILD/canorus-0.7.3.git3a25392'
make[2]: Entering directory '/usr/src/RPM/BUILD/canorus-0.7.3.git3a25392'
[ 30%] Building CXX object src/CMakeFiles/canorus.dir/core/typesetter.cpp.o
cd /usr/src/RPM/BUILD/canorus-0.7.3.git3a25392/src && /usr/bin/c++ -DCANORUS_VERSION=\"0.8.0rc1\" -DDEFAULT_DATA_DIR=\"/usr/share/canorus\" -DQT_CORE_LIB -DQT_GUI_LIB -DQT_PRINTSUPPORT_LIB -DQT_SVG_LIB -DQT_WIDGETS_LIB -DQT_XML_LIB -D__LINUX_ALSA__ -I/usr/src/RPM/BUILD/canorus-0.7.3.git3a25392/src -I/usr/src/RPM/BUILD/canorus-0.7.3.git3a25392/src/zlib -I/usr/src/RPM/BUILD/canorus-0.7.3.git3a25392/src/core -I/usr/src/RPM/BUILD/canorus-0.7.3.git3a25392/src/ui -I/usr/src/RPM/BUILD/canorus-0.7.3.git3a25392/src/widgets -I/usr/src/RPM/BUILD/canorus-0.7.3.git3a25392/src/import -isystem /usr/include/qt5 -isystem /usr/include/qt5/QtCore -isystem /usr/share/qt5/../../lib/qt5/mkspecs/linux-g++ -isystem /usr/include/qt5/QtGui -isystem /usr/include/qt5/QtSvg -isystem /usr/include/qt5/QtWidgets -isystem /usr/include/qt5/QtXml -isystem /usr/include/qt5/QtPrintSupport -pipe -frecord-gcc-switches -Wall -g -O2 -march=i586 -mtune=generic -O0 -g -fstack-protector-all -Wall -Werror -Wuninitialized -Wtype-limits -Wstack-protector -fPIE -fPIC -std=gnu++14 -o CMakeFiles/canorus.dir/core/typesetter.cpp.o -c /usr/src/RPM/BUILD/canorus-0.7.3.git3a25392/src/core/typesetter.cpp
make[2]: Leaving directory '/usr/src/RPM/BUILD/canorus-0.7.3.git3a25392'
make[2]: Entering directory '/usr/src/RPM/BUILD/canorus-0.7.3.git3a25392'
[ 29%] Building CXX object src/CMakeFiles/canorus.dir/core/file.cpp.o
cd /usr/src/RPM/BUILD/canorus-0.7.3.git3a25392/src && /usr/bin/c++ -DCANORUS_VERSION=\"0.8.0rc1\" -DDEFAULT_DATA_DIR=\"/usr/share/canorus\" -DQT_CORE_LIB -DQT_GUI_LIB -DQT_PRINTSUPPORT_LIB -DQT_SVG_LIB -DQT_WIDGETS_LIB -DQT_XML_LIB -D__LINUX_ALSA__ -I/usr/src/RPM/BUILD/canorus-0.7.3.git3a25392/src -I/usr/src/RPM/BUILD/canorus-0.7.3.git3a25392/src/zlib -I/usr/src/RPM/BUILD/canorus-0.7.3.git3a25392/src/core -I/usr/src/RPM/BUILD/canorus-0.7.3.git3a25392/src/ui -I/usr/src/RPM/BUILD/canorus-0.7.3.git3a25392/src/widgets -I/usr/src/RPM/BUILD/canorus-0.7.3.git3a25392/src/import -isystem /usr/include/qt5 -isystem /usr/include/qt5/QtCore -isystem /usr/share/qt5/../../lib/qt5/mkspecs/linux-g++ -isystem /usr/include/qt5/QtGui -isystem /usr/include/qt5/QtSvg -isystem /usr/include/qt5/QtWidgets -isystem /usr/include/qt5/QtXml -isystem /usr/include/qt5/QtPrintSupport -pipe -frecord-gcc-switches -Wall -g -O2 -march=i586 -mtune=generic -O0 -g -fstack-protector-all -Wall -Werror -Wuninitialized -Wtype-limits -Wstack-protector -fPIE -fPIC -std=gnu++14 -o CMakeFiles/canorus.dir/core/file.cpp.o -c /usr/src/RPM/BUILD/canorus-0.7.3.git3a25392/src/core/file.cpp
make[2]: Leaving directory '/usr/src/RPM/BUILD/canorus-0.7.3.git3a25392'
make[2]: Entering directory '/usr/src/RPM/BUILD/canorus-0.7.3.git3a25392'
[ 31%] Building CXX object src/CMakeFiles/canorus.dir/core/archive.cpp.o
cd /usr/src/RPM/BUILD/canorus-0.7.3.git3a25392/src && /usr/bin/c++ -DCANORUS_VERSION=\"0.8.0rc1\" -DDEFAULT_DATA_DIR=\"/usr/share/canorus\" -DQT_CORE_LIB -DQT_GUI_LIB -DQT_PRINTSUPPORT_LIB -DQT_SVG_LIB -DQT_WIDGETS_LIB -DQT_XML_LIB -D__LINUX_ALSA__ -I/usr/src/RPM/BUILD/canorus-0.7.3.git3a25392/src -I/usr/src/RPM/BUILD/canorus-0.7.3.git3a25392/src/zlib -I/usr/src/RPM/BUILD/canorus-0.7.3.git3a25392/src/core -I/usr/src/RPM/BUILD/canorus-0.7.3.git3a25392/src/ui -I/usr/src/RPM/BUILD/canorus-0.7.3.git3a25392/src/widgets -I/usr/src/RPM/BUILD/canorus-0.7.3.git3a25392/src/import -isystem /usr/include/qt5 -isystem /usr/include/qt5/QtCore -isystem /usr/share/qt5/../../lib/qt5/mkspecs/linux-g++ -isystem /usr/include/qt5/QtGui -isystem /usr/include/qt5/QtSvg -isystem /usr/include/qt5/QtWidgets -isystem /usr/include/qt5/QtXml -isystem /usr/include/qt5/QtPrintSupport -pipe -frecord-gcc-switches -Wall -g -O2 -march=i586 -mtune=generic -O0 -g -fstack-protector-all -Wall -Werror -Wuninitialized -Wtype-limits -Wstack-protector -fPIE -fPIC -std=gnu++14 -o CMakeFiles/canorus.dir/core/archive.cpp.o -c /usr/src/RPM/BUILD/canorus-0.7.3.git3a25392/src/core/archive.cpp
make[2]: Leaving directory '/usr/src/RPM/BUILD/canorus-0.7.3.git3a25392'
make[2]: Entering directory '/usr/src/RPM/BUILD/canorus-0.7.3.git3a25392'
[ 29%] Building CXX object src/CMakeFiles/canorus.dir/core/autorecovery.cpp.o
cd /usr/src/RPM/BUILD/canorus-0.7.3.git3a25392/src && /usr/bin/c++ -DCANORUS_VERSION=\"0.8.0rc1\" -DDEFAULT_DATA_DIR=\"/usr/share/canorus\" -DQT_CORE_LIB -DQT_GUI_LIB -DQT_PRINTSUPPORT_LIB -DQT_SVG_LIB -DQT_WIDGETS_LIB -DQT_XML_LIB -D__LINUX_ALSA__ -I/usr/src/RPM/BUILD/canorus-0.7.3.git3a25392/src -I/usr/src/RPM/BUILD/canorus-0.7.3.git3a25392/src/zlib -I/usr/src/RPM/BUILD/canorus-0.7.3.git3a25392/src/core -I/usr/src/RPM/BUILD/canorus-0.7.3.git3a25392/src/ui -I/usr/src/RPM/BUILD/canorus-0.7.3.git3a25392/src/widgets -I/usr/src/RPM/BUILD/canorus-0.7.3.git3a25392/src/import -isystem /usr/include/qt5 -isystem /usr/include/qt5/QtCore -isystem /usr/share/qt5/../../lib/qt5/mkspecs/linux-g++ -isystem /usr/include/qt5/QtGui -isystem /usr/include/qt5/QtSvg -isystem /usr/include/qt5/QtWidgets -isystem /usr/include/qt5/QtXml -isystem /usr/include/qt5/QtPrintSupport -pipe -frecord-gcc-switches -Wall -g -O2 -march=i586 -mtune=generic -O0 -g -fstack-protector-all -Wall -Werror -Wuninitialized -Wtype-limits -Wstack-protector -fPIE -fPIC -std=gnu++14 -o CMakeFiles/canorus.dir/core/autorecovery.cpp.o -c /usr/src/RPM/BUILD/canorus-0.7.3.git3a25392/src/core/autorecovery.cpp
In file included from /usr/src/RPM/BUILD/canorus-0.7.3.git3a25392/src/core/autorecovery.cpp:13:
/usr/src/RPM/BUILD/canorus-0.7.3.git3a25392/src/import/canorusmlimport.h:50:56: error: 'QXmlParseException' is deprecated [-Werror=deprecated-declarations]
   50 |     bool fatalError(const QXmlParseException& exception);
      |                                                        ^
cc1plus: all warnings being treated as errors
make[2]: *** [src/CMakeFiles/canorus.dir/build.make:363: src/CMakeFiles/canorus.dir/core/autorecovery.cpp.o] Error 1
make[2]: Leaving directory '/usr/src/RPM/BUILD/canorus-0.7.3.git3a25392'
make[2]: *** Waiting for unfinished jobs....
make[2]: Entering directory '/usr/src/RPM/BUILD/canorus-0.7.3.git3a25392'
[ 30%] Building CXX object src/CMakeFiles/canorus.dir/core/fileformats.cpp.o
cd /usr/src/RPM/BUILD/canorus-0.7.3.git3a25392/src && /usr/bin/c++ -DCANORUS_VERSION=\"0.8.0rc1\" -DDEFAULT_DATA_DIR=\"/usr/share/canorus\" -DQT_CORE_LIB -DQT_GUI_LIB -DQT_PRINTSUPPORT_LIB -DQT_SVG_LIB -DQT_WIDGETS_LIB -DQT_XML_LIB -D__LINUX_ALSA__ -I/usr/src/RPM/BUILD/canorus-0.7.3.git3a25392/src -I/usr/src/RPM/BUILD/canorus-0.7.3.git3a25392/src/zlib -I/usr/src/RPM/BUILD/canorus-0.7.3.git3a25392/src/core -I/usr/src/RPM/BUILD/canorus-0.7.3.git3a25392/src/ui -I/usr/src/RPM/BUILD/canorus-0.7.3.git3a25392/src/widgets -I/usr/src/RPM/BUILD/canorus-0.7.3.git3a25392/src/import -isystem /usr/include/qt5 -isystem /usr/include/qt5/QtCore -isystem /usr/share/qt5/../../lib/qt5/mkspecs/linux-g++ -isystem /usr/include/qt5/QtGui -isystem /usr/include/qt5/QtSvg -isystem /usr/include/qt5/QtWidgets -isystem /usr/include/qt5/QtXml -isystem /usr/include/qt5/QtPrintSupport -pipe -frecord-gcc-switches -Wall -g -O2 -march=i586 -mtune=generic -O0 -g -fstack-protector-all -Wall -Werror -Wuninitialized -Wtype-limits -Wstack-protector -fPIE -fPIC -std=gnu++14 -o CMakeFiles/canorus.dir/core/fileformats.cpp.o -c /usr/src/RPM/BUILD/canorus-0.7.3.git3a25392/src/core/fileformats.cpp
make[2]: Leaving directory '/usr/src/RPM/BUILD/canorus-0.7.3.git3a25392'
make[2]: Entering directory '/usr/src/RPM/BUILD/canorus-0.7.3.git3a25392'
[ 28%] Building CXX object src/CMakeFiles/canorus.dir/core/settings.cpp.o
cd /usr/src/RPM/BUILD/canorus-0.7.3.git3a25392/src && /usr/bin/c++ -DCANORUS_VERSION=\"0.8.0rc1\" -DDEFAULT_DATA_DIR=\"/usr/share/canorus\" -DQT_CORE_LIB -DQT_GUI_LIB -DQT_PRINTSUPPORT_LIB -DQT_SVG_LIB -DQT_WIDGETS_LIB -DQT_XML_LIB -D__LINUX_ALSA__ -I/usr/src/RPM/BUILD/canorus-0.7.3.git3a25392/src -I/usr/src/RPM/BUILD/canorus-0.7.3.git3a25392/src/zlib -I/usr/src/RPM/BUILD/canorus-0.7.3.git3a25392/src/core -I/usr/src/RPM/BUILD/canorus-0.7.3.git3a25392/src/ui -I/usr/src/RPM/BUILD/canorus-0.7.3.git3a25392/src/widgets -I/usr/src/RPM/BUILD/canorus-0.7.3.git3a25392/src/import -isystem /usr/include/qt5 -isystem /usr/include/qt5/QtCore -isystem /usr/share/qt5/../../lib/qt5/mkspecs/linux-g++ -isystem /usr/include/qt5/QtGui -isystem /usr/include/qt5/QtSvg -isystem /usr/include/qt5/QtWidgets -isystem /usr/include/qt5/QtXml -isystem /usr/include/qt5/QtPrintSupport -pipe -frecord-gcc-switches -Wall -g -O2 -march=i586 -mtune=generic -O0 -g -fstack-protector-all -Wall -Werror -Wuninitialized -Wtype-limits -Wstack-protector -fPIE -fPIC -std=gnu++14 -o CMakeFiles/canorus.dir/core/settings.cpp.o -c /usr/src/RPM/BUILD/canorus-0.7.3.git3a25392/src/core/settings.cpp
/usr/src/RPM/BUILD/canorus-0.7.3.git3a25392/src/core/settings.cpp: In member function 'void CASettings::addSingleAction(CASingleAction&)':
/usr/src/RPM/BUILD/canorus-0.7.3.git3a25392/src/core/settings.cpp:464:52: error: 'QTextStream& QTextStreamFunctions::endl(QTextStream&)' is deprecated: Use Qt::endl [-Werror=deprecated-declarations]
  464 |     qWarning() << "CASettings::addSingleAction" << endl;
      |                                                    ^~~~
In file included from /usr/include/qt5/QtCore/qdebug.h:49,
                 from /usr/include/qt5/QtCore/QDebug:1,
                 from /usr/src/RPM/BUILD/canorus-0.7.3.git3a25392/src/core/settings.cpp:8:
/usr/include/qt5/QtCore/qtextstream.h:293:75: note: declared here
  293 | Q_CORE_EXPORT QT_DEPRECATED_VERSION_X(5, 15, "Use Qt::endl") QTextStream &endl(QTextStream &s);
      |                                                                           ^~~~
/usr/src/RPM/BUILD/canorus-0.7.3.git3a25392/src/core/settings.cpp:464:52: error: 'QTextStream& QTextStreamFunctions::endl(QTextStream&)' is deprecated: Use Qt::endl [-Werror=deprecated-declarations]
  464 |     qWarning() << "CASettings::addSingleAction" << endl;
      |                                                    ^~~~
In file included from /usr/include/qt5/QtCore/qdebug.h:49,
                 from /usr/include/qt5/QtCore/QDebug:1,
                 from /usr/src/RPM/BUILD/canorus-0.7.3.git3a25392/src/core/settings.cpp:8:
/usr/include/qt5/QtCore/qtextstream.h:293:75: note: declared here
  293 | Q_CORE_EXPORT QT_DEPRECATED_VERSION_X(5, 15, "Use Qt::endl") QTextStream &endl(QTextStream &s);
      |                                                                           ^~~~
/usr/src/RPM/BUILD/canorus-0.7.3.git3a25392/src/core/settings.cpp:483:60: error: 'QTextStream& QTextStreamFunctions::endl(QTextStream&)' is deprecated: Use Qt::endl [-Werror=deprecated-declarations]
  483 |     qWarning() << "New size is " << _oActionList.size() << endl;
      |                                                            ^~~~
In file included from /usr/include/qt5/QtCore/qdebug.h:49,
                 from /usr/include/qt5/QtCore/QDebug:1,
                 from /usr/src/RPM/BUILD/canorus-0.7.3.git3a25392/src/core/settings.cpp:8:
/usr/include/qt5/QtCore/qtextstream.h:293:75: note: declared here
  293 | Q_CORE_EXPORT QT_DEPRECATED_VERSION_X(5, 15, "Use Qt::endl") QTextStream &endl(QTextStream &s);
      |                                                                           ^~~~
/usr/src/RPM/BUILD/canorus-0.7.3.git3a25392/src/core/settings.cpp:483:60: error: 'QTextStream& QTextStreamFunctions::endl(QTextStream&)' is deprecated: Use Qt::endl [-Werror=deprecated-declarations]
  483 |     qWarning() << "New size is " << _oActionList.size() << endl;
      |                                                            ^~~~
In file included from /usr/include/qt5/QtCore/qdebug.h:49,
                 from /usr/include/qt5/QtCore/QDebug:1,
                 from /usr/src/RPM/BUILD/canorus-0.7.3.git3a25392/src/core/settings.cpp:8:
/usr/include/qt5/QtCore/qtextstream.h:293:75: note: declared here
  293 | Q_CORE_EXPORT QT_DEPRECATED_VERSION_X(5, 15, "Use Qt::endl") QTextStream &endl(QTextStream &s);
      |                                                                           ^~~~
cc1plus: all warnings being treated as errors
make[2]: *** [src/CMakeFiles/canorus.dir/build.make:324: src/CMakeFiles/canorus.dir/core/settings.cpp.o] Error 1
make[2]: Leaving directory '/usr/src/RPM/BUILD/canorus-0.7.3.git3a25392'
make[2]: Entering directory '/usr/src/RPM/BUILD/canorus-0.7.3.git3a25392'
[ 30%] Building CXX object src/CMakeFiles/canorus.dir/core/tar.cpp.o
cd /usr/src/RPM/BUILD/canorus-0.7.3.git3a25392/src && /usr/bin/c++ -DCANORUS_VERSION=\"0.8.0rc1\" -DDEFAULT_DATA_DIR=\"/usr/share/canorus\" -DQT_CORE_LIB -DQT_GUI_LIB -DQT_PRINTSUPPORT_LIB -DQT_SVG_LIB -DQT_WIDGETS_LIB -DQT_XML_LIB -D__LINUX_ALSA__ -I/usr/src/RPM/BUILD/canorus-0.7.3.git3a25392/src -I/usr/src/RPM/BUILD/canorus-0.7.3.git3a25392/src/zlib -I/usr/src/RPM/BUILD/canorus-0.7.3.git3a25392/src/core -I/usr/src/RPM/BUILD/canorus-0.7.3.git3a25392/src/ui -I/usr/src/RPM/BUILD/canorus-0.7.3.git3a25392/src/widgets -I/usr/src/RPM/BUILD/canorus-0.7.3.git3a25392/src/import -isystem /usr/include/qt5 -isystem /usr/include/qt5/QtCore -isystem /usr/share/qt5/../../lib/qt5/mkspecs/linux-g++ -isystem /usr/include/qt5/QtGui -isystem /usr/include/qt5/QtSvg -isystem /usr/include/qt5/QtWidgets -isystem /usr/include/qt5/QtXml -isystem /usr/include/qt5/QtPrintSupport -pipe -frecord-gcc-switches -Wall -g -O2 -march=i586 -mtune=generic -O0 -g -fstack-protector-all -Wall -Werror -Wuninitialized -Wtype-limits -Wstack-protector -fPIE -fPIC -std=gnu++14 -o CMakeFiles/canorus.dir/core/tar.cpp.o -c /usr/src/RPM/BUILD/canorus-0.7.3.git3a25392/src/core/tar.cpp
make[2]: Leaving directory '/usr/src/RPM/BUILD/canorus-0.7.3.git3a25392'
make[2]: Entering directory '/usr/src/RPM/BUILD/canorus-0.7.3.git3a25392'
[ 28%] Building CXX object src/CMakeFiles/canorus.dir/core/undocommand.cpp.o
cd /usr/src/RPM/BUILD/canorus-0.7.3.git3a25392/src && /usr/bin/c++ -DCANORUS_VERSION=\"0.8.0rc1\" -DDEFAULT_DATA_DIR=\"/usr/share/canorus\" -DQT_CORE_LIB -DQT_GUI_LIB -DQT_PRINTSUPPORT_LIB -DQT_SVG_LIB -DQT_WIDGETS_LIB -DQT_XML_LIB -D__LINUX_ALSA__ -I/usr/src/RPM/BUILD/canorus-0.7.3.git3a25392/src -I/usr/src/RPM/BUILD/canorus-0.7.3.git3a25392/src/zlib -I/usr/src/RPM/BUILD/canorus-0.7.3.git3a25392/src/core -I/usr/src/RPM/BUILD/canorus-0.7.3.git3a25392/src/ui -I/usr/src/RPM/BUILD/canorus-0.7.3.git3a25392/src/widgets -I/usr/src/RPM/BUILD/canorus-0.7.3.git3a25392/src/import -isystem /usr/include/qt5 -isystem /usr/include/qt5/QtCore -isystem /usr/share/qt5/../../lib/qt5/mkspecs/linux-g++ -isystem /usr/include/qt5/QtGui -isystem /usr/include/qt5/QtSvg -isystem /usr/include/qt5/QtWidgets -isystem /usr/include/qt5/QtXml -isystem /usr/include/qt5/QtPrintSupport -pipe -frecord-gcc-switches -Wall -g -O2 -march=i586 -mtune=generic -O0 -g -fstack-protector-all -Wall -Werror -Wuninitialized -Wtype-limits -Wstack-protector -fPIE -fPIC -std=gnu++14 -o CMakeFiles/canorus.dir/core/undocommand.cpp.o -c /usr/src/RPM/BUILD/canorus-0.7.3.git3a25392/src/core/undocommand.cpp
make[2]: Leaving directory '/usr/src/RPM/BUILD/canorus-0.7.3.git3a25392'
make[2]: Entering directory '/usr/src/RPM/BUILD/canorus-0.7.3.git3a25392'
[ 27%] Building CXX object src/CMakeFiles/canorus.dir/canorus.cpp.o
cd /usr/src/RPM/BUILD/canorus-0.7.3.git3a25392/src && /usr/bin/c++ -DCANORUS_VERSION=\"0.8.0rc1\" -DDEFAULT_DATA_DIR=\"/usr/share/canorus\" -DQT_CORE_LIB -DQT_GUI_LIB -DQT_PRINTSUPPORT_LIB -DQT_SVG_LIB -DQT_WIDGETS_LIB -DQT_XML_LIB -D__LINUX_ALSA__ -I/usr/src/RPM/BUILD/canorus-0.7.3.git3a25392/src -I/usr/src/RPM/BUILD/canorus-0.7.3.git3a25392/src/zlib -I/usr/src/RPM/BUILD/canorus-0.7.3.git3a25392/src/core -I/usr/src/RPM/BUILD/canorus-0.7.3.git3a25392/src/ui -I/usr/src/RPM/BUILD/canorus-0.7.3.git3a25392/src/widgets -I/usr/src/RPM/BUILD/canorus-0.7.3.git3a25392/src/import -isystem /usr/include/qt5 -isystem /usr/include/qt5/QtCore -isystem /usr/share/qt5/../../lib/qt5/mkspecs/linux-g++ -isystem /usr/include/qt5/QtGui -isystem /usr/include/qt5/QtSvg -isystem /usr/include/qt5/QtWidgets -isystem /usr/include/qt5/QtXml -isystem /usr/include/qt5/QtPrintSupport -pipe -frecord-gcc-switches -Wall -g -O2 -march=i586 -mtune=generic -O0 -g -fstack-protector-all -Wall -Werror -Wuninitialized -Wtype-limits -Wstack-protector -fPIE -fPIC -std=gnu++14 -o CMakeFiles/canorus.dir/canorus.cpp.o -c /usr/src/RPM/BUILD/canorus-0.7.3.git3a25392/src/canorus.cpp
make[2]: Leaving directory '/usr/src/RPM/BUILD/canorus-0.7.3.git3a25392'
make[2]: Entering directory '/usr/src/RPM/BUILD/canorus-0.7.3.git3a25392'
[ 31%] Building CXX object src/CMakeFiles/canorus.dir/core/midirecorder.cpp.o
cd /usr/src/RPM/BUILD/canorus-0.7.3.git3a25392/src && /usr/bin/c++ -DCANORUS_VERSION=\"0.8.0rc1\" -DDEFAULT_DATA_DIR=\"/usr/share/canorus\" -DQT_CORE_LIB -DQT_GUI_LIB -DQT_PRINTSUPPORT_LIB -DQT_SVG_LIB -DQT_WIDGETS_LIB -DQT_XML_LIB -D__LINUX_ALSA__ -I/usr/src/RPM/BUILD/canorus-0.7.3.git3a25392/src -I/usr/src/RPM/BUILD/canorus-0.7.3.git3a25392/src/zlib -I/usr/src/RPM/BUILD/canorus-0.7.3.git3a25392/src/core -I/usr/src/RPM/BUILD/canorus-0.7.3.git3a25392/src/ui -I/usr/src/RPM/BUILD/canorus-0.7.3.git3a25392/src/widgets -I/usr/src/RPM/BUILD/canorus-0.7.3.git3a25392/src/import -isystem /usr/include/qt5 -isystem /usr/include/qt5/QtCore -isystem /usr/share/qt5/../../lib/qt5/mkspecs/linux-g++ -isystem /usr/include/qt5/QtGui -isystem /usr/include/qt5/QtSvg -isystem /usr/include/qt5/QtWidgets -isystem /usr/include/qt5/QtXml -isystem /usr/include/qt5/QtPrintSupport -pipe -frecord-gcc-switches -Wall -g -O2 -march=i586 -mtune=generic -O0 -g -fstack-protector-all -Wall -Werror -Wuninitialized -Wtype-limits -Wstack-protector -fPIE -fPIC -std=gnu++14 -o CMakeFiles/canorus.dir/core/midirecorder.cpp.o -c /usr/src/RPM/BUILD/canorus-0.7.3.git3a25392/src/core/midirecorder.cpp
make[2]: Leaving directory '/usr/src/RPM/BUILD/canorus-0.7.3.git3a25392'
make[2]: Entering directory '/usr/src/RPM/BUILD/canorus-0.7.3.git3a25392'
[ 27%] Building CXX object src/CMakeFiles/canorus.dir/main.cpp.o
cd /usr/src/RPM/BUILD/canorus-0.7.3.git3a25392/src && /usr/bin/c++ -DCANORUS_VERSION=\"0.8.0rc1\" -DDEFAULT_DATA_DIR=\"/usr/share/canorus\" -DQT_CORE_LIB -DQT_GUI_LIB -DQT_PRINTSUPPORT_LIB -DQT_SVG_LIB -DQT_WIDGETS_LIB -DQT_XML_LIB -D__LINUX_ALSA__ -I/usr/src/RPM/BUILD/canorus-0.7.3.git3a25392/src -I/usr/src/RPM/BUILD/canorus-0.7.3.git3a25392/src/zlib -I/usr/src/RPM/BUILD/canorus-0.7.3.git3a25392/src/core -I/usr/src/RPM/BUILD/canorus-0.7.3.git3a25392/src/ui -I/usr/src/RPM/BUILD/canorus-0.7.3.git3a25392/src/widgets -I/usr/src/RPM/BUILD/canorus-0.7.3.git3a25392/src/import -isystem /usr/include/qt5 -isystem /usr/include/qt5/QtCore -isystem /usr/share/qt5/../../lib/qt5/mkspecs/linux-g++ -isystem /usr/include/qt5/QtGui -isystem /usr/include/qt5/QtSvg -isystem /usr/include/qt5/QtWidgets -isystem /usr/include/qt5/QtXml -isystem /usr/include/qt5/QtPrintSupport -pipe -frecord-gcc-switches -Wall -g -O2 -march=i586 -mtune=generic -O0 -g -fstack-protector-all -Wall -Werror -Wuninitialized -Wtype-limits -Wstack-protector -fPIE -fPIC -std=gnu++14 -o CMakeFiles/canorus.dir/main.cpp.o -c /usr/src/RPM/BUILD/canorus-0.7.3.git3a25392/src/main.cpp
In file included from /usr/src/RPM/BUILD/canorus-0.7.3.git3a25392/src/main.cpp:16:
/usr/src/RPM/BUILD/canorus-0.7.3.git3a25392/src/interface/pluginmanager.h:52:56: error: 'QXmlParseException' is deprecated [-Werror=deprecated-declarations]
   52 |     bool fatalError(const QXmlParseException& exception);
      |                                                        ^
cc1plus: all warnings being treated as errors
make[2]: *** [src/CMakeFiles/canorus.dir/build.make:298: src/CMakeFiles/canorus.dir/main.cpp.o] Error 1
make[2]: Leaving directory '/usr/src/RPM/BUILD/canorus-0.7.3.git3a25392'
make[1]: *** [CMakeFiles/Makefile2:219: src/CMakeFiles/canorus.dir/all] Error 2
make: *** [Makefile:149: all] Error 2
error: Bad exit status from /usr/src/tmp/rpm-tmp.71403 (%build)


RPM build errors:
    Bad exit status from /usr/src/tmp/rpm-tmp.71403 (%build)
Command exited with non-zero status 1
49.92user 4.69system 0:19.17elapsed 284%CPU (0avgtext+0avgdata 221364maxresident)k
0inputs+0outputs (0major+729188minor)pagefaults 0swaps
hsh-rebuild: rebuild of `canorus-0.7.3.git3a25392-alt1.src.rpm' failed.
Command exited with non-zero status 1
82.23user 13.20system 0:59.95elapsed 159%CPU (0avgtext+0avgdata 221364maxresident)k
128584inputs+0outputs (0major+1066978minor)pagefaults 0swaps