86>Jun 2 15:13:10 userdel[3562306]: delete user 'rooter'
<86>Jun 2 15:13:10 userdel[3562306]: removed group 'rooter' owned by 'rooter'
<86>Jun 2 15:13:10 userdel[3562306]: removed shadow group 'rooter' owned by 'rooter'
<86>Jun 2 15:13:10 groupadd[3562323]: group added to /etc/group: name=rooter, GID=525
<86>Jun 2 15:13:10 groupadd[3562323]: group added to /etc/gshadow: name=rooter
<86>Jun 2 15:13:10 groupadd[3562323]: new group: name=rooter, GID=525
<86>Jun 2 15:13:10 useradd[3562336]: new user: name=rooter, UID=525, GID=525, home=/root, shell=/bin/bash
<86>Jun 2 15:13:10 userdel[3562352]: delete user 'builder'
<86>Jun 2 15:13:10 userdel[3562352]: removed group 'builder' owned by 'builder'
<86>Jun 2 15:13:10 userdel[3562352]: removed shadow group 'builder' owned by 'builder'
<86>Jun 2 15:13:10 groupadd[3562362]: group added to /etc/group: name=builder, GID=526
<86>Jun 2 15:13:10 groupadd[3562362]: group added to /etc/gshadow: name=builder
<86>Jun 2 15:13:10 groupadd[3562362]: new group: name=builder, GID=526
<86>Jun 2 15:13:10 useradd[3562368]: new user: name=builder, UID=526, GID=526, home=/usr/src, shell=/bin/bash
/usr/src/in/srpm/infinispan-8.2.4-alt2_5jpp8.src.rpm: license not found in '/usr/share/license' directory: ASL
/usr/src/in/srpm/infinispan-8.2.4-alt2_5jpp8.src.rpm: license not found in '/usr/share/license' directory: 2.0
/usr/src/in/srpm/infinispan-8.2.4-alt2_5jpp8.src.rpm: license not found in '/usr/share/license' directory: Public
/usr/src/in/srpm/infinispan-8.2.4-alt2_5jpp8.src.rpm: license not found in '/usr/share/license' directory: Domain
warning: user igor does not exist - using root
warning: group igor does not exist - using root
warning: user igor does not exist - using root
warning: group igor does not exist - using root
warning: user igor does not exist - using root
warning: group igor does not exist - using root
warning: user igor does not exist - using root
warning: group igor does not exist - using root
warning: Unparseable macro: % open source, and written in Java. The purpose of
warning: Macro %pom_disable_module not found
warning: Macro %pom_remove_plugin not found
warning: Macro %pom_disable_module not found
warning: Macro %pom_disable_module not found
warning: Macro %pom_disable_module not found
warning: Macro %pom_disable_module not found
warning: Macro %pom_disable_module not found
warning: Macro %pom_disable_module not found
warning: Macro %pom_disable_module not found
warning: Macro %pom_disable_module not found
warning: Macro %pom_disable_module not found
warning: Macro %pom_disable_module not found
warning: Macro %pom_disable_module not found
warning: Macro %pom_disable_module not found
warning: Macro %pom_disable_module not found
warning: Macro %pom_disable_module not found
warning: Macro %pom_disable_module not found
warning: Macro %pom_disable_module not found
warning: Macro %pom_disable_module not found
warning: Macro %pom_disable_module not found
warning: Macro %pom_disable_module not found
warning: Macro %pom_disable_module not found
warning: Macro %pom_disable_module not found
warning: Macro %pom_disable_module not found
warning: Macro %pom_disable_module not found
warning: Macro %pom_disable_module not found
warning: Macro %pom_disable_module not found
warning: Macro %pom_disable_module not found
warning: Macro %pom_disable_module not found
warning: Macro %pom_disable_module not found
warning: Macro %pom_disable_module not found
warning: Macro %pom_disable_module not found
warning: Macro %pom_disable_module not found
warning: Macro %pom_disable_module not found
warning: Macro %pom_disable_module not found
warning: Macro %pom_disable_module not found
warning: Macro %pom_disable_module not found
warning: Macro %pom_disable_module not found
warning: Macro %pom_xpath_set not found
warning: Macro %pom_remove_plugin not found
warning: Macro %pom_remove_plugin not found
warning: Macro %pom_remove_plugin not found
warning: Macro %pom_remove_plugin not found
warning: Macro %pom_remove_plugin not found
warning: Macro %pom_change_dep not found
warning: Macro %pom_remove_dep not found
warning: Macro %pom_change_dep not found
warning: Macro %pom_change_dep not found
warning: Macro %pom_change_dep not found
warning: Macro %pom_xpath_inject not found
warning: Macro %pom_add_plugin not found
warning: Macro %pom_remove_plugin not found
warning: Macro %pom_add_plugin not found
warning: Macro %pom_disable_module not found
warning: Macro %pom_disable_module not found
warning: Macro %pom_disable_module not found
warning: Macro %pom_disable_module not found
warning: Macro %pom_disable_module not found
warning: Macro %pom_disable_module not found
warning: Macro %pom_disable_module not found
warning: Macro %pom_disable_module not found
warning: Macro %pom_xpath_remove not found
warning: Macro %pom_xpath_remove not found
warning: Macro %pom_xpath_remove not found
warning: Macro %mvn_alias not found
warning: Macro %mvn_build not found
warning: Macro %mvn_install not found
<13>Jun 2 15:13:22 rpmi: javapackages-filesystem-1:5.3.0-alt1_4jpp8 sisyphus+234467.100.1.1 1563037789 installed
<13>Jun 2 15:13:22 rpmi: javapackages-tools-1:5.3.0-alt1_4jpp8 sisyphus+234467.100.1.1 1563037789 installed
<13>Jun 2 15:13:22 rpmi: plexus-utils-0:3.1.0-alt1_4jpp8 sisyphus+232632.100.1.1 1560946792 installed
<13>Jun 2 15:13:22 rpmi: slf4j-0:1.7.25-alt1_6jpp8 sisyphus+234787.100.1.2 1563401783 installed
<13>Jun 2 15:13:22 rpmi: apache-commons-logging-0:1.2-alt1_17jpp8 sisyphus+230666.100.1.3 1559086314 installed
<13>Jun 2 15:13:22 rpmi: apache-commons-io-1:2.6-alt1_8jpp8 sisyphus+246236.100.1.2 1581684285 installed
<13>Jun 2 15:13:22 rpmi: jboss-logging-3.3.0-alt1_6jpp8 sisyphus+230829.100.1.1 1559205941 installed
<13>Jun 2 15:13:22 rpmi: maven-shared-utils-3.2.1-alt1_0.5jpp8 sisyphus+246399.100.1.3 1581811963 installed
<13>Jun 2 15:13:22 rpmi: plexus-containers-component-annotations-0:1.7.1-alt1_9jpp8 sisyphus+230738.100.1.2 1559119352 installed
<13>Jun 2 15:13:22 rpmi: plexus-interpolation-0:1.22-alt1_11jpp8 sisyphus+230585.100.1.3 1559072693 installed
<13>Jun 2 15:13:22 rpmi: maven-wagon-provider-api-0:3.2.0-alt1_2jpp8 sisyphus+234500.100.1.1 1563092918 installed
<13>Jun 2 15:13:22 rpmi: xml-commons-apis-1.4.01-alt3_29jpp8 sisyphus+246084.100.1.1 1581616535 installed
<13>Jun 2 15:13:22 rpmi: httpcomponents-core-4.4.10-alt1_5jpp8 sisyphus+234626.100.1.1 1563265825 installed
<13>Jun 2 15:13:22 rpmi: hawtjni-runtime-0:1.16-alt1_4jpp8 sisyphus+230701.100.1.2 1559102558 installed
<13>Jun 2 15:13:22 rpmi: apache-commons-codec-0:1.11-alt1_6jpp8 sisyphus+230657.100.1.3 1559083228 installed
<13>Jun 2 15:13:22 rpmi: plexus-classworlds-0:2.5.2-alt2_11jpp8 sisyphus+230577.100.1.3 1559069608 installed
<13>Jun 2 15:13:22 rpmi: apache-commons-lang3-3.8.1-alt1_5jpp8 sisyphus+246238.100.1.3 1581684944 installed
<13>Jun 2 15:13:23 rpmi: guava20-20.0-alt1_11jpp8 sisyphus+246194.100.1.2 1581647544 installed
<13>Jun 2 15:13:23 rpmi: maven-resolver-api-1:1.3.1-alt1_2jpp8 sisyphus+234217.100.1.1 1562753977 installed
<13>Jun 2 15:13:23 rpmi: maven-resolver-util-1:1.3.1-alt1_2jpp8 sisyphus+234217.100.1.1 1562753977 installed
<13>Jun 2 15:13:23 rpmi: maven-resolver-spi-1:1.3.1-alt1_2jpp8 sisyphus+234217.100.1.1 1562753977 installed
<13>Jun 2 15:13:23 rpmi: jcl-over-slf4j-0:1.7.25-alt1_6jpp8 sisyphus+234787.100.1.2 1563401783 installed
<13>Jun 2 15:13:23 rpmi: apache-commons-collections-0:3.2.2-alt1_12jpp8 sisyphus+230659.100.1.2 1559083601 installed
<13>Jun 2 15:13:23 rpmi: aopalliance-0:1.0-alt6_21jpp8 sisyphus+246474.100.1.1 1581861463 installed
<13>Jun 2 15:13:23 rpmi: atinject-0:1-alt7_32.20100611svn86jpp8 sisyphus+246479.100.1.1 1581862067 installed
<13>Jun 2 15:13:23 rpmi: apache-commons-cli-0:1.4-alt1_8jpp8 sisyphus+246229.100.1.1 1581671949 installed
<13>Jun 2 15:13:23 rpmi: xmvn-api-3.0.0-alt1_23jpp8 sisyphus+234592.200.1.1 1563216657 installed
<13>Jun 2 15:13:23 rpmi: xmvn-core-3.0.0-alt1_23jpp8 sisyphus+234592.200.1.1 1563216657 installed
<13>Jun 2 15:13:23 rpmi: maven-resolver-connector-basic-1:1.3.1-alt1_2jpp8 sisyphus+234217.100.1.1 1562753977 installed
<13>Jun 2 15:13:23 rpmi: jansi-native-0:1.7-alt1_8jpp8 sisyphus+230705.100.1.2 1559107008 installed
<13>Jun 2 15:13:23 rpmi: jansi-0:1.17.1-alt1_3jpp8 sisyphus+230098.100.1.1 1558798755 installed
<13>Jun 2 15:13:23 rpmi: maven-artifact-1:2.2.1-alt6_61jpp8 sisyphus+230725.100.1.2 1559113327 installed
<13>Jun 2 15:13:23 rpmi: maven-model-1:2.2.1-alt6_61jpp8 sisyphus+230725.100.1.2 1559113327 installed
<13>Jun 2 15:13:23 rpmi: apache-commons-lang-0:2.6-alt5_24jpp8 sisyphus+230665.100.1.2 1559085370 installed
<13>Jun 2 15:13:23 rpmi: javassist-0:3.18.1-alt1_12jpp8 sisyphus+246109.100.1.1 1581622834 installed
<13>Jun 2 15:13:23 rpmi: plexus-cipher-1.7-alt3_18jpp8 sisyphus+246337.100.1.3 1581793897 installed
<13>Jun 2 15:13:23 rpmi: osgi-core-7.0.0-alt1_3jpp8 sisyphus+246369.100.1.3 1581802553 installed
<13>Jun 2 15:13:23 rpmi: xorg-proto-devel-2020.1-alt1 sisyphus+250406.100.1.1 1587554810 installed
<13>Jun 2 15:13:23 rpmi: libjpeg-2:2.0.2-alt1 sisyphus+226996.100.1.1 1554902907 installed
<13>Jun 2 15:13:23 rpmi: libpng16-1.6.37-alt1 sisyphus+236677.100.2.1 1566917998 installed
<13>Jun 2 15:13:23 rpmi: libexpat-2.2.9-alt1 sisyphus+252464.200.2.1 1590958865 installed
<13>Jun 2 15:13:23 rpmi: libffi6-1:3.2.1-alt4 sisyphus+251953.300.2.1 1589891360 installed
<13>Jun 2 15:13:23 rpmi: plexus-sec-dispatcher-1.4-alt4_29jpp8 sisyphus+246341.100.1.3 1581794923 installed
<13>Jun 2 15:13:23 rpmi: google-guice-0:4.1-alt1_14jpp8 sisyphus+230697.100.1.3 1559104116 installed
<13>Jun 2 15:13:23 rpmi: maven-resolver-impl-1:1.3.1-alt1_2jpp8 sisyphus+234217.100.1.1 1562753977 installed
<13>Jun 2 15:13:23 rpmi: maven-resolver-transport-wagon-1:1.3.1-alt1_2jpp8 sisyphus+234217.100.1.1 1562753977 installed
<13>Jun 2 15:13:23 rpmi: maven-wagon-file-0:3.2.0-alt1_2jpp8 sisyphus+234500.100.1.1 1563092918 installed
<13>Jun 2 15:13:23 rpmi: jboss-sasl-1.0.5-alt1_6jpp8 sisyphus+230845.100.1.1 1559212008 installed
<13>Jun 2 15:13:23 rpmi: beust-jcommander-1.71-alt1_6jpp8 sisyphus+230680.100.1.3 1559093321 installed
<13>Jun 2 15:13:23 rpmi: ant-lib-0:1.10.5-alt1_5jpp8 sisyphus+232747.100.2.1 1561092977 installed
<13>Jun 2 15:13:23 rpmi: antlr3-java-1:3.5.2-alt1_22jpp8 sisyphus+234457.100.1.1 1563027983 installed
<13>Jun 2 15:13:23 rpmi: geronimo-annotation-1.0-alt4_27jpp8 sisyphus+246176.100.1.2 1581642137 installed
<13>Jun 2 15:13:23 rpmi: xpp3-1:1.1.4-alt1_20.cjpp8 sisyphus+234613.100.1.1 1563228326 installed
<13>Jun 2 15:13:23 rpmi: jboss-marshalling-1.4.11-alt1_8jpp8 sisyphus+246120.100.1.2 1581628806 installed
<13>Jun 2 15:13:23 rpmi: libICE-1.0.10-alt1 sisyphus+247690.100.1.1 1584000387 installed
<13>Jun 2 15:13:23 rpmi: xml-utils-1:2.9.10-alt3 sisyphus+245000.16400.79.1 1583230501 installed
<13>Jun 2 15:13:23 rpmi: libSM-1.2.3-alt1 sisyphus+226734.100.2.1 1554586158 installed
<13>Jun 2 15:13:23 rpmi: lucene5-0:5.5.0-alt3_0jpp8 sisyphus+232670.100.1.1 1560973029 installed
<13>Jun 2 15:13:23 rpmi: libwayland-server-1.18.0-alt1 sisyphus+245906.100.1.1 1581492503 installed
<13>Jun 2 15:13:23 rpmi: velocity-1:1.7-alt3_27jpp8 sisyphus+246328.100.1.1 1581787500 installed
<13>Jun 2 15:13:24 rpmi: aesh-0.66.8-alt1_7jpp8 sisyphus+230195.100.1.1 1558897690 installed
<13>Jun 2 15:13:24 rpmi: jline-0:2.14.6-alt1_6jpp8 sisyphus+246150.100.1.1 1581626775 installed
<13>Jun 2 15:13:24 rpmi: xmvn-connector-aether-3.0.0-alt1_23jpp8 sisyphus+234592.200.1.1 1563216657 installed
<13>Jun 2 15:13:24 rpmi: maven-dependency-tree-3.0-alt1_7jpp8 sisyphus+230483.100.1.2 1558992218 installed
<13>Jun 2 15:13:24 rpmi: leveldb-java-0.7-alt1_10jpp8 sisyphus+230458.100.1.1 1558980462 installed
<13>Jun 2 15:13:24 rpmi: wildfly-common-1.1.0-alt1_7jpp8 sisyphus+231048.100.1.1 1559295857 installed
<13>Jun 2 15:13:24 rpmi: xnio-3.4.0-alt2_5jpp8 1526637813 installed
<13>Jun 2 15:13:24 rpmi: jboss-remoting-0:4.0.21-alt1_6jpp8 sisyphus+230842.100.2.1 1559419428 installed
<13>Jun 2 15:13:24 rpmi: xmlgraphics-commons-0:2.2-alt1_3jpp8 sisyphus+234789.100.1.3 1563402604 installed
<13>Jun 2 15:13:24 rpmi: plexus-compiler-0:2.8.2-alt1_4jpp8 sisyphus+230579.100.1.2 1559070334 installed
<13>Jun 2 15:13:24 rpmi: plexus-build-api-0:0.0.7-alt3_23jpp8 sisyphus+249033.100.1.1 1585685203 installed
<13>Jun 2 15:13:24 rpmi: stax2-api-4.0.0-alt1_6jpp8 sisyphus+231012.100.1.1 1559280074 installed
<13>Jun 2 15:13:24 rpmi: apache-commons-compress-0:1.18-alt1_4jpp8 sisyphus+230079.100.1.3 1558794575 installed
<13>Jun 2 15:13:24 rpmi: felix-utils-1.10.4-alt1_4jpp8 sisyphus+230330.100.1.2 1558938291 installed
<13>Jun 2 15:13:24 rpmi: jandex-2.0.2-alt1_6jpp8 sisyphus+230765.100.1.3 1559140689 installed
<13>Jun 2 15:13:24 rpmi: hibernate-jpa-2.0-api-1.0.1-alt3_23jpp8 sisyphus+230409.100.1.1 1558963530 installed
<13>Jun 2 15:13:24 rpmi: jboss-transaction-1.1-api-1.0.1-alt2_18jpp8 sisyphus+230852.100.1.1 1559214449 installed
<13>Jun 2 15:13:24 rpmi: jboss-servlet-3.1-api-1.0.0-alt1_6jpp8 sisyphus+230848.100.1.1 1559212763 installed
<13>Jun 2 15:13:24 rpmi: qdox-1:2.0-alt1_4.M9jpp8 sisyphus+230741.100.1.3 1559121911 installed
<13>Jun 2 15:13:24 rpmi: osgi-compendium-7.0.0-alt1_4jpp8 sisyphus+246368.100.1.3 1581802907 installed
<13>Jun 2 15:13:24 rpmi: jboss-servlet-3.0-api-1.0.2-alt1_13jpp8 sisyphus+246124.100.1.3 1581630111 installed
<13>Jun 2 15:13:24 rpmi: jackson-core-2.9.8-alt1_1jpp8 sisyphus+234491.100.1.1 1563086233 installed
<13>Jun 2 15:13:24 rpmi: jboss-logmanager-0:2.0.4-alt1_8jpp8 sisyphus+246119.100.1.1 1581623711 installed
<13>Jun 2 15:13:24 rpmi: jboss-modules-1.5.2-alt2_8jpp8 sisyphus+246121.100.1.1 1581624097 installed
<13>Jun 2 15:13:24 rpmi: picketbox-commons-1.0.0-alt2_19jpp8 sisyphus+249044.100.1.2 1585688982 installed
<13>Jun 2 15:13:24 rpmi: liblksctp-1.0.17-alt2 1523113261 installed
<13>Jun 2 15:13:24 rpmi: libglvnd-7:1.3.1-alt2 sisyphus+252520.100.1.1 1590837007 installed
<13>Jun 2 15:13:24 rpmi: eclipse-equinox-osgi-1:4.6.0-alt0.1jpp 1481827780 installed
<13>Jun 2 15:13:24 rpmi: sgml-common-0.6.3-alt15 1423664786 installed
<13>Jun 2 15:13:24 rpmi: log4j12-1.2.17-alt1_26jpp8 sisyphus+246374.100.1.2 1581803360 installed
<13>Jun 2 15:13:24 rpmi: log4j-jboss-logmanager-0:1.1.2-alt1_7jpp8 sisyphus+230465.100.1.3 1558986444 installed
<13>Jun 2 15:13:24 rpmi: docbook-dtds-4.5-alt1 1223476557 installed
<13>Jun 2 15:13:24 rpmi: docbook-style-xsl-1.79.1-alt4 sisyphus+232871.100.1.1 1561238010 installed
<13>Jun 2 15:13:25 rpmi: eclipselink-persistence-api-2.1.0-alt1_7jpp8 sisyphus+230307.100.1.2 1558931311 installed
<13>Jun 2 15:13:25 rpmi: lksctp-tools-1.0.17-alt2 1523113261 installed
<13>Jun 2 15:13:25 rpmi: picketbox-xacml-2.0.8-alt1_7jpp8 sisyphus+249045.100.1.3 1585689379 installed
<13>Jun 2 15:13:25 rpmi: jboss-jacc-1.4-api-1.0.2-alt2_16jpp8 sisyphus+230811.100.1.1 1559190606 installed
<13>Jun 2 15:13:25 rpmi: felix-bundlerepository-2.0.10-alt1_5jpp8 sisyphus+230318.100.1.1 1558935277 installed
<13>Jun 2 15:13:25 rpmi: jboss-jacc-1.5-api-1.0.0-alt1_11jpp8 sisyphus+230812.100.1.3 1559191755 installed
<13>Jun 2 15:13:25 rpmi: aalto-xml-1.0.0-alt1_7jpp8 sisyphus+230194.100.1.1 1558897643 installed
<13>Jun 2 15:13:25 rpmi: leveldbjni-1.8-alt3_20jpp8 sisyphus+230459.100.1.3 1558984695 installed
<13>Jun 2 15:13:27 rpmi: scala-2.10.6-alt2_17jpp8 sisyphus+246312.100.1.1 1581786324 installed
<13>Jun 2 15:13:27 rpmi: lucene5-analysis-0:5.5.0-alt3_0jpp8 sisyphus+232670.100.1.1 1560973029 installed
<13>Jun 2 15:13:27 rpmi: libICE-devel-1.0.10-alt1 sisyphus+247690.100.1.1 1584000387 installed
<13>Jun 2 15:13:27 rpmi: libSM-devel-1.2.3-alt1 sisyphus+226734.100.2.1 1554586158 installed
<13>Jun 2 15:13:27 rpmi: jboss-marshalling-osgi-1.4.11-alt1_8jpp8 sisyphus+246120.100.1.2 1581628806 installed
<13>Jun 2 15:13:27 rpmi: kxml-2.3.0-alt3_20jpp8 sisyphus+246438.100.1.1 1581834392 installed
<13>Jun 2 15:13:27 rpmi: stringtemplate4-4.0.8-alt1_8jpp8 sisyphus+231017.100.1.1 1559282039 installed
<13>Jun 2 15:13:27 rpmi: libp11-kit-0.23.15-alt1 sisyphus+226408.100.2.1 1554288204 installed
<13>Jun 2 15:13:27 rpmi: libwayland-client-1.18.0-alt1 sisyphus+245906.100.1.1 1581492503 installed
<13>Jun 2 15:13:27 rpmi: libjasper-2.0.16-alt1 sisyphus+231386.100.1.1 1559568070 installed
<13>Jun 2 15:13:27 rpmi: jcsp-1.1-alt1_0.11.rc5jpp8 sisyphus+230869.100.1.1 1559221390 installed
<13>Jun 2 15:13:27 rpmi: apache-commons-configuration-0:1.10-alt1_15jpp8 sisyphus+246230.100.1.2 1581682006 installed
<13>Jun 2 15:13:27 rpmi: xmvn-mojo-3.0.0-alt1_23jpp8 sisyphus+234592.200.1.1 1563216657 installed
<13>Jun 2 15:13:27 rpmi: maven-resolver-transport-file-1:1.3.1-alt1_2jpp8 sisyphus+234217.100.1.1 1562753977 installed
<13>Jun 2 15:13:27 rpmi: plexus-component-api-1.0-alt4_0.28.alpha15jpp8 sisyphus+246338.100.1.2 1581792678 installed
<13>Jun 2 15:13:27 rpmi: plexus-interactivity-api-0:1.0-alt6_0.29.alpha6jpp8 sisyphus+249035.100.1.3 1585686294 installed
<13>Jun 2 15:13:27 rpmi: apache-commons-httpclient-1:3.1-alt6_33jpp8 sisyphus+246235.100.1.2 1581683324 installed
<13>Jun 2 15:13:27 rpmi: maven-invoker-2.2-alt1_9jpp8 sisyphus+230495.100.1.3 1559025269 installed
<13>Jun 2 15:13:27 rpmi: jboss-vfs-0:3.2.12-alt1_6jpp8 sisyphus+230855.100.1.1 1559215753 installed
<13>Jun 2 15:13:27 rpmi: wildfly-elytron-1.0.2-alt1_6jpp8 sisyphus+231050.100.1.1 1559296672 installed
<13>Jun 2 15:13:27 rpmi: plexus-io-0:3.0.0-alt1_4jpp8 sisyphus+230586.100.1.2 1559073032 installed
<13>Jun 2 15:13:27 rpmi: bsf-1:2.4.0-alt3_32jpp8 sisyphus+230681.100.1.3 1559094820 installed
<13>Jun 2 15:13:27 rpmi: fontbox-0:2.0.9-alt1_5jpp8 sisyphus+232748.100.2.2 1561094391 installed
<13>Jun 2 15:13:27 rpmi: jboss-interceptors-1.2-api-1.0.0-alt1_10jpp8 sisyphus+230808.100.1.1 1559189873 installed
<13>Jun 2 15:13:27 rpmi: jsoup-1.11.3-alt1_4jpp8 sisyphus+230720.100.1.2 1559110900 installed
<13>Jun 2 15:13:27 rpmi: apache-ivy-0:2.4.0-alt1_16jpp8 sisyphus+230669.100.1.3 1559087305 installed
<13>Jun 2 15:13:27 rpmi: extra166y-1.7.0-alt1_11jpp8 sisyphus+230314.100.1.1 1558915133 installed
<13>Jun 2 15:13:27 rpmi: multiverse-0.7.0-alt1_10jpp8 sisyphus+230533.100.1.2 1559038108 installed
<13>Jun 2 15:13:27 rpmi: apache-commons-pool-0:1.6-alt2_19jpp8 sisyphus+230668.100.1.2 1559085349 installed
<13>Jun 2 15:13:27 rpmi: avalon-logkit-0:2.1-alt2_32jpp8 sisyphus+230676.100.1.3 1559090555 installed
<13>Jun 2 15:13:27 rpmi: avalon-framework-0:4.3-alt4_24jpp8 sisyphus+246481.100.1.3 1581864563 installed
<13>Jun 2 15:13:27 rpmi: jai-imageio-core-1.2-alt1_0.24.20100217cvsjpp8 sisyphus+221788.100.1.1 1550423410 installed
<13>Jun 2 15:13:27 rpmi: bean-validation-api-1.1.0-alt1_11jpp8 sisyphus+230254.100.1.2 1558917671 installed
<13>Jun 2 15:13:27 rpmi: classmate-1.3.1-alt1_6jpp8 sisyphus+230275.100.1.2 1558922228 installed
<13>Jun 2 15:13:27 rpmi: jaxen-0:1.1.6-alt1_19jpp8 sisyphus+230709.100.1.3 1559108543 installed
<13>Jun 2 15:13:27 rpmi: dom4j-0:2.0.0-alt1_9jpp8 sisyphus+246467.100.1.2 1581845608 installed
<13>Jun 2 15:13:28 rpmi: fastutil-7.0.7-alt1_7jpp8 sisyphus+230317.100.1.1 1558935500 installed
<13>Jun 2 15:13:28 rpmi: stream-lib-2.6.0-alt1_12jpp8 sisyphus+246324.100.1.2 1581789378 installed
<13>Jun 2 15:13:28 rpmi: java-common-1.6.0-alt1 sisyphus+234020.100.1.1 1562437039 installed
<13>Jun 2 15:13:28 rpmi: gnu-getopt-0:1.0.14-alt1_17jpp8 sisyphus+246193.100.1.1 1581632669 installed
<13>Jun 2 15:13:28 rpmi: jdeparser-2.0.0-alt1_6jpp8 sisyphus+230872.100.1.1 1559223473 installed
<13>Jun 2 15:13:29 rpmi: jboss-logging-tools-2.0.1-alt1_8jpp8 sisyphus+230831.100.1.1 1559206298 installed
<13>Jun 2 15:13:29 rpmi: hibernate-commons-annotations-5.0.1-alt1_6jpp8 sisyphus+230408.100.1.2 1558964082 installed
<13>Jun 2 15:13:29 rpmi: jboss-remoting-jmx-2.0.1-alt1_6jpp8 sisyphus+230841.100.1.3 1559211405 installed
<13>Jun 2 15:13:29 rpmi: jackson-annotations-2.9.8-alt1_1jpp8 sisyphus+230095.100.1.3 1558799786 installed
<13>Jun 2 15:13:29 rpmi: jackson-databind-2.9.8-alt1_1jpp8 sisyphus+234491.200.1.1 1563086320 installed
<13>Jun 2 15:13:29 rpmi: log4j-0:2.11.1-alt1_3jpp8 sisyphus+230084.100.1.3 1558796509 installed
<13>Jun 2 15:13:29 rpmi: log4j-jcl-0:2.11.1-alt1_3jpp8 sisyphus+230084.100.1.3 1558796509 installed
<13>Jun 2 15:13:29 rpmi: log4j-slf4j-0:2.11.1-alt1_3jpp8 sisyphus+230084.100.1.3 1558796509 installed
<13>Jun 2 15:13:29 rpmi: jboss-annotations-1.2-api-1.0.0-alt1_6jpp8 sisyphus+230793.100.1.1 1559185134 installed
<13>Jun 2 15:13:29 rpmi: jboss-classfilewriter-1.1.2-alt1_6jpp8 sisyphus+230794.100.1.1 1559185502 installed
<13>Jun 2 15:13:29 rpmi: jboss-connector-1.6-api-1.0.1-alt2_9jpp8 sisyphus+230796.100.1.1 1559186114 installed
<13>Jun 2 15:13:29 rpmi: jboss-dmr-1.3.0-alt1_3jpp8 1510444517 installed
<13>Jun 2 15:13:29 rpmi: jboss-invocation-1.4.1-alt1_6jpp8 sisyphus+230809.100.1.1 1559190104 installed
<13>Jun 2 15:13:29 rpmi: jboss-jaspi-1.1-api-1.0.0-alt1_6jpp8 sisyphus+230815.100.1.1 1559191742 installed
<13>Jun 2 15:13:29 rpmi: jdeparser1-1.0.0-alt1_7jpp8 sisyphus+230871.100.1.1 1559223178 installed
<13>Jun 2 15:13:29 rpmi: jboss-msc-1.2.6-alt1_6jpp8 sisyphus+230837.100.1.8 1559211373 installed
<13>Jun 2 15:13:29 rpmi: jboss-stdio-1.0.2-alt1_9jpp8 sisyphus+230850.100.1.1 1559214175 installed
<13>Jun 2 15:13:29 rpmi: jboss-threads-0:2.2.1-alt1_7jpp8 sisyphus+230851.100.1.1 1559214474 installed
<13>Jun 2 15:13:29 rpmi: jboss-websocket-1.1-api-1.1.1-alt1_6jpp8 sisyphus+230857.100.1.1 1559216334 installed
<13>Jun 2 15:13:29 rpmi: undertow-1:1.4.0-alt1_6jpp8 sisyphus+231040.100.1.1 1559293236 installed
<13>Jun 2 15:13:29 rpmi: staxmapper-1.2.0-alt1_6jpp8 sisyphus+231014.100.1.1 1559281039 installed
<13>Jun 2 15:13:29 rpmi: glassfish-el-api-3.0.1-alt1_0.13.b08jpp8 sisyphus+246188.100.1.3 1581646552 installed
<13>Jun 2 15:13:29 rpmi: cdi-api-1.2-alt1_12jpp8 sisyphus+246450.100.1.1 1581841321 installed
<13>Jun 2 15:13:29 rpmi: sisu-inject-2:0.3.3-alt1_8jpp8 sisyphus+249061.100.1.1 1585693066 installed
<13>Jun 2 15:13:29 rpmi: sisu-plexus-2:0.3.3-alt1_8jpp8 sisyphus+249061.100.1.1 1585693066 installed
<13>Jun 2 15:13:29 rpmi: maven-filesystem-0.01-alt2.1 1460115697 installed
<13>Jun 2 15:13:29 rpmi: xpp3-minimal-1:1.1.4-alt1_20.cjpp8 sisyphus+234613.100.1.1 1563228326 installed
<13>Jun 2 15:13:29 rpmi: xstream-0:1.4.11.1-alt1_2jpp8 sisyphus+232422.100.1.1 1560804121 installed
<13>Jun 2 15:13:29 rpmi: jzlib-0:1.1.3-alt1_12jpp8 sisyphus+246197.100.1.2 1581650007 installed
<13>Jun 2 15:13:29 rpmi: netty3-3.10.6-alt2_6jpp8 sisyphus+234851.100.1.1 1563462247 installed
<13>Jun 2 15:13:29 rpmi: apache-commons-exec-0:1.3-alt1_13jpp8 sisyphus+246866.100.1.1 1582573268 installed
<13>Jun 2 15:13:29 rpmi: osgi-annotation-7.0.0-alt1_4jpp8 sisyphus+246367.100.1.2 1581802295 installed
<13>Jun 2 15:13:29 rpmi: aqute-bndlib-0:3.5.0-alt1_8jpp8 sisyphus+246478.100.1.1 1581862098 installed
<13>Jun 2 15:13:30 rpmi: jcodings-1.0.9-alt2_17jpp8 sisyphus+246126.100.1.1 1581624628 installed
<13>Jun 2 15:13:30 rpmi: bytelist-1.0.8-alt2_19jpp8 sisyphus+246490.100.1.1 1581862876 installed
<13>Jun 2 15:13:30 rpmi: mchange-commons-0.2.11-alt2_9jpp8 sisyphus+244215.100.1.1 1578935163 installed
<13>Jun 2 15:13:30 rpmi: dain-snappy-0.4-alt1_9jpp8 sisyphus+246459.100.1.2 1581844027 installed
<13>Jun 2 15:13:30 rpmi: geronimo-interceptor-1.0.1-alt2_22jpp8 sisyphus+246178.100.1.3 1581643241 installed
<13>Jun 2 15:13:30 rpmi: geronimo-jpa-1.1.1-alt3_25jpp8 sisyphus+246183.100.1.3 1581644997 installed
<13>Jun 2 15:13:30 rpmi: geronimo-jta-1.1.1-alt3_27jpp8 sisyphus+246184.100.1.3 1581645279 installed
<13>Jun 2 15:13:30 rpmi: geronimo-validation-1.1-alt2_22jpp8 sisyphus+246187.100.1.2 1581645984 installed
<13>Jun 2 15:13:30 rpmi: hamcrest-core-0:1.3-alt3_27jpp8 sisyphus+246429.100.1.1 1581833287 installed
<13>Jun 2 15:13:30 rpmi: junit-1:4.12-alt1_13jpp8 sisyphus+246172.100.1.2 1581640927 installed
<13>Jun 2 15:13:30 rpmi: maven-verifier-1.6-alt1_10jpp8 sisyphus+246402.100.1.2 1581812459 installed
<13>Jun 2 15:13:30 rpmi: hibernate-jpa-2.1-api-1.0.0-alt1_8jpp8 sisyphus+246430.100.1.3 1581836913 installed
<13>Jun 2 15:13:30 rpmi: jctools-2.1.2-alt1_1jpp8 sisyphus+234514.100.1.1 1563120991 installed
<13>Jun 2 15:13:30 rpmi: netty-4.1.13-alt1_9jpp8 sisyphus+226389.100.1.2 1554268093 installed
<13>Jun 2 15:13:30 rpmi: joda-time-0:2.9.9-alt1_6.tzdata2017bjpp8 sisyphus+246159.100.1.2 1581638779 installed
<13>Jun 2 15:13:30 rpmi: jsr-311-1.1.1-alt2_20jpp8 sisyphus+246169.100.1.1 1581628196 installed
<13>Jun 2 15:13:30 rpmi: protobuf-java-3.11.4-alt1 sisyphus+247781.40.2.1 1584113294 installed
<13>Jun 2 15:13:30 rpmi: protoparser-3.1.5-alt1_7jpp8 sisyphus+249048.100.1.2 1585690380 installed
<13>Jun 2 15:13:30 rpmi: protostream-3.0.4-alt1_7jpp8 sisyphus+230593.100.1.3 1559080767 installed
<13>Jun 2 15:13:30 rpmi: jgroups-1:3.6.10-alt1_8jpp8 sisyphus+246146.100.1.1 1581626433 installed
<13>Jun 2 15:13:30 rpmi: xz-java-1.8-alt1_6jpp8 sisyphus+246078.100.1.1 1581610971 installed
<13>Jun 2 15:13:30 rpmi: plexus-archiver-0:3.6.0-alt1_3jpp8 sisyphus+230573.100.1.2 1559064649 installed
<13>Jun 2 15:13:30 rpmi: maven-plugin-testing-harness-3.3.0-alt1_16jpp8 sisyphus+246388.100.1.2 1581807247 installed
<13>Jun 2 15:13:30 rpmi: zip-30000000:3.0-alt1 1332241772 installed
<13>Jun 2 15:13:30 rpmi: rpm-macros-java-1:5.3.0-alt1_4jpp8 sisyphus+234467.100.1.1 1563037789 installed
<13>Jun 2 15:13:30 rpmi: libnatspec-0.3.1-alt2 1445691580 installed
<13>Jun 2 15:13:30 rpmi: unzip-6.0-alt3 sisyphus+244330.100.1.1 1579094108 installed
<13>Jun 2 15:13:30 rpmi: libpcsclite-1.8.26-alt1 sisyphus+243821.140.3.1 1578667511 installed
<13>Jun 2 15:13:30 rpmi: libsqlite3-3.32.1-alt1 sisyphus+252287.100.1.1 1590532211 installed
<13>Jun 2 15:13:31 rpmi: libnspr-1:4.25-alt1 sisyphus+247014.100.1.1 1582673206 installed
<13>Jun 2 15:13:31 rpmi: javazi-2020a-alt1 sisyphus+250575.200.1.1 1587740494 installed
<13>Jun 2 15:13:31 rpmi: libgif-4.1.6-alt3 1299634261 installed
<13>Jun 2 15:13:31 rpmi: liblz4-1:1.9.2-alt1 sisyphus+238585.100.2.2 1570066927 installed
<13>Jun 2 15:13:31 rpmi: libgpg-error-1.36-alt1 sisyphus+225621.300.1.1 1553521082 installed
<13>Jun 2 15:13:31 rpmi: libgcrypt20-1.8.5-alt3 sisyphus+239622.100.1.1 1571746654 installed
<13>Jun 2 15:13:31 rpmi: libsystemd-1:245.5-alt1 sisyphus+250810.500.6.1 1588357136 installed
<13>Jun 2 15:13:31 rpmi: libdbus-1.12.16-alt2 sisyphus+240566.100.2.1 1573547696 installed
<13>Jun 2 15:13:31 rpmi: libavahi-0.7-alt3 sisyphus+250384.100.2.1 1587547019 installed
<13>Jun 2 15:13:31 rpmi: libcups-2.3.1-alt1 sisyphus+247381.100.2.2 1583841455 installed
<13>Jun 2 15:13:31 rpmi: libxslt-1.1.34-alt2 sisyphus+248264.100.1.1 1584829770 installed
<13>Jun 2 15:13:31 rpmi: icon-theme-hicolor-0.17-alt2 sisyphus+248343.100.1.1 1584979043 installed
<13>Jun 2 15:13:31 rpmi: libwebp7-1.1.0-alt1 sisyphus+243895.100.1.1 1578410873 installed
<13>Jun 2 15:13:31 rpmi: libjbig-2.1-alt1 1401380926 installed
<13>Jun 2 15:13:31 rpmi: libtiff5-4.1.0-alt1 sisyphus+240802.100.1.1 1573743635 installed
<13>Jun 2 15:13:31 rpmi: shared-mime-info-2.0-alt1 sisyphus+251302.100.1.1 1588847607 installed
<13>Jun 2 15:13:31 rpmi: gsettings-desktop-schemas-data-3.36.1-alt1 sisyphus+250870.100.1.1 1588227108 installed
<13>Jun 2 15:13:31 rpmi: libgio-2.64.3-alt1 sisyphus+251581.40.3.3 1590771553 installed
<13>Jun 2 15:13:31 rpmi: gsettings-desktop-schemas-3.36.1-alt1 sisyphus+250870.100.1.1 1588227105 installed
<13>Jun 2 15:13:31 rpmi: libgdk-pixbuf-locales-2.40.0-alt1 sisyphus+238952.140.2.1 1570644607 installed
<13>Jun 2 15:13:31 rpmi: libgdk-pixbuf-2.40.0-alt1 sisyphus+238952.140.2.1 1570644615 installed
<13>Jun 2 15:13:31 rpmi: gtk-update-icon-cache-3.24.20-alt1 sisyphus+250751.100.1.1 1588052725 installed
<13>Jun 2 15:13:31 rpmi: libgtk+2-locales-2.24.32-alt4 sisyphus+248211.200.2.1 1584869557 installed
<13>Jun 2 15:13:31 rpmi: libdatrie-0.2.9-alt1_6 1511686676 installed
<13>Jun 2 15:13:31 rpmi: libthai-0.1.28-alt1_1 sisyphus+226107.100.1.1 1554123079 installed
<13>Jun 2 15:13:32 rpmi: libfribidi-1.0.9-alt1 sisyphus+247242.1500.7.1 1583840860 installed
<13>Jun 2 15:13:32 rpmi: libpixman-3:0.40.0-alt1 sisyphus+250700.100.1.1 1587971055 installed
<13>Jun 2 15:13:32 rpmi: libxshmfence-1.3-alt1 sisyphus+223149.1000.2.1 1551268571 installed
<13>Jun 2 15:13:32 rpmi: libpciaccess-1:0.16-alt1 sisyphus+234814.100.1.1 1563438291 installed
<13>Jun 2 15:13:32 rpmi: libdrm-1:2.4.102-alt1 sisyphus+252307.100.1.1 1590574828 installed
<13>Jun 2 15:13:32 rpmi: libgbm-4:20.1.0-alt1 sisyphus+252339.100.1.1 1590650691 installed
<13>Jun 2 15:13:32 rpmi: libatk-locales-2.36.0-alt1 sisyphus+249208.100.1.1 1585840405 installed
<13>Jun 2 15:13:32 rpmi: libatk-2.36.0-alt1 sisyphus+249208.100.1.1 1585840406 installed
<13>Jun 2 15:13:32 rpmi: libX11-locales-3:1.6.9-alt1 sisyphus+239210.100.1.1 1571056781 installed
<13>Jun 2 15:13:32 rpmi: libXdmcp-1.1.3-alt1 sisyphus+225206.600.1.2 1552949353 installed
<13>Jun 2 15:13:32 rpmi: libXau-1.0.9-alt1 sisyphus+223149.200.2.1 1551268152 installed
<13>Jun 2 15:13:32 rpmi: libxcb-1.14-alt1 sisyphus+247358.200.1.3 1583854228 installed
<13>Jun 2 15:13:32 rpmi: libX11-3:1.6.9-alt1 sisyphus+239210.100.1.1 1571056801 installed
<13>Jun 2 15:13:32 rpmi: libXext-1.3.4-alt1 sisyphus+225206.700.1.2 1552949429 installed
<13>Jun 2 15:13:32 rpmi: libXrender-0.9.8-alt1 1371312112 installed
<13>Jun 2 15:13:32 rpmi: libXfixes-5.0.3-alt1 sisyphus+226736.100.2.2 1554614841 installed
<13>Jun 2 15:13:32 rpmi: libXi-1.7.10-alt1 sisyphus+232786.300.1.1 1561106978 installed
<13>Jun 2 15:13:32 rpmi: libXcomposite-0.4.5-alt1 sisyphus+225206.300.1.2 1552949137 installed
<13>Jun 2 15:13:32 rpmi: libXdamage-1.1.5-alt1 sisyphus+225206.500.1.2 1552949286 installed
<13>Jun 2 15:13:32 rpmi: libXcursor-1.2.0-alt1 sisyphus+225206.400.1.2 1552949218 installed
<13>Jun 2 15:13:32 rpmi: libXrandr-1.5.2-alt1 sisyphus+225206.1300.1.2 1552949710 installed
<13>Jun 2 15:13:32 rpmi: libXxf86vm-1.1.4-alt2 1527672187 installed
<13>Jun 2 15:13:32 rpmi: libGLX-mesa-4:20.1.0-alt1 sisyphus+252339.100.1.1 1590650691 installed
<13>Jun 2 15:13:32 rpmi: libEGL-mesa-4:20.1.0-alt1 sisyphus+252339.100.1.1 1590650691 installed
<13>Jun 2 15:13:32 rpmi: libEGL-7:1.3.1-alt2 sisyphus+252520.100.1.1 1590837007 installed
<13>Jun 2 15:13:32 rpmi: libGLX-7:1.3.1-alt2 sisyphus+252520.100.1.1 1590837007 installed
<13>Jun 2 15:13:32 rpmi: libGL-7:1.3.1-alt2 sisyphus+252520.100.1.1 1590837007 installed
<13>Jun 2 15:13:32 rpmi: libXinerama-1.1.4-alt1 sisyphus+223149.300.2.1 1551268216 installed
<13>Jun 2 15:13:32 rpmi: libXtst-1.2.2-alt1 1369984893 installed
<13>Jun 2 15:13:32 rpmi: libXt-1.2.0-alt1 sisyphus+247690.400.1.1 1584000596 installed
<13>Jun 2 15:13:34 rpmi: libxcb-devel-1.14-alt1 sisyphus+247358.200.1.3 1583854228 installed
<13>Jun 2 15:13:34 rpmi: libX11-devel-3:1.6.9-alt1 sisyphus+239210.100.1.1 1571056801 installed
<13>Jun 2 15:13:34 rpmi: libXt-devel-1.2.0-alt1 sisyphus+247690.400.1.1 1584000596 installed
<13>Jun 2 15:13:34 rpmi: libbrotlicommon-1.0.7-alt1 sisyphus+226738.100.2.1 1554554568 installed
<13>Jun 2 15:13:34 rpmi: libbrotlidec-1.0.7-alt1 sisyphus+226738.100.2.1 1554554568 installed
<13>Jun 2 15:13:34 rpmi: libgraphite2-1.3.14-alt2 sisyphus+250009.100.1.1 1586943065 installed
<13>Jun 2 15:13:34 rpmi: libharfbuzz-2.6.4-alt3 sisyphus+251539.200.8.2 1590700094 installed
<13>Jun 2 15:13:34 rpmi: libfreetype-2.10.2-alt1 sisyphus+251736.100.1.1 1589531905 installed
<13>Jun 2 15:13:34 rpmi: fontconfig-2.13.1-alt1 sisyphus+247349.100.1.2 1583841221 installed
Updating fonts cache: <29>Jun 2 15:13:35 fontconfig: Updating fonts cache: succeeded
[ DONE ]
<13>Jun 2 15:13:35 rpmi: libcairo-1:1.16.0-alt1 sisyphus+226534.100.2.3 1554515535 installed
<13>Jun 2 15:13:35 rpmi: fonts-type1-xorg-7.0.0-alt4 1188553211 installed
<13>Jun 2 15:13:35 rpmi: libXft-2.3.3-alt1 sisyphus+225206.1000.3.2 1552987708 installed
<13>Jun 2 15:13:35 rpmi: libpango-1.44.7-alt1 sisyphus+239731.100.1.1 1571986949 installed
<13>Jun 2 15:13:35 rpmi: libgtk+2-2.24.32-alt4 sisyphus+248211.200.2.1 1584869549 installed
<13>Jun 2 15:13:36 rpmi: libgail-2.24.32-alt4 sisyphus+248211.200.2.1 1584869549 installed
<13>Jun 2 15:13:36 rpmi: publicsuffix-list-20200401-alt1 sisyphus+249161.100.1.1 1585815856 installed
<13>Jun 2 15:13:36 rpmi: httpcomponents-client-4.5.7-alt1_1jpp8 sisyphus+234750.100.1.1 1563380626 installed
<13>Jun 2 15:13:36 rpmi: maven-wagon-http-shared-0:3.2.0-alt1_2jpp8 sisyphus+234500.100.1.1 1563092918 installed
<13>Jun 2 15:13:36 rpmi: maven-wagon-http-0:3.2.0-alt1_2jpp8 sisyphus+234500.100.1.1 1563092918 installed
<13>Jun 2 15:13:36 rpmi: maven-1:3.5.4-alt1_10jpp8 sisyphus+234629.100.1.2 1563267886 installed
<13>Jun 2 15:13:36 rpmi: maven-lib-1:3.5.4-alt1_10jpp8 sisyphus+234629.100.1.2 1563267886 installed
<13>Jun 2 15:13:36 rpmi: maven-archiver-0:3.2.0-alt1_4jpp8 sisyphus+230477.100.1.3 1558989899 installed
<13>Jun 2 15:13:36 rpmi: maven-common-artifact-filters-3.0.1-alt1_8jpp8 sisyphus+246378.100.1.2 1581805207 installed
<13>Jun 2 15:13:36 rpmi: maven-artifact-transfer-1:0.9.0-alt1_6jpp8 sisyphus+230479.100.1.2 1558990306 installed
<13>Jun 2 15:13:36 rpmi: maven-source-plugin-3.0.1-alt1_6jpp8 sisyphus+230515.100.1.3 1559032634 installed
<13>Jun 2 15:13:36 rpmi: maven-jar-plugin-3.1.0-alt1_3jpp8 sisyphus+230496.100.1.3 1559025734 installed
<13>Jun 2 15:13:36 rpmi: maven-shared-incremental-1.1-alt1_18jpp8 sisyphus+246396.100.1.2 1581810480 installed
<13>Jun 2 15:13:36 rpmi: maven-filtering-3.1.1-alt1_9jpp8 sisyphus+246380.100.1.3 1581806111 installed
<13>Jun 2 15:13:36 rpmi: maven-resources-plugin-3.1.0-alt1_6jpp8 sisyphus+246394.100.1.3 1581808735 installed
<13>Jun 2 15:13:36 rpmi: xmvn-minimal-3.0.0-alt1_23jpp8 sisyphus+234592.200.1.1 1563216657 installed
<13>Jun 2 15:13:36 rpmi: maven-resolver-transport-http-1:1.3.1-alt1_2jpp8 sisyphus+234217.100.1.1 1562753977 installed
<13>Jun 2 15:13:36 rpmi: libgdbm-1.8.3-alt10 1454943334 installed
<13>Jun 2 15:13:36 rpmi: libtasn1-4.16.0-alt1 sisyphus+245480.100.1.1 1580825062 installed
<13>Jun 2 15:13:36 rpmi: rpm-macros-alternatives-0.5.1-alt1 sisyphus+226946.100.1.1 1554830426 installed
<13>Jun 2 15:13:36 rpmi: alternatives-0.5.1-alt1 sisyphus+226946.100.1.1 1554830426 installed
<13>Jun 2 15:13:36 rpmi: ca-certificates-2020.01.23-alt1 sisyphus+244791.300.2.1 1580285500 installed
<13>Jun 2 15:13:36 rpmi: ca-trust-0.1.2-alt1 sisyphus+233348.100.1.1 1561653823 installed
<13>Jun 2 15:13:36 rpmi: p11-kit-trust-0.23.15-alt1 sisyphus+226408.100.2.1 1554288204 installed
<13>Jun 2 15:13:36 rpmi: libcrypto1.1-1.1.1g-alt1 sisyphus+249982.60.8.1 1587743711 installed
<13>Jun 2 15:13:36 rpmi: libssl1.1-1.1.1g-alt1 sisyphus+249982.60.8.1 1587743711 installed
<13>Jun 2 15:13:36 rpmi: libpython3-3.8.2-alt1 sisyphus+244999.100.3.1 1585218480 installed
<13>Jun 2 15:13:36 rpmi: python3-3.8.2-alt1 sisyphus+244999.100.3.1 1585218480 installed
<13>Jun 2 15:13:37 rpmi: python3-base-3.8.2-alt1 sisyphus+244999.100.3.1 1585218480 installed
<13>Jun 2 15:13:37 rpmi: python3-module-sugarbowl-0.52.1-alt1.git20141130.1.1 sisyphus+227470.1100.1.1 1555687657 installed
<13>Jun 2 15:13:37 rpmi: python3-module-six-1.14.0-alt1 sisyphus+251567.100.1.1 1589268039 installed
<13>Jun 2 15:13:37 rpmi: python3-module-markupsafe-1.1.1-alt1 sisyphus+248369.100.1.1 1585046136 installed
<13>Jun 2 15:13:37 rpmi: python3-module-jinja2-2.10.3-alt1 sisyphus+241982.100.1.1 1575023523 installed
<13>Jun 2 15:13:37 rpmi: python3-module-clyde-0.8.0-alt1.git20141130.2.1 sisyphus+227465.1600.1.2 1555756906 installed
<13>Jun 2 15:13:37 rpmi: python3-module-pkg_resources-1:46.1.3-alt1 sisyphus+250566.200.3.1 1587973342 installed
<13>Jun 2 15:13:37 rpmi: python3-module-runfile-0.46.1-alt1.git20141130.2.1 sisyphus+227469.1300.2.3 1555706376 installed
<13>Jun 2 15:13:37 rpmi: objectweb-asm-0:7.0-alt1_4jpp8 sisyphus+246362.100.1.3 1581801326 installed
<13>Jun 2 15:13:37 rpmi: plexus-languages-0.9.10-alt1_5jpp8 sisyphus+249036.100.1.3 1585686585 installed
<13>Jun 2 15:13:37 rpmi: antlr-tool-0:2.7.7-alt12_57jpp8 sisyphus+230655.100.1.1 1559061963 installed
<13>Jun 2 15:13:37 rpmi: gpars-1.2.1-alt1_13jpp8 sisyphus+230383.100.1.2 1558956752 installed
<13>Jun 2 15:13:38 rpmi: groovy-lib-0:2.4.8-alt1_9jpp8 sisyphus+234614.100.1.2 1563229744 installed
<13>Jun 2 15:13:38 rpmi: hibernate3-1:3.6.10-alt4_22jpp8 1527682207 installed
<13>Jun 2 15:13:38 rpmi: cglib-0:3.2.9-alt1_4jpp8 sisyphus+246451.100.1.1 1581841093 installed
<13>Jun 2 15:13:38 rpmi: springframework-0:3.2.18-alt2_4jpp8 1527861093 installed
<13>Jun 2 15:13:38 rpmi: bsh-0:2.0-alt1_16.b6jpp8 sisyphus+246487.100.1.1 1581862559 installed
<13>Jun 2 15:13:38 rpmi: springframework-expression-0:3.2.18-alt2_4jpp8 1527861093 installed
<13>Jun 2 15:13:38 rpmi: hibernate3-entitymanager-1:3.6.10-alt4_22jpp8 1527682207 installed
<13>Jun 2 15:13:38 rpmi: xbean-0:4.9-alt1_2jpp8 sisyphus+230152.100.1.1 1558817445 installed
<13>Jun 2 15:13:38 rpmi: plexus-containers-container-default-0:1.7.1-alt1_9jpp8 sisyphus+230738.100.1.2 1559119352 installed
<13>Jun 2 15:13:38 rpmi: maven-plugin-registry-1:2.2.1-alt6_61jpp8 sisyphus+230725.100.1.2 1559113327 installed
<13>Jun 2 15:13:38 rpmi: maven-doxia-logging-api-0:1.7-alt1_10jpp8 sisyphus+230487.100.1.3 1559021328 installed
<13>Jun 2 15:13:38 rpmi: maven-doxia-sink-api-0:1.7-alt1_10jpp8 sisyphus+230487.100.1.3 1559021328 installed
<13>Jun 2 15:13:38 rpmi: maven-reporting-api-1:3.0-alt3_18jpp8 sisyphus+246392.100.1.2 1581808388 installed
<13>Jun 2 15:13:38 rpmi: plexus-i18n-0:1.0-alt7_0.15.b10.4jpp8 sisyphus+246340.100.1.2 1581794394 installed
<13>Jun 2 15:13:38 rpmi: maven-plugin-annotations-0:3.5.1-alt1_7jpp8 sisyphus+246389.100.1.3 1581809388 installed
<13>Jun 2 15:13:38 rpmi: maven-surefire-0:2.22.0-alt1_6jpp8 sisyphus+246401.100.1.3 1581813318 installed
<13>Jun 2 15:13:38 rpmi: maven-surefire-plugin-0:2.22.0-alt1_6jpp8 sisyphus+246401.100.1.3 1581813318 installed
<13>Jun 2 15:13:38 rpmi: maven-surefire-provider-junit-0:2.22.0-alt1_6jpp8 sisyphus+246401.100.1.3 1581813318 installed
<13>Jun 2 15:13:39 rpmi: maven-surefire-provider-testng-0:2.22.0-alt1_6jpp8 sisyphus+246401.100.1.3 1581813318 installed
<13>Jun 2 15:13:39 rpmi: maven-artifact-manager-1:2.2.1-alt6_61jpp8 sisyphus+230725.100.1.2 1559113327 installed
<13>Jun 2 15:13:39 rpmi: maven-profile-1:2.2.1-alt6_61jpp8 sisyphus+230725.100.1.2 1559113327 installed
<13>Jun 2 15:13:39 rpmi: maven-settings-1:2.2.1-alt6_61jpp8 sisyphus+230725.100.1.2 1559113327 installed
<13>Jun 2 15:13:39 rpmi: maven-project-1:2.2.1-alt6_61jpp8 sisyphus+230725.100.1.2 1559113327 installed
<13>Jun 2 15:13:39 rpmi: plexus-velocity-0:1.2-alt1_8jpp8 sisyphus+246342.100.1.3 1581795180 installed
<13>Jun 2 15:13:39 rpmi: maven-enforcer-api-0:1.4.1-alt1_10jpp8 sisyphus+230489.100.1.3 1559022665 installed
<13>Jun 2 15:13:39 rpmi: maven-enforcer-rules-0:1.4.1-alt1_10jpp8 sisyphus+230489.100.1.3 1559022665 installed
<13>Jun 2 15:13:39 rpmi: maven-compiler-plugin-3.8.0-alt1_2jpp8 sisyphus+234770.100.1.1 1563387380 installed
<13>Jun 2 15:13:39 rpmi: xmvn-install-3.0.0-alt1_23jpp8 sisyphus+234592.200.1.1 1563216657 installed
<13>Jun 2 15:13:39 rpmi: parboiled-1.1.6-alt1_16jpp8 sisyphus+249040.100.1.3 1585687650 installed
<13>Jun 2 15:13:39 rpmi: pegdown-1.4.2-alt1_15jpp8 sisyphus+249043.100.1.1 1585686958 installed
<13>Jun 2 15:13:39 rpmi: xml-commons-resolver-0:1.2-alt1_29jpp8 sisyphus+246085.100.1.1 1581616616 installed
<13>Jun 2 15:13:39 rpmi: xalan-j2-0:2.7.1-alt4_39jpp8 sisyphus+230759.100.1.3 1559127607 installed
<13>Jun 2 15:13:39 rpmi: xerces-j2-0:2.12.0-alt1_4jpp8 sisyphus+246082.100.1.1 1581615230 installed
<13>Jun 2 15:13:39 rpmi: batik-css-0:1.10-alt1_4jpp8 sisyphus+230679.100.1.3 1559093898 installed
<13>Jun 2 15:13:39 rpmi: batik-0:1.10-alt1_4jpp8 sisyphus+230679.100.1.3 1559093898 installed
<13>Jun 2 15:13:39 rpmi: xmlunit-0:1.6-alt1_9jpp8 sisyphus+231069.100.1.1 1559306501 installed
<13>Jun 2 15:13:39 rpmi: maven-doxia-core-0:1.7-alt1_10jpp8 sisyphus+230487.100.1.3 1559021328 installed
<13>Jun 2 15:13:39 rpmi: maven-doxia-module-xhtml-0:1.7-alt1_10jpp8 sisyphus+230487.100.1.3 1559021328 installed
<13>Jun 2 15:13:39 rpmi: maven-doxia-module-markdown-0:1.7-alt1_10jpp8 sisyphus+230487.100.1.3 1559021328 installed
<13>Jun 2 15:13:39 rpmi: maven-doxia-module-apt-0:1.7-alt1_10jpp8 sisyphus+230487.100.1.3 1559021328 installed
<13>Jun 2 15:13:39 rpmi: maven-doxia-module-fml-0:1.7-alt1_10jpp8 sisyphus+230487.100.1.3 1559021328 installed
<13>Jun 2 15:13:39 rpmi: maven-doxia-module-xdoc-0:1.7-alt1_10jpp8 sisyphus+230487.100.1.3 1559021328 installed
<13>Jun 2 15:13:39 rpmi: objectweb-asm3-3.3.1-alt1_23jpp8 sisyphus+246361.100.1.1 1581799825 installed
<13>Jun 2 15:13:39 rpmi: jackson-1.9.11-alt1_15jpp8 sisyphus+230762.100.1.1 1559134303 installed
<13>Jun 2 15:13:39 rpmi: xmvn-subst-3.0.0-alt1_23jpp8 sisyphus+234592.200.1.1 1563216657 installed
<13>Jun 2 15:13:39 rpmi: xmvn-resolve-3.0.0-alt1_23jpp8 sisyphus+234592.200.1.1 1563216657 installed
<13>Jun 2 15:13:39 rpmi: python3-module-genshi-0.7-alt2 sisyphus+229363.100.1.1 1557847335 installed
<13>Jun 2 15:13:39 rpmi: python3-module-webencodings-0.5.1-alt2 sisyphus+245915.200.1.1 1581496105 installed
<13>Jun 2 15:13:39 rpmi: python3-module-cssselect-0.9.1-alt2 sisyphus+250566.2300.6.1 1588188959 installed
<13>Jun 2 15:13:40 rpmi: python3-module-html5lib-1:1.0.1-alt1 sisyphus+238807.100.2.1 1570465973 installed
<13>Jun 2 15:13:40 rpmi: python3-module-lxml-4.5.0-alt2 sisyphus+250566.2700.6.1 1588189778 installed
<13>Jun 2 15:13:40 rpmi: python3-module-javapackages-1:5.3.0-alt1_4jpp8 sisyphus+234467.100.1.1 1563037789 installed
<13>Jun 2 15:13:40 rpmi: javapackages-local-1:5.3.0-alt1_4jpp8 sisyphus+234467.100.1.1 1563037789 installed
<13>Jun 2 15:13:40 rpmi: rpm-build-java-1:5.3.0-alt1_4jpp8 sisyphus+234467.100.1.1 1563037789 installed
<13>Jun 2 15:13:40 rpmi: ca-trust-java-0.1.2-alt1 sisyphus+233348.100.1.1 1561653823 installed
<13>Jun 2 15:13:40 rpmi: libnss-3.52.0-alt1 sisyphus+251332.100.1.1 1588945483 installed
<13>Jun 2 15:13:43 rpmi: java-1.8.0-openjdk-headless-0:1.8.0.212.b04-alt2_0jpp8 sisyphus+234504.100.1.1 1563098253 installed
<13>Jun 2 15:13:43 rpmi: tomcat-el-3.0-api-1:9.0.13-alt1_2jpp8 sisyphus+225655.100.1.1 1553582378 installed
<13>Jun 2 15:13:43 rpmi: springframework-beans-0:3.2.18-alt2_4jpp8 1527861093 installed
<13>Jun 2 15:13:43 rpmi: springframework-aop-0:3.2.18-alt2_4jpp8 1527861093 installed
<13>Jun 2 15:13:43 rpmi: springframework-context-0:3.2.18-alt2_4jpp8 1527861093 installed
<13>Jun 2 15:13:44 rpmi: infinispan-8.2.4-alt2_5jpp8 sisyphus+234009.100.1.1 1562423121 installed
<13>Jun 2 15:13:44 rpmi: picketbox-4.9.6-alt1_8jpp8 sisyphus+230568.100.1.2 1559059607 installed
<13>Jun 2 15:13:44 rpmi: java-stub-javadoc-0.1-alt1 1229813340 installed
<13>Jun 2 15:13:44 rpmi: alsa-ucm-conf-1.2.2-alt1 sisyphus+246761.200.1.1 1582270179 installed
<13>Jun 2 15:13:44 rpmi: alsa-topology-conf-1.2.2-alt1 sisyphus+246761.100.1.1 1582270157 installed
<13>Jun 2 15:13:44 rpmi: libalsa-1:1.2.2-alt1 sisyphus+246761.300.1.1 1582270238 installed
<13>Jun 2 15:13:44 rpmi: java-1.8.0-openjdk-0:1.8.0.212.b04-alt2_0jpp8 sisyphus+234504.100.1.1 1563098253 installed
<13>Jun 2 15:13:45 rpmi: java-1.8.0-openjdk-devel-0:1.8.0.212.b04-alt2_0jpp8 sisyphus+234504.100.1.1 1563098253 installed
<13>Jun 2 15:13:45 rpmi: jpackage-generic-compat-0.30-alt1 sisyphus+234288.100.1.1 1562847521 installed
<13>Jun 2 15:13:45 rpmi: fop-0:2.2-alt1_4jpp8 sisyphus+232748.200.2.2 1561094573 installed
<13>Jun 2 15:13:45 rpmi: maven-doxia-module-fo-0:1.7-alt1_10jpp8 sisyphus+230487.100.1.3 1559021328 installed
<13>Jun 2 15:13:45 rpmi: maven-doxia-sitetools-0:1.7.5-alt1_4jpp8 sisyphus+230486.100.1.1 1558993278 installed
<13>Jun 2 15:13:45 rpmi: maven-javadoc-plugin-3.0.1-alt1_3jpp8 sisyphus+232632.200.1.1 1560946909 installed
<13>Jun 2 15:13:45 rpmi: maven-reporting-impl-3.0.0-alt1_7jpp8 sisyphus+246393.100.1.3 1581810132 installed
<13>Jun 2 15:13:45 rpmi: maven-plugin-bundle-3.5.1-alt1_4jpp8 sisyphus+246387.100.1.2 1581807016 installed
<13>Jun 2 15:13:45 rpmi: maven-local-1:5.3.0-alt1_4jpp8 sisyphus+234467.100.1.1 1563037789 installed
<13>Jun 2 15:13:45 rpmi: jpackage-1.8-compat-0.30-alt1 sisyphus+234288.100.1.1 1562847521 installed
<13>Jun 2 15:13:46 rpmi: wildfly-core-2.2.0-alt1_10jpp8 sisyphus+231049.100.1.4 1559299904 installed
<13>Jun 2 15:13:46 rpmi: maven-enforcer-plugin-0:1.4.1-alt1_10jpp8 sisyphus+230489.100.1.3 1559022665 installed
<13>Jun 2 15:13:46 rpmi: antlr3-tool-1:3.5.2-alt1_22jpp8 sisyphus+234457.100.1.1 1563027983 installed
<13>Jun 2 15:13:46 rpmi: maven-antrun-plugin-1.8-alt1_10jpp8 sisyphus+246375.100.1.3 1581804552 installed
<13>Jun 2 15:13:46 rpmi: maven-plugin-build-helper-1.9.1-alt1_11jpp8 sisyphus+246386.100.1.2 1581807015 installed
<13>Jun 2 15:13:46 rpmi: hibernate-core-5.0.10-alt1_6jpp8 sisyphus+230412.100.1.2 1558967719 installed
<13>Jun 2 15:13:46 rpmi: jboss-parent-0:20-alt1_8jpp8 sisyphus+246122.100.1.1 1581623915 installed
<13>Jun 2 15:13:46 rpmi: exec-maven-plugin-1.6.0-alt1_8jpp8 sisyphus+246441.100.1.2 1581839738 installed
<13>Jun 2 15:13:46 rpmi: maven-injection-plugin-0:1.0.2-alt3_22jpp8 sisyphus+246381.100.1.3 1581806464 installed
<13>Jun 2 15:13:47 rpmi: c3p0-0:0.9.5-alt1_0.8.pre8jpp8 sisyphus+234755.100.1.1 1563382358 installed
<13>Jun 2 15:13:47 rpmi: jboss-logging-tools1-1.2.1-alt1_6jpp8 sisyphus+230830.100.1.1 1559206293 installed
<13>Jun 2 15:13:47 rpmi: jcip-annotations-1:1-alt3_27.20060626jpp8 sisyphus+246125.100.1.1 1581624490 installed
<13>Jun 2 15:13:47 rpmi: metainf-services-1.7-alt1_6jpp8 sisyphus+230522.100.1.2 1559034250 installed
<13>Jun 2 15:13:47 rpmi: shrinkwrap-descriptors-bom-2.0.0-alt3_0.22.alpha9jpp8 sisyphus+230985.100.1.68 1559310130 installed
<13>Jun 2 15:13:47 rpmi: arquillian-bom-1.1.11-alt2_9jpp8 sisyphus+234604.100.1.1 1563222821 installed
<13>Jun 2 15:13:47 rpmi: geronimo-jcache-1.0-alt1_0.9.alpha.1jpp8 sisyphus+246180.100.1.2 1581643564 installed
<13>Jun 2 15:13:47 rpmi: shrinkwrap-bom-1.2.3-alt2_8jpp8 sisyphus+249058.100.1.3 1585695427 installed
<13>Jun 2 15:13:47 rpmi: shrinkwrap-resolver-bom-2.2.2-alt2_6jpp8 sisyphus+234217.200.1.1 1562754215 installed
warning: Unparseable macro: % open source, and written in Java. The purpose of
Building target platforms: i586
Building for target i586
Wrote: /usr/src/in/nosrpm/infinispan-8.2.4-alt2_5jpp8.nosrc.rpm
warning: Unparseable macro: % open source, and written in Java. The purpose of
Installing infinispan-8.2.4-alt2_5jpp8.src.rpm
Building target platforms: i586
Building for target i586
Executing(%prep): /bin/sh -e /usr/src/tmp/rpm-tmp.61930
+ umask 022
+ /bin/mkdir -p /usr/src/RPM/BUILD
+ cd /usr/src/RPM/BUILD
+ cd /usr/src/RPM/BUILD
+ rm -rf infinispan-8.2.4.Final
+ echo 'Source #0 (infinispan-8.2.4.Final.tar.gz):'
Source #0 (infinispan-8.2.4.Final.tar.gz):
+ /bin/gzip -dc /usr/src/RPM/SOURCES/infinispan-8.2.4.Final.tar.gz
+ /bin/tar -xf -
+ cd infinispan-8.2.4.Final
+ /bin/chmod -c -Rf u+rwX,go-w .
+ find . -name '*.jar' -print -delete
./ide-settings/intellij/IntelliJ_IDEA_Code_Style.jar
+ find . -name '*.class' -print -delete
+ cp -pr license/src/main/resources/META-INF/LICENSE.txt.vm LICENSE.txt
+ /usr/bin/python3 /usr/share/java-utils/pom_editor.py pom_disable_module checkstyle
+ /usr/bin/python3 /usr/share/java-utils/pom_editor.py pom_remove_plugin -r org.apache.maven.plugins:maven-checkstyle-plugin
+ /usr/bin/python3 /usr/share/java-utils/pom_editor.py pom_disable_module all
+ /usr/bin/python3 /usr/share/java-utils/pom_editor.py pom_disable_module all/cli
+ /usr/bin/python3 /usr/share/java-utils/pom_editor.py pom_disable_module all/embedded
+ /usr/bin/python3 /usr/share/java-utils/pom_editor.py pom_disable_module all/embedded-query
+ /usr/bin/python3 /usr/share/java-utils/pom_editor.py pom_disable_module all/remote
+ /usr/bin/python3 /usr/share/java-utils/pom_editor.py pom_disable_module as-modules/embedded
+ /usr/bin/python3 /usr/share/java-utils/pom_editor.py pom_disable_module as-modules/client
+ /usr/bin/python3 /usr/share/java-utils/pom_editor.py pom_disable_module demos/gui
+ /usr/bin/python3 /usr/share/java-utils/pom_editor.py pom_disable_module demos/distexec
+ /usr/bin/python3 /usr/share/java-utils/pom_editor.py pom_disable_module demos/lucene-directory-demo
+ /usr/bin/python3 /usr/share/java-utils/pom_editor.py pom_disable_module demos/gridfs-webdav
+ /usr/bin/python3 /usr/share/java-utils/pom_editor.py pom_disable_module demos/nearcache
+ /usr/bin/python3 /usr/share/java-utils/pom_editor.py pom_disable_module demos/nearcache-client
+ /usr/bin/python3 /usr/share/java-utils/pom_editor.py pom_disable_module integrationtests
+ /usr/bin/python3 /usr/share/java-utils/pom_editor.py pom_disable_module integrationtests/as-integration-embedded
+ /usr/bin/python3 /usr/share/java-utils/pom_editor.py pom_disable_module integrationtests/as-integration-client
+ /usr/bin/python3 /usr/share/java-utils/pom_editor.py pom_disable_module integrationtests/as-lucene-directory
+ /usr/bin/python3 /usr/share/java-utils/pom_editor.py pom_disable_module integrationtests/compatibility-mode-it
+ /usr/bin/python3 /usr/share/java-utils/pom_editor.py pom_disable_module integrationtests/cdi-jcache-it
+ /usr/bin/python3 /usr/share/java-utils/pom_editor.py pom_disable_module integrationtests/security-it
+ /usr/bin/python3 /usr/share/java-utils/pom_editor.py pom_disable_module integrationtests/security-manager-it
+ /usr/bin/python3 /usr/share/java-utils/pom_editor.py pom_disable_module integrationtests/osgi
+ /usr/bin/python3 /usr/share/java-utils/pom_editor.py pom_disable_module integrationtests/cdi-weld-se-it
+ /usr/bin/python3 /usr/share/java-utils/pom_editor.py pom_disable_module integrationtests/all-embedded-it
+ /usr/bin/python3 /usr/share/java-utils/pom_editor.py pom_disable_module integrationtests/all-embedded-query-it
+ /usr/bin/python3 /usr/share/java-utils/pom_editor.py pom_disable_module integrationtests/all-remote-it
+ /usr/bin/python3 /usr/share/java-utils/pom_editor.py pom_disable_module javadoc
+ /usr/bin/python3 /usr/share/java-utils/pom_editor.py pom_disable_module persistence/rest
+ /usr/bin/python3 /usr/share/java-utils/pom_editor.py pom_disable_module rhq-plugin
+ /usr/bin/python3 /usr/share/java-utils/pom_editor.py pom_disable_module server/integration
+ /usr/bin/python3 /usr/share/java-utils/pom_editor.py pom_disable_module server/rest
+ /usr/bin/python3 /usr/share/java-utils/pom_editor.py pom_disable_module tck-runner jcache
+ /usr/bin/python3 /usr/share/java-utils/pom_editor.py pom_disable_module spring/spring4
+ /usr/bin/python3 /usr/share/java-utils/pom_editor.py pom_disable_module spring/spring4/spring4-common
+ /usr/bin/python3 /usr/share/java-utils/pom_editor.py pom_disable_module spring/spring4/spring4-embedded
+ /usr/bin/python3 /usr/share/java-utils/pom_editor.py pom_disable_module spring/spring4/spring4-remote
+ /usr/bin/python3 /usr/share/java-utils/pom_editor.py pom_xpath_set pom:properties/pom:version.jboss.logging.processor 1 parent
+ /usr/bin/python3 /usr/share/java-utils/pom_editor.py pom_remove_plugin :maven-remote-resources-plugin parent
+ /usr/bin/python3 /usr/share/java-utils/pom_editor.py pom_remove_plugin -r :maven-scala-plugin parent jcache/embedded
+ /usr/bin/python3 /usr/share/java-utils/pom_editor.py pom_remove_plugin :jetty-maven-plugin persistence/rest
+ /usr/bin/python3 /usr/share/java-utils/pom_editor.py pom_remove_plugin :maven-invoker-plugin jcache/embedded
+ /usr/bin/python3 /usr/share/java-utils/pom_editor.py pom_remove_plugin :maven-failsafe-plugin parent
+ /usr/bin/python3 /usr/share/java-utils/pom_editor.py pom_change_dep -r org.osgi:org.osgi.core org.eclipse.osgi:org.eclipse.osgi commons persistence/jpa osgi bom
+ /usr/bin/python3 /usr/share/java-utils/pom_editor.py pom_remove_dep -r org.osgi:org.osgi.compendium commons persistence/jpa
+ /usr/bin/python3 /usr/share/java-utils/pom_editor.py pom_change_dep -r org.osgi:org.osgi.compendium org.eclipse.osgi:org.eclipse.osgi.services osgi bom
+ /usr/bin/python3 /usr/share/java-utils/pom_editor.py pom_change_dep -r javax.cache:cache-api org.apache.geronimo.specs:geronimo-jcache_1.0_spec:1.0-alpha-1 jcache/commons jcache/embedded jcache/remote bom core cdi/remote
+ /usr/bin/python3 /usr/share/java-utils/pom_editor.py pom_change_dep :leveldbjni-all :leveldbjni persistence/leveldb
+ /usr/bin/python3 /usr/share/java-utils/pom_editor.py pom_xpath_inject 'pom:plugin[pom:artifactId='\''maven-compiler-plugin'\'']/pom:configuration' '
false
${version.java}
${version.java}' commons
+ for p in core server/core persistence/jdbc lucene/lucene-directory query server/hotrod tree client/hotrod-client persistence/remote persistence/leveldb server/memcached server/websocket cli/cli-interpreter cdi/embedded cdi/remote jcache/embedded
+ /usr/bin/python3 /usr/share/java-utils/pom_editor.py pom_add_plugin org.apache.maven.plugins:maven-compiler-plugin:3.0 core '
false
${version.java}
${version.java}
UTF-8
'
+ for p in core server/core persistence/jdbc lucene/lucene-directory query server/hotrod tree client/hotrod-client persistence/remote persistence/leveldb server/memcached server/websocket cli/cli-interpreter cdi/embedded cdi/remote jcache/embedded
+ /usr/bin/python3 /usr/share/java-utils/pom_editor.py pom_add_plugin org.apache.maven.plugins:maven-compiler-plugin:3.0 server/core '
false
${version.java}
${version.java}
UTF-8
'
+ for p in core server/core persistence/jdbc lucene/lucene-directory query server/hotrod tree client/hotrod-client persistence/remote persistence/leveldb server/memcached server/websocket cli/cli-interpreter cdi/embedded cdi/remote jcache/embedded
+ /usr/bin/python3 /usr/share/java-utils/pom_editor.py pom_add_plugin org.apache.maven.plugins:maven-compiler-plugin:3.0 persistence/jdbc '
false
${version.java}
${version.java}
UTF-8
'
+ for p in core server/core persistence/jdbc lucene/lucene-directory query server/hotrod tree client/hotrod-client persistence/remote persistence/leveldb server/memcached server/websocket cli/cli-interpreter cdi/embedded cdi/remote jcache/embedded
+ /usr/bin/python3 /usr/share/java-utils/pom_editor.py pom_add_plugin org.apache.maven.plugins:maven-compiler-plugin:3.0 lucene/lucene-directory '
false
${version.java}
${version.java}
UTF-8
'
+ for p in core server/core persistence/jdbc lucene/lucene-directory query server/hotrod tree client/hotrod-client persistence/remote persistence/leveldb server/memcached server/websocket cli/cli-interpreter cdi/embedded cdi/remote jcache/embedded
+ /usr/bin/python3 /usr/share/java-utils/pom_editor.py pom_add_plugin org.apache.maven.plugins:maven-compiler-plugin:3.0 query '
false
${version.java}
${version.java}
UTF-8
'
+ for p in core server/core persistence/jdbc lucene/lucene-directory query server/hotrod tree client/hotrod-client persistence/remote persistence/leveldb server/memcached server/websocket cli/cli-interpreter cdi/embedded cdi/remote jcache/embedded
+ /usr/bin/python3 /usr/share/java-utils/pom_editor.py pom_add_plugin org.apache.maven.plugins:maven-compiler-plugin:3.0 server/hotrod '
false
${version.java}
${version.java}
UTF-8
'
+ for p in core server/core persistence/jdbc lucene/lucene-directory query server/hotrod tree client/hotrod-client persistence/remote persistence/leveldb server/memcached server/websocket cli/cli-interpreter cdi/embedded cdi/remote jcache/embedded
+ /usr/bin/python3 /usr/share/java-utils/pom_editor.py pom_add_plugin org.apache.maven.plugins:maven-compiler-plugin:3.0 tree '
false
${version.java}
${version.java}
UTF-8
'
+ for p in core server/core persistence/jdbc lucene/lucene-directory query server/hotrod tree client/hotrod-client persistence/remote persistence/leveldb server/memcached server/websocket cli/cli-interpreter cdi/embedded cdi/remote jcache/embedded
+ /usr/bin/python3 /usr/share/java-utils/pom_editor.py pom_add_plugin org.apache.maven.plugins:maven-compiler-plugin:3.0 client/hotrod-client '
false
${version.java}
${version.java}
UTF-8
'
+ for p in core server/core persistence/jdbc lucene/lucene-directory query server/hotrod tree client/hotrod-client persistence/remote persistence/leveldb server/memcached server/websocket cli/cli-interpreter cdi/embedded cdi/remote jcache/embedded
+ /usr/bin/python3 /usr/share/java-utils/pom_editor.py pom_add_plugin org.apache.maven.plugins:maven-compiler-plugin:3.0 persistence/remote '
false
${version.java}
${version.java}
UTF-8
'
+ for p in core server/core persistence/jdbc lucene/lucene-directory query server/hotrod tree client/hotrod-client persistence/remote persistence/leveldb server/memcached server/websocket cli/cli-interpreter cdi/embedded cdi/remote jcache/embedded
+ /usr/bin/python3 /usr/share/java-utils/pom_editor.py pom_add_plugin org.apache.maven.plugins:maven-compiler-plugin:3.0 persistence/leveldb '
false
${version.java}
${version.java}
UTF-8
'
+ for p in core server/core persistence/jdbc lucene/lucene-directory query server/hotrod tree client/hotrod-client persistence/remote persistence/leveldb server/memcached server/websocket cli/cli-interpreter cdi/embedded cdi/remote jcache/embedded
+ /usr/bin/python3 /usr/share/java-utils/pom_editor.py pom_add_plugin org.apache.maven.plugins:maven-compiler-plugin:3.0 server/memcached '
false
${version.java}
${version.java}
UTF-8
'
+ for p in core server/core persistence/jdbc lucene/lucene-directory query server/hotrod tree client/hotrod-client persistence/remote persistence/leveldb server/memcached server/websocket cli/cli-interpreter cdi/embedded cdi/remote jcache/embedded
+ /usr/bin/python3 /usr/share/java-utils/pom_editor.py pom_add_plugin org.apache.maven.plugins:maven-compiler-plugin:3.0 server/websocket '
false
${version.java}
${version.java}
UTF-8
'
+ for p in core server/core persistence/jdbc lucene/lucene-directory query server/hotrod tree client/hotrod-client persistence/remote persistence/leveldb server/memcached server/websocket cli/cli-interpreter cdi/embedded cdi/remote jcache/embedded
+ /usr/bin/python3 /usr/share/java-utils/pom_editor.py pom_add_plugin org.apache.maven.plugins:maven-compiler-plugin:3.0 cli/cli-interpreter '
false
${version.java}
${version.java}
UTF-8
'
+ for p in core server/core persistence/jdbc lucene/lucene-directory query server/hotrod tree client/hotrod-client persistence/remote persistence/leveldb server/memcached server/websocket cli/cli-interpreter cdi/embedded cdi/remote jcache/embedded
+ /usr/bin/python3 /usr/share/java-utils/pom_editor.py pom_add_plugin org.apache.maven.plugins:maven-compiler-plugin:3.0 cdi/embedded '
false
${version.java}
${version.java}
UTF-8
'
+ for p in core server/core persistence/jdbc lucene/lucene-directory query server/hotrod tree client/hotrod-client persistence/remote persistence/leveldb server/memcached server/websocket cli/cli-interpreter cdi/embedded cdi/remote jcache/embedded
+ /usr/bin/python3 /usr/share/java-utils/pom_editor.py pom_add_plugin org.apache.maven.plugins:maven-compiler-plugin:3.0 cdi/remote '
false
${version.java}
${version.java}
UTF-8
'
+ for p in core server/core persistence/jdbc lucene/lucene-directory query server/hotrod tree client/hotrod-client persistence/remote persistence/leveldb server/memcached server/websocket cli/cli-interpreter cdi/embedded cdi/remote jcache/embedded
+ /usr/bin/python3 /usr/share/java-utils/pom_editor.py pom_add_plugin org.apache.maven.plugins:maven-compiler-plugin:3.0 jcache/embedded '
false
${version.java}
${version.java}
UTF-8
'
+ for p in core hotrod memcached
+ /usr/bin/python3 /usr/share/java-utils/pom_editor.py pom_remove_plugin :maven-scala-plugin server/core
+ /usr/bin/python3 /usr/share/java-utils/pom_editor.py pom_add_plugin org.apache.maven.plugins:maven-antrun-plugin:1.7 server/core '
compile
process-sources
run
org.scala-lang
scala-compiler
${version.scala}
'
+ for p in core hotrod memcached
+ /usr/bin/python3 /usr/share/java-utils/pom_editor.py pom_remove_plugin :maven-scala-plugin server/hotrod
+ /usr/bin/python3 /usr/share/java-utils/pom_editor.py pom_add_plugin org.apache.maven.plugins:maven-antrun-plugin:1.7 server/hotrod '
compile
process-sources
run
org.scala-lang
scala-compiler
${version.scala}
'
+ for p in core hotrod memcached
+ /usr/bin/python3 /usr/share/java-utils/pom_editor.py pom_remove_plugin :maven-scala-plugin server/memcached
+ /usr/bin/python3 /usr/share/java-utils/pom_editor.py pom_add_plugin org.apache.maven.plugins:maven-antrun-plugin:1.7 server/memcached '
compile
process-sources
run
org.scala-lang
scala-compiler
${version.scala}
'
+ /usr/bin/python3 /usr/share/java-utils/pom_editor.py pom_disable_module lucene/directory-provider
+ /usr/bin/python3 /usr/share/java-utils/pom_editor.py pom_disable_module object-filter
+ /usr/bin/python3 /usr/share/java-utils/pom_editor.py pom_disable_module query
+ /usr/bin/python3 /usr/share/java-utils/pom_editor.py pom_disable_module remote-query/remote-query-server
+ /usr/bin/python3 /usr/share/java-utils/pom_editor.py pom_disable_module scripting
+ /usr/bin/python3 /usr/share/java-utils/pom_editor.py pom_disable_module server/hotrod
+ /usr/bin/python3 /usr/share/java-utils/pom_editor.py pom_disable_module tasks
+ /usr/bin/python3 /usr/share/java-utils/pom_editor.py pom_disable_module tools
+ /usr/bin/python3 /usr/share/java-utils/pom_editor.py pom_xpath_remove 'pom:dependency[pom:artifactId = '\''tools'\'']/pom:scope' tools
+ /usr/bin/python3 /usr/share/java-utils/pom_editor.py pom_xpath_remove 'pom:dependency[pom:artifactId = '\''tools'\'']/pom:systemPath' tools
+ /usr/bin/python3 /usr/share/java-utils/pom_editor.py pom_xpath_remove 'pom:dependency[pom:groupId = '\''org.hibernate'\'']/pom:classifier' lucene/directory-provider
+ /usr/bin/python3 /usr/share/java-utils/mvn_alias.py :infinispan-directory-provider org.hibernate:hibernate-search-infinispan
+ sed -i /version.lucene/s,5.5.1,5.5.0, server/integration/versions/pom.xml parent/pom.xml
+ exit 0
Executing(%build): /bin/sh -e /usr/src/tmp/rpm-tmp.66023
+ umask 022
+ /bin/mkdir -p /usr/src/RPM/BUILD
+ cd /usr/src/RPM/BUILD
+ cd infinispan-8.2.4.Final
+ /usr/bin/python3 /usr/share/java-utils/mvn_build.py -f
Executing: xmvn --batch-mode --offline -Dmaven.test.skip=true package org.fedoraproject.xmvn:xmvn-mojo:install org.apache.maven.plugins:maven-javadoc-plugin:aggregate org.fedoraproject.xmvn:xmvn-mojo:builddep
['xmvn', '--batch-mode', '--offline', '-Dmaven.test.skip=true', 'package', 'org.fedoraproject.xmvn:xmvn-mojo:install', 'org.apache.maven.plugins:maven-javadoc-plugin:aggregate', 'org.fedoraproject.xmvn:xmvn-mojo:builddep']
[INFO] Scanning for projects...
[WARNING] Ignoring metadata for artifact org.picketbox:picketbox:pom:SYSTEM as it has duplicate metadata
[INFO] ------------------------------------------------------------------------
[INFO] Reactor Build Order:
[INFO]
[INFO] Infinispan BOM [pom]
[INFO] Infinispan Common Parent [pom]
[INFO] Infinispan Commons [bundle]
[INFO] Infinispan Core [bundle]
[INFO] Infinispan Extended Statistics [jar]
[INFO] Infinispan Query DSL API [bundle]
[INFO] Infinispan Remote Query Client [bundle]
[INFO] Infinispan Tree API [bundle]
[INFO] Parent pom for the Lucene integration modules [pom]
[INFO] Parent pom for cachestore modules [pom]
[INFO] Infinispan JDBC CacheStore [bundle]
[INFO] Infinispan Lucene Directory Implementation [bundle]
[INFO] Infinispan JPA CacheStore [bundle]
[INFO] Infinispan Hot Rod Client [bundle]
[INFO] Infinispan Remote CacheStore [bundle]
[INFO] Infinispan CLI Client [bundle]
[INFO] Infinispan Command Line Interface persistence [bundle]
[INFO] Infinispan LevelDB CacheStore [bundle]
[INFO] Infinispan Soft-Index CacheStore [bundle]
[INFO] Parent pom for server modules [pom]
[INFO] Infinispan Server - Core Components [bundle]
[INFO] Infinispan Memcached Server [bundle]
[INFO] Infinispan WebSocket Server [bundle]
[INFO] Infinispan Atomic Factory [jar]
[INFO] Infinispan OSGi Service [bundle]
[INFO] Infinispan Spring 3 Integration [bundle]
[INFO] Infinispan CLI Interpreter [bundle]
[INFO] Infinispan Tasks API [jar]
[INFO] Infinispan CDI support parent [pom]
[INFO] Infinispan CDI support common [jar]
[INFO] Infinispan CDI embedded support [bundle]
[INFO] Infinispan CDI remote support [bundle]
[INFO] Infinispan JCACHE (JSR-107) Parent [pom]
[INFO] Infinispan JCACHE (JSR-107) Common Components [jar]
[INFO] Infinispan JCACHE (JSR-107) Embedded Implementation [bundle]
[INFO] Infinispan JCACHE (JSR-107) Remote Implementation [jar]
[INFO] Infinispan [pom]
[INFO]
[INFO] -------------------< org.infinispan:infinispan-bom >--------------------
[INFO] Building Infinispan BOM 8.2.4.Final [1/37]
[INFO] --------------------------------[ pom ]---------------------------------
[INFO]
[INFO] ------------------< org.infinispan:infinispan-parent >------------------
[INFO] Building Infinispan Common Parent 8.2.4.Final [2/37]
[INFO] --------------------------------[ pom ]---------------------------------
[INFO]
[INFO] --- maven-enforcer-plugin:1.4.1:enforce (enforce-java) @ infinispan-parent ---
[INFO]
[INFO] --- exec-maven-plugin:1.6.0:java (serialize_component_metadata) @ infinispan-parent ---
[INFO] skipping execute as per configuration
[INFO]
[INFO] --- maven-antrun-plugin:1.8:run (copy_serialized_metadata) @ infinispan-parent ---
[INFO] Skipping Antrun execution
[INFO]
[INFO] --- exec-maven-plugin:1.6.0:java (serialize_test_component_metadata) @ infinispan-parent ---
[INFO] skipping execute as per configuration
[INFO]
[INFO] --- maven-antrun-plugin:1.8:run (copy_serialized_test_metadata) @ infinispan-parent ---
[INFO] Skipping Antrun execution
[INFO]
[INFO] --- maven-jar-plugin:3.1.0:test-jar (build-test-jar) @ infinispan-parent ---
[INFO] Skipping packaging of the test-jar
[INFO]
[INFO] -----------------< org.infinispan:infinispan-commons >------------------
[INFO] Building Infinispan Commons 8.2.4.Final [3/37]
[INFO] -------------------------------[ bundle ]-------------------------------
[INFO]
[INFO] --- maven-enforcer-plugin:1.4.1:enforce (enforce-java) @ infinispan-commons ---
[INFO]
[INFO] --- maven-resources-plugin:3.1.0:resources (default-resources) @ infinispan-commons ---
[INFO] Using 'UTF-8' encoding to copy filtered resources.
[INFO] Copying 1 resource
[INFO] Copying 0 resource
[INFO]
[INFO] --- maven-compiler-plugin:3.8.0:compile (default-compile) @ infinispan-commons ---
[INFO] Compiling 160 source files to /usr/src/RPM/BUILD/infinispan-8.2.4.Final/commons/target/classes
[INFO]
[INFO] --- exec-maven-plugin:1.6.0:java (serialize_component_metadata) @ infinispan-commons ---
[INFO] skipping execute as per configuration
[INFO]
[INFO] --- maven-resources-plugin:3.1.0:testResources (default-testResources) @ infinispan-commons ---
[INFO] Not copying test resources
[INFO]
[INFO] --- maven-antrun-plugin:1.8:run (copy_serialized_metadata) @ infinispan-commons ---
[INFO] Skipping Antrun execution
[INFO]
[INFO] --- maven-compiler-plugin:3.8.0:testCompile (default-testCompile) @ infinispan-commons ---
[INFO] Not compiling test sources
[INFO]
[INFO] --- exec-maven-plugin:1.6.0:java (serialize_test_component_metadata) @ infinispan-commons ---
[INFO] skipping execute as per configuration
[INFO]
[INFO] --- maven-antrun-plugin:1.8:run (copy_serialized_test_metadata) @ infinispan-commons ---
[INFO] Skipping Antrun execution
[INFO]
[INFO] --- maven-surefire-plugin:2.22.0:test (default-test) @ infinispan-commons ---
[INFO] Tests are skipped.
[INFO]
[INFO] --- maven-bundle-plugin:3.5.1:bundle (default-bundle) @ infinispan-commons ---
[INFO]
[INFO] --- maven-jar-plugin:3.1.0:test-jar (build-test-jar) @ infinispan-commons ---
[INFO] Skipping packaging of the test-jar
[INFO]
[INFO] --- build-helper-maven-plugin:1.9.1:attach-artifact (attach-artifacts) @ infinispan-commons ---
[INFO]
[INFO] -------------------< org.infinispan:infinispan-core >-------------------
[INFO] Building Infinispan Core 8.2.4.Final [4/37]
[INFO] -------------------------------[ bundle ]-------------------------------
[INFO]
[INFO] --- maven-enforcer-plugin:1.4.1:enforce (enforce-java) @ infinispan-core ---
[INFO]
[INFO] --- maven-resources-plugin:3.1.0:resources (default-resources) @ infinispan-core ---
[INFO] Using 'UTF-8' encoding to copy filtered resources.
[INFO] Copying 1 resource
[INFO] Copying 1 resource
[INFO] Copying 5 resources
[INFO]
[INFO] --- maven-compiler-plugin:3.8.0:compile (default-compile) @ infinispan-core ---
[INFO] Compiling 1315 source files to /usr/src/RPM/BUILD/infinispan-8.2.4.Final/core/target/classes
[WARNING] /usr/src/RPM/BUILD/infinispan-8.2.4.Final/core/src/main/java/org/infinispan/security/Security.java:[15,19] sun.reflect.Reflection is internal proprietary API and may be removed in a future release
[WARNING] /usr/src/RPM/BUILD/infinispan-8.2.4.Final/core/src/main/java/org/infinispan/container/entries/MarshalledValueEntrySizeCalculator.java:[7,16] sun.misc.Unsafe is internal proprietary API and may be removed in a future release
[WARNING] /usr/src/RPM/BUILD/infinispan-8.2.4.Final/core/src/main/java/org/infinispan/container/entries/PrimitiveEntrySizeCalculator.java:[4,16] sun.misc.Unsafe is internal proprietary API and may be removed in a future release
[WARNING] /usr/src/RPM/BUILD/infinispan-8.2.4.Final/core/src/main/java/org/infinispan/security/Security.java:[15,19] sun.reflect.Reflection is internal proprietary API and may be removed in a future release
[WARNING] /usr/src/RPM/BUILD/infinispan-8.2.4.Final/core/src/main/java/org/infinispan/container/entries/MarshalledValueEntrySizeCalculator.java:[7,16] sun.misc.Unsafe is internal proprietary API and may be removed in a future release
[WARNING] /usr/src/RPM/BUILD/infinispan-8.2.4.Final/core/src/main/java/org/infinispan/container/entries/PrimitiveEntrySizeCalculator.java:[4,16] sun.misc.Unsafe is internal proprietary API and may be removed in a future release
[WARNING] /usr/src/RPM/BUILD/infinispan-8.2.4.Final/core/src/main/java/org/infinispan/security/Security.java:[15,19] sun.reflect.Reflection is internal proprietary API and may be removed in a future release
[WARNING] /usr/src/RPM/BUILD/infinispan-8.2.4.Final/core/src/main/java/org/infinispan/container/entries/MarshalledValueEntrySizeCalculator.java:[7,16] sun.misc.Unsafe is internal proprietary API and may be removed in a future release
[WARNING] /usr/src/RPM/BUILD/infinispan-8.2.4.Final/core/src/main/java/org/infinispan/container/entries/PrimitiveEntrySizeCalculator.java:[4,16] sun.misc.Unsafe is internal proprietary API and may be removed in a future release
[WARNING] /usr/src/RPM/BUILD/infinispan-8.2.4.Final/core/src/main/java/org/infinispan/security/Security.java:[15,19] sun.reflect.Reflection is internal proprietary API and may be removed in a future release
[WARNING] /usr/src/RPM/BUILD/infinispan-8.2.4.Final/core/src/main/java/org/infinispan/container/entries/MarshalledValueEntrySizeCalculator.java:[7,16] sun.misc.Unsafe is internal proprietary API and may be removed in a future release
[WARNING] /usr/src/RPM/BUILD/infinispan-8.2.4.Final/core/src/main/java/org/infinispan/container/entries/PrimitiveEntrySizeCalculator.java:[4,16] sun.misc.Unsafe is internal proprietary API and may be removed in a future release
[WARNING] /usr/src/RPM/BUILD/infinispan-8.2.4.Final/core/src/main/java/org/infinispan/security/Security.java:[39,19] sun.reflect.Reflection is internal proprietary API and may be removed in a future release
[WARNING] /usr/src/RPM/BUILD/infinispan-8.2.4.Final/core/src/main/java/org/infinispan/security/Security.java:[39,69] sun.reflect.Reflection is internal proprietary API and may be removed in a future release
[WARNING] /usr/src/RPM/BUILD/infinispan-8.2.4.Final/core/src/main/java/org/infinispan/security/Security.java:[40,19] sun.reflect.Reflection is internal proprietary API and may be removed in a future release
[WARNING] /usr/src/RPM/BUILD/infinispan-8.2.4.Final/core/src/main/java/org/infinispan/security/Security.java:[40,51] sun.reflect.Reflection is internal proprietary API and may be removed in a future release
[WARNING] /usr/src/RPM/BUILD/infinispan-8.2.4.Final/core/src/main/java/org/infinispan/security/Security.java:[199,17] sun.reflect.Reflection is internal proprietary API and may be removed in a future release
[WARNING] /usr/src/RPM/BUILD/infinispan-8.2.4.Final/core/src/main/java/org/infinispan/container/entries/PrimitiveEntrySizeCalculator.java:[26,48] sun.misc.Unsafe is internal proprietary API and may be removed in a future release
[WARNING] /usr/src/RPM/BUILD/infinispan-8.2.4.Final/core/src/main/java/org/infinispan/container/entries/PrimitiveEntrySizeCalculator.java:[27,18] sun.misc.Unsafe is internal proprietary API and may be removed in a future release
[WARNING] /usr/src/RPM/BUILD/infinispan-8.2.4.Final/core/src/main/java/org/infinispan/container/entries/PrimitiveEntrySizeCalculator.java:[35,35] sun.misc.Unsafe is internal proprietary API and may be removed in a future release
[WARNING] /usr/src/RPM/BUILD/infinispan-8.2.4.Final/core/src/main/java/org/infinispan/container/entries/PrimitiveEntrySizeCalculator.java:[43,35] sun.misc.Unsafe is internal proprietary API and may be removed in a future release
[WARNING] /usr/src/RPM/BUILD/infinispan-8.2.4.Final/core/src/main/java/org/infinispan/container/entries/PrimitiveEntrySizeCalculator.java:[50,35] sun.misc.Unsafe is internal proprietary API and may be removed in a future release
[WARNING] /usr/src/RPM/BUILD/infinispan-8.2.4.Final/core/src/main/java/org/infinispan/container/entries/PrimitiveEntrySizeCalculator.java:[52,35] sun.misc.Unsafe is internal proprietary API and may be removed in a future release
[WARNING] /usr/src/RPM/BUILD/infinispan-8.2.4.Final/core/src/main/java/org/infinispan/container/entries/PrimitiveEntrySizeCalculator.java:[54,35] sun.misc.Unsafe is internal proprietary API and may be removed in a future release
[WARNING] /usr/src/RPM/BUILD/infinispan-8.2.4.Final/core/src/main/java/org/infinispan/container/entries/PrimitiveEntrySizeCalculator.java:[64,35] sun.misc.Unsafe is internal proprietary API and may be removed in a future release
[WARNING] /usr/src/RPM/BUILD/infinispan-8.2.4.Final/core/src/main/java/org/infinispan/container/entries/PrimitiveEntrySizeCalculator.java:[71,10] sun.misc.Unsafe is internal proprietary API and may be removed in a future release
[WARNING] /usr/src/RPM/BUILD/infinispan-8.2.4.Final/core/src/main/java/org/infinispan/container/entries/PrimitiveEntrySizeCalculator.java:[134,11] sun.misc.Unsafe is internal proprietary API and may be removed in a future release
[WARNING] /usr/src/RPM/BUILD/infinispan-8.2.4.Final/core/src/main/java/org/infinispan/container/entries/PrimitiveEntrySizeCalculator.java:[136,17] sun.misc.Unsafe is internal proprietary API and may be removed in a future release
[WARNING] /usr/src/RPM/BUILD/infinispan-8.2.4.Final/core/src/main/java/org/infinispan/container/entries/PrimitiveEntrySizeCalculator.java:[140,63] sun.misc.Unsafe is internal proprietary API and may be removed in a future release
[WARNING] /usr/src/RPM/BUILD/infinispan-8.2.4.Final/core/src/main/java/org/infinispan/container/entries/PrimitiveEntrySizeCalculator.java:[141,28] sun.misc.Unsafe is internal proprietary API and may be removed in a future release
[WARNING] /usr/src/RPM/BUILD/infinispan-8.2.4.Final/core/src/main/java/org/infinispan/container/entries/PrimitiveEntrySizeCalculator.java:[142,30] sun.misc.Unsafe is internal proprietary API and may be removed in a future release
[WARNING] /usr/src/RPM/BUILD/infinispan-8.2.4.Final/core/src/main/java/org/infinispan/container/entries/PrimitiveEntrySizeCalculator.java:[142,42] sun.misc.Unsafe is internal proprietary API and may be removed in a future release
[WARNING] /usr/src/RPM/BUILD/infinispan-8.2.4.Final/core/src/main/java/org/infinispan/container/entries/MarshalledValueEntrySizeCalculator.java:[53,47] sun.misc.Unsafe is internal proprietary API and may be removed in a future release
[WARNING] /usr/src/RPM/BUILD/infinispan-8.2.4.Final/core/src/main/java/org/infinispan/container/entries/MarshalledValueEntrySizeCalculator.java:[54,18] sun.misc.Unsafe is internal proprietary API and may be removed in a future release
[INFO] /usr/src/RPM/BUILD/infinispan-8.2.4.Final/core/src/main/java/org/infinispan/commands/VisitableCommand.java: Some input files use or override a deprecated API.
[INFO] /usr/src/RPM/BUILD/infinispan-8.2.4.Final/core/src/main/java/org/infinispan/commands/VisitableCommand.java: Recompile with -Xlint:deprecation for details.
[INFO] /usr/src/RPM/BUILD/infinispan-8.2.4.Final/core/src/main/java/org/infinispan/util/concurrent/CompletableFutures.java: Some input files use unchecked or unsafe operations.
[INFO] /usr/src/RPM/BUILD/infinispan-8.2.4.Final/core/src/main/java/org/infinispan/util/concurrent/CompletableFutures.java: Recompile with -Xlint:unchecked for details.
[INFO]
[INFO] --- maven-injection-plugin:1.0.2:bytecode (default) @ infinispan-core ---
[WARNING] The POM for com.sun:tools:jar:any is missing, no dependency information available
[INFO] writing injection changes back [/usr/src/RPM/BUILD/infinispan-8.2.4.Final/core/target/classes/org/infinispan/Version$Injected.class]
[INFO] writing injection changes back [/usr/src/RPM/BUILD/infinispan-8.2.4.Final/core/target/classes/org/infinispan/Version$Injected.class]
[INFO]
[INFO] --- exec-maven-plugin:1.6.0:java (serialize_component_metadata) @ infinispan-core ---
[ComponentMetadataPersister] Starting component metadata generation. Scanning classes in /usr/src/RPM/BUILD/infinispan-8.2.4.Final/core/target/classes
ERROR StatusLogger No Log4j 2 configuration file found. Using default configuration (logging only errors to the console), or user programmatically provided configurations. Set system property 'log4j2.debug' to show Log4j 2 internal initialization logging. See https://logging.apache.org/log4j/2.x/manual/configuration.html for instructions on how to configure Log4j 2
[ComponentMetadataPersister] Persisted metadata in /usr/src/RPM/BUILD/infinispan-8.2.4.Final/core/src/main/resources/infinispan-core-component-metadata.dat
[ComponentMetadataPersister] 297 components and 83 factories analyzed and persisted in 1.44 seconds.
[INFO]
[INFO] --- maven-resources-plugin:3.1.0:testResources (default-testResources) @ infinispan-core ---
[INFO] Not copying test resources
[INFO]
[INFO] --- maven-antrun-plugin:1.8:run (copy_serialized_metadata) @ infinispan-core ---
[INFO] Executing tasks
main:
[copy] Copying 1 file to /usr/src/RPM/BUILD/infinispan-8.2.4.Final/core/target/classes
[INFO] Executed tasks
[INFO]
[INFO] --- maven-compiler-plugin:3.8.0:testCompile (default-testCompile) @ infinispan-core ---
[INFO] Not compiling test sources
[INFO]
[INFO] --- exec-maven-plugin:1.6.0:java (serialize_test_component_metadata) @ infinispan-core ---
[ComponentMetadataPersister] Starting component metadata generation. Scanning classes in /usr/src/RPM/BUILD/infinispan-8.2.4.Final/core/target/test-classes
[ComponentMetadataPersister] Persisted metadata in /usr/src/RPM/BUILD/infinispan-8.2.4.Final/core/src/test/resources/infinispan-core-tests-component-metadata.dat
ERROR StatusLogger No Log4j 2 configuration file found. Using default configuration (logging only errors to the console), or user programmatically provided configurations. Set system property 'log4j2.debug' to show Log4j 2 internal initialization logging. See https://logging.apache.org/log4j/2.x/manual/configuration.html for instructions on how to configure Log4j 2
[ComponentMetadataPersister] 0 components and 0 factories analyzed and persisted in 14 milliseconds.
[INFO]
[INFO] --- maven-antrun-plugin:1.8:run (copy_serialized_test_metadata) @ infinispan-core ---
[INFO] Executing tasks
main:
[copy] Copying 1 file to /usr/src/RPM/BUILD/infinispan-8.2.4.Final/core/target/test-classes
[INFO] Executed tasks
[INFO]
[INFO] --- maven-surefire-plugin:2.22.0:test (default-test) @ infinispan-core ---
[INFO] Tests are skipped.
[INFO]
[INFO] --- maven-antrun-plugin:1.8:run (generate-blueprint) @ infinispan-core ---
[INFO] Executing tasks
main:
[INFO] Executed tasks
[INFO]
[INFO] --- maven-bundle-plugin:3.5.1:bundle (default-bundle) @ infinispan-core ---
[INFO]
[INFO] --- maven-jar-plugin:3.1.0:test-jar (build-test-jar) @ infinispan-core ---
[INFO] Skipping packaging of the test-jar
[INFO]
[INFO] --- build-helper-maven-plugin:1.9.1:attach-artifact (attach-artifacts) @ infinispan-core ---
[INFO]
[INFO] -----------< org.infinispan:infinispan-extended-statistics >------------
[INFO] Building Infinispan Extended Statistics 8.2.4.Final [5/37]
[INFO] --------------------------------[ jar ]---------------------------------
[INFO]
[INFO] --- maven-enforcer-plugin:1.4.1:enforce (enforce-java) @ infinispan-extended-statistics ---
[INFO]
[INFO] --- maven-resources-plugin:3.1.0:resources (default-resources) @ infinispan-extended-statistics ---
[INFO] Using 'UTF-8' encoding to copy filtered resources.
[INFO] Copying 1 resource
[INFO]
[INFO] --- maven-compiler-plugin:3.8.0:compile (default-compile) @ infinispan-extended-statistics ---
[INFO] Changes detected - recompiling the module!
[INFO] Compiling 23 source files to /usr/src/RPM/BUILD/infinispan-8.2.4.Final/extended-statistics/target/classes
[INFO] /usr/src/RPM/BUILD/infinispan-8.2.4.Final/extended-statistics/src/main/java/org/infinispan/stats/wrappers/ExtendedStatisticRpcManager.java: /usr/src/RPM/BUILD/infinispan-8.2.4.Final/extended-statistics/src/main/java/org/infinispan/stats/wrappers/ExtendedStatisticRpcManager.java uses or overrides a deprecated API.
[INFO] /usr/src/RPM/BUILD/infinispan-8.2.4.Final/extended-statistics/src/main/java/org/infinispan/stats/wrappers/ExtendedStatisticRpcManager.java: Recompile with -Xlint:deprecation for details.
[INFO]
[INFO] --- exec-maven-plugin:1.6.0:java (serialize_component_metadata) @ infinispan-extended-statistics ---
[ComponentMetadataPersister] Starting component metadata generation. Scanning classes in /usr/src/RPM/BUILD/infinispan-8.2.4.Final/extended-statistics/target/classes
ERROR StatusLogger No Log4j 2 configuration file found. Using default configuration (logging only errors to the console), or user programmatically provided configurations. Set system property 'log4j2.debug' to show Log4j 2 internal initialization logging. See https://logging.apache.org/log4j/2.x/manual/configuration.html for instructions on how to configure Log4j 2
[ComponentMetadataPersister] Persisted metadata in /usr/src/RPM/BUILD/infinispan-8.2.4.Final/extended-statistics/src/main/resources/infinispan-extended-statistics-component-metadata.dat
[ComponentMetadataPersister] 2 components and 0 factories analyzed and persisted in 364 milliseconds.
[INFO]
[INFO] --- maven-resources-plugin:3.1.0:testResources (default-testResources) @ infinispan-extended-statistics ---
[INFO] Not copying test resources
[INFO]
[INFO] --- maven-antrun-plugin:1.8:run (copy_serialized_metadata) @ infinispan-extended-statistics ---
[INFO] Executing tasks
main:
[copy] Copying 1 file to /usr/src/RPM/BUILD/infinispan-8.2.4.Final/extended-statistics/target/classes
[INFO] Executed tasks
[INFO]
[INFO] --- maven-compiler-plugin:3.8.0:testCompile (default-testCompile) @ infinispan-extended-statistics ---
[INFO] Not compiling test sources
[INFO]
[INFO] --- exec-maven-plugin:1.6.0:java (serialize_test_component_metadata) @ infinispan-extended-statistics ---
[INFO] skipping execute as per configuration
[INFO]
[INFO] --- maven-antrun-plugin:1.8:run (copy_serialized_test_metadata) @ infinispan-extended-statistics ---
[INFO] Skipping Antrun execution
[INFO]
[INFO] --- maven-surefire-plugin:2.22.0:test (default-test) @ infinispan-extended-statistics ---
[INFO] Tests are skipped.
[INFO]
[INFO] --- maven-antrun-plugin:1.8:run (generate-blueprint) @ infinispan-extended-statistics ---
[INFO] Executing tasks
main:
[INFO] Executed tasks
[INFO]
[INFO] --- maven-jar-plugin:3.1.0:jar (default-jar) @ infinispan-extended-statistics ---
[INFO] Building jar: /usr/src/RPM/BUILD/infinispan-8.2.4.Final/extended-statistics/target/infinispan-extended-statistics.jar
[INFO]
[INFO] --- maven-jar-plugin:3.1.0:test-jar (build-test-jar) @ infinispan-extended-statistics ---
[INFO] Skipping packaging of the test-jar
[INFO]
[INFO] ----------------< org.infinispan:infinispan-query-dsl >-----------------
[INFO] Building Infinispan Query DSL API 8.2.4.Final [6/37]
[INFO] -------------------------------[ bundle ]-------------------------------
[INFO]
[INFO] --- maven-enforcer-plugin:1.4.1:enforce (enforce-java) @ infinispan-query-dsl ---
[INFO]
[INFO] --- maven-resources-plugin:3.1.0:resources (default-resources) @ infinispan-query-dsl ---
[INFO] Using 'UTF-8' encoding to copy filtered resources.
[INFO] skip non existing resourceDirectory /usr/src/RPM/BUILD/infinispan-8.2.4.Final/query-dsl/src/main/resources
[INFO]
[INFO] --- maven-compiler-plugin:3.8.0:compile (default-compile) @ infinispan-query-dsl ---
[INFO] Changes detected - recompiling the module!
[INFO] Compiling 42 source files to /usr/src/RPM/BUILD/infinispan-8.2.4.Final/query-dsl/target/classes
[INFO] /usr/src/RPM/BUILD/infinispan-8.2.4.Final/query-dsl/src/main/java/org/infinispan/query/dsl/impl/BaseCondition.java: Some input files use unchecked or unsafe operations.
[INFO] /usr/src/RPM/BUILD/infinispan-8.2.4.Final/query-dsl/src/main/java/org/infinispan/query/dsl/impl/BaseCondition.java: Recompile with -Xlint:unchecked for details.
[INFO]
[INFO] --- exec-maven-plugin:1.6.0:java (serialize_component_metadata) @ infinispan-query-dsl ---
[INFO] skipping execute as per configuration
[INFO]
[INFO] --- maven-resources-plugin:3.1.0:testResources (default-testResources) @ infinispan-query-dsl ---
[INFO] Not copying test resources
[INFO]
[INFO] --- maven-antrun-plugin:1.8:run (copy_serialized_metadata) @ infinispan-query-dsl ---
[INFO] Skipping Antrun execution
[INFO]
[INFO] --- maven-compiler-plugin:3.8.0:testCompile (default-testCompile) @ infinispan-query-dsl ---
[INFO] Not compiling test sources
[INFO]
[INFO] --- exec-maven-plugin:1.6.0:java (serialize_test_component_metadata) @ infinispan-query-dsl ---
[INFO] skipping execute as per configuration
[INFO]
[INFO] --- maven-antrun-plugin:1.8:run (copy_serialized_test_metadata) @ infinispan-query-dsl ---
[INFO] Skipping Antrun execution
[INFO]
[INFO] --- maven-surefire-plugin:2.22.0:test (default-test) @ infinispan-query-dsl ---
[INFO] Tests are skipped.
[INFO]
[INFO] --- maven-bundle-plugin:3.5.1:bundle (default-bundle) @ infinispan-query-dsl ---
[INFO]
[INFO] --- maven-jar-plugin:3.1.0:test-jar (build-test-jar) @ infinispan-query-dsl ---
[INFO] Skipping packaging of the test-jar
[INFO]
[INFO] -----------< org.infinispan:infinispan-remote-query-client >------------
[INFO] Building Infinispan Remote Query Client 8.2.4.Final [7/37]
[INFO] -------------------------------[ bundle ]-------------------------------
[INFO]
[INFO] --- maven-enforcer-plugin:1.4.1:enforce (enforce-java) @ infinispan-remote-query-client ---
[INFO]
[INFO] --- maven-resources-plugin:3.1.0:resources (default-resources) @ infinispan-remote-query-client ---
[INFO] Using 'UTF-8' encoding to copy filtered resources.
[INFO] Copying 1 resource
[INFO]
[INFO] --- maven-compiler-plugin:3.8.0:compile (default-compile) @ infinispan-remote-query-client ---
[INFO] Changes detected - recompiling the module!
[INFO] Compiling 8 source files to /usr/src/RPM/BUILD/infinispan-8.2.4.Final/remote-query/remote-query-client/target/classes
[INFO]
[INFO] --- exec-maven-plugin:1.6.0:java (serialize_component_metadata) @ infinispan-remote-query-client ---
[INFO] skipping execute as per configuration
[INFO]
[INFO] --- maven-resources-plugin:3.1.0:testResources (default-testResources) @ infinispan-remote-query-client ---
[INFO] Not copying test resources
[INFO]
[INFO] --- maven-antrun-plugin:1.8:run (copy_serialized_metadata) @ infinispan-remote-query-client ---
[INFO] Skipping Antrun execution
[INFO]
[INFO] --- maven-compiler-plugin:3.8.0:testCompile (default-testCompile) @ infinispan-remote-query-client ---
[INFO] Not compiling test sources
[INFO]
[INFO] --- exec-maven-plugin:1.6.0:java (serialize_test_component_metadata) @ infinispan-remote-query-client ---
[INFO] skipping execute as per configuration
[INFO]
[INFO] --- maven-antrun-plugin:1.8:run (copy_serialized_test_metadata) @ infinispan-remote-query-client ---
[INFO] Skipping Antrun execution
[INFO]
[INFO] --- maven-surefire-plugin:2.22.0:test (default-test) @ infinispan-remote-query-client ---
[INFO] Tests are skipped.
[INFO]
[INFO] --- maven-bundle-plugin:3.5.1:bundle (default-bundle) @ infinispan-remote-query-client ---
[INFO]
[INFO] --- maven-jar-plugin:3.1.0:test-jar (build-test-jar) @ infinispan-remote-query-client ---
[INFO] Skipping packaging of the test-jar
[INFO]
[INFO] -------------------< org.infinispan:infinispan-tree >-------------------
[INFO] Building Infinispan Tree API 8.2.4.Final [8/37]
[INFO] -------------------------------[ bundle ]-------------------------------
[INFO]
[INFO] --- maven-enforcer-plugin:1.4.1:enforce (enforce-java) @ infinispan-tree ---
[INFO]
[INFO] --- maven-resources-plugin:3.1.0:resources (default-resources) @ infinispan-tree ---
[INFO] Using 'UTF-8' encoding to copy filtered resources.
[INFO] Copying 1 resource
[INFO]
[INFO] --- maven-compiler-plugin:3.8.0:compile (default-compile) @ infinispan-tree ---
[INFO] Compiling 13 source files to /usr/src/RPM/BUILD/infinispan-8.2.4.Final/tree/target/classes
[INFO] /usr/src/RPM/BUILD/infinispan-8.2.4.Final/tree/src/main/java/org/infinispan/tree/Fqn.java: Some input files use unchecked or unsafe operations.
[INFO] /usr/src/RPM/BUILD/infinispan-8.2.4.Final/tree/src/main/java/org/infinispan/tree/Fqn.java: Recompile with -Xlint:unchecked for details.
[INFO]
[INFO] --- exec-maven-plugin:1.6.0:java (serialize_component_metadata) @ infinispan-tree ---
[INFO] skipping execute as per configuration
[INFO]
[INFO] --- maven-resources-plugin:3.1.0:testResources (default-testResources) @ infinispan-tree ---
[INFO] Not copying test resources
[INFO]
[INFO] --- maven-antrun-plugin:1.8:run (copy_serialized_metadata) @ infinispan-tree ---
[INFO] Skipping Antrun execution
[INFO]
[INFO] --- maven-compiler-plugin:3.8.0:testCompile (default-testCompile) @ infinispan-tree ---
[INFO] Not compiling test sources
[INFO]
[INFO] --- exec-maven-plugin:1.6.0:java (serialize_test_component_metadata) @ infinispan-tree ---
[INFO] skipping execute as per configuration
[INFO]
[INFO] --- maven-antrun-plugin:1.8:run (copy_serialized_test_metadata) @ infinispan-tree ---
[INFO] Skipping Antrun execution
[INFO]
[INFO] --- maven-surefire-plugin:2.22.0:test (default-test) @ infinispan-tree ---
[INFO] Tests are skipped.
[INFO]
[INFO] --- maven-antrun-plugin:1.8:run (generate-blueprint) @ infinispan-tree ---
[INFO] Executing tasks
main:
[INFO] Executed tasks
[INFO]
[INFO] --- maven-bundle-plugin:3.5.1:bundle (default-bundle) @ infinispan-tree ---
[INFO]
[INFO] --- maven-jar-plugin:3.1.0:test-jar (build-test-jar) @ infinispan-tree ---
[INFO] Skipping packaging of the test-jar
[INFO]
[INFO] --------------< org.infinispan:infinispan-lucene-parent >---------------
[INFO] Building Parent pom for the Lucene integration modules 8.2.4.Final [9/37]
[INFO] --------------------------------[ pom ]---------------------------------
[INFO]
[INFO] --- maven-enforcer-plugin:1.4.1:enforce (enforce-java) @ infinispan-lucene-parent ---
[INFO]
[INFO] --- exec-maven-plugin:1.6.0:java (serialize_component_metadata) @ infinispan-lucene-parent ---
[INFO] skipping execute as per configuration
[INFO]
[INFO] --- maven-antrun-plugin:1.8:run (copy_serialized_metadata) @ infinispan-lucene-parent ---
[INFO] Skipping Antrun execution
[INFO]
[INFO] --- exec-maven-plugin:1.6.0:java (serialize_test_component_metadata) @ infinispan-lucene-parent ---
[INFO] skipping execute as per configuration
[INFO]
[INFO] --- maven-antrun-plugin:1.8:run (copy_serialized_test_metadata) @ infinispan-lucene-parent ---
[INFO] Skipping Antrun execution
[INFO]
[INFO] --- maven-jar-plugin:3.1.0:test-jar (build-test-jar) @ infinispan-lucene-parent ---
[INFO] Skipping packaging of the test-jar
[INFO]
[INFO] ------------< org.infinispan:infinispan-persistence-parent >------------
[INFO] Building Parent pom for cachestore modules 8.2.4.Final [10/37]
[INFO] --------------------------------[ pom ]---------------------------------
[INFO]
[INFO] --- maven-enforcer-plugin:1.4.1:enforce (enforce-java) @ infinispan-persistence-parent ---
[INFO]
[INFO] --- exec-maven-plugin:1.6.0:java (serialize_component_metadata) @ infinispan-persistence-parent ---
[INFO] skipping execute as per configuration
[INFO]
[INFO] --- maven-antrun-plugin:1.8:run (copy_serialized_metadata) @ infinispan-persistence-parent ---
[INFO] Skipping Antrun execution
[INFO]
[INFO] --- exec-maven-plugin:1.6.0:java (serialize_test_component_metadata) @ infinispan-persistence-parent ---
[INFO] skipping execute as per configuration
[INFO]
[INFO] --- maven-antrun-plugin:1.8:run (copy_serialized_test_metadata) @ infinispan-persistence-parent ---
[INFO] Skipping Antrun execution
[INFO]
[INFO] --- maven-jar-plugin:3.1.0:test-jar (build-test-jar) @ infinispan-persistence-parent ---
[INFO] Skipping packaging of the test-jar
[INFO]
[INFO] -------------< org.infinispan:infinispan-cachestore-jdbc >--------------
[INFO] Building Infinispan JDBC CacheStore 8.2.4.Final [11/37]
[INFO] -------------------------------[ bundle ]-------------------------------
[INFO]
[INFO] --- maven-enforcer-plugin:1.4.1:enforce (enforce-java) @ infinispan-cachestore-jdbc ---
[INFO]
[INFO] --- maven-resources-plugin:3.1.0:resources (default-resources) @ infinispan-cachestore-jdbc ---
[INFO] Using 'UTF-8' encoding to copy filtered resources.
[INFO] Copying 1 resource
[INFO] Copying 0 resource
[INFO] Copying 1 resource
[INFO]
[INFO] --- maven-compiler-plugin:3.8.0:compile (default-compile) @ infinispan-cachestore-jdbc ---
[INFO] Compiling 39 source files to /usr/src/RPM/BUILD/infinispan-8.2.4.Final/persistence/jdbc/target/classes
[INFO] /usr/src/RPM/BUILD/infinispan-8.2.4.Final/persistence/jdbc/src/main/java/org/infinispan/persistence/jdbc/configuration/JdbcStoreConfigurationParser80.java: /usr/src/RPM/BUILD/infinispan-8.2.4.Final/persistence/jdbc/src/main/java/org/infinispan/persistence/jdbc/configuration/JdbcStoreConfigurationParser80.java uses or overrides a deprecated API.
[INFO] /usr/src/RPM/BUILD/infinispan-8.2.4.Final/persistence/jdbc/src/main/java/org/infinispan/persistence/jdbc/configuration/JdbcStoreConfigurationParser80.java: Recompile with -Xlint:deprecation for details.
[INFO] /usr/src/RPM/BUILD/infinispan-8.2.4.Final/persistence/jdbc/src/main/java/org/infinispan/persistence/jdbc/configuration/AbstractJdbcStoreConfigurationBuilder.java: Some input files use unchecked or unsafe operations.
[INFO] /usr/src/RPM/BUILD/infinispan-8.2.4.Final/persistence/jdbc/src/main/java/org/infinispan/persistence/jdbc/configuration/AbstractJdbcStoreConfigurationBuilder.java: Recompile with -Xlint:unchecked for details.
[INFO]
[INFO] --- exec-maven-plugin:1.6.0:java (serialize_component_metadata) @ infinispan-cachestore-jdbc ---
[INFO] skipping execute as per configuration
[INFO]
[INFO] --- maven-resources-plugin:3.1.0:testResources (default-testResources) @ infinispan-cachestore-jdbc ---
[INFO] Not copying test resources
[INFO]
[INFO] --- maven-antrun-plugin:1.8:run (copy_serialized_metadata) @ infinispan-cachestore-jdbc ---
[INFO] Skipping Antrun execution
[INFO]
[INFO] --- maven-compiler-plugin:3.8.0:testCompile (default-testCompile) @ infinispan-cachestore-jdbc ---
[INFO] Not compiling test sources
[INFO]
[INFO] --- exec-maven-plugin:1.6.0:java (serialize_test_component_metadata) @ infinispan-cachestore-jdbc ---
[INFO] skipping execute as per configuration
[INFO]
[INFO] --- maven-antrun-plugin:1.8:run (copy_serialized_test_metadata) @ infinispan-cachestore-jdbc ---
[INFO] Skipping Antrun execution
[INFO]
[INFO] --- maven-surefire-plugin:2.22.0:test (default-test) @ infinispan-cachestore-jdbc ---
[INFO] Tests are skipped.
[INFO]
[INFO] --- maven-antrun-plugin:1.8:run (generate-blueprint) @ infinispan-cachestore-jdbc ---
[INFO] Executing tasks
main:
[INFO] Executed tasks
[INFO]
[INFO] --- maven-bundle-plugin:3.5.1:bundle (default-bundle) @ infinispan-cachestore-jdbc ---
[INFO]
[INFO] --- maven-jar-plugin:3.1.0:test-jar (build-test-jar) @ infinispan-cachestore-jdbc ---
[INFO] Skipping packaging of the test-jar
[INFO]
[INFO] --- build-helper-maven-plugin:1.9.1:attach-artifact (attach-artifacts) @ infinispan-cachestore-jdbc ---
[INFO]
[INFO] -------------< org.infinispan:infinispan-lucene-directory >-------------
[INFO] Building Infinispan Lucene Directory Implementation 8.2.4.Final [12/37]
[INFO] -------------------------------[ bundle ]-------------------------------
[INFO]
[INFO] --- maven-enforcer-plugin:1.4.1:enforce (enforce-java) @ infinispan-lucene-directory ---
[INFO]
[INFO] --- maven-resources-plugin:3.1.0:resources (default-resources) @ infinispan-lucene-directory ---
[INFO] Using 'UTF-8' encoding to copy filtered resources.
[INFO] Copying 2 resources
[INFO]
[INFO] --- maven-compiler-plugin:3.8.0:compile (default-compile) @ infinispan-lucene-directory ---
[INFO] Compiling 43 source files to /usr/src/RPM/BUILD/infinispan-8.2.4.Final/lucene/lucene-directory/target/classes
[INFO] /usr/src/RPM/BUILD/infinispan-8.2.4.Final/lucene/lucene-directory/src/main/java/org/infinispan/lucene/cacheloader/LuceneCacheLoader.java: Some input files use unchecked or unsafe operations.
[INFO] /usr/src/RPM/BUILD/infinispan-8.2.4.Final/lucene/lucene-directory/src/main/java/org/infinispan/lucene/cacheloader/LuceneCacheLoader.java: Recompile with -Xlint:unchecked for details.
[INFO]
[INFO] --- exec-maven-plugin:1.6.0:java (serialize_component_metadata) @ infinispan-lucene-directory ---
[INFO] skipping execute as per configuration
[INFO]
[INFO] --- maven-resources-plugin:3.1.0:testResources (default-testResources) @ infinispan-lucene-directory ---
[INFO] Not copying test resources
[INFO]
[INFO] --- maven-antrun-plugin:1.8:run (copy_serialized_metadata) @ infinispan-lucene-directory ---
[INFO] Skipping Antrun execution
[INFO]
[INFO] --- maven-compiler-plugin:3.8.0:testCompile (default-testCompile) @ infinispan-lucene-directory ---
[INFO] Not compiling test sources
[INFO]
[INFO] --- exec-maven-plugin:1.6.0:java (serialize_test_component_metadata) @ infinispan-lucene-directory ---
[INFO] skipping execute as per configuration
[INFO]
[INFO] --- maven-antrun-plugin:1.8:run (copy_serialized_test_metadata) @ infinispan-lucene-directory ---
[INFO] Skipping Antrun execution
[INFO]
[INFO] --- maven-surefire-plugin:2.22.0:test (default-test) @ infinispan-lucene-directory ---
[INFO] Tests are skipped.
[INFO]
[INFO] --- maven-bundle-plugin:3.5.1:bundle (default-bundle) @ infinispan-lucene-directory ---
[WARNING] Include-Resource: overriding OSGI-INF/blueprint/blueprint.xml=src/main/resources/OSGI-INF/blueprint/blueprint.xml,META-INF/services/org.infinispan.lifecycle.ModuleLifecycle=src/main/resources/META-INF/services/org.infinispan.lifecycle.ModuleLifecycle with META-INF/services/org.infinispan.lifecycle.ModuleLifecycle=target/classes/META-INF/services/org.infinispan.lifecycle.ModuleLifecycle (add {maven-resources} if you want to include the maven resources)
[INFO]
[INFO] --- maven-jar-plugin:3.1.0:test-jar (build-test-jar) @ infinispan-lucene-directory ---
[INFO] Skipping packaging of the test-jar
[INFO]
[INFO] --------------< org.infinispan:infinispan-cachestore-jpa >--------------
[INFO] Building Infinispan JPA CacheStore 8.2.4.Final [13/37]
[INFO] -------------------------------[ bundle ]-------------------------------
[INFO]
[INFO] --- maven-enforcer-plugin:1.4.1:enforce (enforce-java) @ infinispan-cachestore-jpa ---
[INFO]
[INFO] --- maven-resources-plugin:3.1.0:resources (default-resources) @ infinispan-cachestore-jpa ---
[INFO] Using 'UTF-8' encoding to copy filtered resources.
[INFO] Copying 1 resource
[INFO] Copying 0 resource
[INFO] Copying 1 resource
[INFO]
[INFO] --- maven-compiler-plugin:3.8.0:compile (default-compile) @ infinispan-cachestore-jpa ---
[INFO] Changes detected - recompiling the module!
[INFO] Compiling 13 source files to /usr/src/RPM/BUILD/infinispan-8.2.4.Final/persistence/jpa/target/classes
[INFO] /usr/src/RPM/BUILD/infinispan-8.2.4.Final/persistence/jpa/src/main/java/org/infinispan/persistence/jpa/configuration/JpaStoreConfigurationParser80.java: /usr/src/RPM/BUILD/infinispan-8.2.4.Final/persistence/jpa/src/main/java/org/infinispan/persistence/jpa/configuration/JpaStoreConfigurationParser80.java uses or overrides a deprecated API.
[INFO] /usr/src/RPM/BUILD/infinispan-8.2.4.Final/persistence/jpa/src/main/java/org/infinispan/persistence/jpa/configuration/JpaStoreConfigurationParser80.java: Recompile with -Xlint:deprecation for details.
[INFO] /usr/src/RPM/BUILD/infinispan-8.2.4.Final/persistence/jpa/src/main/java/org/infinispan/persistence/jpa/JpaStore.java: /usr/src/RPM/BUILD/infinispan-8.2.4.Final/persistence/jpa/src/main/java/org/infinispan/persistence/jpa/JpaStore.java uses unchecked or unsafe operations.
[INFO] /usr/src/RPM/BUILD/infinispan-8.2.4.Final/persistence/jpa/src/main/java/org/infinispan/persistence/jpa/JpaStore.java: Recompile with -Xlint:unchecked for details.
[INFO]
[INFO] --- exec-maven-plugin:1.6.0:java (serialize_component_metadata) @ infinispan-cachestore-jpa ---
[INFO] skipping execute as per configuration
[INFO]
[INFO] --- maven-resources-plugin:3.1.0:testResources (default-testResources) @ infinispan-cachestore-jpa ---
[INFO] Not copying test resources
[INFO]
[INFO] --- maven-antrun-plugin:1.8:run (copy_serialized_metadata) @ infinispan-cachestore-jpa ---
[INFO] Skipping Antrun execution
[INFO]
[INFO] --- maven-compiler-plugin:3.8.0:testCompile (default-testCompile) @ infinispan-cachestore-jpa ---
[INFO] Not compiling test sources
[INFO]
[INFO] --- exec-maven-plugin:1.6.0:java (serialize_test_component_metadata) @ infinispan-cachestore-jpa ---
[INFO] skipping execute as per configuration
[INFO]
[INFO] --- maven-antrun-plugin:1.8:run (copy_serialized_test_metadata) @ infinispan-cachestore-jpa ---
[INFO] Skipping Antrun execution
[INFO]
[INFO] --- maven-surefire-plugin:2.22.0:test (default-test) @ infinispan-cachestore-jpa ---
[INFO] Tests are skipped.
[INFO]
[INFO] --- maven-antrun-plugin:1.8:run (generate-blueprint) @ infinispan-cachestore-jpa ---
[INFO] Executing tasks
main:
[INFO] Executed tasks
[INFO]
[INFO] --- maven-bundle-plugin:3.5.1:bundle (default-bundle) @ infinispan-cachestore-jpa ---
[INFO]
[INFO] --- maven-jar-plugin:3.1.0:test-jar (build-test-jar) @ infinispan-cachestore-jpa ---
[INFO] Skipping packaging of the test-jar
[INFO]
[INFO] --- build-helper-maven-plugin:1.9.1:attach-artifact (attach-artifacts) @ infinispan-cachestore-jpa ---
[INFO]
[INFO] --------------< org.infinispan:infinispan-client-hotrod >---------------
[INFO] Building Infinispan Hot Rod Client 8.2.4.Final [14/37]
[INFO] -------------------------------[ bundle ]-------------------------------
[INFO]
[INFO] --- maven-enforcer-plugin:1.4.1:enforce (enforce-java) @ infinispan-client-hotrod ---
[INFO]
[INFO] --- maven-resources-plugin:3.1.0:resources (default-resources) @ infinispan-client-hotrod ---
[INFO] Using 'UTF-8' encoding to copy filtered resources.
[INFO] Copying 1 resource
[INFO]
[INFO] --- maven-compiler-plugin:3.8.0:compile (default-compile) @ infinispan-client-hotrod ---
[INFO] Compiling 169 source files to /usr/src/RPM/BUILD/infinispan-8.2.4.Final/client/hotrod-client/target/classes
[INFO] /usr/src/RPM/BUILD/infinispan-8.2.4.Final/client/hotrod-client/src/main/java/org/infinispan/client/hotrod/configuration/Configuration.java: Some input files use or override a deprecated API.
[INFO] /usr/src/RPM/BUILD/infinispan-8.2.4.Final/client/hotrod-client/src/main/java/org/infinispan/client/hotrod/configuration/Configuration.java: Recompile with -Xlint:deprecation for details.
[INFO] /usr/src/RPM/BUILD/infinispan-8.2.4.Final/client/hotrod-client/src/main/java/org/infinispan/client/hotrod/impl/transport/tcp/TcpTransportFactory.java: Some input files use unchecked or unsafe operations.
[INFO] /usr/src/RPM/BUILD/infinispan-8.2.4.Final/client/hotrod-client/src/main/java/org/infinispan/client/hotrod/impl/transport/tcp/TcpTransportFactory.java: Recompile with -Xlint:unchecked for details.
[INFO]
[INFO] --- exec-maven-plugin:1.6.0:java (serialize_component_metadata) @ infinispan-client-hotrod ---
[INFO] skipping execute as per configuration
[INFO]
[INFO] --- maven-resources-plugin:3.1.0:testResources (default-testResources) @ infinispan-client-hotrod ---
[INFO] Not copying test resources
[INFO]
[INFO] --- maven-antrun-plugin:1.8:run (copy_serialized_metadata) @ infinispan-client-hotrod ---
[INFO] Skipping Antrun execution
[INFO]
[INFO] --- maven-compiler-plugin:3.8.0:testCompile (default-testCompile) @ infinispan-client-hotrod ---
[INFO] Not compiling test sources
[INFO]
[INFO] --- exec-maven-plugin:1.6.0:java (serialize_test_component_metadata) @ infinispan-client-hotrod ---
[INFO] skipping execute as per configuration
[INFO]
[INFO] --- maven-antrun-plugin:1.8:run (copy_serialized_test_metadata) @ infinispan-client-hotrod ---
[INFO] Skipping Antrun execution
[INFO]
[INFO] --- maven-surefire-plugin:2.22.0:test (default-test) @ infinispan-client-hotrod ---
[INFO] Tests are skipped.
[INFO]
[INFO] --- maven-bundle-plugin:3.5.1:bundle (default-bundle) @ infinispan-client-hotrod ---
[INFO]
[INFO] --- maven-jar-plugin:3.1.0:test-jar (build-test-jar) @ infinispan-client-hotrod ---
[INFO] Skipping packaging of the test-jar
[INFO]
[INFO] --- build-helper-maven-plugin:1.9.1:attach-artifact (attach-artifacts) @ infinispan-client-hotrod ---
[INFO]
[INFO] ------------< org.infinispan:infinispan-cachestore-remote >-------------
[INFO] Building Infinispan Remote CacheStore 8.2.4.Final [15/37]
[INFO] -------------------------------[ bundle ]-------------------------------
[INFO]
[INFO] --- maven-enforcer-plugin:1.4.1:enforce (enforce-java) @ infinispan-cachestore-remote ---
[INFO]
[INFO] --- maven-resources-plugin:3.1.0:resources (default-resources) @ infinispan-cachestore-remote ---
[INFO] Using 'UTF-8' encoding to copy filtered resources.
[INFO] Copying 1 resource
[INFO] Copying 0 resource
[INFO] Copying 2 resources
[INFO]
[INFO] --- maven-compiler-plugin:3.8.0:compile (default-compile) @ infinispan-cachestore-remote ---
[INFO] Compiling 24 source files to /usr/src/RPM/BUILD/infinispan-8.2.4.Final/persistence/remote/target/classes
[INFO] /usr/src/RPM/BUILD/infinispan-8.2.4.Final/persistence/remote/src/main/java/org/infinispan/persistence/remote/configuration/RemoteStoreConfigurationParser80.java: /usr/src/RPM/BUILD/infinispan-8.2.4.Final/persistence/remote/src/main/java/org/infinispan/persistence/remote/configuration/RemoteStoreConfigurationParser80.java uses or overrides a deprecated API.
[INFO] /usr/src/RPM/BUILD/infinispan-8.2.4.Final/persistence/remote/src/main/java/org/infinispan/persistence/remote/configuration/RemoteStoreConfigurationParser80.java: Recompile with -Xlint:deprecation for details.
[INFO] /usr/src/RPM/BUILD/infinispan-8.2.4.Final/persistence/remote/src/main/java/org/infinispan/persistence/remote/configuration/RemoteStoreConfiguration.java: Some input files use unchecked or unsafe operations.
[INFO] /usr/src/RPM/BUILD/infinispan-8.2.4.Final/persistence/remote/src/main/java/org/infinispan/persistence/remote/configuration/RemoteStoreConfiguration.java: Recompile with -Xlint:unchecked for details.
[INFO]
[INFO] --- exec-maven-plugin:1.6.0:java (serialize_component_metadata) @ infinispan-cachestore-remote ---
[INFO] skipping execute as per configuration
[INFO]
[INFO] --- maven-resources-plugin:3.1.0:testResources (default-testResources) @ infinispan-cachestore-remote ---
[INFO] Not copying test resources
[INFO]
[INFO] --- maven-antrun-plugin:1.8:run (copy_serialized_metadata) @ infinispan-cachestore-remote ---
[INFO] Skipping Antrun execution
[INFO]
[INFO] --- maven-compiler-plugin:3.8.0:testCompile (default-testCompile) @ infinispan-cachestore-remote ---
[INFO] Not compiling test sources
[INFO]
[INFO] --- exec-maven-plugin:1.6.0:java (serialize_test_component_metadata) @ infinispan-cachestore-remote ---
[INFO] skipping execute as per configuration
[INFO]
[INFO] --- maven-antrun-plugin:1.8:run (copy_serialized_test_metadata) @ infinispan-cachestore-remote ---
[INFO] Skipping Antrun execution
[INFO]
[INFO] --- maven-surefire-plugin:2.22.0:test (default-test) @ infinispan-cachestore-remote ---
[INFO] Tests are skipped.
[INFO]
[INFO] --- maven-antrun-plugin:1.8:run (generate-blueprint) @ infinispan-cachestore-remote ---
[INFO] Executing tasks
main:
[INFO] Executed tasks
[INFO]
[INFO] --- maven-bundle-plugin:3.5.1:bundle (default-bundle) @ infinispan-cachestore-remote ---
[INFO]
[INFO] --- maven-jar-plugin:3.1.0:test-jar (build-test-jar) @ infinispan-cachestore-remote ---
[INFO] Skipping packaging of the test-jar
[INFO]
[INFO] --- build-helper-maven-plugin:1.9.1:attach-artifact (attach-artifacts) @ infinispan-cachestore-remote ---
[INFO]
[INFO] ----------------< org.infinispan:infinispan-cli-client >----------------
[INFO] Building Infinispan CLI Client 8.2.4.Final [16/37]
[INFO] -------------------------------[ bundle ]-------------------------------
[INFO]
[INFO] --- maven-enforcer-plugin:1.4.1:enforce (enforce-java) @ infinispan-cli-client ---
[INFO]
[INFO] --- maven-resources-plugin:3.1.0:resources (default-resources) @ infinispan-cli-client ---
[INFO] Using 'UTF-8' encoding to copy filtered resources.
[INFO] Copying 29 resources
[INFO]
[INFO] --- maven-compiler-plugin:3.8.0:compile (default-compile) @ infinispan-cli-client ---
[INFO] Changes detected - recompiling the module!
[INFO] Compiling 73 source files to /usr/src/RPM/BUILD/infinispan-8.2.4.Final/cli/cli-client/target/classes
[INFO] /usr/src/RPM/BUILD/infinispan-8.2.4.Final/cli/cli-client/src/main/java/org/infinispan/cli/connection/jmx/JMXConnection.java: /usr/src/RPM/BUILD/infinispan-8.2.4.Final/cli/cli-client/src/main/java/org/infinispan/cli/connection/jmx/JMXConnection.java uses unchecked or unsafe operations.
[INFO] /usr/src/RPM/BUILD/infinispan-8.2.4.Final/cli/cli-client/src/main/java/org/infinispan/cli/connection/jmx/JMXConnection.java: Recompile with -Xlint:unchecked for details.
[INFO]
[INFO] --- exec-maven-plugin:1.6.0:java (serialize_component_metadata) @ infinispan-cli-client ---
[INFO] skipping execute as per configuration
[INFO]
[INFO] --- maven-resources-plugin:3.1.0:testResources (default-testResources) @ infinispan-cli-client ---
[INFO] Not copying test resources
[INFO]
[INFO] --- maven-antrun-plugin:1.8:run (copy_serialized_metadata) @ infinispan-cli-client ---
[INFO] Skipping Antrun execution
[INFO]
[INFO] --- maven-compiler-plugin:3.8.0:testCompile (default-testCompile) @ infinispan-cli-client ---
[INFO] Not compiling test sources
[INFO]
[INFO] --- exec-maven-plugin:1.6.0:java (serialize_test_component_metadata) @ infinispan-cli-client ---
[INFO] skipping execute as per configuration
[INFO]
[INFO] --- maven-antrun-plugin:1.8:run (copy_serialized_test_metadata) @ infinispan-cli-client ---
[INFO] Skipping Antrun execution
[INFO]
[INFO] --- maven-surefire-plugin:2.22.0:test (default-test) @ infinispan-cli-client ---
[INFO] Tests are skipped.
[INFO]
[INFO] --- maven-bundle-plugin:3.5.1:bundle (default-bundle) @ infinispan-cli-client ---
[INFO]
[INFO] --- maven-jar-plugin:3.1.0:test-jar (build-test-jar) @ infinispan-cli-client ---
[INFO] Skipping packaging of the test-jar
[INFO]
[INFO] -------------< org.infinispan:infinispan-persistence-cli >--------------
[INFO] Building Infinispan Command Line Interface persistence 8.2.4.Final [17/37]
[INFO] -------------------------------[ bundle ]-------------------------------
[INFO]
[INFO] --- maven-enforcer-plugin:1.4.1:enforce (enforce-java) @ infinispan-persistence-cli ---
[INFO]
[INFO] --- maven-resources-plugin:3.1.0:resources (default-resources) @ infinispan-persistence-cli ---
[INFO] Using 'UTF-8' encoding to copy filtered resources.
[INFO] Copying 0 resource
[INFO] Copying 1 resource
[INFO]
[INFO] --- maven-compiler-plugin:3.8.0:compile (default-compile) @ infinispan-persistence-cli ---
[INFO] Changes detected - recompiling the module!
[INFO] Compiling 8 source files to /usr/src/RPM/BUILD/infinispan-8.2.4.Final/persistence/cli/target/classes
[INFO] /usr/src/RPM/BUILD/infinispan-8.2.4.Final/persistence/cli/src/main/java/org/infinispan/persistence/cli/configuration/CLInterfaceLoaderConfigurationParser80.java: Some input files use or override a deprecated API.
[INFO] /usr/src/RPM/BUILD/infinispan-8.2.4.Final/persistence/cli/src/main/java/org/infinispan/persistence/cli/configuration/CLInterfaceLoaderConfigurationParser80.java: Recompile with -Xlint:deprecation for details.
[INFO] /usr/src/RPM/BUILD/infinispan-8.2.4.Final/persistence/cli/src/main/java/org/infinispan/persistence/cli/CLInterfaceLoader.java: Some input files use unchecked or unsafe operations.
[INFO] /usr/src/RPM/BUILD/infinispan-8.2.4.Final/persistence/cli/src/main/java/org/infinispan/persistence/cli/CLInterfaceLoader.java: Recompile with -Xlint:unchecked for details.
[INFO]
[INFO] --- exec-maven-plugin:1.6.0:java (serialize_component_metadata) @ infinispan-persistence-cli ---
[INFO] skipping execute as per configuration
[INFO]
[INFO] --- maven-resources-plugin:3.1.0:testResources (default-testResources) @ infinispan-persistence-cli ---
[INFO] Not copying test resources
[INFO]
[INFO] --- maven-antrun-plugin:1.8:run (copy_serialized_metadata) @ infinispan-persistence-cli ---
[INFO] Skipping Antrun execution
[INFO]
[INFO] --- maven-compiler-plugin:3.8.0:testCompile (default-testCompile) @ infinispan-persistence-cli ---
[INFO] Not compiling test sources
[INFO]
[INFO] --- exec-maven-plugin:1.6.0:java (serialize_test_component_metadata) @ infinispan-persistence-cli ---
[INFO] skipping execute as per configuration
[INFO]
[INFO] --- maven-antrun-plugin:1.8:run (copy_serialized_test_metadata) @ infinispan-persistence-cli ---
[INFO] Skipping Antrun execution
[INFO]
[INFO] --- maven-surefire-plugin:2.22.0:test (default-test) @ infinispan-persistence-cli ---
[INFO] Tests are skipped.
[INFO]
[INFO] --- maven-antrun-plugin:1.8:run (generate-blueprint) @ infinispan-persistence-cli ---
[INFO] Executing tasks
main:
[INFO] Executed tasks
[INFO]
[INFO] --- maven-bundle-plugin:3.5.1:bundle (default-bundle) @ infinispan-persistence-cli ---
[INFO]
[INFO] --- maven-jar-plugin:3.1.0:test-jar (build-test-jar) @ infinispan-persistence-cli ---
[INFO] Skipping packaging of the test-jar
[INFO]
[INFO] ------------< org.infinispan:infinispan-cachestore-leveldb >------------
[INFO] Building Infinispan LevelDB CacheStore 8.2.4.Final [18/37]
[INFO] -------------------------------[ bundle ]-------------------------------
[INFO]
[INFO] --- maven-enforcer-plugin:1.4.1:enforce (enforce-java) @ infinispan-cachestore-leveldb ---
[INFO]
[INFO] --- maven-resources-plugin:3.1.0:resources (default-resources) @ infinispan-cachestore-leveldb ---
[INFO] Using 'UTF-8' encoding to copy filtered resources.
[INFO] Copying 1 resource
[INFO] Copying 0 resource
[INFO] Copying 1 resource
[INFO]
[INFO] --- maven-compiler-plugin:3.8.0:compile (default-compile) @ infinispan-cachestore-leveldb ---
[INFO] Compiling 9 source files to /usr/src/RPM/BUILD/infinispan-8.2.4.Final/persistence/leveldb/target/classes
[INFO] /usr/src/RPM/BUILD/infinispan-8.2.4.Final/persistence/leveldb/src/main/java/org/infinispan/persistence/leveldb/configuration/LevelDBStoreConfigurationParser80.java: /usr/src/RPM/BUILD/infinispan-8.2.4.Final/persistence/leveldb/src/main/java/org/infinispan/persistence/leveldb/configuration/LevelDBStoreConfigurationParser80.java uses or overrides a deprecated API.
[INFO] /usr/src/RPM/BUILD/infinispan-8.2.4.Final/persistence/leveldb/src/main/java/org/infinispan/persistence/leveldb/configuration/LevelDBStoreConfigurationParser80.java: Recompile with -Xlint:deprecation for details.
[INFO] /usr/src/RPM/BUILD/infinispan-8.2.4.Final/persistence/leveldb/src/main/java/org/infinispan/persistence/leveldb/LevelDBStore.java: /usr/src/RPM/BUILD/infinispan-8.2.4.Final/persistence/leveldb/src/main/java/org/infinispan/persistence/leveldb/LevelDBStore.java uses unchecked or unsafe operations.
[INFO] /usr/src/RPM/BUILD/infinispan-8.2.4.Final/persistence/leveldb/src/main/java/org/infinispan/persistence/leveldb/LevelDBStore.java: Recompile with -Xlint:unchecked for details.
[INFO]
[INFO] --- exec-maven-plugin:1.6.0:java (serialize_component_metadata) @ infinispan-cachestore-leveldb ---
[INFO] skipping execute as per configuration
[INFO]
[INFO] --- maven-resources-plugin:3.1.0:testResources (default-testResources) @ infinispan-cachestore-leveldb ---
[INFO] Not copying test resources
[INFO]
[INFO] --- maven-antrun-plugin:1.8:run (copy_serialized_metadata) @ infinispan-cachestore-leveldb ---
[INFO] Skipping Antrun execution
[INFO]
[INFO] --- maven-compiler-plugin:3.8.0:testCompile (default-testCompile) @ infinispan-cachestore-leveldb ---
[INFO] Not compiling test sources
[INFO]
[INFO] --- exec-maven-plugin:1.6.0:java (serialize_test_component_metadata) @ infinispan-cachestore-leveldb ---
[INFO] skipping execute as per configuration
[INFO]
[INFO] --- maven-antrun-plugin:1.8:run (copy_serialized_test_metadata) @ infinispan-cachestore-leveldb ---
[INFO] Skipping Antrun execution
[INFO]
[INFO] --- maven-surefire-plugin:2.22.0:test (default-test) @ infinispan-cachestore-leveldb ---
[INFO] Tests are skipped.
[INFO]
[INFO] --- maven-antrun-plugin:1.8:run (generate-blueprint) @ infinispan-cachestore-leveldb ---
[INFO] Executing tasks
main:
[INFO] Executed tasks
[INFO]
[INFO] --- maven-bundle-plugin:3.5.1:bundle (default-bundle) @ infinispan-cachestore-leveldb ---
[INFO]
[INFO] --- maven-jar-plugin:3.1.0:test-jar (build-test-jar) @ infinispan-cachestore-leveldb ---
[INFO] Skipping packaging of the test-jar
[INFO]
[INFO] --- build-helper-maven-plugin:1.9.1:attach-artifact (attach-artifacts) @ infinispan-cachestore-leveldb ---
[INFO]
[INFO] ----------< org.infinispan:infinispan-persistence-soft-index >----------
[INFO] Building Infinispan Soft-Index CacheStore 8.2.4.Final [19/37]
[INFO] -------------------------------[ bundle ]-------------------------------
[INFO]
[INFO] --- maven-enforcer-plugin:1.4.1:enforce (enforce-java) @ infinispan-persistence-soft-index ---
[INFO]
[INFO] --- maven-resources-plugin:3.1.0:resources (default-resources) @ infinispan-persistence-soft-index ---
[INFO] Using 'UTF-8' encoding to copy filtered resources.
[INFO] Copying 0 resource
[INFO] Copying 1 resource
[INFO]
[INFO] --- maven-compiler-plugin:3.8.0:compile (default-compile) @ infinispan-persistence-soft-index ---
[INFO] Changes detected - recompiling the module!
[INFO] Compiling 21 source files to /usr/src/RPM/BUILD/infinispan-8.2.4.Final/persistence/soft-index/target/classes
[INFO] /usr/src/RPM/BUILD/infinispan-8.2.4.Final/persistence/soft-index/src/main/java/org/infinispan/persistence/sifs/configuration/SoftIndexFileStoreConfigurationParser80.java: /usr/src/RPM/BUILD/infinispan-8.2.4.Final/persistence/soft-index/src/main/java/org/infinispan/persistence/sifs/configuration/SoftIndexFileStoreConfigurationParser80.java uses or overrides a deprecated API.
[INFO] /usr/src/RPM/BUILD/infinispan-8.2.4.Final/persistence/soft-index/src/main/java/org/infinispan/persistence/sifs/configuration/SoftIndexFileStoreConfigurationParser80.java: Recompile with -Xlint:deprecation for details.
[INFO] /usr/src/RPM/BUILD/infinispan-8.2.4.Final/persistence/soft-index/src/main/java/org/infinispan/persistence/sifs/IndexQueue.java: Some input files use unchecked or unsafe operations.
[INFO] /usr/src/RPM/BUILD/infinispan-8.2.4.Final/persistence/soft-index/src/main/java/org/infinispan/persistence/sifs/IndexQueue.java: Recompile with -Xlint:unchecked for details.
[INFO]
[INFO] --- exec-maven-plugin:1.6.0:java (serialize_component_metadata) @ infinispan-persistence-soft-index ---
[INFO] skipping execute as per configuration
[INFO]
[INFO] --- maven-resources-plugin:3.1.0:testResources (default-testResources) @ infinispan-persistence-soft-index ---
[INFO] Not copying test resources
[INFO]
[INFO] --- maven-antrun-plugin:1.8:run (copy_serialized_metadata) @ infinispan-persistence-soft-index ---
[INFO] Skipping Antrun execution
[INFO]
[INFO] --- maven-compiler-plugin:3.8.0:testCompile (default-testCompile) @ infinispan-persistence-soft-index ---
[INFO] Not compiling test sources
[INFO]
[INFO] --- exec-maven-plugin:1.6.0:java (serialize_test_component_metadata) @ infinispan-persistence-soft-index ---
[INFO] skipping execute as per configuration
[INFO]
[INFO] --- maven-antrun-plugin:1.8:run (copy_serialized_test_metadata) @ infinispan-persistence-soft-index ---
[INFO] Skipping Antrun execution
[INFO]
[INFO] --- maven-surefire-plugin:2.22.0:test (default-test) @ infinispan-persistence-soft-index ---
[INFO] Tests are skipped.
[INFO]
[INFO] --- maven-antrun-plugin:1.8:run (generate-blueprint) @ infinispan-persistence-soft-index ---
[INFO] Executing tasks
main:
[INFO] Executed tasks
[INFO]
[INFO] --- maven-bundle-plugin:3.5.1:bundle (default-bundle) @ infinispan-persistence-soft-index ---
[WARNING] Bundle org.infinispan:infinispan-persistence-soft-index:bundle:8.2.4.Final : Unused Export-Package instructions: [org.infinispan.persistence.sfis.*]
[INFO]
[INFO] --- maven-jar-plugin:3.1.0:test-jar (build-test-jar) @ infinispan-persistence-soft-index ---
[INFO] Skipping packaging of the test-jar
[INFO]
[INFO] --------------< org.infinispan:infinispan-server-parent >---------------
[INFO] Building Parent pom for server modules 8.2.4.Final [20/37]
[INFO] --------------------------------[ pom ]---------------------------------
[INFO]
[INFO] --- maven-enforcer-plugin:1.4.1:enforce (enforce-java) @ infinispan-server-parent ---
[INFO]
[INFO] --- exec-maven-plugin:1.6.0:java (serialize_component_metadata) @ infinispan-server-parent ---
[INFO] skipping execute as per configuration
[INFO]
[INFO] --- maven-antrun-plugin:1.8:run (copy_serialized_metadata) @ infinispan-server-parent ---
[INFO] Skipping Antrun execution
[INFO]
[INFO] --- exec-maven-plugin:1.6.0:java (serialize_test_component_metadata) @ infinispan-server-parent ---
[INFO] skipping execute as per configuration
[INFO]
[INFO] --- maven-antrun-plugin:1.8:run (copy_serialized_test_metadata) @ infinispan-server-parent ---
[INFO] Skipping Antrun execution
[INFO]
[INFO] --- maven-jar-plugin:3.1.0:test-jar (build-test-jar) @ infinispan-server-parent ---
[INFO] Skipping packaging of the test-jar
[INFO]
[INFO] ---------------< org.infinispan:infinispan-server-core >----------------
[INFO] Building Infinispan Server - Core Components 8.2.4.Final [21/37]
[INFO] -------------------------------[ bundle ]-------------------------------
[INFO]
[INFO] --- maven-enforcer-plugin:1.4.1:enforce (enforce-java) @ infinispan-server-core ---
[INFO]
[INFO] --- maven-antrun-plugin:1.8:run (compile) @ infinispan-server-core ---
[WARNING] Parameter tasks is deprecated, use target instead
[INFO] Executing tasks
main:
[mkdir] Created dir: /usr/src/RPM/BUILD/infinispan-8.2.4.Final/server/core/target/classes
[scalac] Compiling 18 scala and 21 java source files to /usr/src/RPM/BUILD/infinispan-8.2.4.Final/server/core/target/classes
warning: there were 2 deprecation warning(s); re-run with -deprecation for details
one warning found
[scalac] Compile succeeded with 1 warning; see the compiler output for details.
[INFO] Executed tasks
[INFO]
[INFO] --- maven-resources-plugin:3.1.0:resources (default-resources) @ infinispan-server-core ---
[INFO] Using 'UTF-8' encoding to copy filtered resources.
[INFO] Copying 2 resources
[INFO]
[INFO] --- maven-compiler-plugin:3.8.0:compile (default-compile) @ infinispan-server-core ---
[INFO] Compiling 20 source files to /usr/src/RPM/BUILD/infinispan-8.2.4.Final/server/core/target/classes
[INFO] /usr/src/RPM/BUILD/infinispan-8.2.4.Final/server/core/src/main/scala/org/infinispan/server/core/configuration/ProtocolServerConfigurationBuilder.java: /usr/src/RPM/BUILD/infinispan-8.2.4.Final/server/core/src/main/scala/org/infinispan/server/core/configuration/ProtocolServerConfigurationBuilder.java uses unchecked or unsafe operations.
[INFO] /usr/src/RPM/BUILD/infinispan-8.2.4.Final/server/core/src/main/scala/org/infinispan/server/core/configuration/ProtocolServerConfigurationBuilder.java: Recompile with -Xlint:unchecked for details.
[INFO]
[INFO] --- exec-maven-plugin:1.6.0:java (serialize_component_metadata) @ infinispan-server-core ---
[ComponentMetadataPersister] Starting component metadata generation. Scanning classes in /usr/src/RPM/BUILD/infinispan-8.2.4.Final/server/core/target/classes
[ComponentMetadataPersister] Persisted metadata in /usr/src/RPM/BUILD/infinispan-8.2.4.Final/server/core/src/main/resources/infinispan-server-core-component-metadata.dat
[ComponentMetadataPersister] 2 components and 0 factories analyzed and persisted in 202 milliseconds.
[INFO]
[INFO] --- maven-resources-plugin:3.1.0:testResources (default-testResources) @ infinispan-server-core ---
[INFO] Not copying test resources
[INFO]
[INFO] --- maven-antrun-plugin:1.8:run (copy_serialized_metadata) @ infinispan-server-core ---
[INFO] Executing tasks
main:
[copy] Copying 1 file to /usr/src/RPM/BUILD/infinispan-8.2.4.Final/server/core/target/classes
[INFO] Executed tasks
[INFO]
[INFO] --- maven-compiler-plugin:3.8.0:testCompile (default-testCompile) @ infinispan-server-core ---
[INFO] Not compiling test sources
[INFO]
[INFO] --- exec-maven-plugin:1.6.0:java (serialize_test_component_metadata) @ infinispan-server-core ---
[INFO] skipping execute as per configuration
[INFO]
[INFO] --- maven-antrun-plugin:1.8:run (copy_serialized_test_metadata) @ infinispan-server-core ---
[INFO] Skipping Antrun execution
[INFO]
[INFO] --- maven-surefire-plugin:2.22.0:test (default-test) @ infinispan-server-core ---
[INFO] Tests are skipped.
[INFO]
[INFO] --- maven-bundle-plugin:3.5.1:bundle (default-bundle) @ infinispan-server-core ---
[INFO]
[INFO] --- maven-jar-plugin:3.1.0:test-jar (build-test-jar) @ infinispan-server-core ---
[INFO] Skipping packaging of the test-jar
[INFO]
[INFO] -------------< org.infinispan:infinispan-server-memcached >-------------
[INFO] Building Infinispan Memcached Server 8.2.4.Final [22/37]
[INFO] -------------------------------[ bundle ]-------------------------------
[INFO]
[INFO] --- maven-enforcer-plugin:1.4.1:enforce (enforce-java) @ infinispan-server-memcached ---
[INFO]
[INFO] --- maven-antrun-plugin:1.8:run (compile) @ infinispan-server-memcached ---
[WARNING] Parameter tasks is deprecated, use target instead
[INFO] Executing tasks
main:
[mkdir] Created dir: /usr/src/RPM/BUILD/infinispan-8.2.4.Final/server/memcached/target/classes
[scalac] Compiling 9 scala and 5 java source files to /usr/src/RPM/BUILD/infinispan-8.2.4.Final/server/memcached/target/classes
warning: there were 1 deprecation warning(s); re-run with -deprecation for details
one warning found
[scalac] Compile succeeded with 1 warning; see the compiler output for details.
[INFO] Executed tasks
[INFO]
[INFO] --- maven-resources-plugin:3.1.0:resources (default-resources) @ infinispan-server-memcached ---
[INFO] Using 'UTF-8' encoding to copy filtered resources.
[INFO] Copying 2 resources
[INFO]
[INFO] --- maven-compiler-plugin:3.8.0:compile (default-compile) @ infinispan-server-memcached ---
[INFO] Compiling 4 source files to /usr/src/RPM/BUILD/infinispan-8.2.4.Final/server/memcached/target/classes
[INFO]
[INFO] --- exec-maven-plugin:1.6.0:java (serialize_component_metadata) @ infinispan-server-memcached ---
[INFO] skipping execute as per configuration
[INFO]
[INFO] --- maven-resources-plugin:3.1.0:testResources (default-testResources) @ infinispan-server-memcached ---
[INFO] Not copying test resources
[INFO]
[INFO] --- maven-antrun-plugin:1.8:run (copy_serialized_metadata) @ infinispan-server-memcached ---
[INFO] Skipping Antrun execution
[INFO]
[INFO] --- maven-compiler-plugin:3.8.0:testCompile (default-testCompile) @ infinispan-server-memcached ---
[INFO] Not compiling test sources
[INFO]
[INFO] --- exec-maven-plugin:1.6.0:java (serialize_test_component_metadata) @ infinispan-server-memcached ---
[INFO] skipping execute as per configuration
[INFO]
[INFO] --- maven-antrun-plugin:1.8:run (copy_serialized_test_metadata) @ infinispan-server-memcached ---
[INFO] Skipping Antrun execution
[INFO]
[INFO] --- maven-surefire-plugin:2.22.0:test (default-test) @ infinispan-server-memcached ---
[INFO] Tests are skipped.
[INFO]
[INFO] --- maven-bundle-plugin:3.5.1:bundle (default-bundle) @ infinispan-server-memcached ---
[INFO]
[INFO] --- maven-jar-plugin:3.1.0:test-jar (build-test-jar) @ infinispan-server-memcached ---
[INFO] Skipping packaging of the test-jar
[INFO]
[INFO] -------------< org.infinispan:infinispan-server-websocket >-------------
[INFO] Building Infinispan WebSocket Server 8.2.4.Final [23/37]
[INFO] -------------------------------[ bundle ]-------------------------------
[INFO]
[INFO] --- maven-enforcer-plugin:1.4.1:enforce (enforce-java) @ infinispan-server-websocket ---
[INFO]
[INFO] --- maven-resources-plugin:3.1.0:resources (default-resources) @ infinispan-server-websocket ---
[INFO] Using 'UTF-8' encoding to copy filtered resources.
[INFO] Copying 1 resource
[INFO]
[INFO] --- maven-compiler-plugin:3.8.0:compile (default-compile) @ infinispan-server-websocket ---
[INFO] Compiling 14 source files to /usr/src/RPM/BUILD/infinispan-8.2.4.Final/server/websocket/target/classes
[INFO] /usr/src/RPM/BUILD/infinispan-8.2.4.Final/server/websocket/src/main/java/org/infinispan/server/websocket/WebSocketServerHandler.java: /usr/src/RPM/BUILD/infinispan-8.2.4.Final/server/websocket/src/main/java/org/infinispan/server/websocket/WebSocketServerHandler.java uses or overrides a deprecated API.
[INFO] /usr/src/RPM/BUILD/infinispan-8.2.4.Final/server/websocket/src/main/java/org/infinispan/server/websocket/WebSocketServerHandler.java: Recompile with -Xlint:deprecation for details.
[INFO]
[INFO] --- exec-maven-plugin:1.6.0:java (serialize_component_metadata) @ infinispan-server-websocket ---
[INFO] skipping execute as per configuration
[INFO]
[INFO] --- maven-resources-plugin:3.1.0:testResources (default-testResources) @ infinispan-server-websocket ---
[INFO] Not copying test resources
[INFO]
[INFO] --- maven-antrun-plugin:1.8:run (copy_serialized_metadata) @ infinispan-server-websocket ---
[INFO] Skipping Antrun execution
[INFO]
[INFO] --- maven-compiler-plugin:3.8.0:testCompile (default-testCompile) @ infinispan-server-websocket ---
[INFO] Not compiling test sources
[INFO]
[INFO] --- exec-maven-plugin:1.6.0:java (serialize_test_component_metadata) @ infinispan-server-websocket ---
[INFO] skipping execute as per configuration
[INFO]
[INFO] --- maven-antrun-plugin:1.8:run (copy_serialized_test_metadata) @ infinispan-server-websocket ---
[INFO] Skipping Antrun execution
[INFO]
[INFO] --- maven-surefire-plugin:2.22.0:test (default-test) @ infinispan-server-websocket ---
[INFO] Tests are skipped.
[INFO]
[INFO] --- maven-bundle-plugin:3.5.1:bundle (default-bundle) @ infinispan-server-websocket ---
[INFO]
[INFO] --- maven-jar-plugin:3.1.0:test-jar (build-test-jar) @ infinispan-server-websocket ---
[INFO] Skipping packaging of the test-jar
[INFO]
[INFO] --------------< org.infinispan:infinispan-atomic-factory >--------------
[INFO] Building Infinispan Atomic Factory 8.2.4.Final [24/37]
[INFO] --------------------------------[ jar ]---------------------------------
[INFO]
[INFO] --- maven-enforcer-plugin:1.4.1:enforce (enforce-java) @ infinispan-atomic-factory ---
[INFO]
[INFO] --- maven-resources-plugin:3.1.0:resources (default-resources) @ infinispan-atomic-factory ---
[INFO] Using 'UTF-8' encoding to copy filtered resources.
[INFO] skip non existing resourceDirectory /usr/src/RPM/BUILD/infinispan-8.2.4.Final/atomic-factory/src/main/resources
[INFO]
[INFO] --- maven-compiler-plugin:3.8.0:compile (default-compile) @ infinispan-atomic-factory ---
[INFO] Changes detected - recompiling the module!
[INFO] Compiling 12 source files to /usr/src/RPM/BUILD/infinispan-8.2.4.Final/atomic-factory/target/classes
[INFO] /usr/src/RPM/BUILD/infinispan-8.2.4.Final/atomic-factory/src/main/java/org/infinispan/atomic/sharded/collections/ShardedTreeMap.java: Some input files use unchecked or unsafe operations.
[INFO] /usr/src/RPM/BUILD/infinispan-8.2.4.Final/atomic-factory/src/main/java/org/infinispan/atomic/sharded/collections/ShardedTreeMap.java: Recompile with -Xlint:unchecked for details.
[INFO]
[INFO] --- exec-maven-plugin:1.6.0:java (serialize_component_metadata) @ infinispan-atomic-factory ---
[INFO] skipping execute as per configuration
[INFO]
[INFO] --- maven-resources-plugin:3.1.0:testResources (default-testResources) @ infinispan-atomic-factory ---
[INFO] Not copying test resources
[INFO]
[INFO] --- maven-antrun-plugin:1.8:run (copy_serialized_metadata) @ infinispan-atomic-factory ---
[INFO] Skipping Antrun execution
[INFO]
[INFO] --- maven-compiler-plugin:3.8.0:testCompile (default-testCompile) @ infinispan-atomic-factory ---
[INFO] Not compiling test sources
[INFO]
[INFO] --- exec-maven-plugin:1.6.0:java (serialize_test_component_metadata) @ infinispan-atomic-factory ---
[INFO] skipping execute as per configuration
[INFO]
[INFO] --- maven-antrun-plugin:1.8:run (copy_serialized_test_metadata) @ infinispan-atomic-factory ---
[INFO] Skipping Antrun execution
[INFO]
[INFO] --- maven-surefire-plugin:2.22.0:test (default-test) @ infinispan-atomic-factory ---
[INFO] Tests are skipped.
[INFO]
[INFO] --- maven-jar-plugin:3.1.0:jar (default-jar) @ infinispan-atomic-factory ---
[INFO] Building jar: /usr/src/RPM/BUILD/infinispan-8.2.4.Final/atomic-factory/target/infinispan-atomic-factory.jar
[INFO]
[INFO] --- maven-jar-plugin:3.1.0:test-jar (build-test-jar) @ infinispan-atomic-factory ---
[INFO] Skipping packaging of the test-jar
[INFO]
[INFO] -------------------< org.infinispan:infinispan-osgi >-------------------
[INFO] Building Infinispan OSGi Service 8.2.4.Final [25/37]
[INFO] -------------------------------[ bundle ]-------------------------------
[INFO]
[INFO] --- maven-enforcer-plugin:1.4.1:enforce (enforce-java) @ infinispan-osgi ---
[INFO]
[INFO] --- maven-resources-plugin:3.1.0:resources (default-resources) @ infinispan-osgi ---
[INFO] Using 'UTF-8' encoding to copy filtered resources.
[INFO] Copying 1 resource
[INFO] Copying 1 resource
[INFO]
[INFO] --- maven-compiler-plugin:3.8.0:compile (default-compile) @ infinispan-osgi ---
[INFO] Changes detected - recompiling the module!
[INFO] Compiling 1 source file to /usr/src/RPM/BUILD/infinispan-8.2.4.Final/osgi/target/classes
[INFO]
[INFO] --- exec-maven-plugin:1.6.0:java (serialize_component_metadata) @ infinispan-osgi ---
[INFO] skipping execute as per configuration
[INFO]
[INFO] --- maven-resources-plugin:3.1.0:testResources (default-testResources) @ infinispan-osgi ---
[INFO] Not copying test resources
[INFO]
[INFO] --- maven-antrun-plugin:1.8:run (copy_serialized_metadata) @ infinispan-osgi ---
[INFO] Skipping Antrun execution
[INFO]
[INFO] --- maven-compiler-plugin:3.8.0:testCompile (default-testCompile) @ infinispan-osgi ---
[INFO] Not compiling test sources
[INFO]
[INFO] --- exec-maven-plugin:1.6.0:java (serialize_test_component_metadata) @ infinispan-osgi ---
[INFO] skipping execute as per configuration
[INFO]
[INFO] --- maven-antrun-plugin:1.8:run (copy_serialized_test_metadata) @ infinispan-osgi ---
[INFO] Skipping Antrun execution
[INFO]
[INFO] --- maven-surefire-plugin:2.22.0:test (default-test) @ infinispan-osgi ---
[INFO] Tests are skipped.
[INFO]
[INFO] --- maven-bundle-plugin:3.5.1:bundle (default-bundle) @ infinispan-osgi ---
[INFO]
[INFO] --- maven-jar-plugin:3.1.0:test-jar (build-test-jar) @ infinispan-osgi ---
[INFO] Skipping packaging of the test-jar
[INFO]
[INFO] --- build-helper-maven-plugin:1.9.1:attach-artifact (attach-artifacts) @ infinispan-osgi ---
[INFO]
[INFO] ------------------< org.infinispan:infinispan-spring >------------------
[INFO] Building Infinispan Spring 3 Integration 8.2.4.Final [26/37]
[INFO] -------------------------------[ bundle ]-------------------------------
[INFO]
[INFO] --- maven-enforcer-plugin:1.4.1:enforce (enforce-java) @ infinispan-spring ---
[INFO]
[INFO] --- maven-resources-plugin:3.1.0:resources (default-resources) @ infinispan-spring ---
[INFO] Using 'UTF-8' encoding to copy filtered resources.
[INFO] Copying 1 resource
[INFO] Copying 2 resources
[INFO]
[INFO] --- maven-compiler-plugin:3.8.0:compile (default-compile) @ infinispan-spring ---
[INFO] Changes detected - recompiling the module!
[INFO] Compiling 21 source files to /usr/src/RPM/BUILD/infinispan-8.2.4.Final/spring/spring/target/classes
[INFO] /usr/src/RPM/BUILD/infinispan-8.2.4.Final/spring/spring/src/main/java/org/infinispan/spring/AbstractRemoteCacheManagerFactory.java: Some input files use or override a deprecated API.
[INFO] /usr/src/RPM/BUILD/infinispan-8.2.4.Final/spring/spring/src/main/java/org/infinispan/spring/AbstractRemoteCacheManagerFactory.java: Recompile with -Xlint:deprecation for details.
[INFO]
[INFO] --- exec-maven-plugin:1.6.0:java (serialize_component_metadata) @ infinispan-spring ---
[INFO] skipping execute as per configuration
[INFO]
[INFO] --- maven-resources-plugin:3.1.0:testResources (default-testResources) @ infinispan-spring ---
[INFO] Not copying test resources
[INFO]
[INFO] --- maven-antrun-plugin:1.8:run (copy_serialized_metadata) @ infinispan-spring ---
[INFO] Skipping Antrun execution
[INFO]
[INFO] --- maven-compiler-plugin:3.8.0:testCompile (default-testCompile) @ infinispan-spring ---
[INFO] Not compiling test sources
[INFO]
[INFO] --- exec-maven-plugin:1.6.0:java (serialize_test_component_metadata) @ infinispan-spring ---
[INFO] skipping execute as per configuration
[INFO]
[INFO] --- maven-antrun-plugin:1.8:run (copy_serialized_test_metadata) @ infinispan-spring ---
[INFO] Skipping Antrun execution
[INFO]
[INFO] --- maven-surefire-plugin:2.22.0:test (default-test) @ infinispan-spring ---
[INFO] Tests are skipped.
[INFO]
[INFO] --- maven-bundle-plugin:3.5.1:bundle (default-bundle) @ infinispan-spring ---
[INFO]
[INFO] --- maven-jar-plugin:3.1.0:test-jar (build-test-jar) @ infinispan-spring ---
[INFO] Skipping packaging of the test-jar
[INFO]
[INFO] -------------< org.infinispan:infinispan-cli-interpreter >--------------
[INFO] Building Infinispan CLI Interpreter 8.2.4.Final [27/37]
[INFO] -------------------------------[ bundle ]-------------------------------
[INFO]
[INFO] --- maven-enforcer-plugin:1.4.1:enforce (enforce-java) @ infinispan-cli-interpreter ---
[INFO]
[INFO] --- antlr3-maven-plugin:3.5.2:antlr (default) @ infinispan-cli-interpreter ---
[INFO] ANTLR: Processing source directory /usr/src/RPM/BUILD/infinispan-8.2.4.Final/cli/cli-interpreter/src/main/antlr3
ANTLR Parser Generator Version 3.5.2
Output file /usr/src/RPM/BUILD/infinispan-8.2.4.Final/cli/cli-interpreter/target/generated-sources/antlr3/org/infinispan/cli/interpreter/IspnCliQLParser.java does not exist: must build /usr/src/RPM/BUILD/infinispan-8.2.4.Final/cli/cli-interpreter/src/main/antlr3/org/infinispan/cli/interpreter/IspnCliQL.g
org/infinispan/cli/interpreter/IspnCliQL.g
[INFO]
[INFO] --- maven-resources-plugin:3.1.0:resources (default-resources) @ infinispan-cli-interpreter ---
[INFO] Using 'UTF-8' encoding to copy filtered resources.
[INFO] Copying 1 resource
[INFO]
[INFO] --- maven-compiler-plugin:3.8.0:compile (default-compile) @ infinispan-cli-interpreter ---
[INFO] Compiling 58 source files to /usr/src/RPM/BUILD/infinispan-8.2.4.Final/cli/cli-interpreter/target/classes
The system is out of resources.
Consult the following stack trace for details.
java.lang.StackOverflowError
at com.sun.tools.javac.parser.UnicodeReader.putChar(UnicodeReader.java:143)
at com.sun.tools.javac.parser.JavaTokenizer.scanOperator(JavaTokenizer.java:435)
at com.sun.tools.javac.parser.JavaTokenizer.readToken(JavaTokenizer.java:651)
at com.sun.tools.javac.parser.Scanner.ensureLookahead(Scanner.java:102)
at com.sun.tools.javac.parser.Scanner.token(Scanner.java:95)
at com.sun.tools.javac.parser.JavacParser.peekToken(JavacParser.java:310)
at com.sun.tools.javac.parser.JavacParser.peekToken(JavacParser.java:306)
at com.sun.tools.javac.parser.JavacParser.term3(JavacParser.java:1249)
at com.sun.tools.javac.parser.JavacParser.term2(JavacParser.java:909)
at com.sun.tools.javac.parser.JavacParser.term1(JavacParser.java:880)
at com.sun.tools.javac.parser.JavacParser.term(JavacParser.java:836)
at com.sun.tools.javac.parser.JavacParser.term(JavacParser.java:816)
at com.sun.tools.javac.parser.JavacParser.blockStatement(JavacParser.java:2431)
at com.sun.tools.javac.parser.JavacParser.blockStatements(JavacParser.java:2337)
at com.sun.tools.javac.parser.JavacParser.block(JavacParser.java:2308)
at com.sun.tools.javac.parser.JavacParser.block(JavacParser.java:2322)
at com.sun.tools.javac.parser.JavacParser.parseStatement(JavacParser.java:2480)
at com.sun.tools.javac.parser.JavacParser.blockStatement(JavacParser.java:2391)
at com.sun.tools.javac.parser.JavacParser.parseStatementAsBlock(JavacParser.java:2356)
at com.sun.tools.javac.parser.JavacParser.parseStatement(JavacParser.java:2484)
at com.sun.tools.javac.parser.JavacParser.blockStatement(JavacParser.java:2391)
at com.sun.tools.javac.parser.JavacParser.parseStatementAsBlock(JavacParser.java:2356)
at com.sun.tools.javac.parser.JavacParser.parseStatement(JavacParser.java:2488)
at com.sun.tools.javac.parser.JavacParser.blockStatement(JavacParser.java:2391)
at com.sun.tools.javac.parser.JavacParser.parseStatementAsBlock(JavacParser.java:2356)
at com.sun.tools.javac.parser.JavacParser.parseStatement(JavacParser.java:2488)
at com.sun.tools.javac.parser.JavacParser.blockStatement(JavacParser.java:2391)
at com.sun.tools.javac.parser.JavacParser.parseStatementAsBlock(JavacParser.java:2356)
at com.sun.tools.javac.parser.JavacParser.parseStatement(JavacParser.java:2488)
at com.sun.tools.javac.parser.JavacParser.blockStatement(JavacParser.java:2391)
at com.sun.tools.javac.parser.JavacParser.parseStatementAsBlock(JavacParser.java:2356)
at com.sun.tools.javac.parser.JavacParser.parseStatement(JavacParser.java:2488)
at com.sun.tools.javac.parser.JavacParser.blockStatement(JavacParser.java:2391)
at com.sun.tools.javac.parser.JavacParser.parseStatementAsBlock(JavacParser.java:2356)
at com.sun.tools.javac.parser.JavacParser.parseStatement(JavacParser.java:2488)
at com.sun.tools.javac.parser.JavacParser.blockStatement(JavacParser.java:2391)
at com.sun.tools.javac.parser.JavacParser.parseStatementAsBlock(JavacParser.java:2356)
at com.sun.tools.javac.parser.JavacParser.parseStatement(JavacParser.java:2488)
at com.sun.tools.javac.parser.JavacParser.blockStatement(JavacParser.java:2391)
at com.sun.tools.javac.parser.JavacParser.parseStatementAsBlock(JavacParser.java:2356)
at com.sun.tools.javac.parser.JavacParser.parseStatement(JavacParser.java:2488)
at com.sun.tools.javac.parser.JavacParser.blockStatement(JavacParser.java:2391)
at com.sun.tools.javac.parser.JavacParser.parseStatementAsBlock(JavacParser.java:2356)
at com.sun.tools.javac.parser.JavacParser.parseStatement(JavacParser.java:2488)
at com.sun.tools.javac.parser.JavacParser.blockStatement(JavacParser.java:2391)
at com.sun.tools.javac.parser.JavacParser.parseStatementAsBlock(JavacParser.java:2356)
at com.sun.tools.javac.parser.JavacParser.parseStatement(JavacParser.java:2488)
at com.sun.tools.javac.parser.JavacParser.blockStatement(JavacParser.java:2391)
at com.sun.tools.javac.parser.JavacParser.parseStatementAsBlock(JavacParser.java:2356)
at com.sun.tools.javac.parser.JavacParser.parseStatement(JavacParser.java:2488)
at com.sun.tools.javac.parser.JavacParser.blockStatement(JavacParser.java:2391)
at com.sun.tools.javac.parser.JavacParser.parseStatementAsBlock(JavacParser.java:2356)
at com.sun.tools.javac.parser.JavacParser.parseStatement(JavacParser.java:2488)
at com.sun.tools.javac.parser.JavacParser.blockStatement(JavacParser.java:2391)
at com.sun.tools.javac.parser.JavacParser.parseStatementAsBlock(JavacParser.java:2356)
at com.sun.tools.javac.parser.JavacParser.parseStatement(JavacParser.java:2488)
at com.sun.tools.javac.parser.JavacParser.blockStatement(JavacParser.java:2391)
at com.sun.tools.javac.parser.JavacParser.parseStatementAsBlock(JavacParser.java:2356)
at com.sun.tools.javac.parser.JavacParser.parseStatement(JavacParser.java:2488)
at com.sun.tools.javac.parser.JavacParser.blockStatement(JavacParser.java:2391)
at com.sun.tools.javac.parser.JavacParser.parseStatementAsBlock(JavacParser.java:2356)
at com.sun.tools.javac.parser.JavacParser.parseStatement(JavacParser.java:2488)
at com.sun.tools.javac.parser.JavacParser.blockStatement(JavacParser.java:2391)
at com.sun.tools.javac.parser.JavacParser.parseStatementAsBlock(JavacParser.java:2356)
at com.sun.tools.javac.parser.JavacParser.parseStatement(JavacParser.java:2488)
at com.sun.tools.javac.parser.JavacParser.blockStatement(JavacParser.java:2391)
at com.sun.tools.javac.parser.JavacParser.parseStatementAsBlock(JavacParser.java:2356)
at com.sun.tools.javac.parser.JavacParser.parseStatement(JavacParser.java:2488)
at com.sun.tools.javac.parser.JavacParser.blockStatement(JavacParser.java:2391)
at com.sun.tools.javac.parser.JavacParser.parseStatementAsBlock(JavacParser.java:2356)
at com.sun.tools.javac.parser.JavacParser.parseStatement(JavacParser.java:2488)
at com.sun.tools.javac.parser.JavacParser.blockStatement(JavacParser.java:2391)
at com.sun.tools.javac.parser.JavacParser.parseStatementAsBlock(JavacParser.java:2356)
at com.sun.tools.javac.parser.JavacParser.parseStatement(JavacParser.java:2488)
at com.sun.tools.javac.parser.JavacParser.blockStatement(JavacParser.java:2391)
at com.sun.tools.javac.parser.JavacParser.parseStatementAsBlock(JavacParser.java:2356)
at com.sun.tools.javac.parser.JavacParser.parseStatement(JavacParser.java:2488)
at com.sun.tools.javac.parser.JavacParser.blockStatement(JavacParser.java:2391)
at com.sun.tools.javac.parser.JavacParser.parseStatementAsBlock(JavacParser.java:2356)
at com.sun.tools.javac.parser.JavacParser.parseStatement(JavacParser.java:2488)
at com.sun.tools.javac.parser.JavacParser.blockStatement(JavacParser.java:2391)
at com.sun.tools.javac.parser.JavacParser.parseStatementAsBlock(JavacParser.java:2356)
at com.sun.tools.javac.parser.JavacParser.parseStatement(JavacParser.java:2488)
at com.sun.tools.javac.parser.JavacParser.blockStatement(JavacParser.java:2391)
at com.sun.tools.javac.parser.JavacParser.parseStatementAsBlock(JavacParser.java:2356)
at com.sun.tools.javac.parser.JavacParser.parseStatement(JavacParser.java:2488)
at com.sun.tools.javac.parser.JavacParser.blockStatement(JavacParser.java:2391)
at com.sun.tools.javac.parser.JavacParser.parseStatementAsBlock(JavacParser.java:2356)
at com.sun.tools.javac.parser.JavacParser.parseStatement(JavacParser.java:2488)
at com.sun.tools.javac.parser.JavacParser.blockStatement(JavacParser.java:2391)
at com.sun.tools.javac.parser.JavacParser.parseStatementAsBlock(JavacParser.java:2356)
at com.sun.tools.javac.parser.JavacParser.parseStatement(JavacParser.java:2488)
at com.sun.tools.javac.parser.JavacParser.blockStatement(JavacParser.java:2391)
at com.sun.tools.javac.parser.JavacParser.parseStatementAsBlock(JavacParser.java:2356)
at com.sun.tools.javac.parser.JavacParser.parseStatement(JavacParser.java:2488)
at com.sun.tools.javac.parser.JavacParser.blockStatement(JavacParser.java:2391)
at com.sun.tools.javac.parser.JavacParser.parseStatementAsBlock(JavacParser.java:2356)
at com.sun.tools.javac.parser.JavacParser.parseStatement(JavacParser.java:2488)
at com.sun.tools.javac.parser.JavacParser.blockStatement(JavacParser.java:2391)
at com.sun.tools.javac.parser.JavacParser.parseStatementAsBlock(JavacParser.java:2356)
at com.sun.tools.javac.parser.JavacParser.parseStatement(JavacParser.java:2488)
at com.sun.tools.javac.parser.JavacParser.blockStatement(JavacParser.java:2391)
at com.sun.tools.javac.parser.JavacParser.parseStatementAsBlock(JavacParser.java:2356)
at com.sun.tools.javac.parser.JavacParser.parseStatement(JavacParser.java:2488)
at com.sun.tools.javac.parser.JavacParser.blockStatement(JavacParser.java:2391)
at com.sun.tools.javac.parser.JavacParser.parseStatementAsBlock(JavacParser.java:2356)
at com.sun.tools.javac.parser.JavacParser.parseStatement(JavacParser.java:2488)
at com.sun.tools.javac.parser.JavacParser.blockStatement(JavacParser.java:2391)
at com.sun.tools.javac.parser.JavacParser.parseStatementAsBlock(JavacParser.java:2356)
at com.sun.tools.javac.parser.JavacParser.parseStatement(JavacParser.java:2488)
at com.sun.tools.javac.parser.JavacParser.blockStatement(JavacParser.java:2391)
at com.sun.tools.javac.parser.JavacParser.parseStatementAsBlock(JavacParser.java:2356)
at com.sun.tools.javac.parser.JavacParser.parseStatement(JavacParser.java:2488)
at com.sun.tools.javac.parser.JavacParser.blockStatement(JavacParser.java:2391)
at com.sun.tools.javac.parser.JavacParser.parseStatementAsBlock(JavacParser.java:2356)
at com.sun.tools.javac.parser.JavacParser.parseStatement(JavacParser.java:2488)
at com.sun.tools.javac.parser.JavacParser.blockStatement(JavacParser.java:2391)
at com.sun.tools.javac.parser.JavacParser.parseStatementAsBlock(JavacParser.java:2356)
at com.sun.tools.javac.parser.JavacParser.parseStatement(JavacParser.java:2488)
at com.sun.tools.javac.parser.JavacParser.blockStatement(JavacParser.java:2391)
at com.sun.tools.javac.parser.JavacParser.parseStatementAsBlock(JavacParser.java:2356)
at com.sun.tools.javac.parser.JavacParser.parseStatement(JavacParser.java:2488)
at com.sun.tools.javac.parser.JavacParser.blockStatement(JavacParser.java:2391)
at com.sun.tools.javac.parser.JavacParser.parseStatementAsBlock(JavacParser.java:2356)
at com.sun.tools.javac.parser.JavacParser.parseStatement(JavacParser.java:2488)
at com.sun.tools.javac.parser.JavacParser.blockStatement(JavacParser.java:2391)
at com.sun.tools.javac.parser.JavacParser.parseStatementAsBlock(JavacParser.java:2356)
at com.sun.tools.javac.parser.JavacParser.parseStatement(JavacParser.java:2488)
at com.sun.tools.javac.parser.JavacParser.blockStatement(JavacParser.java:2391)
at com.sun.tools.javac.parser.JavacParser.parseStatementAsBlock(JavacParser.java:2356)
at com.sun.tools.javac.parser.JavacParser.parseStatement(JavacParser.java:2488)
at com.sun.tools.javac.parser.JavacParser.blockStatement(JavacParser.java:2391)
at com.sun.tools.javac.parser.JavacParser.parseStatementAsBlock(JavacParser.java:2356)
at com.sun.tools.javac.parser.JavacParser.parseStatement(JavacParser.java:2488)
at com.sun.tools.javac.parser.JavacParser.blockStatement(JavacParser.java:2391)
at com.sun.tools.javac.parser.JavacParser.parseStatementAsBlock(JavacParser.java:2356)
at com.sun.tools.javac.parser.JavacParser.parseStatement(JavacParser.java:2488)
at com.sun.tools.javac.parser.JavacParser.blockStatement(JavacParser.java:2391)
at com.sun.tools.javac.parser.JavacParser.parseStatementAsBlock(JavacParser.java:2356)
at com.sun.tools.javac.parser.JavacParser.parseStatement(JavacParser.java:2488)
at com.sun.tools.javac.parser.JavacParser.blockStatement(JavacParser.java:2391)
at com.sun.tools.javac.parser.JavacParser.parseStatementAsBlock(JavacParser.java:2356)
at com.sun.tools.javac.parser.JavacParser.parseStatement(JavacParser.java:2488)
at com.sun.tools.javac.parser.JavacParser.blockStatement(JavacParser.java:2391)
at com.sun.tools.javac.parser.JavacParser.parseStatementAsBlock(JavacParser.java:2356)
at com.sun.tools.javac.parser.JavacParser.parseStatement(JavacParser.java:2488)
at com.sun.tools.javac.parser.JavacParser.blockStatement(JavacParser.java:2391)
at com.sun.tools.javac.parser.JavacParser.parseStatementAsBlock(JavacParser.java:2356)
at com.sun.tools.javac.parser.JavacParser.parseStatement(JavacParser.java:2488)
at com.sun.tools.javac.parser.JavacParser.blockStatement(JavacParser.java:2391)
at com.sun.tools.javac.parser.JavacParser.parseStatementAsBlock(JavacParser.java:2356)
at com.sun.tools.javac.parser.JavacParser.parseStatement(JavacParser.java:2488)
at com.sun.tools.javac.parser.JavacParser.blockStatement(JavacParser.java:2391)
at com.sun.tools.javac.parser.JavacParser.parseStatementAsBlock(JavacParser.java:2356)
at com.sun.tools.javac.parser.JavacParser.parseStatement(JavacParser.java:2488)
at com.sun.tools.javac.parser.JavacParser.blockStatement(JavacParser.java:2391)
at com.sun.tools.javac.parser.JavacParser.parseStatementAsBlock(JavacParser.java:2356)
at com.sun.tools.javac.parser.JavacParser.parseStatement(JavacParser.java:2488)
at com.sun.tools.javac.parser.JavacParser.blockStatement(JavacParser.java:2391)
at com.sun.tools.javac.parser.JavacParser.parseStatementAsBlock(JavacParser.java:2356)
at com.sun.tools.javac.parser.JavacParser.parseStatement(JavacParser.java:2488)
at com.sun.tools.javac.parser.JavacParser.blockStatement(JavacParser.java:2391)
at com.sun.tools.javac.parser.JavacParser.parseStatementAsBlock(JavacParser.java:2356)
at com.sun.tools.javac.parser.JavacParser.parseStatement(JavacParser.java:2488)
at com.sun.tools.javac.parser.JavacParser.blockStatement(JavacParser.java:2391)
at com.sun.tools.javac.parser.JavacParser.parseStatementAsBlock(JavacParser.java:2356)
at com.sun.tools.javac.parser.JavacParser.parseStatement(JavacParser.java:2488)
at com.sun.tools.javac.parser.JavacParser.blockStatement(JavacParser.java:2391)
at com.sun.tools.javac.parser.JavacParser.parseStatementAsBlock(JavacParser.java:2356)
at com.sun.tools.javac.parser.JavacParser.parseStatement(JavacParser.java:2488)
at com.sun.tools.javac.parser.JavacParser.blockStatement(JavacParser.java:2391)
at com.sun.tools.javac.parser.JavacParser.parseStatementAsBlock(JavacParser.java:2356)
at com.sun.tools.javac.parser.JavacParser.parseStatement(JavacParser.java:2488)
at com.sun.tools.javac.parser.JavacParser.blockStatement(JavacParser.java:2391)
at com.sun.tools.javac.parser.JavacParser.parseStatementAsBlock(JavacParser.java:2356)
at com.sun.tools.javac.parser.JavacParser.parseStatement(JavacParser.java:2488)
at com.sun.tools.javac.parser.JavacParser.blockStatement(JavacParser.java:2391)
at com.sun.tools.javac.parser.JavacParser.parseStatementAsBlock(JavacParser.java:2356)
at com.sun.tools.javac.parser.JavacParser.parseStatement(JavacParser.java:2488)
at com.sun.tools.javac.parser.JavacParser.blockStatement(JavacParser.java:2391)
at com.sun.tools.javac.parser.JavacParser.parseStatementAsBlock(JavacParser.java:2356)
at com.sun.tools.javac.parser.JavacParser.parseStatement(JavacParser.java:2488)
at com.sun.tools.javac.parser.JavacParser.blockStatement(JavacParser.java:2391)
at com.sun.tools.javac.parser.JavacParser.parseStatementAsBlock(JavacParser.java:2356)
at com.sun.tools.javac.parser.JavacParser.parseStatement(JavacParser.java:2488)
at com.sun.tools.javac.parser.JavacParser.blockStatement(JavacParser.java:2391)
at com.sun.tools.javac.parser.JavacParser.parseStatementAsBlock(JavacParser.java:2356)
at com.sun.tools.javac.parser.JavacParser.parseStatement(JavacParser.java:2488)
at com.sun.tools.javac.parser.JavacParser.blockStatement(JavacParser.java:2391)
at com.sun.tools.javac.parser.JavacParser.parseStatementAsBlock(JavacParser.java:2356)
at com.sun.tools.javac.parser.JavacParser.parseStatement(JavacParser.java:2488)
at com.sun.tools.javac.parser.JavacParser.blockStatement(JavacParser.java:2391)
at com.sun.tools.javac.parser.JavacParser.parseStatementAsBlock(JavacParser.java:2356)
at com.sun.tools.javac.parser.JavacParser.parseStatement(JavacParser.java:2488)
at com.sun.tools.javac.parser.JavacParser.blockStatement(JavacParser.java:2391)
at com.sun.tools.javac.parser.JavacParser.parseStatementAsBlock(JavacParser.java:2356)
at com.sun.tools.javac.parser.JavacParser.parseStatement(JavacParser.java:2488)
at com.sun.tools.javac.parser.JavacParser.blockStatement(JavacParser.java:2391)
at com.sun.tools.javac.parser.JavacParser.parseStatementAsBlock(JavacParser.java:2356)
at com.sun.tools.javac.parser.JavacParser.parseStatement(JavacParser.java:2488)
at com.sun.tools.javac.parser.JavacParser.blockStatement(JavacParser.java:2391)
at com.sun.tools.javac.parser.JavacParser.parseStatementAsBlock(JavacParser.java:2356)
at com.sun.tools.javac.parser.JavacParser.parseStatement(JavacParser.java:2488)
at com.sun.tools.javac.parser.JavacParser.blockStatement(JavacParser.java:2391)
at com.sun.tools.javac.parser.JavacParser.parseStatementAsBlock(JavacParser.java:2356)
at com.sun.tools.javac.parser.JavacParser.parseStatement(JavacParser.java:2488)
at com.sun.tools.javac.parser.JavacParser.blockStatement(JavacParser.java:2391)
at com.sun.tools.javac.parser.JavacParser.parseStatementAsBlock(JavacParser.java:2356)
at com.sun.tools.javac.parser.JavacParser.parseStatement(JavacParser.java:2488)
at com.sun.tools.javac.parser.JavacParser.blockStatement(JavacParser.java:2391)
at com.sun.tools.javac.parser.JavacParser.parseStatementAsBlock(JavacParser.java:2356)
at com.sun.tools.javac.parser.JavacParser.parseStatement(JavacParser.java:2488)
at com.sun.tools.javac.parser.JavacParser.blockStatement(JavacParser.java:2391)
at com.sun.tools.javac.parser.JavacParser.parseStatementAsBlock(JavacParser.java:2356)
at com.sun.tools.javac.parser.JavacParser.parseStatement(JavacParser.java:2488)
at com.sun.tools.javac.parser.JavacParser.blockStatement(JavacParser.java:2391)
at com.sun.tools.javac.parser.JavacParser.parseStatementAsBlock(JavacParser.java:2356)
at com.sun.tools.javac.parser.JavacParser.parseStatement(JavacParser.java:2488)
at com.sun.tools.javac.parser.JavacParser.blockStatement(JavacParser.java:2391)
at com.sun.tools.javac.parser.JavacParser.parseStatementAsBlock(JavacParser.java:2356)
at com.sun.tools.javac.parser.JavacParser.parseStatement(JavacParser.java:2488)
at com.sun.tools.javac.parser.JavacParser.blockStatement(JavacParser.java:2391)
at com.sun.tools.javac.parser.JavacParser.parseStatementAsBlock(JavacParser.java:2356)
at com.sun.tools.javac.parser.JavacParser.parseStatement(JavacParser.java:2488)
at com.sun.tools.javac.parser.JavacParser.blockStatement(JavacParser.java:2391)
at com.sun.tools.javac.parser.JavacParser.parseStatementAsBlock(JavacParser.java:2356)
at com.sun.tools.javac.parser.JavacParser.parseStatement(JavacParser.java:2488)
at com.sun.tools.javac.parser.JavacParser.blockStatement(JavacParser.java:2391)
at com.sun.tools.javac.parser.JavacParser.parseStatementAsBlock(JavacParser.java:2356)
at com.sun.tools.javac.parser.JavacParser.parseStatement(JavacParser.java:2488)
at com.sun.tools.javac.parser.JavacParser.blockStatement(JavacParser.java:2391)
at com.sun.tools.javac.parser.JavacParser.parseStatementAsBlock(JavacParser.java:2356)
at com.sun.tools.javac.parser.JavacParser.parseStatement(JavacParser.java:2488)
at com.sun.tools.javac.parser.JavacParser.blockStatement(JavacParser.java:2391)
at com.sun.tools.javac.parser.JavacParser.parseStatementAsBlock(JavacParser.java:2356)
at com.sun.tools.javac.parser.JavacParser.parseStatement(JavacParser.java:2488)
at com.sun.tools.javac.parser.JavacParser.blockStatement(JavacParser.java:2391)
at com.sun.tools.javac.parser.JavacParser.parseStatementAsBlock(JavacParser.java:2356)
at com.sun.tools.javac.parser.JavacParser.parseStatement(JavacParser.java:2488)
at com.sun.tools.javac.parser.JavacParser.blockStatement(JavacParser.java:2391)
at com.sun.tools.javac.parser.JavacParser.parseStatementAsBlock(JavacParser.java:2356)
at com.sun.tools.javac.parser.JavacParser.parseStatement(JavacParser.java:2488)
at com.sun.tools.javac.parser.JavacParser.blockStatement(JavacParser.java:2391)
at com.sun.tools.javac.parser.JavacParser.parseStatementAsBlock(JavacParser.java:2356)
at com.sun.tools.javac.parser.JavacParser.parseStatement(JavacParser.java:2488)
at com.sun.tools.javac.parser.JavacParser.blockStatement(JavacParser.java:2391)
at com.sun.tools.javac.parser.JavacParser.parseStatementAsBlock(JavacParser.java:2356)
at com.sun.tools.javac.parser.JavacParser.parseStatement(JavacParser.java:2488)
at com.sun.tools.javac.parser.JavacParser.blockStatement(JavacParser.java:2391)
at com.sun.tools.javac.parser.JavacParser.parseStatementAsBlock(JavacParser.java:2356)
at com.sun.tools.javac.parser.JavacParser.parseStatement(JavacParser.java:2488)
at com.sun.tools.javac.parser.JavacParser.blockStatement(JavacParser.java:2391)
at com.sun.tools.javac.parser.JavacParser.parseStatementAsBlock(JavacParser.java:2356)
at com.sun.tools.javac.parser.JavacParser.parseStatement(JavacParser.java:2488)
at com.sun.tools.javac.parser.JavacParser.blockStatement(JavacParser.java:2391)
at com.sun.tools.javac.parser.JavacParser.parseStatementAsBlock(JavacParser.java:2356)
at com.sun.tools.javac.parser.JavacParser.parseStatement(JavacParser.java:2488)
at com.sun.tools.javac.parser.JavacParser.blockStatement(JavacParser.java:2391)
at com.sun.tools.javac.parser.JavacParser.parseStatementAsBlock(JavacParser.java:2356)
at com.sun.tools.javac.parser.JavacParser.parseStatement(JavacParser.java:2488)
at com.sun.tools.javac.parser.JavacParser.blockStatement(JavacParser.java:2391)
at com.sun.tools.javac.parser.JavacParser.parseStatementAsBlock(JavacParser.java:2356)
at com.sun.tools.javac.parser.JavacParser.parseStatement(JavacParser.java:2488)
at com.sun.tools.javac.parser.JavacParser.blockStatement(JavacParser.java:2391)
at com.sun.tools.javac.parser.JavacParser.parseStatementAsBlock(JavacParser.java:2356)
at com.sun.tools.javac.parser.JavacParser.parseStatement(JavacParser.java:2488)
at com.sun.tools.javac.parser.JavacParser.blockStatement(JavacParser.java:2391)
at com.sun.tools.javac.parser.JavacParser.parseStatementAsBlock(JavacParser.java:2356)
at com.sun.tools.javac.parser.JavacParser.parseStatement(JavacParser.java:2488)
at com.sun.tools.javac.parser.JavacParser.blockStatement(JavacParser.java:2391)
at com.sun.tools.javac.parser.JavacParser.parseStatementAsBlock(JavacParser.java:2356)
at com.sun.tools.javac.parser.JavacParser.parseStatement(JavacParser.java:2488)
at com.sun.tools.javac.parser.JavacParser.blockStatement(JavacParser.java:2391)
at com.sun.tools.javac.parser.JavacParser.parseStatementAsBlock(JavacParser.java:2356)
at com.sun.tools.javac.parser.JavacParser.parseStatement(JavacParser.java:2488)
at com.sun.tools.javac.parser.JavacParser.blockStatement(JavacParser.java:2391)
at com.sun.tools.javac.parser.JavacParser.parseStatementAsBlock(JavacParser.java:2356)
at com.sun.tools.javac.parser.JavacParser.parseStatement(JavacParser.java:2488)
at com.sun.tools.javac.parser.JavacParser.blockStatement(JavacParser.java:2391)
at com.sun.tools.javac.parser.JavacParser.parseStatementAsBlock(JavacParser.java:2356)
at com.sun.tools.javac.parser.JavacParser.parseStatement(JavacParser.java:2488)
at com.sun.tools.javac.parser.JavacParser.blockStatement(JavacParser.java:2391)
at com.sun.tools.javac.parser.JavacParser.parseStatementAsBlock(JavacParser.java:2356)
at com.sun.tools.javac.parser.JavacParser.parseStatement(JavacParser.java:2488)
at com.sun.tools.javac.parser.JavacParser.blockStatement(JavacParser.java:2391)
at com.sun.tools.javac.parser.JavacParser.parseStatementAsBlock(JavacParser.java:2356)
at com.sun.tools.javac.parser.JavacParser.parseStatement(JavacParser.java:2488)
at com.sun.tools.javac.parser.JavacParser.blockStatement(JavacParser.java:2391)
at com.sun.tools.javac.parser.JavacParser.parseStatementAsBlock(JavacParser.java:2356)
at com.sun.tools.javac.parser.JavacParser.parseStatement(JavacParser.java:2488)
at com.sun.tools.javac.parser.JavacParser.blockStatement(JavacParser.java:2391)
at com.sun.tools.javac.parser.JavacParser.parseStatementAsBlock(JavacParser.java:2356)
at com.sun.tools.javac.parser.JavacParser.parseStatement(JavacParser.java:2488)
at com.sun.tools.javac.parser.JavacParser.blockStatement(JavacParser.java:2391)
at com.sun.tools.javac.parser.JavacParser.parseStatementAsBlock(JavacParser.java:2356)
at com.sun.tools.javac.parser.JavacParser.parseStatement(JavacParser.java:2488)
at com.sun.tools.javac.parser.JavacParser.blockStatement(JavacParser.java:2391)
at com.sun.tools.javac.parser.JavacParser.parseStatementAsBlock(JavacParser.java:2356)
at com.sun.tools.javac.parser.JavacParser.parseStatement(JavacParser.java:2488)
at com.sun.tools.javac.parser.JavacParser.blockStatement(JavacParser.java:2391)
at com.sun.tools.javac.parser.JavacParser.parseStatementAsBlock(JavacParser.java:2356)
at com.sun.tools.javac.parser.JavacParser.parseStatement(JavacParser.java:2488)
at com.sun.tools.javac.parser.JavacParser.blockStatement(JavacParser.java:2391)
at com.sun.tools.javac.parser.JavacParser.parseStatementAsBlock(JavacParser.java:2356)
at com.sun.tools.javac.parser.JavacParser.parseStatement(JavacParser.java:2488)
at com.sun.tools.javac.parser.JavacParser.blockStatement(JavacParser.java:2391)
at com.sun.tools.javac.parser.JavacParser.parseStatementAsBlock(JavacParser.java:2356)
at com.sun.tools.javac.parser.JavacParser.parseStatement(JavacParser.java:2488)
at com.sun.tools.javac.parser.JavacParser.blockStatement(JavacParser.java:2391)
at com.sun.tools.javac.parser.JavacParser.parseStatementAsBlock(JavacParser.java:2356)
at com.sun.tools.javac.parser.JavacParser.parseStatement(JavacParser.java:2488)
at com.sun.tools.javac.parser.JavacParser.blockStatement(JavacParser.java:2391)
at com.sun.tools.javac.parser.JavacParser.parseStatementAsBlock(JavacParser.java:2356)
at com.sun.tools.javac.parser.JavacParser.parseStatement(JavacParser.java:2488)
at com.sun.tools.javac.parser.JavacParser.blockStatement(JavacParser.java:2391)
at com.sun.tools.javac.parser.JavacParser.parseStatementAsBlock(JavacParser.java:2356)
at com.sun.tools.javac.parser.JavacParser.parseStatement(JavacParser.java:2488)
at com.sun.tools.javac.parser.JavacParser.blockStatement(JavacParser.java:2391)
at com.sun.tools.javac.parser.JavacParser.parseStatementAsBlock(JavacParser.java:2356)
at com.sun.tools.javac.parser.JavacParser.parseStatement(JavacParser.java:2488)
at com.sun.tools.javac.parser.JavacParser.blockStatement(JavacParser.java:2391)
at com.sun.tools.javac.parser.JavacParser.parseStatementAsBlock(JavacParser.java:2356)
at com.sun.tools.javac.parser.JavacParser.parseStatement(JavacParser.java:2488)
at com.sun.tools.javac.parser.JavacParser.blockStatement(JavacParser.java:2391)
at com.sun.tools.javac.parser.JavacParser.parseStatementAsBlock(JavacParser.java:2356)
at com.sun.tools.javac.parser.JavacParser.parseStatement(JavacParser.java:2488)
at com.sun.tools.javac.parser.JavacParser.blockStatement(JavacParser.java:2391)
at com.sun.tools.javac.parser.JavacParser.parseStatementAsBlock(JavacParser.java:2356)
at com.sun.tools.javac.parser.JavacParser.parseStatement(JavacParser.java:2488)
at com.sun.tools.javac.parser.JavacParser.blockStatement(JavacParser.java:2391)
at com.sun.tools.javac.parser.JavacParser.parseStatementAsBlock(JavacParser.java:2356)
at com.sun.tools.javac.parser.JavacParser.parseStatement(JavacParser.java:2488)
at com.sun.tools.javac.parser.JavacParser.blockStatement(JavacParser.java:2391)
at com.sun.tools.javac.parser.JavacParser.parseStatementAsBlock(JavacParser.java:2356)
at com.sun.tools.javac.parser.JavacParser.parseStatement(JavacParser.java:2488)
at com.sun.tools.javac.parser.JavacParser.blockStatement(JavacParser.java:2391)
at com.sun.tools.javac.parser.JavacParser.parseStatementAsBlock(JavacParser.java:2356)
at com.sun.tools.javac.parser.JavacParser.parseStatement(JavacParser.java:2488)
at com.sun.tools.javac.parser.JavacParser.blockStatement(JavacParser.java:2391)
at com.sun.tools.javac.parser.JavacParser.parseStatementAsBlock(JavacParser.java:2356)
at com.sun.tools.javac.parser.JavacParser.parseStatement(JavacParser.java:2488)
at com.sun.tools.javac.parser.JavacParser.blockStatement(JavacParser.java:2391)
at com.sun.tools.javac.parser.JavacParser.parseStatementAsBlock(JavacParser.java:2356)
at com.sun.tools.javac.parser.JavacParser.parseStatement(JavacParser.java:2488)
at com.sun.tools.javac.parser.JavacParser.blockStatement(JavacParser.java:2391)
at com.sun.tools.javac.parser.JavacParser.parseStatementAsBlock(JavacParser.java:2356)
at com.sun.tools.javac.parser.JavacParser.parseStatement(JavacParser.java:2488)
at com.sun.tools.javac.parser.JavacParser.blockStatement(JavacParser.java:2391)
at com.sun.tools.javac.parser.JavacParser.parseStatementAsBlock(JavacParser.java:2356)
at com.sun.tools.javac.parser.JavacParser.parseStatement(JavacParser.java:2488)
at com.sun.tools.javac.parser.JavacParser.blockStatement(JavacParser.java:2391)
at com.sun.tools.javac.parser.JavacParser.parseStatementAsBlock(JavacParser.java:2356)
at com.sun.tools.javac.parser.JavacParser.parseStatement(JavacParser.java:2488)
at com.sun.tools.javac.parser.JavacParser.blockStatement(JavacParser.java:2391)
at com.sun.tools.javac.parser.JavacParser.parseStatementAsBlock(JavacParser.java:2356)
at com.sun.tools.javac.parser.JavacParser.parseStatement(JavacParser.java:2488)
at com.sun.tools.javac.parser.JavacParser.blockStatement(JavacParser.java:2391)
at com.sun.tools.javac.parser.JavacParser.parseStatementAsBlock(JavacParser.java:2356)
at com.sun.tools.javac.parser.JavacParser.parseStatement(JavacParser.java:2488)
at com.sun.tools.javac.parser.JavacParser.blockStatement(JavacParser.java:2391)
at com.sun.tools.javac.parser.JavacParser.parseStatementAsBlock(JavacParser.java:2356)
at com.sun.tools.javac.parser.JavacParser.parseStatement(JavacParser.java:2488)
at com.sun.tools.javac.parser.JavacParser.blockStatement(JavacParser.java:2391)
at com.sun.tools.javac.parser.JavacParser.parseStatementAsBlock(JavacParser.java:2356)
at com.sun.tools.javac.parser.JavacParser.parseStatement(JavacParser.java:2488)
at com.sun.tools.javac.parser.JavacParser.blockStatement(JavacParser.java:2391)
at com.sun.tools.javac.parser.JavacParser.parseStatementAsBlock(JavacParser.java:2356)
at com.sun.tools.javac.parser.JavacParser.parseStatement(JavacParser.java:2488)
at com.sun.tools.javac.parser.JavacParser.blockStatement(JavacParser.java:2391)
at com.sun.tools.javac.parser.JavacParser.parseStatementAsBlock(JavacParser.java:2356)
at com.sun.tools.javac.parser.JavacParser.parseStatement(JavacParser.java:2488)
at com.sun.tools.javac.parser.JavacParser.blockStatement(JavacParser.java:2391)
at com.sun.tools.javac.parser.JavacParser.parseStatementAsBlock(JavacParser.java:2356)
at com.sun.tools.javac.parser.JavacParser.parseStatement(JavacParser.java:2488)
at com.sun.tools.javac.parser.JavacParser.blockStatement(JavacParser.java:2391)
at com.sun.tools.javac.parser.JavacParser.parseStatementAsBlock(JavacParser.java:2356)
at com.sun.tools.javac.parser.JavacParser.parseStatement(JavacParser.java:2488)
at com.sun.tools.javac.parser.JavacParser.blockStatement(JavacParser.java:2391)
at com.sun.tools.javac.parser.JavacParser.parseStatementAsBlock(JavacParser.java:2356)
at com.sun.tools.javac.parser.JavacParser.parseStatement(JavacParser.java:2488)
at com.sun.tools.javac.parser.JavacParser.blockStatement(JavacParser.java:2391)
at com.sun.tools.javac.parser.JavacParser.parseStatementAsBlock(JavacParser.java:2356)
at com.sun.tools.javac.parser.JavacParser.parseStatement(JavacParser.java:2488)
at com.sun.tools.javac.parser.JavacParser.blockStatement(JavacParser.java:2391)
at com.sun.tools.javac.parser.JavacParser.parseStatementAsBlock(JavacParser.java:2356)
at com.sun.tools.javac.parser.JavacParser.parseStatement(JavacParser.java:2488)
at com.sun.tools.javac.parser.JavacParser.blockStatement(JavacParser.java:2391)
at com.sun.tools.javac.parser.JavacParser.parseStatementAsBlock(JavacParser.java:2356)
at com.sun.tools.javac.parser.JavacParser.parseStatement(JavacParser.java:2488)
at com.sun.tools.javac.parser.JavacParser.blockStatement(JavacParser.java:2391)
at com.sun.tools.javac.parser.JavacParser.parseStatementAsBlock(JavacParser.java:2356)
at com.sun.tools.javac.parser.JavacParser.parseStatement(JavacParser.java:2488)
at com.sun.tools.javac.parser.JavacParser.blockStatement(JavacParser.java:2391)
at com.sun.tools.javac.parser.JavacParser.parseStatementAsBlock(JavacParser.java:2356)
at com.sun.tools.javac.parser.JavacParser.parseStatement(JavacParser.java:2488)
at com.sun.tools.javac.parser.JavacParser.blockStatement(JavacParser.java:2391)
at com.sun.tools.javac.parser.JavacParser.parseStatementAsBlock(JavacParser.java:2356)
at com.sun.tools.javac.parser.JavacParser.parseStatement(JavacParser.java:2488)
at com.sun.tools.javac.parser.JavacParser.blockStatement(JavacParser.java:2391)
at com.sun.tools.javac.parser.JavacParser.parseStatementAsBlock(JavacParser.java:2356)
at com.sun.tools.javac.parser.JavacParser.parseStatement(JavacParser.java:2488)
at com.sun.tools.javac.parser.JavacParser.blockStatement(JavacParser.java:2391)
at com.sun.tools.javac.parser.JavacParser.parseStatementAsBlock(JavacParser.java:2356)
at com.sun.tools.javac.parser.JavacParser.parseStatement(JavacParser.java:2488)
at com.sun.tools.javac.parser.JavacParser.blockStatement(JavacParser.java:2391)
at com.sun.tools.javac.parser.JavacParser.parseStatementAsBlock(JavacParser.java:2356)
at com.sun.tools.javac.parser.JavacParser.parseStatement(JavacParser.java:2488)
at com.sun.tools.javac.parser.JavacParser.blockStatement(JavacParser.java:2391)
at com.sun.tools.javac.parser.JavacParser.parseStatementAsBlock(JavacParser.java:2356)
at com.sun.tools.javac.parser.JavacParser.parseStatement(JavacParser.java:2488)
at com.sun.tools.javac.parser.JavacParser.blockStatement(JavacParser.java:2391)
at com.sun.tools.javac.parser.JavacParser.parseStatementAsBlock(JavacParser.java:2356)
at com.sun.tools.javac.parser.JavacParser.parseStatement(JavacParser.java:2488)
at com.sun.tools.javac.parser.JavacParser.blockStatement(JavacParser.java:2391)
at com.sun.tools.javac.parser.JavacParser.parseStatementAsBlock(JavacParser.java:2356)
at com.sun.tools.javac.parser.JavacParser.parseStatement(JavacParser.java:2488)
at com.sun.tools.javac.parser.JavacParser.blockStatement(JavacParser.java:2391)
at com.sun.tools.javac.parser.JavacParser.parseStatementAsBlock(JavacParser.java:2356)
at com.sun.tools.javac.parser.JavacParser.parseStatement(JavacParser.java:2488)
at com.sun.tools.javac.parser.JavacParser.blockStatement(JavacParser.java:2391)
at com.sun.tools.javac.parser.JavacParser.parseStatementAsBlock(JavacParser.java:2356)
at com.sun.tools.javac.parser.JavacParser.parseStatement(JavacParser.java:2488)
at com.sun.tools.javac.parser.JavacParser.blockStatement(JavacParser.java:2391)
at com.sun.tools.javac.parser.JavacParser.parseStatementAsBlock(JavacParser.java:2356)
at com.sun.tools.javac.parser.JavacParser.parseStatement(JavacParser.java:2488)
at com.sun.tools.javac.parser.JavacParser.blockStatement(JavacParser.java:2391)
at com.sun.tools.javac.parser.JavacParser.parseStatementAsBlock(JavacParser.java:2356)
at com.sun.tools.javac.parser.JavacParser.parseStatement(JavacParser.java:2488)
at com.sun.tools.javac.parser.JavacParser.blockStatement(JavacParser.java:2391)
at com.sun.tools.javac.parser.JavacParser.parseStatementAsBlock(JavacParser.java:2356)
at com.sun.tools.javac.parser.JavacParser.parseStatement(JavacParser.java:2488)
at com.sun.tools.javac.parser.JavacParser.blockStatement(JavacParser.java:2391)
at com.sun.tools.javac.parser.JavacParser.parseStatementAsBlock(JavacParser.java:2356)
at com.sun.tools.javac.parser.JavacParser.parseStatement(JavacParser.java:2488)
at com.sun.tools.javac.parser.JavacParser.blockStatement(JavacParser.java:2391)
at com.sun.tools.javac.parser.JavacParser.parseStatementAsBlock(JavacParser.java:2356)
at com.sun.tools.javac.parser.JavacParser.parseStatement(JavacParser.java:2488)
at com.sun.tools.javac.parser.JavacParser.blockStatement(JavacParser.java:2391)
at com.sun.tools.javac.parser.JavacParser.parseStatementAsBlock(JavacParser.java:2356)
at com.sun.tools.javac.parser.JavacParser.parseStatement(JavacParser.java:2488)
at com.sun.tools.javac.parser.JavacParser.blockStatement(JavacParser.java:2391)
at com.sun.tools.javac.parser.JavacParser.parseStatementAsBlock(JavacParser.java:2356)
at com.sun.tools.javac.parser.JavacParser.parseStatement(JavacParser.java:2488)
at com.sun.tools.javac.parser.JavacParser.blockStatement(JavacParser.java:2391)
at com.sun.tools.javac.parser.JavacParser.parseStatementAsBlock(JavacParser.java:2356)
at com.sun.tools.javac.parser.JavacParser.parseStatement(JavacParser.java:2488)
at com.sun.tools.javac.parser.JavacParser.blockStatement(JavacParser.java:2391)
at com.sun.tools.javac.parser.JavacParser.parseStatementAsBlock(JavacParser.java:2356)
at com.sun.tools.javac.parser.JavacParser.parseStatement(JavacParser.java:2488)
at com.sun.tools.javac.parser.JavacParser.blockStatement(JavacParser.java:2391)
at com.sun.tools.javac.parser.JavacParser.parseStatementAsBlock(JavacParser.java:2356)
at com.sun.tools.javac.parser.JavacParser.parseStatement(JavacParser.java:2488)
at com.sun.tools.javac.parser.JavacParser.blockStatement(JavacParser.java:2391)
at com.sun.tools.javac.parser.JavacParser.parseStatementAsBlock(JavacParser.java:2356)
at com.sun.tools.javac.parser.JavacParser.parseStatement(JavacParser.java:2488)
at com.sun.tools.javac.parser.JavacParser.blockStatement(JavacParser.java:2391)
at com.sun.tools.javac.parser.JavacParser.parseStatementAsBlock(JavacParser.java:2356)
at com.sun.tools.javac.parser.JavacParser.parseStatement(JavacParser.java:2488)
at com.sun.tools.javac.parser.JavacParser.blockStatement(JavacParser.java:2391)
at com.sun.tools.javac.parser.JavacParser.parseStatementAsBlock(JavacParser.java:2356)
at com.sun.tools.javac.parser.JavacParser.parseStatement(JavacParser.java:2488)
at com.sun.tools.javac.parser.JavacParser.blockStatement(JavacParser.java:2391)
at com.sun.tools.javac.parser.JavacParser.parseStatementAsBlock(JavacParser.java:2356)
at com.sun.tools.javac.parser.JavacParser.parseStatement(JavacParser.java:2488)
at com.sun.tools.javac.parser.JavacParser.blockStatement(JavacParser.java:2391)
at com.sun.tools.javac.parser.JavacParser.parseStatementAsBlock(JavacParser.java:2356)
at com.sun.tools.javac.parser.JavacParser.parseStatement(JavacParser.java:2488)
at com.sun.tools.javac.parser.JavacParser.blockStatement(JavacParser.java:2391)
at com.sun.tools.javac.parser.JavacParser.parseStatementAsBlock(JavacParser.java:2356)
at com.sun.tools.javac.parser.JavacParser.parseStatement(JavacParser.java:2488)
at com.sun.tools.javac.parser.JavacParser.blockStatement(JavacParser.java:2391)
at com.sun.tools.javac.parser.JavacParser.parseStatementAsBlock(JavacParser.java:2356)
at com.sun.tools.javac.parser.JavacParser.parseStatement(JavacParser.java:2488)
at com.sun.tools.javac.parser.JavacParser.blockStatement(JavacParser.java:2391)
at com.sun.tools.javac.parser.JavacParser.parseStatementAsBlock(JavacParser.java:2356)
at com.sun.tools.javac.parser.JavacParser.parseStatement(JavacParser.java:2488)
at com.sun.tools.javac.parser.JavacParser.blockStatement(JavacParser.java:2391)
at com.sun.tools.javac.parser.JavacParser.parseStatementAsBlock(JavacParser.java:2356)
at com.sun.tools.javac.parser.JavacParser.parseStatement(JavacParser.java:2488)
at com.sun.tools.javac.parser.JavacParser.blockStatement(JavacParser.java:2391)
at com.sun.tools.javac.parser.JavacParser.parseStatementAsBlock(JavacParser.java:2356)
at com.sun.tools.javac.parser.JavacParser.parseStatement(JavacParser.java:2488)
at com.sun.tools.javac.parser.JavacParser.blockStatement(JavacParser.java:2391)
at com.sun.tools.javac.parser.JavacParser.parseStatementAsBlock(JavacParser.java:2356)
at com.sun.tools.javac.parser.JavacParser.parseStatement(JavacParser.java:2488)
at com.sun.tools.javac.parser.JavacParser.blockStatement(JavacParser.java:2391)
at com.sun.tools.javac.parser.JavacParser.parseStatementAsBlock(JavacParser.java:2356)
at com.sun.tools.javac.parser.JavacParser.parseStatement(JavacParser.java:2488)
at com.sun.tools.javac.parser.JavacParser.blockStatement(JavacParser.java:2391)
at com.sun.tools.javac.parser.JavacParser.parseStatementAsBlock(JavacParser.java:2356)
at com.sun.tools.javac.parser.JavacParser.parseStatement(JavacParser.java:2488)
at com.sun.tools.javac.parser.JavacParser.blockStatement(JavacParser.java:2391)
at com.sun.tools.javac.parser.JavacParser.parseStatementAsBlock(JavacParser.java:2356)
at com.sun.tools.javac.parser.JavacParser.parseStatement(JavacParser.java:2488)
at com.sun.tools.javac.parser.JavacParser.blockStatement(JavacParser.java:2391)
at com.sun.tools.javac.parser.JavacParser.parseStatementAsBlock(JavacParser.java:2356)
at com.sun.tools.javac.parser.JavacParser.parseStatement(JavacParser.java:2488)
at com.sun.tools.javac.parser.JavacParser.blockStatement(JavacParser.java:2391)
at com.sun.tools.javac.parser.JavacParser.parseStatementAsBlock(JavacParser.java:2356)
at com.sun.tools.javac.parser.JavacParser.parseStatement(JavacParser.java:2488)
at com.sun.tools.javac.parser.JavacParser.blockStatement(JavacParser.java:2391)
at com.sun.tools.javac.parser.JavacParser.parseStatementAsBlock(JavacParser.java:2356)
at com.sun.tools.javac.parser.JavacParser.parseStatement(JavacParser.java:2488)
at com.sun.tools.javac.parser.JavacParser.blockStatement(JavacParser.java:2391)
at com.sun.tools.javac.parser.JavacParser.parseStatementAsBlock(JavacParser.java:2356)
at com.sun.tools.javac.parser.JavacParser.parseStatement(JavacParser.java:2488)
at com.sun.tools.javac.parser.JavacParser.blockStatement(JavacParser.java:2391)
at com.sun.tools.javac.parser.JavacParser.parseStatementAsBlock(JavacParser.java:2356)
at com.sun.tools.javac.parser.JavacParser.parseStatement(JavacParser.java:2488)
at com.sun.tools.javac.parser.JavacParser.blockStatement(JavacParser.java:2391)
at com.sun.tools.javac.parser.JavacParser.parseStatementAsBlock(JavacParser.java:2356)
at com.sun.tools.javac.parser.JavacParser.parseStatement(JavacParser.java:2488)
at com.sun.tools.javac.parser.JavacParser.blockStatement(JavacParser.java:2391)
at com.sun.tools.javac.parser.JavacParser.parseStatementAsBlock(JavacParser.java:2356)
at com.sun.tools.javac.parser.JavacParser.parseStatement(JavacParser.java:2488)
at com.sun.tools.javac.parser.JavacParser.blockStatement(JavacParser.java:2391)
at com.sun.tools.javac.parser.JavacParser.parseStatementAsBlock(JavacParser.java:2356)
at com.sun.tools.javac.parser.JavacParser.parseStatement(JavacParser.java:2488)
at com.sun.tools.javac.parser.JavacParser.blockStatement(JavacParser.java:2391)
at com.sun.tools.javac.parser.JavacParser.parseStatementAsBlock(JavacParser.java:2356)
at com.sun.tools.javac.parser.JavacParser.parseStatement(JavacParser.java:2488)
at com.sun.tools.javac.parser.JavacParser.blockStatement(JavacParser.java:2391)
at com.sun.tools.javac.parser.JavacParser.parseStatementAsBlock(JavacParser.java:2356)
at com.sun.tools.javac.parser.JavacParser.parseStatement(JavacParser.java:2488)
at com.sun.tools.javac.parser.JavacParser.blockStatement(JavacParser.java:2391)
at com.sun.tools.javac.parser.JavacParser.parseStatementAsBlock(JavacParser.java:2356)
at com.sun.tools.javac.parser.JavacParser.parseStatement(JavacParser.java:2488)
at com.sun.tools.javac.parser.JavacParser.blockStatement(JavacParser.java:2391)
at com.sun.tools.javac.parser.JavacParser.parseStatementAsBlock(JavacParser.java:2356)
at com.sun.tools.javac.parser.JavacParser.parseStatement(JavacParser.java:2488)
at com.sun.tools.javac.parser.JavacParser.blockStatement(JavacParser.java:2391)
at com.sun.tools.javac.parser.JavacParser.parseStatementAsBlock(JavacParser.java:2356)
at com.sun.tools.javac.parser.JavacParser.parseStatement(JavacParser.java:2488)
at com.sun.tools.javac.parser.JavacParser.blockStatement(JavacParser.java:2391)
at com.sun.tools.javac.parser.JavacParser.parseStatementAsBlock(JavacParser.java:2356)
at com.sun.tools.javac.parser.JavacParser.parseStatement(JavacParser.java:2488)
at com.sun.tools.javac.parser.JavacParser.blockStatement(JavacParser.java:2391)
at com.sun.tools.javac.parser.JavacParser.parseStatementAsBlock(JavacParser.java:2356)
at com.sun.tools.javac.parser.JavacParser.parseStatement(JavacParser.java:2488)
at com.sun.tools.javac.parser.JavacParser.blockStatement(JavacParser.java:2391)
at com.sun.tools.javac.parser.JavacParser.parseStatementAsBlock(JavacParser.java:2356)
at com.sun.tools.javac.parser.JavacParser.parseStatement(JavacParser.java:2488)
at com.sun.tools.javac.parser.JavacParser.blockStatement(JavacParser.java:2391)
at com.sun.tools.javac.parser.JavacParser.parseStatementAsBlock(JavacParser.java:2356)
at com.sun.tools.javac.parser.JavacParser.parseStatement(JavacParser.java:2488)
at com.sun.tools.javac.parser.JavacParser.blockStatement(JavacParser.java:2391)
at com.sun.tools.javac.parser.JavacParser.parseStatementAsBlock(JavacParser.java:2356)
at com.sun.tools.javac.parser.JavacParser.parseStatement(JavacParser.java:2488)
at com.sun.tools.javac.parser.JavacParser.blockStatement(JavacParser.java:2391)
at com.sun.tools.javac.parser.JavacParser.parseStatementAsBlock(JavacParser.java:2356)
at com.sun.tools.javac.parser.JavacParser.parseStatement(JavacParser.java:2488)
at com.sun.tools.javac.parser.JavacParser.blockStatement(JavacParser.java:2391)
at com.sun.tools.javac.parser.JavacParser.parseStatementAsBlock(JavacParser.java:2356)
at com.sun.tools.javac.parser.JavacParser.parseStatement(JavacParser.java:2488)
at com.sun.tools.javac.parser.JavacParser.blockStatement(JavacParser.java:2391)
at com.sun.tools.javac.parser.JavacParser.parseStatementAsBlock(JavacParser.java:2356)
at com.sun.tools.javac.parser.JavacParser.parseStatement(JavacParser.java:2488)
at com.sun.tools.javac.parser.JavacParser.blockStatement(JavacParser.java:2391)
at com.sun.tools.javac.parser.JavacParser.parseStatementAsBlock(JavacParser.java:2356)
at com.sun.tools.javac.parser.JavacParser.parseStatement(JavacParser.java:2488)
at com.sun.tools.javac.parser.JavacParser.blockStatement(JavacParser.java:2391)
at com.sun.tools.javac.parser.JavacParser.parseStatementAsBlock(JavacParser.java:2356)
at com.sun.tools.javac.parser.JavacParser.parseStatement(JavacParser.java:2488)
at com.sun.tools.javac.parser.JavacParser.blockStatement(JavacParser.java:2391)
at com.sun.tools.javac.parser.JavacParser.parseStatementAsBlock(JavacParser.java:2356)
at com.sun.tools.javac.parser.JavacParser.parseStatement(JavacParser.java:2488)
at com.sun.tools.javac.parser.JavacParser.blockStatement(JavacParser.java:2391)
at com.sun.tools.javac.parser.JavacParser.parseStatementAsBlock(JavacParser.java:2356)
at com.sun.tools.javac.parser.JavacParser.parseStatement(JavacParser.java:2488)
at com.sun.tools.javac.parser.JavacParser.blockStatement(JavacParser.java:2391)
at com.sun.tools.javac.parser.JavacParser.parseStatementAsBlock(JavacParser.java:2356)
at com.sun.tools.javac.parser.JavacParser.parseStatement(JavacParser.java:2488)
at com.sun.tools.javac.parser.JavacParser.blockStatement(JavacParser.java:2391)
at com.sun.tools.javac.parser.JavacParser.parseStatementAsBlock(JavacParser.java:2356)
at com.sun.tools.javac.parser.JavacParser.parseStatement(JavacParser.java:2488)
at com.sun.tools.javac.parser.JavacParser.blockStatement(JavacParser.java:2391)
at com.sun.tools.javac.parser.JavacParser.parseStatementAsBlock(JavacParser.java:2356)
at com.sun.tools.javac.parser.JavacParser.parseStatement(JavacParser.java:2488)
at com.sun.tools.javac.parser.JavacParser.blockStatement(JavacParser.java:2391)
at com.sun.tools.javac.parser.JavacParser.parseStatementAsBlock(JavacParser.java:2356)
at com.sun.tools.javac.parser.JavacParser.parseStatement(JavacParser.java:2488)
at com.sun.tools.javac.parser.JavacParser.blockStatement(JavacParser.java:2391)
at com.sun.tools.javac.parser.JavacParser.parseStatementAsBlock(JavacParser.java:2356)
at com.sun.tools.javac.parser.JavacParser.parseStatement(JavacParser.java:2488)
at com.sun.tools.javac.parser.JavacParser.blockStatement(JavacParser.java:2391)
at com.sun.tools.javac.parser.JavacParser.parseStatementAsBlock(JavacParser.java:2356)
at com.sun.tools.javac.parser.JavacParser.parseStatement(JavacParser.java:2488)
at com.sun.tools.javac.parser.JavacParser.blockStatement(JavacParser.java:2391)
at com.sun.tools.javac.parser.JavacParser.parseStatementAsBlock(JavacParser.java:2356)
at com.sun.tools.javac.parser.JavacParser.parseStatement(JavacParser.java:2488)
at com.sun.tools.javac.parser.JavacParser.blockStatement(JavacParser.java:2391)
at com.sun.tools.javac.parser.JavacParser.parseStatementAsBlock(JavacParser.java:2356)
at com.sun.tools.javac.parser.JavacParser.parseStatement(JavacParser.java:2488)
at com.sun.tools.javac.parser.JavacParser.blockStatement(JavacParser.java:2391)
at com.sun.tools.javac.parser.JavacParser.parseStatementAsBlock(JavacParser.java:2356)
at com.sun.tools.javac.parser.JavacParser.parseStatement(JavacParser.java:2488)
at com.sun.tools.javac.parser.JavacParser.blockStatement(JavacParser.java:2391)
at com.sun.tools.javac.parser.JavacParser.parseStatementAsBlock(JavacParser.java:2356)
at com.sun.tools.javac.parser.JavacParser.parseStatement(JavacParser.java:2488)
at com.sun.tools.javac.parser.JavacParser.blockStatement(JavacParser.java:2391)
at com.sun.tools.javac.parser.JavacParser.parseStatementAsBlock(JavacParser.java:2356)
at com.sun.tools.javac.parser.JavacParser.parseStatement(JavacParser.java:2488)
at com.sun.tools.javac.parser.JavacParser.blockStatement(JavacParser.java:2391)
at com.sun.tools.javac.parser.JavacParser.parseStatementAsBlock(JavacParser.java:2356)
at com.sun.tools.javac.parser.JavacParser.parseStatement(JavacParser.java:2488)
at com.sun.tools.javac.parser.JavacParser.blockStatement(JavacParser.java:2391)
at com.sun.tools.javac.parser.JavacParser.parseStatementAsBlock(JavacParser.java:2356)
at com.sun.tools.javac.parser.JavacParser.parseStatement(JavacParser.java:2488)
at com.sun.tools.javac.parser.JavacParser.blockStatement(JavacParser.java:2391)
at com.sun.tools.javac.parser.JavacParser.parseStatementAsBlock(JavacParser.java:2356)
at com.sun.tools.javac.parser.JavacParser.parseStatement(JavacParser.java:2488)
at com.sun.tools.javac.parser.JavacParser.blockStatement(JavacParser.java:2391)
at com.sun.tools.javac.parser.JavacParser.parseStatementAsBlock(JavacParser.java:2356)
at com.sun.tools.javac.parser.JavacParser.parseStatement(JavacParser.java:2488)
at com.sun.tools.javac.parser.JavacParser.blockStatement(JavacParser.java:2391)
at com.sun.tools.javac.parser.JavacParser.parseStatementAsBlock(JavacParser.java:2356)
at com.sun.tools.javac.parser.JavacParser.parseStatement(JavacParser.java:2488)
at com.sun.tools.javac.parser.JavacParser.blockStatement(JavacParser.java:2391)
at com.sun.tools.javac.parser.JavacParser.parseStatementAsBlock(JavacParser.java:2356)
at com.sun.tools.javac.parser.JavacParser.parseStatement(JavacParser.java:2488)
at com.sun.tools.javac.parser.JavacParser.blockStatement(JavacParser.java:2391)
at com.sun.tools.javac.parser.JavacParser.parseStatementAsBlock(JavacParser.java:2356)
at com.sun.tools.javac.parser.JavacParser.parseStatement(JavacParser.java:2488)
at com.sun.tools.javac.parser.JavacParser.blockStatement(JavacParser.java:2391)
at com.sun.tools.javac.parser.JavacParser.parseStatementAsBlock(JavacParser.java:2356)
at com.sun.tools.javac.parser.JavacParser.parseStatement(JavacParser.java:2488)
at com.sun.tools.javac.parser.JavacParser.blockStatement(JavacParser.java:2391)
at com.sun.tools.javac.parser.JavacParser.parseStatementAsBlock(JavacParser.java:2356)
at com.sun.tools.javac.parser.JavacParser.parseStatement(JavacParser.java:2488)
at com.sun.tools.javac.parser.JavacParser.blockStatement(JavacParser.java:2391)
at com.sun.tools.javac.parser.JavacParser.parseStatementAsBlock(JavacParser.java:2356)
at com.sun.tools.javac.parser.JavacParser.parseStatement(JavacParser.java:2488)
at com.sun.tools.javac.parser.JavacParser.blockStatement(JavacParser.java:2391)
at com.sun.tools.javac.parser.JavacParser.parseStatementAsBlock(JavacParser.java:2356)
at com.sun.tools.javac.parser.JavacParser.parseStatement(JavacParser.java:2488)
at com.sun.tools.javac.parser.JavacParser.blockStatement(JavacParser.java:2391)
at com.sun.tools.javac.parser.JavacParser.parseStatementAsBlock(JavacParser.java:2356)
at com.sun.tools.javac.parser.JavacParser.parseStatement(JavacParser.java:2488)
at com.sun.tools.javac.parser.JavacParser.blockStatement(JavacParser.java:2391)
at com.sun.tools.javac.parser.JavacParser.parseStatementAsBlock(JavacParser.java:2356)
at com.sun.tools.javac.parser.JavacParser.parseStatement(JavacParser.java:2488)
at com.sun.tools.javac.parser.JavacParser.blockStatement(JavacParser.java:2391)
at com.sun.tools.javac.parser.JavacParser.parseStatementAsBlock(JavacParser.java:2356)
at com.sun.tools.javac.parser.JavacParser.parseStatement(JavacParser.java:2488)
at com.sun.tools.javac.parser.JavacParser.blockStatement(JavacParser.java:2391)
at com.sun.tools.javac.parser.JavacParser.parseStatementAsBlock(JavacParser.java:2356)
at com.sun.tools.javac.parser.JavacParser.parseStatement(JavacParser.java:2488)
at com.sun.tools.javac.parser.JavacParser.blockStatement(JavacParser.java:2391)
at com.sun.tools.javac.parser.JavacParser.parseStatementAsBlock(JavacParser.java:2356)
at com.sun.tools.javac.parser.JavacParser.parseStatement(JavacParser.java:2488)
at com.sun.tools.javac.parser.JavacParser.blockStatement(JavacParser.java:2391)
at com.sun.tools.javac.parser.JavacParser.parseStatementAsBlock(JavacParser.java:2356)
at com.sun.tools.javac.parser.JavacParser.parseStatement(JavacParser.java:2488)
at com.sun.tools.javac.parser.JavacParser.blockStatement(JavacParser.java:2391)
at com.sun.tools.javac.parser.JavacParser.parseStatementAsBlock(JavacParser.java:2356)
at com.sun.tools.javac.parser.JavacParser.parseStatement(JavacParser.java:2488)
at com.sun.tools.javac.parser.JavacParser.blockStatement(JavacParser.java:2391)
at com.sun.tools.javac.parser.JavacParser.parseStatementAsBlock(JavacParser.java:2356)
at com.sun.tools.javac.parser.JavacParser.parseStatement(JavacParser.java:2488)
at com.sun.tools.javac.parser.JavacParser.blockStatement(JavacParser.java:2391)
at com.sun.tools.javac.parser.JavacParser.parseStatementAsBlock(JavacParser.java:2356)
at com.sun.tools.javac.parser.JavacParser.parseStatement(JavacParser.java:2488)
at com.sun.tools.javac.parser.JavacParser.blockStatement(JavacParser.java:2391)
at com.sun.tools.javac.parser.JavacParser.parseStatementAsBlock(JavacParser.java:2356)
at com.sun.tools.javac.parser.JavacParser.parseStatement(JavacParser.java:2488)
at com.sun.tools.javac.parser.JavacParser.blockStatement(JavacParser.java:2391)
at com.sun.tools.javac.parser.JavacParser.parseStatementAsBlock(JavacParser.java:2356)
at com.sun.tools.javac.parser.JavacParser.parseStatement(JavacParser.java:2488)
at com.sun.tools.javac.parser.JavacParser.blockStatement(JavacParser.java:2391)
at com.sun.tools.javac.parser.JavacParser.parseStatementAsBlock(JavacParser.java:2356)
at com.sun.tools.javac.parser.JavacParser.parseStatement(JavacParser.java:2488)
at com.sun.tools.javac.parser.JavacParser.blockStatement(JavacParser.java:2391)
at com.sun.tools.javac.parser.JavacParser.parseStatementAsBlock(JavacParser.java:2356)
at com.sun.tools.javac.parser.JavacParser.parseStatement(JavacParser.java:2488)
at com.sun.tools.javac.parser.JavacParser.blockStatement(JavacParser.java:2391)
at com.sun.tools.javac.parser.JavacParser.parseStatementAsBlock(JavacParser.java:2356)
at com.sun.tools.javac.parser.JavacParser.parseStatement(JavacParser.java:2488)
at com.sun.tools.javac.parser.JavacParser.blockStatement(JavacParser.java:2391)
at com.sun.tools.javac.parser.JavacParser.parseStatementAsBlock(JavacParser.java:2356)
at com.sun.tools.javac.parser.JavacParser.parseStatement(JavacParser.java:2488)
at com.sun.tools.javac.parser.JavacParser.blockStatement(JavacParser.java:2391)
at com.sun.tools.javac.parser.JavacParser.parseStatementAsBlock(JavacParser.java:2356)
at com.sun.tools.javac.parser.JavacParser.parseStatement(JavacParser.java:2488)
at com.sun.tools.javac.parser.JavacParser.blockStatement(JavacParser.java:2391)
at com.sun.tools.javac.parser.JavacParser.parseStatementAsBlock(JavacParser.java:2356)
at com.sun.tools.javac.parser.JavacParser.parseStatement(JavacParser.java:2488)
at com.sun.tools.javac.parser.JavacParser.blockStatement(JavacParser.java:2391)
at com.sun.tools.javac.parser.JavacParser.parseStatementAsBlock(JavacParser.java:2356)
at com.sun.tools.javac.parser.JavacParser.parseStatement(JavacParser.java:2488)
at com.sun.tools.javac.parser.JavacParser.blockStatement(JavacParser.java:2391)
at com.sun.tools.javac.parser.JavacParser.parseStatementAsBlock(JavacParser.java:2356)
at com.sun.tools.javac.parser.JavacParser.parseStatement(JavacParser.java:2488)
at com.sun.tools.javac.parser.JavacParser.blockStatement(JavacParser.java:2391)
at com.sun.tools.javac.parser.JavacParser.parseStatementAsBlock(JavacParser.java:2356)
at com.sun.tools.javac.parser.JavacParser.parseStatement(JavacParser.java:2488)
at com.sun.tools.javac.parser.JavacParser.blockStatement(JavacParser.java:2391)
at com.sun.tools.javac.parser.JavacParser.parseStatementAsBlock(JavacParser.java:2356)
at com.sun.tools.javac.parser.JavacParser.parseStatement(JavacParser.java:2488)
at com.sun.tools.javac.parser.JavacParser.blockStatement(JavacParser.java:2391)
at com.sun.tools.javac.parser.JavacParser.parseStatementAsBlock(JavacParser.java:2356)
at com.sun.tools.javac.parser.JavacParser.parseStatement(JavacParser.java:2488)
at com.sun.tools.javac.parser.JavacParser.blockStatement(JavacParser.java:2391)
at com.sun.tools.javac.parser.JavacParser.parseStatementAsBlock(JavacParser.java:2356)
at com.sun.tools.javac.parser.JavacParser.parseStatement(JavacParser.java:2488)
at com.sun.tools.javac.parser.JavacParser.blockStatement(JavacParser.java:2391)
at com.sun.tools.javac.parser.JavacParser.parseStatementAsBlock(JavacParser.java:2356)
at com.sun.tools.javac.parser.JavacParser.parseStatement(JavacParser.java:2488)
at com.sun.tools.javac.parser.JavacParser.blockStatement(JavacParser.java:2391)
at com.sun.tools.javac.parser.JavacParser.parseStatementAsBlock(JavacParser.java:2356)
at com.sun.tools.javac.parser.JavacParser.parseStatement(JavacParser.java:2488)
at com.sun.tools.javac.parser.JavacParser.blockStatement(JavacParser.java:2391)
at com.sun.tools.javac.parser.JavacParser.parseStatementAsBlock(JavacParser.java:2356)
at com.sun.tools.javac.parser.JavacParser.parseStatement(JavacParser.java:2488)
at com.sun.tools.javac.parser.JavacParser.blockStatement(JavacParser.java:2391)
at com.sun.tools.javac.parser.JavacParser.parseStatementAsBlock(JavacParser.java:2356)
at com.sun.tools.javac.parser.JavacParser.parseStatement(JavacParser.java:2488)
at com.sun.tools.javac.parser.JavacParser.blockStatement(JavacParser.java:2391)
at com.sun.tools.javac.parser.JavacParser.parseStatementAsBlock(JavacParser.java:2356)
at com.sun.tools.javac.parser.JavacParser.parseStatement(JavacParser.java:2488)
at com.sun.tools.javac.parser.JavacParser.blockStatement(JavacParser.java:2391)
at com.sun.tools.javac.parser.JavacParser.parseStatementAsBlock(JavacParser.java:2356)
at com.sun.tools.javac.parser.JavacParser.parseStatement(JavacParser.java:2488)
at com.sun.tools.javac.parser.JavacParser.blockStatement(JavacParser.java:2391)
at com.sun.tools.javac.parser.JavacParser.parseStatementAsBlock(JavacParser.java:2356)
at com.sun.tools.javac.parser.JavacParser.parseStatement(JavacParser.java:2488)
at com.sun.tools.javac.parser.JavacParser.blockStatement(JavacParser.java:2391)
at com.sun.tools.javac.parser.JavacParser.parseStatementAsBlock(JavacParser.java:2356)
at com.sun.tools.javac.parser.JavacParser.parseStatement(JavacParser.java:2488)
at com.sun.tools.javac.parser.JavacParser.blockStatement(JavacParser.java:2391)
at com.sun.tools.javac.parser.JavacParser.parseStatementAsBlock(JavacParser.java:2356)
at com.sun.tools.javac.parser.JavacParser.parseStatement(JavacParser.java:2488)
at com.sun.tools.javac.parser.JavacParser.blockStatement(JavacParser.java:2391)
at com.sun.tools.javac.parser.JavacParser.parseStatementAsBlock(JavacParser.java:2356)
at com.sun.tools.javac.parser.JavacParser.parseStatement(JavacParser.java:2488)
at com.sun.tools.javac.parser.JavacParser.blockStatement(JavacParser.java:2391)
at com.sun.tools.javac.parser.JavacParser.parseStatementAsBlock(JavacParser.java:2356)
at com.sun.tools.javac.parser.JavacParser.parseStatement(JavacParser.java:2488)
at com.sun.tools.javac.parser.JavacParser.blockStatement(JavacParser.java:2391)
at com.sun.tools.javac.parser.JavacParser.parseStatementAsBlock(JavacParser.java:2356)
at com.sun.tools.javac.parser.JavacParser.parseStatement(JavacParser.java:2488)
at com.sun.tools.javac.parser.JavacParser.blockStatement(JavacParser.java:2391)
at com.sun.tools.javac.parser.JavacParser.parseStatementAsBlock(JavacParser.java:2356)
at com.sun.tools.javac.parser.JavacParser.parseStatement(JavacParser.java:2488)
at com.sun.tools.javac.parser.JavacParser.blockStatement(JavacParser.java:2391)
at com.sun.tools.javac.parser.JavacParser.parseStatementAsBlock(JavacParser.java:2356)
at com.sun.tools.javac.parser.JavacParser.parseStatement(JavacParser.java:2488)
at com.sun.tools.javac.parser.JavacParser.blockStatement(JavacParser.java:2391)
at com.sun.tools.javac.parser.JavacParser.parseStatementAsBlock(JavacParser.java:2356)
at com.sun.tools.javac.parser.JavacParser.parseStatement(JavacParser.java:2488)
at com.sun.tools.javac.parser.JavacParser.blockStatement(JavacParser.java:2391)
at com.sun.tools.javac.parser.JavacParser.parseStatementAsBlock(JavacParser.java:2356)
at com.sun.tools.javac.parser.JavacParser.parseStatement(JavacParser.java:2488)
at com.sun.tools.javac.parser.JavacParser.blockStatement(JavacParser.java:2391)
at com.sun.tools.javac.parser.JavacParser.parseStatementAsBlock(JavacParser.java:2356)
at com.sun.tools.javac.parser.JavacParser.parseStatement(JavacParser.java:2488)
at com.sun.tools.javac.parser.JavacParser.blockStatement(JavacParser.java:2391)
at com.sun.tools.javac.parser.JavacParser.parseStatementAsBlock(JavacParser.java:2356)
at com.sun.tools.javac.parser.JavacParser.parseStatement(JavacParser.java:2488)
at com.sun.tools.javac.parser.JavacParser.blockStatement(JavacParser.java:2391)
at com.sun.tools.javac.parser.JavacParser.parseStatementAsBlock(JavacParser.java:2356)
at com.sun.tools.javac.parser.JavacParser.parseStatement(JavacParser.java:2488)
at com.sun.tools.javac.parser.JavacParser.blockStatement(JavacParser.java:2391)
at com.sun.tools.javac.parser.JavacParser.parseStatementAsBlock(JavacParser.java:2356)
at com.sun.tools.javac.parser.JavacParser.parseStatement(JavacParser.java:2488)
at com.sun.tools.javac.parser.JavacParser.blockStatement(JavacParser.java:2391)
at com.sun.tools.javac.parser.JavacParser.parseStatementAsBlock(JavacParser.java:2356)
at com.sun.tools.javac.parser.JavacParser.parseStatement(JavacParser.java:2488)
at com.sun.tools.javac.parser.JavacParser.blockStatement(JavacParser.java:2391)
at com.sun.tools.javac.parser.JavacParser.parseStatementAsBlock(JavacParser.java:2356)
at com.sun.tools.javac.parser.JavacParser.parseStatement(JavacParser.java:2488)
at com.sun.tools.javac.parser.JavacParser.blockStatement(JavacParser.java:2391)
at com.sun.tools.javac.parser.JavacParser.parseStatementAsBlock(JavacParser.java:2356)
at com.sun.tools.javac.parser.JavacParser.parseStatement(JavacParser.java:2488)
at com.sun.tools.javac.parser.JavacParser.blockStatement(JavacParser.java:2391)
at com.sun.tools.javac.parser.JavacParser.parseStatementAsBlock(JavacParser.java:2356)
at com.sun.tools.javac.parser.JavacParser.parseStatement(JavacParser.java:2488)
at com.sun.tools.javac.parser.JavacParser.blockStatement(JavacParser.java:2391)
at com.sun.tools.javac.parser.JavacParser.parseStatementAsBlock(JavacParser.java:2356)
at com.sun.tools.javac.parser.JavacParser.parseStatement(JavacParser.java:2488)
at com.sun.tools.javac.parser.JavacParser.blockStatement(JavacParser.java:2391)
at com.sun.tools.javac.parser.JavacParser.parseStatementAsBlock(JavacParser.java:2356)
at com.sun.tools.javac.parser.JavacParser.parseStatement(JavacParser.java:2488)
at com.sun.tools.javac.parser.JavacParser.blockStatement(JavacParser.java:2391)
at com.sun.tools.javac.parser.JavacParser.parseStatementAsBlock(JavacParser.java:2356)
at com.sun.tools.javac.parser.JavacParser.parseStatement(JavacParser.java:2488)
at com.sun.tools.javac.parser.JavacParser.blockStatement(JavacParser.java:2391)
at com.sun.tools.javac.parser.JavacParser.parseStatementAsBlock(JavacParser.java:2356)
at com.sun.tools.javac.parser.JavacParser.parseStatement(JavacParser.java:2488)
at com.sun.tools.javac.parser.JavacParser.blockStatement(JavacParser.java:2391)
at com.sun.tools.javac.parser.JavacParser.parseStatementAsBlock(JavacParser.java:2356)
at com.sun.tools.javac.parser.JavacParser.parseStatement(JavacParser.java:2488)
at com.sun.tools.javac.parser.JavacParser.blockStatement(JavacParser.java:2391)
at com.sun.tools.javac.parser.JavacParser.parseStatementAsBlock(JavacParser.java:2356)
at com.sun.tools.javac.parser.JavacParser.parseStatement(JavacParser.java:2488)
at com.sun.tools.javac.parser.JavacParser.blockStatement(JavacParser.java:2391)
at com.sun.tools.javac.parser.JavacParser.parseStatementAsBlock(JavacParser.java:2356)
at com.sun.tools.javac.parser.JavacParser.parseStatement(JavacParser.java:2488)
at com.sun.tools.javac.parser.JavacParser.blockStatement(JavacParser.java:2391)
at com.sun.tools.javac.parser.JavacParser.parseStatementAsBlock(JavacParser.java:2356)
at com.sun.tools.javac.parser.JavacParser.parseStatement(JavacParser.java:2488)
at com.sun.tools.javac.parser.JavacParser.blockStatement(JavacParser.java:2391)
at com.sun.tools.javac.parser.JavacParser.parseStatementAsBlock(JavacParser.java:2356)
at com.sun.tools.javac.parser.JavacParser.parseStatement(JavacParser.java:2488)
at com.sun.tools.javac.parser.JavacParser.blockStatement(JavacParser.java:2391)
at com.sun.tools.javac.parser.JavacParser.parseStatementAsBlock(JavacParser.java:2356)
at com.sun.tools.javac.parser.JavacParser.parseStatement(JavacParser.java:2488)
at com.sun.tools.javac.parser.JavacParser.blockStatement(JavacParser.java:2391)
at com.sun.tools.javac.parser.JavacParser.parseStatementAsBlock(JavacParser.java:2356)
at com.sun.tools.javac.parser.JavacParser.parseStatement(JavacParser.java:2488)
at com.sun.tools.javac.parser.JavacParser.blockStatement(JavacParser.java:2391)
at com.sun.tools.javac.parser.JavacParser.parseStatementAsBlock(JavacParser.java:2356)
at com.sun.tools.javac.parser.JavacParser.parseStatement(JavacParser.java:2488)
at com.sun.tools.javac.parser.JavacParser.blockStatement(JavacParser.java:2391)
at com.sun.tools.javac.parser.JavacParser.parseStatementAsBlock(JavacParser.java:2356)
at com.sun.tools.javac.parser.JavacParser.parseStatement(JavacParser.java:2488)
at com.sun.tools.javac.parser.JavacParser.blockStatement(JavacParser.java:2391)
at com.sun.tools.javac.parser.JavacParser.parseStatementAsBlock(JavacParser.java:2356)
at com.sun.tools.javac.parser.JavacParser.parseStatement(JavacParser.java:2488)
at com.sun.tools.javac.parser.JavacParser.blockStatement(JavacParser.java:2391)
at com.sun.tools.javac.parser.JavacParser.parseStatementAsBlock(JavacParser.java:2356)
at com.sun.tools.javac.parser.JavacParser.parseStatement(JavacParser.java:2488)
at com.sun.tools.javac.parser.JavacParser.blockStatement(JavacParser.java:2391)
at com.sun.tools.javac.parser.JavacParser.parseStatementAsBlock(JavacParser.java:2356)
at com.sun.tools.javac.parser.JavacParser.parseStatement(JavacParser.java:2488)
at com.sun.tools.javac.parser.JavacParser.blockStatement(JavacParser.java:2391)
at com.sun.tools.javac.parser.JavacParser.parseStatementAsBlock(JavacParser.java:2356)
at com.sun.tools.javac.parser.JavacParser.parseStatement(JavacParser.java:2488)
at com.sun.tools.javac.parser.JavacParser.blockStatement(JavacParser.java:2391)
at com.sun.tools.javac.parser.JavacParser.parseStatementAsBlock(JavacParser.java:2356)
at com.sun.tools.javac.parser.JavacParser.parseStatement(JavacParser.java:2488)
at com.sun.tools.javac.parser.JavacParser.blockStatement(JavacParser.java:2391)
at com.sun.tools.javac.parser.JavacParser.parseStatementAsBlock(JavacParser.java:2356)
at com.sun.tools.javac.parser.JavacParser.parseStatement(JavacParser.java:2488)
at com.sun.tools.javac.parser.JavacParser.blockStatement(JavacParser.java:2391)
at com.sun.tools.javac.parser.JavacParser.parseStatementAsBlock(JavacParser.java:2356)
at com.sun.tools.javac.parser.JavacParser.parseStatement(JavacParser.java:2488)
at com.sun.tools.javac.parser.JavacParser.blockStatement(JavacParser.java:2391)
at com.sun.tools.javac.parser.JavacParser.parseStatementAsBlock(JavacParser.java:2356)
at com.sun.tools.javac.parser.JavacParser.parseStatement(JavacParser.java:2488)
at com.sun.tools.javac.parser.JavacParser.blockStatement(JavacParser.java:2391)
at com.sun.tools.javac.parser.JavacParser.parseStatementAsBlock(JavacParser.java:2356)
at com.sun.tools.javac.parser.JavacParser.parseStatement(JavacParser.java:2488)
at com.sun.tools.javac.parser.JavacParser.blockStatement(JavacParser.java:2391)
at com.sun.tools.javac.parser.JavacParser.parseStatementAsBlock(JavacParser.java:2356)
at com.sun.tools.javac.parser.JavacParser.parseStatement(JavacParser.java:2488)
at com.sun.tools.javac.parser.JavacParser.blockStatement(JavacParser.java:2391)
at com.sun.tools.javac.parser.JavacParser.parseStatementAsBlock(JavacParser.java:2356)
at com.sun.tools.javac.parser.JavacParser.parseStatement(JavacParser.java:2488)
at com.sun.tools.javac.parser.JavacParser.blockStatement(JavacParser.java:2391)
at com.sun.tools.javac.parser.JavacParser.parseStatementAsBlock(JavacParser.java:2356)
at com.sun.tools.javac.parser.JavacParser.parseStatement(JavacParser.java:2488)
at com.sun.tools.javac.parser.JavacParser.blockStatement(JavacParser.java:2391)
at com.sun.tools.javac.parser.JavacParser.parseStatementAsBlock(JavacParser.java:2356)
at com.sun.tools.javac.parser.JavacParser.parseStatement(JavacParser.java:2488)
at com.sun.tools.javac.parser.JavacParser.blockStatement(JavacParser.java:2391)
at com.sun.tools.javac.parser.JavacParser.parseStatementAsBlock(JavacParser.java:2356)
at com.sun.tools.javac.parser.JavacParser.parseStatement(JavacParser.java:2488)
at com.sun.tools.javac.parser.JavacParser.blockStatement(JavacParser.java:2391)
at com.sun.tools.javac.parser.JavacParser.parseStatementAsBlock(JavacParser.java:2356)
at com.sun.tools.javac.parser.JavacParser.parseStatement(JavacParser.java:2488)
at com.sun.tools.javac.parser.JavacParser.blockStatement(JavacParser.java:2391)
at com.sun.tools.javac.parser.JavacParser.parseStatementAsBlock(JavacParser.java:2356)
at com.sun.tools.javac.parser.JavacParser.parseStatement(JavacParser.java:2488)
at com.sun.tools.javac.parser.JavacParser.blockStatement(JavacParser.java:2391)
at com.sun.tools.javac.parser.JavacParser.parseStatementAsBlock(JavacParser.java:2356)
at com.sun.tools.javac.parser.JavacParser.parseStatement(JavacParser.java:2488)
at com.sun.tools.javac.parser.JavacParser.blockStatement(JavacParser.java:2391)
at com.sun.tools.javac.parser.JavacParser.parseStatementAsBlock(JavacParser.java:2356)
at com.sun.tools.javac.parser.JavacParser.parseStatement(JavacParser.java:2488)
at com.sun.tools.javac.parser.JavacParser.blockStatement(JavacParser.java:2391)
at com.sun.tools.javac.parser.JavacParser.parseStatementAsBlock(JavacParser.java:2356)
at com.sun.tools.javac.parser.JavacParser.parseStatement(JavacParser.java:2488)
at com.sun.tools.javac.parser.JavacParser.blockStatement(JavacParser.java:2391)
at com.sun.tools.javac.parser.JavacParser.parseStatementAsBlock(JavacParser.java:2356)
at com.sun.tools.javac.parser.JavacParser.parseStatement(JavacParser.java:2488)
at com.sun.tools.javac.parser.JavacParser.blockStatement(JavacParser.java:2391)
at com.sun.tools.javac.parser.JavacParser.parseStatementAsBlock(JavacParser.java:2356)
at com.sun.tools.javac.parser.JavacParser.parseStatement(JavacParser.java:2488)
at com.sun.tools.javac.parser.JavacParser.blockStatement(JavacParser.java:2391)
at com.sun.tools.javac.parser.JavacParser.parseStatementAsBlock(JavacParser.java:2356)
at com.sun.tools.javac.parser.JavacParser.parseStatement(JavacParser.java:2488)
at com.sun.tools.javac.parser.JavacParser.blockStatement(JavacParser.java:2391)
at com.sun.tools.javac.parser.JavacParser.parseStatementAsBlock(JavacParser.java:2356)
at com.sun.tools.javac.parser.JavacParser.parseStatement(JavacParser.java:2488)
at com.sun.tools.javac.parser.JavacParser.blockStatement(JavacParser.java:2391)
at com.sun.tools.javac.parser.JavacParser.parseStatementAsBlock(JavacParser.java:2356)
at com.sun.tools.javac.parser.JavacParser.parseStatement(JavacParser.java:2488)
at com.sun.tools.javac.parser.JavacParser.blockStatement(JavacParser.java:2391)
at com.sun.tools.javac.parser.JavacParser.parseStatementAsBlock(JavacParser.java:2356)
at com.sun.tools.javac.parser.JavacParser.parseStatement(JavacParser.java:2488)
at com.sun.tools.javac.parser.JavacParser.blockStatement(JavacParser.java:2391)
at com.sun.tools.javac.parser.JavacParser.parseStatementAsBlock(JavacParser.java:2356)
at com.sun.tools.javac.parser.JavacParser.parseStatement(JavacParser.java:2488)
at com.sun.tools.javac.parser.JavacParser.blockStatement(JavacParser.java:2391)
at com.sun.tools.javac.parser.JavacParser.parseStatementAsBlock(JavacParser.java:2356)
at com.sun.tools.javac.parser.JavacParser.parseStatement(JavacParser.java:2488)
at com.sun.tools.javac.parser.JavacParser.blockStatement(JavacParser.java:2391)
at com.sun.tools.javac.parser.JavacParser.parseStatementAsBlock(JavacParser.java:2356)
at com.sun.tools.javac.parser.JavacParser.parseStatement(JavacParser.java:2488)
at com.sun.tools.javac.parser.JavacParser.blockStatement(JavacParser.java:2391)
at com.sun.tools.javac.parser.JavacParser.parseStatementAsBlock(JavacParser.java:2356)
at com.sun.tools.javac.parser.JavacParser.parseStatement(JavacParser.java:2488)
at com.sun.tools.javac.parser.JavacParser.blockStatement(JavacParser.java:2391)
at com.sun.tools.javac.parser.JavacParser.parseStatementAsBlock(JavacParser.java:2356)
at com.sun.tools.javac.parser.JavacParser.parseStatement(JavacParser.java:2488)
at com.sun.tools.javac.parser.JavacParser.blockStatement(JavacParser.java:2391)
at com.sun.tools.javac.parser.JavacParser.parseStatementAsBlock(JavacParser.java:2356)
at com.sun.tools.javac.parser.JavacParser.parseStatement(JavacParser.java:2488)
at com.sun.tools.javac.parser.JavacParser.blockStatement(JavacParser.java:2391)
at com.sun.tools.javac.parser.JavacParser.parseStatementAsBlock(JavacParser.java:2356)
at com.sun.tools.javac.parser.JavacParser.parseStatement(JavacParser.java:2488)
at com.sun.tools.javac.parser.JavacParser.blockStatement(JavacParser.java:2391)
at com.sun.tools.javac.parser.JavacParser.parseStatementAsBlock(JavacParser.java:2356)
at com.sun.tools.javac.parser.JavacParser.parseStatement(JavacParser.java:2488)
at com.sun.tools.javac.parser.JavacParser.blockStatement(JavacParser.java:2391)
at com.sun.tools.javac.parser.JavacParser.parseStatementAsBlock(JavacParser.java:2356)
at com.sun.tools.javac.parser.JavacParser.parseStatement(JavacParser.java:2488)
at com.sun.tools.javac.parser.JavacParser.blockStatement(JavacParser.java:2391)
at com.sun.tools.javac.parser.JavacParser.parseStatementAsBlock(JavacParser.java:2356)
at com.sun.tools.javac.parser.JavacParser.parseStatement(JavacParser.java:2488)
at com.sun.tools.javac.parser.JavacParser.blockStatement(JavacParser.java:2391)
at com.sun.tools.javac.parser.JavacParser.parseStatementAsBlock(JavacParser.java:2356)
at com.sun.tools.javac.parser.JavacParser.parseStatement(JavacParser.java:2488)
at com.sun.tools.javac.parser.JavacParser.blockStatement(JavacParser.java:2391)
at com.sun.tools.javac.parser.JavacParser.parseStatementAsBlock(JavacParser.java:2356)
at com.sun.tools.javac.parser.JavacParser.parseStatement(JavacParser.java:2488)
at com.sun.tools.javac.parser.JavacParser.blockStatement(JavacParser.java:2391)
at com.sun.tools.javac.parser.JavacParser.parseStatementAsBlock(JavacParser.java:2356)
at com.sun.tools.javac.parser.JavacParser.parseStatement(JavacParser.java:2488)
at com.sun.tools.javac.parser.JavacParser.blockStatement(JavacParser.java:2391)
at com.sun.tools.javac.parser.JavacParser.parseStatementAsBlock(JavacParser.java:2356)
at com.sun.tools.javac.parser.JavacParser.parseStatement(JavacParser.java:2488)
at com.sun.tools.javac.parser.JavacParser.blockStatement(JavacParser.java:2391)
at com.sun.tools.javac.parser.JavacParser.parseStatementAsBlock(JavacParser.java:2356)
at com.sun.tools.javac.parser.JavacParser.parseStatement(JavacParser.java:2488)
at com.sun.tools.javac.parser.JavacParser.blockStatement(JavacParser.java:2391)
at com.sun.tools.javac.parser.JavacParser.parseStatementAsBlock(JavacParser.java:2356)
at com.sun.tools.javac.parser.JavacParser.parseStatement(JavacParser.java:2488)
at com.sun.tools.javac.parser.JavacParser.blockStatement(JavacParser.java:2391)
at com.sun.tools.javac.parser.JavacParser.parseStatementAsBlock(JavacParser.java:2356)
at com.sun.tools.javac.parser.JavacParser.parseStatement(JavacParser.java:2488)
at com.sun.tools.javac.parser.JavacParser.blockStatement(JavacParser.java:2391)
at com.sun.tools.javac.parser.JavacParser.parseStatementAsBlock(JavacParser.java:2356)
at com.sun.tools.javac.parser.JavacParser.parseStatement(JavacParser.java:2488)
at com.sun.tools.javac.parser.JavacParser.blockStatement(JavacParser.java:2391)
at com.sun.tools.javac.parser.JavacParser.parseStatementAsBlock(JavacParser.java:2356)
at com.sun.tools.javac.parser.JavacParser.parseStatement(JavacParser.java:2488)
at com.sun.tools.javac.parser.JavacParser.blockStatement(JavacParser.java:2391)
at com.sun.tools.javac.parser.JavacParser.parseStatementAsBlock(JavacParser.java:2356)
at com.sun.tools.javac.parser.JavacParser.parseStatement(JavacParser.java:2488)
at com.sun.tools.javac.parser.JavacParser.blockStatement(JavacParser.java:2391)
at com.sun.tools.javac.parser.JavacParser.parseStatementAsBlock(JavacParser.java:2356)
at com.sun.tools.javac.parser.JavacParser.parseStatement(JavacParser.java:2488)
at com.sun.tools.javac.parser.JavacParser.blockStatement(JavacParser.java:2391)
at com.sun.tools.javac.parser.JavacParser.parseStatementAsBlock(JavacParser.java:2356)
at com.sun.tools.javac.parser.JavacParser.parseStatement(JavacParser.java:2488)
at com.sun.tools.javac.parser.JavacParser.blockStatement(JavacParser.java:2391)
at com.sun.tools.javac.parser.JavacParser.parseStatementAsBlock(JavacParser.java:2356)
at com.sun.tools.javac.parser.JavacParser.parseStatement(JavacParser.java:2488)
at com.sun.tools.javac.parser.JavacParser.blockStatement(JavacParser.java:2391)
at com.sun.tools.javac.parser.JavacParser.parseStatementAsBlock(JavacParser.java:2356)
at com.sun.tools.javac.parser.JavacParser.parseStatement(JavacParser.java:2488)
at com.sun.tools.javac.parser.JavacParser.blockStatement(JavacParser.java:2391)
at com.sun.tools.javac.parser.JavacParser.parseStatementAsBlock(JavacParser.java:2356)
at com.sun.tools.javac.parser.JavacParser.parseStatement(JavacParser.java:2488)
at com.sun.tools.javac.parser.JavacParser.blockStatement(JavacParser.java:2391)
at com.sun.tools.javac.parser.JavacParser.parseStatementAsBlock(JavacParser.java:2356)
at com.sun.tools.javac.parser.JavacParser.parseStatement(JavacParser.java:2488)
at com.sun.tools.javac.parser.JavacParser.blockStatement(JavacParser.java:2391)
at com.sun.tools.javac.parser.JavacParser.parseStatementAsBlock(JavacParser.java:2356)
at com.sun.tools.javac.parser.JavacParser.parseStatement(JavacParser.java:2488)
at com.sun.tools.javac.parser.JavacParser.blockStatement(JavacParser.java:2391)
at com.sun.tools.javac.parser.JavacParser.parseStatementAsBlock(JavacParser.java:2356)
at com.sun.tools.javac.parser.JavacParser.parseStatement(JavacParser.java:2488)
at com.sun.tools.javac.parser.JavacParser.blockStatement(JavacParser.java:2391)
at com.sun.tools.javac.parser.JavacParser.parseStatementAsBlock(JavacParser.java:2356)
at com.sun.tools.javac.parser.JavacParser.parseStatement(JavacParser.java:2488)
at com.sun.tools.javac.parser.JavacParser.blockStatement(JavacParser.java:2391)
at com.sun.tools.javac.parser.JavacParser.parseStatementAsBlock(JavacParser.java:2356)
at com.sun.tools.javac.parser.JavacParser.parseStatement(JavacParser.java:2488)
at com.sun.tools.javac.parser.JavacParser.blockStatement(JavacParser.java:2391)
at com.sun.tools.javac.parser.JavacParser.parseStatementAsBlock(JavacParser.java:2356)
at com.sun.tools.javac.parser.JavacParser.parseStatement(JavacParser.java:2488)
at com.sun.tools.javac.parser.JavacParser.blockStatement(JavacParser.java:2391)
at com.sun.tools.javac.parser.JavacParser.parseStatementAsBlock(JavacParser.java:2356)
at com.sun.tools.javac.parser.JavacParser.parseStatement(JavacParser.java:2488)
at com.sun.tools.javac.parser.JavacParser.blockStatement(JavacParser.java:2391)
at com.sun.tools.javac.parser.JavacParser.parseStatementAsBlock(JavacParser.java:2356)
at com.sun.tools.javac.parser.JavacParser.parseStatement(JavacParser.java:2488)
at com.sun.tools.javac.parser.JavacParser.blockStatement(JavacParser.java:2391)
at com.sun.tools.javac.parser.JavacParser.parseStatementAsBlock(JavacParser.java:2356)
at com.sun.tools.javac.parser.JavacParser.parseStatement(JavacParser.java:2488)
at com.sun.tools.javac.parser.JavacParser.blockStatement(JavacParser.java:2391)
at com.sun.tools.javac.parser.JavacParser.parseStatementAsBlock(JavacParser.java:2356)
at com.sun.tools.javac.parser.JavacParser.parseStatement(JavacParser.java:2488)
at com.sun.tools.javac.parser.JavacParser.blockStatement(JavacParser.java:2391)
at com.sun.tools.javac.parser.JavacParser.parseStatementAsBlock(JavacParser.java:2356)
at com.sun.tools.javac.parser.JavacParser.parseStatement(JavacParser.java:2488)
at com.sun.tools.javac.parser.JavacParser.blockStatement(JavacParser.java:2391)
at com.sun.tools.javac.parser.JavacParser.parseStatementAsBlock(JavacParser.java:2356)
at com.sun.tools.javac.parser.JavacParser.parseStatement(JavacParser.java:2488)
at com.sun.tools.javac.parser.JavacParser.blockStatement(JavacParser.java:2391)
at com.sun.tools.javac.parser.JavacParser.parseStatementAsBlock(JavacParser.java:2356)
at com.sun.tools.javac.parser.JavacParser.parseStatement(JavacParser.java:2488)
at com.sun.tools.javac.parser.JavacParser.blockStatement(JavacParser.java:2391)
at com.sun.tools.javac.parser.JavacParser.parseStatementAsBlock(JavacParser.java:2356)
at com.sun.tools.javac.parser.JavacParser.parseStatement(JavacParser.java:2488)
at com.sun.tools.javac.parser.JavacParser.blockStatement(JavacParser.java:2391)
at com.sun.tools.javac.parser.JavacParser.parseStatementAsBlock(JavacParser.java:2356)
at com.sun.tools.javac.parser.JavacParser.parseStatement(JavacParser.java:2488)
at com.sun.tools.javac.parser.JavacParser.blockStatement(JavacParser.java:2391)
at com.sun.tools.javac.parser.JavacParser.parseStatementAsBlock(JavacParser.java:2356)
at com.sun.tools.javac.parser.JavacParser.parseStatement(JavacParser.java:2488)
at com.sun.tools.javac.parser.JavacParser.blockStatement(JavacParser.java:2391)
at com.sun.tools.javac.parser.JavacParser.parseStatementAsBlock(JavacParser.java:2356)
at com.sun.tools.javac.parser.JavacParser.parseStatement(JavacParser.java:2488)
at com.sun.tools.javac.parser.JavacParser.blockStatement(JavacParser.java:2391)
at com.sun.tools.javac.parser.JavacParser.parseStatementAsBlock(JavacParser.java:2356)
at com.sun.tools.javac.parser.JavacParser.parseStatement(JavacParser.java:2488)
at com.sun.tools.javac.parser.JavacParser.blockStatement(JavacParser.java:2391)
at com.sun.tools.javac.parser.JavacParser.parseStatementAsBlock(JavacParser.java:2356)
at com.sun.tools.javac.parser.JavacParser.parseStatement(JavacParser.java:2488)
at com.sun.tools.javac.parser.JavacParser.blockStatement(JavacParser.java:2391)
at com.sun.tools.javac.parser.JavacParser.parseStatementAsBlock(JavacParser.java:2356)
[INFO] -------------------------------------------------------------
[ERROR] COMPILATION ERROR :
[INFO] -------------------------------------------------------------
[ERROR] An unknown compilation problem occurred
[INFO] 1 error
[INFO] -------------------------------------------------------------
[INFO]
[INFO] ------------------------------------------------------------------------
[INFO] Skipping Infinispan
[INFO] This project has been banned from the build due to previous failures.
[INFO] ------------------------------------------------------------------------
[INFO] ------------------------------------------------------------------------
[INFO] Reactor Summary:
[INFO]
[INFO] Infinispan BOM ..................................... SUCCESS [ 0.008 s]
[INFO] Infinispan Common Parent ........................... SUCCESS [ 1.032 s]
[INFO] Infinispan Commons ................................. SUCCESS [ 14.152 s]
[INFO] Infinispan Core .................................... SUCCESS [ 16.294 s]
[INFO] Infinispan Extended Statistics ..................... SUCCESS [ 2.491 s]
[INFO] Infinispan Query DSL API ........................... SUCCESS [ 0.540 s]
[INFO] Infinispan Remote Query Client ..................... SUCCESS [ 0.200 s]
[INFO] Infinispan Tree API ................................ SUCCESS [ 1.002 s]
[INFO] Parent pom for the Lucene integration modules ...... SUCCESS [ 0.013 s]
[INFO] Parent pom for cachestore modules .................. SUCCESS [ 0.011 s]
[INFO] Infinispan JDBC CacheStore ......................... SUCCESS [ 1.314 s]
[INFO] Infinispan Lucene Directory Implementation ......... SUCCESS [ 1.174 s]
[INFO] Infinispan JPA CacheStore .......................... SUCCESS [ 0.599 s]
[INFO] Infinispan Hot Rod Client .......................... SUCCESS [ 1.258 s]
[INFO] Infinispan Remote CacheStore ....................... SUCCESS [ 1.234 s]
[INFO] Infinispan CLI Client .............................. SUCCESS [ 0.433 s]
[INFO] Infinispan Command Line Interface persistence ...... SUCCESS [ 0.414 s]
[INFO] Infinispan LevelDB CacheStore ...................... SUCCESS [ 1.082 s]
[INFO] Infinispan Soft-Index CacheStore ................... SUCCESS [ 0.853 s]
[INFO] Parent pom for server modules ...................... SUCCESS [ 0.010 s]
[INFO] Infinispan Server - Core Components ................ SUCCESS [ 9.145 s]
[INFO] Infinispan Memcached Server ........................ SUCCESS [ 3.542 s]
[INFO] Infinispan WebSocket Server ........................ SUCCESS [ 1.182 s]
[INFO] Infinispan Atomic Factory .......................... SUCCESS [ 0.205 s]
[INFO] Infinispan OSGi Service ............................ SUCCESS [ 0.253 s]
[INFO] Infinispan Spring 3 Integration .................... SUCCESS [ 0.497 s]
[INFO] Infinispan CLI Interpreter ......................... FAILURE [ 7.283 s]
[INFO] Infinispan Tasks API ............................... SKIPPED
[INFO] Infinispan CDI support parent ...................... SKIPPED
[INFO] Infinispan CDI support common ...................... SKIPPED
[INFO] Infinispan CDI embedded support .................... SKIPPED
[INFO] Infinispan CDI remote support ...................... SKIPPED
[INFO] Infinispan JCACHE (JSR-107) Parent ................. SKIPPED
[INFO] Infinispan JCACHE (JSR-107) Common Components ...... SKIPPED
[INFO] Infinispan JCACHE (JSR-107) Embedded Implementation SKIPPED
[INFO] Infinispan JCACHE (JSR-107) Remote Implementation .. SKIPPED
[INFO] Infinispan 8.2.4.Final ............................. SKIPPED
[INFO] ------------------------------------------------------------------------
[INFO] BUILD FAILURE
[INFO] ------------------------------------------------------------------------
[INFO] Total time: 01:08 min
[INFO] Finished at: 2020-06-02T15:15:17Z
[INFO] ------------------------------------------------------------------------
[ERROR] Failed to execute goal org.apache.maven.plugins:maven-compiler-plugin:3.8.0:compile (default-compile) on project infinispan-cli-interpreter: Compilation failure
[ERROR] An unknown compilation problem occurred
[ERROR] -> [Help 1]
[ERROR]
[ERROR] To see the full stack trace of the errors, re-run Maven with the -e switch.
[ERROR] Re-run Maven using the -X switch to enable full debug logging.
[ERROR]
[ERROR] For more information about the errors and possible solutions, please read the following articles:
[ERROR] [Help 1] http://cwiki.apache.org/confluence/display/MAVEN/MojoFailureException
[ERROR]
[ERROR] After correcting the problems, you can resume the build with the command
[ERROR] mvn -rf :infinispan-cli-interpreter
error: Bad exit status from /usr/src/tmp/rpm-tmp.66023 (%build)
RPM build errors:
Unparseable macro: % open source, and written in Java. The purpose of
Bad exit status from /usr/src/tmp/rpm-tmp.66023 (%build)
Command exited with non-zero status 1
186.10user 10.69system 1:18.95elapsed 249%CPU (0avgtext+0avgdata 928340maxresident)k
0inputs+0outputs (0major+372208minor)pagefaults 0swaps
hsh-rebuild: rebuild of `infinispan-8.2.4-alt2_5jpp8.src.rpm' failed.
Command exited with non-zero status 1
228.51user 18.85system 2:10.12elapsed 190%CPU (0avgtext+0avgdata 928340maxresident)k
187168inputs+0outputs (0major+996938minor)pagefaults 0swaps