<86>May 29 13:21:20 userdel[2365386]: delete user 'rooter'
<86>May 29 13:21:20 userdel[2365386]: removed group 'rooter' owned by 'rooter'
<86>May 29 13:21:20 groupadd[2365421]: group added to /etc/group: name=rooter, GID=573
<86>May 29 13:21:20 groupadd[2365421]: group added to /etc/gshadow: name=rooter
<86>May 29 13:21:20 groupadd[2365421]: new group: name=rooter, GID=573
<86>May 29 13:21:20 useradd[2365449]: new user: name=rooter, UID=573, GID=573, home=/root, shell=/bin/bash
<86>May 29 13:21:20 userdel[2365493]: delete user 'builder'
<86>May 29 13:21:20 userdel[2365493]: removed group 'builder' owned by 'builder'
<86>May 29 13:21:20 userdel[2365493]: removed shadow group 'builder' owned by 'builder'
<86>May 29 13:21:21 groupadd[2365534]: group added to /etc/group: name=builder, GID=574
<86>May 29 13:21:21 groupadd[2365534]: group added to /etc/gshadow: name=builder
<86>May 29 13:21:21 groupadd[2365534]: new group: name=builder, GID=574
<86>May 29 13:21:21 useradd[2365614]: new user: name=builder, UID=574, GID=574, home=/usr/src, shell=/bin/bash
/usr/src/in/srpm/kf5-krunner-5.70.0-alt1.src.rpm: bad symbols in the license tag: /
<13>May 29 13:21:23 rpmi: libxkbcommon-0.10.0-alt1 sisyphus+244530.100.1.1 1579516274 installed
<13>May 29 13:21:23 rpmi: qt5-base-common-5.12.8-alt3 sisyphus+251241.100.1.1 1588762798 installed
<13>May 29 13:21:23 rpmi: qt5-declarative-common-5.12.8-alt2 sisyphus+250091.200.1.1 1587049220 installed
<13>May 29 13:21:23 rpmi: libexpat-2.2.4-alt1 1503305345 installed
<13>May 29 13:21:23 rpmi: libmtdev-1.1.6-alt1 sisyphus+250141.100.1.1 1587131316 installed
<13>May 29 13:21:23 rpmi: udev-rules-1:245.5-alt1 sisyphus+250810.500.6.1 1588357095 installed
<13>May 29 13:21:23 rpmi: libpng16-1.6.37-alt1 sisyphus+236677.100.2.1 1566917998 installed
<13>May 29 13:21:23 rpmi: libICE-1.0.10-alt1 sisyphus+247690.100.1.1 1584000387 installed
<13>May 29 13:21:23 rpmi: libglvnd-7:1.3.1-alt1 sisyphus+247547.100.1.2 1583859568 installed
<13>May 29 13:21:23 rpmi: libwayland-server-1.18.0-alt1 sisyphus+245906.100.1.1 1581492503 installed
<13>May 29 13:21:24 rpmi: libSM-1.2.3-alt1 sisyphus+226734.100.2.1 1554586158 installed
<13>May 29 13:21:24 rpmi: rpm-macros-qt5-5.12.8-alt3 sisyphus+251241.100.1.1 1588762945 installed
<13>May 29 13:21:24 rpmi: rpm-macros-ubt-0.3-alt1 sisyphus+231357.100.1.1 1559550805 installed
<13>May 29 13:21:24 rpmi: rpm-build-xdg-0.2-alt1 1250461503 installed
<13>May 29 13:21:24 rpmi: libsqlite3-3.32.1-alt1 sisyphus+252287.100.1.1 1590532211 installed
<13>May 29 13:21:24 rpmi: libts-1.0-alt1.qa1 1366249315 installed
<13>May 29 13:21:24 rpmi: libproxy-0.4.15-alt3.1 sisyphus+249308.100.1.1 1585930360 installed
<13>May 29 13:21:24 rpmi: libpcre2-10.35-alt1 sisyphus+251510.100.1.1 1589115526 installed
<13>May 29 13:21:24 rpmi: libjpeg-2:2.0.2-alt1 sisyphus+226996.100.1.1 1554902907 installed
<13>May 29 13:21:24 rpmi: libwacom-data-1.3-alt1 sisyphus+248503.100.1.1 1585137698 installed
<13>May 29 13:21:25 rpmi: libicu66-1:6.6.1-alt1 sisyphus+247988.100.1.1 1584454027 installed
<13>May 29 13:21:25 rpmi: libqt5-core-5.12.8-alt3 sisyphus+251241.100.1.1 1588762798 installed
<13>May 29 13:21:25 rpmi: libqt5-sql-5.12.8-alt3 sisyphus+251241.100.1.1 1588762798 installed
<13>May 29 13:21:25 rpmi: libgudev-1:233-alt1 sisyphus+235422.100.1.1 1564855273 installed
<13>May 29 13:21:25 rpmi: libwacom-1.3-alt1 sisyphus+248503.100.1.1 1585137704 installed
<13>May 29 13:21:25 rpmi: libgraphite2-1.3.14-alt2 sisyphus+250009.100.1.1 1586943065 installed
<13>May 29 13:21:25 rpmi: libevdev-1.9.0-alt1 sisyphus+247242.700.7.1 1583840472 installed
<13>May 29 13:21:25 rpmi: libinput-1.15.5-alt1 sisyphus+249754.100.1.1 1586584941 installed
<13>May 29 13:21:25 rpmi: liblz4-1:1.9.2-alt1 sisyphus+238585.100.2.2 1570066927 installed
<13>May 29 13:21:25 rpmi: libgpg-error-1.36-alt1 sisyphus+225621.300.1.1 1553521082 installed
<13>May 29 13:21:25 rpmi: libgcrypt20-1.8.5-alt3 sisyphus+239622.100.1.1 1571746654 installed
<13>May 29 13:21:25 rpmi: libsystemd-1:245.5-alt1 sisyphus+250810.500.6.1 1588357136 installed
<13>May 29 13:21:25 rpmi: libdbus-1.12.16-alt2 sisyphus+240566.100.2.1 1573547696 installed
<13>May 29 13:21:25 rpmi: libqt5-dbus-5.12.8-alt3 sisyphus+251241.100.1.1 1588762798 installed
<13>May 29 13:21:25 rpmi: libbrotlicommon-1.0.7-alt1 sisyphus+226738.100.2.1 1554554568 installed
<13>May 29 13:21:25 rpmi: libbrotlidec-1.0.7-alt1 sisyphus+226738.100.2.1 1554554568 installed
<13>May 29 13:21:25 rpmi: libharfbuzz-2.6.4-alt3 sisyphus+250007.100.2.1 1586945265 installed
<13>May 29 13:21:25 rpmi: libfreetype-2.10.2-alt1 sisyphus+251736.100.1.1 1589531905 installed
<13>May 29 13:21:25 rpmi: fontconfig-2.13.1-alt1 sisyphus+247349.100.1.2 1583841221 installed
Updating fonts cache: <29>May 29 13:21:26 fontconfig: Updating fonts cache: succeeded
[ DONE ]
<13>May 29 13:21:26 rpmi: libxshmfence-1.3-alt1 sisyphus+223149.1000.2.1 1551268571 installed
<13>May 29 13:21:26 rpmi: libX11-locales-3:1.6.9-alt1 sisyphus+239210.100.1.1 1571056781 installed
<13>May 29 13:21:26 rpmi: libXdmcp-1.1.3-alt1 sisyphus+225206.600.1.2 1552949353 installed
<13>May 29 13:21:26 rpmi: libXau-1.0.9-alt1 sisyphus+223149.200.2.1 1551268152 installed
<13>May 29 13:21:27 rpmi: libxcb-1.14-alt1 sisyphus+247358.200.1.3 1583854228 installed
<13>May 29 13:21:27 rpmi: libX11-3:1.6.9-alt1 sisyphus+239210.100.1.1 1571056801 installed
<13>May 29 13:21:27 rpmi: libXext-1.3.4-alt1 sisyphus+225206.700.1.2 1552949429 installed
<13>May 29 13:21:27 rpmi: libXxf86vm-1.1.4-alt2 1527672187 installed
<13>May 29 13:21:27 rpmi: libXdamage-1.1.5-alt1 sisyphus+225206.500.1.2 1552949286 installed
<13>May 29 13:21:27 rpmi: libXfixes-5.0.3-alt1 sisyphus+226736.100.2.2 1554614841 installed
<13>May 29 13:21:27 rpmi: libXrender-0.9.8-alt1 1371312112 installed
<13>May 29 13:21:27 rpmi: libxcbutil-icccm-0.4.1-alt2 sisyphus+229000.100.1.1 1557152221 installed
<13>May 29 13:21:27 rpmi: libxcbutil-1:0.4.0-alt1 1413392888 installed
<13>May 29 13:21:27 rpmi: libxcbutil-image-0.4.0-alt1 1446204182 installed
<13>May 29 13:21:27 rpmi: libxcbutil-keysyms-0.4.0-alt1 1446204124 installed
<13>May 29 13:21:27 rpmi: libxcb-render-util-0.3.9-alt3 sisyphus+222674.100.1.1 1550989886 installed
<13>May 29 13:21:27 rpmi: libxkbcommon-x11-0.10.0-alt1 sisyphus+244530.100.1.1 1579516274 installed
<13>May 29 13:21:27 rpmi: libwayland-client-1.18.0-alt1 sisyphus+245906.100.1.1 1581492503 installed
<13>May 29 13:21:27 rpmi: libpciaccess-1:0.16-alt1 sisyphus+234814.100.1.1 1563438291 installed
<13>May 29 13:21:27 rpmi: libdrm-1:2.4.102-alt1 sisyphus+252307.100.1.1 1590574828 installed
<13>May 29 13:21:27 rpmi: libGLX-mesa-4:20.1.0-alt1 sisyphus+252339.100.1.1 1590650691 installed
<13>May 29 13:21:27 rpmi: libgbm-4:20.1.0-alt1 sisyphus+252339.100.1.1 1590650691 installed
<13>May 29 13:21:27 rpmi: libEGL-mesa-4:20.1.0-alt1 sisyphus+252339.100.1.1 1590650691 installed
<13>May 29 13:21:27 rpmi: libEGL-7:1.3.1-alt1 sisyphus+247547.100.1.2 1583859568 installed
<13>May 29 13:21:27 rpmi: libGLX-7:1.3.1-alt1 sisyphus+247547.100.1.2 1583859568 installed
<13>May 29 13:21:27 rpmi: libGL-7:1.3.1-alt1 sisyphus+247547.100.1.2 1583859568 installed
<13>May 29 13:21:27 rpmi: libp11-kit-0.23.15-alt1 sisyphus+226408.100.2.1 1554288204 installed
<13>May 29 13:21:27 rpmi: libtasn1-4.16.0-alt1 sisyphus+245480.100.1.1 1580825062 installed
<13>May 29 13:21:27 rpmi: rpm-macros-alternatives-0.5.1-alt1 sisyphus+226946.100.1.1 1554830426 installed
<13>May 29 13:21:27 rpmi: alternatives-0.5.1-alt1 sisyphus+226946.100.1.1 1554830426 installed
<13>May 29 13:21:27 rpmi: ca-certificates-2020.01.23-alt1 sisyphus+244791.300.2.1 1580285500 installed
<13>May 29 13:21:27 rpmi: ca-trust-0.1.2-alt1 sisyphus+233348.100.1.1 1561653823 installed
<13>May 29 13:21:27 rpmi: p11-kit-trust-0.23.15-alt1 sisyphus+226408.100.2.1 1554288204 installed
<13>May 29 13:21:27 rpmi: libcrypto1.1-1.1.1g-alt1 sisyphus+249982.60.8.1 1587743711 installed
<13>May 29 13:21:27 rpmi: libssl1.1-1.1.1g-alt1 sisyphus+249982.60.8.1 1587743711 installed
<13>May 29 13:21:27 rpmi: libqt5-network-5.12.8-alt3 sisyphus+251241.100.1.1 1588762798 installed
<13>May 29 13:21:27 rpmi: libqt5-xcbqpa-5.12.8-alt3 sisyphus+251241.100.1.1 1588762798 installed
<13>May 29 13:21:27 rpmi: libqt5-eglfskmssupport-5.12.8-alt3 sisyphus+251241.100.1.1 1588762798 installed
<13>May 29 13:21:27 rpmi: libqt5-eglfsdeviceintegration-5.12.8-alt3 sisyphus+251241.100.1.1 1588762798 installed
<13>May 29 13:21:28 rpmi: libqt5-gui-5.12.8-alt3 sisyphus+251241.100.1.1 1588762798 installed
<13>May 29 13:21:28 rpmi: libqt5-quickshapes-5.12.8-alt2 sisyphus+250091.200.1.1 1587049220 installed
<13>May 29 13:21:28 rpmi: libqt5-quick-5.12.8-alt2 sisyphus+250091.200.1.1 1587049220 installed
<13>May 29 13:21:28 rpmi: libqt5-qml-5.12.8-alt2 sisyphus+250091.200.1.1 1587049220 installed
<13>May 29 13:21:28 rpmi: rpm-build-qml-5.12.8-alt2 sisyphus+250091.200.1.1 1587049220 installed
<13>May 29 13:21:28 rpmi: rpm-build-kf5-5.12.0-alt2 sisyphus+226903.100.1.1 1554799142 installed
<13>May 29 13:21:28 rpmi: rpm-build-ubt-0.3.1-alt3 sisyphus+226718.100.2.1 1554584225 installed
<13>May 29 13:21:36 rpmi: kf5-filesystem-5.60.0-alt1 sisyphus+234706.100.1.1 1563356908 installed
<13>May 29 13:21:36 rpmi: libqt5-widgets-5.12.8-alt3 sisyphus+251241.100.1.1 1588762798 installed
<13>May 29 13:21:36 rpmi: libqt5-xml-5.12.8-alt3 sisyphus+251241.100.1.1 1588762798 installed
<13>May 29 13:21:36 rpmi: libogg-1.3.4-alt1 sisyphus+247109.100.1.1 1582849994 installed
<13>May 29 13:21:36 rpmi: libvorbis-1.3.6-alt2 sisyphus+220072.200.2.2 1548744475 installed
<13>May 29 13:21:36 rpmi: libwebp7-1.1.0-alt1 sisyphus+243895.100.1.1 1578410873 installed
<13>May 29 13:21:36 rpmi: perl-HTTP-Date-6.04-alt1 sisyphus+241046.100.1.1 1574192946 installed
<13>May 29 13:21:36 rpmi: libraw1394-11-2.1.2-alt1 sisyphus+225496.100.2.1 1553244590 installed
<13>May 29 13:21:36 rpmi: liborc-0.4.31-alt1 sisyphus+240181.100.1.1 1572853315 installed
<13>May 29 13:21:36 rpmi: libfribidi-1.0.9-alt1 sisyphus+247242.1500.7.1 1583840860 installed
<13>May 29 13:21:36 rpmi: libtheora-2:1.1.1-alt6 sisyphus+223372.100.2.1 1551525762 installed
<13>May 29 13:21:36 rpmi: libqt5-opengl-5.12.8-alt3 sisyphus+251241.100.1.1 1588762798 installed
<13>May 29 13:21:36 rpmi: libqt5-test-5.12.8-alt3 sisyphus+251241.100.1.1 1588762798 installed
<13>May 29 13:21:36 rpmi: libva-2.7.1-alt1 sisyphus+251703.100.1.1 1589461900 installed
<13>May 29 13:21:36 rpmi: libopenjpeg2.0-2.3.1-alt1 sisyphus+226454.100.1.1 1554284337 installed
<13>May 29 13:21:36 rpmi: libserd-0.30.2-alt1_1 sisyphus+243654.100.1.1 1577467451 installed
<13>May 29 13:21:36 rpmi: libdvdread8-6.1.1-alt1 sisyphus+250140.300.10.1 1587542974 installed
<13>May 29 13:21:36 rpmi: libspeex-1.2-alt1 1528115225 installed
<13>May 29 13:21:36 rpmi: libgsm-1.0.17-alt1 1523356165 installed
<13>May 29 13:21:36 rpmi: liblcms2-2.9-alt1 1516411892 installed
<13>May 29 13:21:36 rpmi: libusb-1.0.23-alt1 sisyphus+237317.100.1.1 1568059905 installed
<13>May 29 13:21:36 rpmi: perl-XML-NamespaceSupport-1.12-alt1 1491296348 installed
<13>May 29 13:21:36 rpmi: libopus-1.3.1-alt3 sisyphus+248017.100.1.1 1584520433 installed
<13>May 29 13:21:36 rpmi: libidn2-2.3.0-alt1 sisyphus+240846.100.1.2 1573870475 installed
<13>May 29 13:21:36 rpmi: libcom_err-1.44.6-alt1 sisyphus+224154.100.1.1 1552091678 installed
<13>May 29 13:21:36 rpmi: libnettle8-3.6-alt1 sisyphus+251637.100.3.1 1590060253 installed
<13>May 29 13:21:36 rpmi: libgomp1-9.3.1-alt1 sisyphus+251917.40.3.1 1589812684 installed
<13>May 29 13:21:36 rpmi: libdc1394-22-2.2.5-alt1 1529659263 installed
<13>May 29 13:21:36 rpmi: libsord-0.16.4-alt1_3 sisyphus+248484.100.1.2 1585125767 installed
<13>May 29 13:21:36 rpmi: libass9-0.14.0-alt1 sisyphus+220287.100.1.1 1548927397 installed
<13>May 29 13:21:36 rpmi: libflac8-1.3.3-alt1 sisyphus+247112.100.1.1 1582855667 installed
<13>May 29 13:21:36 rpmi: libsndfile-1.0.28-alt2 sisyphus.212728.100 1536333068 installed
<13>May 29 13:21:36 rpmi: libqt5-quickwidgets-5.12.8-alt2 sisyphus+250091.200.1.1 1587049220 installed
<13>May 29 13:21:36 rpmi: kf5-kdeclarative-common-5.70.0-alt1 sisyphus+251665.6000.1.2 1589470971 installed
<13>May 29 13:21:37 rpmi: kf5-kio-common-5.70.1-alt2 sisyphus+251950.100.1.2 1589890160 installed
<13>May 29 13:21:38 rpmi: libxcb-devel-1.14-alt1 sisyphus+247358.200.1.3 1583854228 installed
<13>May 29 13:21:38 rpmi: libvdpau-1:1.3-alt1 sisyphus+236768.100.1.1 1567066130 installed
<13>May 29 13:21:38 rpmi: libavutil56-2:4.2.3-alt1 sisyphus+252236.200.2.1 1590410990 installed
<13>May 29 13:21:38 rpmi: libswscale5-2:4.2.3-alt1 sisyphus+252236.200.2.1 1590410990 installed
<13>May 29 13:21:38 rpmi: libx265-176-3.1.2-alt1 sisyphus+242600.100.2.1 1576573626 installed
<13>May 29 13:21:38 rpmi: libx264-148-alt2 1496163832 installed
<13>May 29 13:21:38 rpmi: libopencore-amrwb0-0.1.5-alt1 1529659346 installed
<13>May 29 13:21:38 rpmi: libopencore-amrnb0-0.1.5-alt1 1529659346 installed
<13>May 29 13:21:38 rpmi: libxslt-1.1.34-alt2 sisyphus+248264.100.1.1 1584829770 installed
<13>May 29 13:21:38 rpmi: libbs2b-3.1.0-alt1.3 1327614927 installed
<13>May 29 13:21:38 rpmi: ilmbase24-common-2.3.0-alt1 sisyphus+237892.300.1.1 1568978210 installed
<13>May 29 13:21:38 rpmi: libiex24-2.3.0-alt1 sisyphus+237892.300.1.1 1568978210 installed
<13>May 29 13:21:38 rpmi: libhalf24-2.3.0-alt1 sisyphus+237892.300.1.1 1568978210 installed
<13>May 29 13:21:38 rpmi: libwavpack-5.3.0-alt1 sisyphus+251276.100.1.1 1588785031 installed
<13>May 29 13:21:39 rpmi: libvpx6-1.8.2-alt1 sisyphus+243422.100.1.1 1577075240 installed
<13>May 29 13:21:39 rpmi: libv4l-1.20.0-alt1 sisyphus+252084.100.1.1 1590156518 installed
<13>May 29 13:21:39 rpmi: libtwolame-0.4.0-alt1 sisyphus+239176.100.2.1 1571294398 installed
<13>May 29 13:21:39 rpmi: liblame-3.100-alt1 1527082574 installed
<13>May 29 13:21:39 rpmi: libjack-1:1.9.14-alt1 sisyphus+251263.200.3.1 1588856135 installed
<13>May 29 13:21:39 rpmi: libjasper-2.0.16-alt1 sisyphus+231386.100.1.1 1559568070 installed
<13>May 29 13:21:39 rpmi: libepoxy-1.5.4-alt1 sisyphus+242061.100.1.1 1575190160 installed
<13>May 29 13:21:39 rpmi: libXrandr-1.5.2-alt1 sisyphus+225206.1300.1.2 1552949710 installed
<13>May 29 13:21:39 rpmi: perl-LWP-MediaTypes-6.04-alt1 sisyphus+225468.100.1.1 1553186684 installed
<13>May 29 13:21:39 rpmi: perl-Compress-Raw-Zlib-2.093-alt1 sisyphus+242766.100.1.1 1576089368 installed
<13>May 29 13:21:39 rpmi: perl-libnet-1:3.11-alt1 1511423541 installed
<13>May 29 13:21:39 rpmi: perl-XML-SAX-Base-1.09-alt1 1494364363 installed
<13>May 29 13:21:39 rpmi: libdv-1.0.0-alt5.7 sisyphus+220898.5400.11.1 1551973592 installed
<13>May 29 13:21:39 rpmi: libwayland-egl-4:18.1.0-alt1 sisyphus+245906.100.1.1 1581492503 installed
<13>May 29 13:21:39 rpmi: libXv-1.0.11-alt1 1527685499 installed
<13>May 29 13:21:39 rpmi: qt5-location-common-5.12.8-alt1 sisyphus+249726.1000.3.1 1586852691 installed
<13>May 29 13:21:39 rpmi: qt5-tools-common-5.12.8-alt2 sisyphus+250091.400.1.1 1587048925 installed
<13>May 29 13:21:39 rpmi: qt5-connectivity-common-5.12.8-alt1 sisyphus+249726.2100.3.1 1586854488 installed
<13>May 29 13:21:39 rpmi: libglog-0.3.4-alt4 sisyphus+235324.300.2.1 1564663103 installed
<13>May 29 13:21:39 rpmi: libopenblas-0.2.20-alt2 sisyphus+229410.100.1.1 1557920019 installed
<13>May 29 13:21:39 rpmi: libat-spi2-core-2.36.0-alt1 sisyphus+247780.1600.3.2 1584200495 installed
<13>May 29 13:21:39 rpmi: shared-mime-info-2.0-alt1 sisyphus+251302.100.1.1 1588847607 installed
<13>May 29 13:21:39 rpmi: libXtst-1.2.2-alt1 1369984893 installed
<13>May 29 13:21:39 rpmi: icon-theme-hicolor-0.17-alt2 sisyphus+248343.100.1.1 1584979043 installed
<13>May 29 13:21:39 rpmi: menu-icons-default-0.2.0.20-alt1 1479213521 installed
<13>May 29 13:21:39 rpmi: altlinux-freedesktop-menu-icon-theme-default-0.0.26-alt1 1366231495 installed
<13>May 29 13:21:39 rpmi: libqt5-bluetooth-5.12.8-alt1 sisyphus+249726.2100.3.1 1586854256 installed
<13>May 29 13:21:39 rpmi: libqt5-nfc-5.12.8-alt1 sisyphus+249726.2100.3.1 1586854256 installed
<13>May 29 13:21:40 rpmi: libqt5-designer-5.12.8-alt2 sisyphus+250091.400.1.1 1587050397 installed
<13>May 29 13:21:40 rpmi: libqt5-help-5.12.8-alt2 sisyphus+250091.400.1.1 1587050397 installed
<13>May 29 13:21:40 rpmi: libzbar-0.23-alt1 sisyphus+245000.31500.84.1 1583640048 installed
<13>May 29 13:21:40 rpmi: libilmthread24-2.3.0-alt1 sisyphus+237892.300.1.1 1568978210 installed
<13>May 29 13:21:40 rpmi: libpostproc55-2:4.2.3-alt1 sisyphus+252236.200.2.1 1590410990 installed
<13>May 29 13:21:40 rpmi: libavresample4-2:4.2.3-alt1 sisyphus+252236.200.2.1 1590410990 installed
<13>May 29 13:21:40 rpmi: libkf5calendarevents-5.70.0-alt1 sisyphus+251665.6000.1.2 1589470734 installed
<13>May 29 13:21:40 rpmi: libinstpatch-1.1.4-alt1 sisyphus+249518.100.1.1 1586239308 installed
<13>May 29 13:21:40 rpmi: libsamplerate-0.1.9-alt2 1487790086 installed
<13>May 29 13:21:40 rpmi: libsratom-0.6.4-alt1_2 sisyphus+248922.100.1.1 1585587247 installed
<13>May 29 13:21:40 rpmi: liblilv-0.24.6-alt1_2 sisyphus+248927.100.1.3 1585591232 installed
<13>May 29 13:21:40 rpmi: libvidstab-1.1.0-alt2 sisyphus+247392.100.1.1 1583425859 installed
<13>May 29 13:21:40 rpmi: libarchive13-3.4.0-alt1 sisyphus+251637.300.3.1 1590062207 installed
<13>May 29 13:21:40 rpmi: libhogweed6-3.6-alt1 sisyphus+251637.100.3.1 1590060253 installed
<13>May 29 13:21:40 rpmi: libgnutls30-3.6.13-alt1 sisyphus+251637.200.3.1 1590062083 installed
<13>May 29 13:21:40 rpmi: libe2fs-1.44.6-alt1 sisyphus+224154.100.1.1 1552091678 installed
<13>May 29 13:21:40 rpmi: libshout2-2.2.2-alt3 1303374835 installed
<13>May 29 13:21:40 rpmi: libdvdnav-6.1.0-alt1 sisyphus+250140.340.10.1 1587543016 installed
<13>May 29 13:21:40 rpmi: libqt5-quicktest-5.12.8-alt2 sisyphus+250091.200.1.1 1587049220 installed
<13>May 29 13:21:40 rpmi: libavc1394-0.5.4-alt1.qa1 1460816781 installed
<13>May 29 13:21:40 rpmi: libiec61883-1.2.0-alt1.qa1 1460815903 installed
<13>May 29 13:21:40 rpmi: perl-File-Listing-6.04-alt1 1329758996 installed
<13>May 29 13:21:40 rpmi: qt5-quickcontrols-5.12.8-alt1 sisyphus+249726.1300.3.1 1586853239 installed
<13>May 29 13:21:40 rpmi: libdbusmenu-qt52-0.9.3-alt0.3 1463760060 installed
<13>May 29 13:21:40 rpmi: kf5-attica-common-5.70.0-alt1 sisyphus+251665.400.1.2 1589465661 installed
<13>May 29 13:21:40 rpmi: libkf5attica-5.70.0-alt1 sisyphus+251665.400.1.2 1589465640 installed
<13>May 29 13:21:40 rpmi: kf5-kactivities-common-5.70.0-alt1 sisyphus+251665.10200.1.2 1589472828 installed
<13>May 29 13:21:40 rpmi: kf5-karchive-common-5.70.0-alt1 sisyphus+251665.2100.1.2 1589467250 installed
<13>May 29 13:21:40 rpmi: libkf5archive-5.70.0-alt1 sisyphus+251665.2100.1.2 1589467159 installed
<13>May 29 13:21:40 rpmi: kf5-kauth-common-5.70.0-alt1 sisyphus+251665.2500.1.2 1589467737 installed
<13>May 29 13:21:40 rpmi: kf5-kcoreaddons-common-5.70.0-alt1 sisyphus+251665.2300.1.2 1589467470 installed
<13>May 29 13:21:40 rpmi: libkf5coreaddons-5.70.0-alt1 sisyphus+251665.2300.1.2 1589467391 installed
<13>May 29 13:21:40 rpmi: libkf5authcore-5.70.0-alt1 sisyphus+251665.2500.1.2 1589467607 installed
<13>May 29 13:21:40 rpmi: libkf5kiontlm-5.70.1-alt2 sisyphus+251950.100.1.2 1589890197 installed
<13>May 29 13:21:40 rpmi: kf5-kbookmarks-common-5.70.0-alt1 sisyphus+251665.5100.1.2 1589470024 installed
<13>May 29 13:21:41 rpmi: kf5-kcodecs-common-5.70.0-alt1 sisyphus+251665.1100.1.2 1589466169 installed
<13>May 29 13:21:41 rpmi: libkf5codecs-5.70.0-alt1 sisyphus+251665.1100.1.2 1589466171 installed
<13>May 29 13:21:41 rpmi: kf5-kcodecs-devel-5.70.0-alt1 sisyphus+251665.1100.1.2 1589466171 installed
<13>May 29 13:21:41 rpmi: kf5-kconfig-common-5.70.0-alt1 sisyphus+251665.1600.1.2 1589466921 installed
<13>May 29 13:21:41 rpmi: libkf5configcore-5.70.0-alt1 sisyphus+251665.1600.1.2 1589466786 installed
<13>May 29 13:21:41 rpmi: libkf5configgui-5.70.0-alt1 sisyphus+251665.1600.1.2 1589466786 installed
<13>May 29 13:21:41 rpmi: kf5-kconfig-devel-5.70.0-alt1 sisyphus+251665.1600.1.2 1589466786 installed
<13>May 29 13:21:41 rpmi: libkf5activities-5.70.0-alt1 sisyphus+251665.10200.1.2 1589472602 installed
<13>May 29 13:21:41 rpmi: kf5-kguiaddons-common-5.70.0-alt1 sisyphus+251665.1200.1.2 1589466251 installed
<13>May 29 13:21:41 rpmi: kf5-ki18n-common-5.70.0-alt1 sisyphus+251665.3100.1.2 1589468124 installed
<13>May 29 13:21:41 rpmi: libkf5i18n-5.70.0-alt1 sisyphus+251665.3100.1.2 1589467987 installed
<13>May 29 13:21:41 rpmi: kf5-kwidgetsaddons-common-5.70.0-alt1 sisyphus+251665.1400.1.2 1589466510 installed
<13>May 29 13:21:41 rpmi: libkf5widgetsaddons-5.70.0-alt1 sisyphus+251665.1400.1.2 1589466450 installed
<13>May 29 13:21:41 rpmi: kf5-kwidgetsaddons-devel-5.70.0-alt1 sisyphus+251665.1400.1.2 1589466450 installed
<13>May 29 13:21:41 rpmi: kf5-kconfigwidgets-common-5.70.0-alt1 sisyphus+251665.3600.1.2 1589468755 installed
<13>May 29 13:21:41 rpmi: kf5-kglobalaccel-common-5.70.0-alt1 sisyphus+251665.4000.1.2 1589468989 installed
<13>May 29 13:21:41 rpmi: kf5-kitemviews-common-5.70.0-alt1 sisyphus+251665.600.1.2 1589465886 installed
<13>May 29 13:21:41 rpmi: libkf5itemviews-5.70.0-alt1 sisyphus+251665.600.1.2 1589465874 installed
<13>May 29 13:21:41 rpmi: kf5-kitemviews-devel-5.70.0-alt1 sisyphus+251665.600.1.2 1589465874 installed
<13>May 29 13:21:41 rpmi: kf5-kiconthemes-common-5.70.0-alt1 sisyphus+251665.4100.1.2 1589469095 installed
<13>May 29 13:21:41 rpmi: kf5-kwindowsystem-common-5.70.0-alt1 sisyphus+251665.1700.1.2 1589467029 installed
<13>May 29 13:21:42 rpmi: kf5-kxmlgui-common-5.70.0-alt1 sisyphus+251665.5000.1.2 1589469902 installed
<13>May 29 13:21:42 rpmi: kf5-kcompletion-common-5.70.0-alt1 sisyphus+251665.3000.1.2 1589468030 installed
<13>May 29 13:21:42 rpmi: libkf5completion-5.70.0-alt1 sisyphus+251665.3000.1.2 1589467885 installed
<13>May 29 13:21:42 rpmi: kf5-kcompletion-devel-5.70.0-alt1 sisyphus+251665.3000.1.2 1589467885 installed
<13>May 29 13:21:42 rpmi: kf5-kcrash-common-5.70.0-alt1 sisyphus+251665.2600.1.2 1589467842 installed
<13>May 29 13:21:42 rpmi: kf5-kdbusaddons-common-5.70.0-alt1 sisyphus+251665.2200.1.2 1589467358 installed
<13>May 29 13:21:42 rpmi: kf5-kjobwidgets-common-5.70.0-alt1 sisyphus+251665.2700.1.2 1589467931 installed
<13>May 29 13:21:42 rpmi: kf5-kservice-common-5.70.0-alt1 sisyphus+251665.3700.1.2 1589468852 installed
<13>May 29 13:21:42 rpmi: kf5-solid-common-5.70.0-alt1 sisyphus+251665.2000.1.2 1589467149 installed
<13>May 29 13:21:42 rpmi: kf5-knotifications-common-5.70.0-alt1 sisyphus+251665.4200.1.2 1589469209 installed
<13>May 29 13:21:42 rpmi: kf5-kpackage-common-5.70.0-alt1 sisyphus+251665.5200.1.2 1589470133 installed
<13>May 29 13:21:42 rpmi: libkf5package-5.70.0-alt1 sisyphus+251665.5200.1.2 1589469854 installed
<13>May 29 13:21:42 rpmi: kf5-ktextwidgets-common-5.70.0-alt1 sisyphus+251665.4700.1.2 1589469778 installed
<13>May 29 13:21:42 rpmi: kf5-sonnet-common-5.70.0-alt1 sisyphus+251665.1500.1.2 1589466581 installed
<13>May 29 13:21:42 rpmi: kf5-kwayland-common-5.70.0-alt1 sisyphus+251665.300.1.2 1589465507 installed
<13>May 29 13:21:42 rpmi: libkf5waylandclient-5.70.0-alt1 sisyphus+251665.300.1.2 1589465520 installed
<13>May 29 13:21:42 rpmi: kf5-plasma-framework-common-5.70.1-alt1 sisyphus+251941.100.1.1 1589877037 installed
<86>May 29 13:21:42 groupadd[2426546]: group added to /etc/group: name=messagebus, GID=499
<86>May 29 13:21:42 groupadd[2426546]: group added to /etc/gshadow: name=messagebus
<86>May 29 13:21:42 groupadd[2426546]: new group: name=messagebus, GID=499
<86>May 29 13:21:42 useradd[2426578]: new user: name=messagebus, UID=499, GID=499, home=/run/dbus, shell=/dev/null
<13>May 29 13:21:42 rpmi: dbus-1.12.16-alt2 sisyphus+240566.100.2.1 1573547696 installed
<13>May 29 13:21:42 rpmi: dbus-tools-1.12.16-alt2 sisyphus+240566.100.2.1 1573547696 installed
<13>May 29 13:21:42 rpmi: dbus-tools-gui-1.12.16-alt2 sisyphus+240566.100.2.1 1573547696 installed
<13>May 29 13:21:42 rpmi: libqt5-quickparticles-5.12.8-alt2 sisyphus+250091.200.1.1 1587049220 installed
<13>May 29 13:21:42 rpmi: libkf5threadweaver-5.70.0-alt1 sisyphus+251665.1000.1.2 1589466057 installed
<13>May 29 13:21:42 rpmi: libtdb-1.4.3-alt1 sisyphus+245000.32340.79.1 1583252597 installed
<13>May 29 13:21:42 rpmi: libltdl7-2.4.6-alt1 sisyphus+226971.100.2.1 1554906368 installed
<13>May 29 13:21:42 rpmi: sound-theme-freedesktop-0.8-alt1 1402011605 installed
<13>May 29 13:21:42 rpmi: qt5-speech-common-5.12.8-alt1 sisyphus+249726.3500.3.1 1586860833 installed
<13>May 29 13:21:42 rpmi: libspeechd-0.8.8-alt2 sisyphus+227564.400.1.2 1555993493 installed
<13>May 29 13:21:42 rpmi: libhunspell-1.7.0-alt1 sisyphus+226731.100.2.1 1554585904 installed
<13>May 29 13:21:42 rpmi: libkf5sonnetcore-5.70.0-alt1 sisyphus+251665.1500.1.2 1589466581 installed
<13>May 29 13:21:42 rpmi: libkf5sonnetui-5.70.0-alt1 sisyphus+251665.1500.1.2 1589466581 installed
<13>May 29 13:21:42 rpmi: kf5-sonnet-devel-5.70.0-alt1 sisyphus+251665.1500.1.2 1589466581 installed
<13>May 29 13:21:42 rpmi: media-player-info-24-alt1 sisyphus+238163.100.1.2 1569417389 installed
<13>May 29 13:21:42 rpmi: libkf5solid-5.70.0-alt1 sisyphus+251665.2000.1.2 1589467037 installed
<13>May 29 13:21:42 rpmi: kf5-solid-devel-5.70.0-alt1 sisyphus+251665.2000.1.2 1589467037 installed
<13>May 29 13:21:42 rpmi: su-0.60-alt35 1484567251 installed
<13>May 29 13:21:42 rpmi: url_handler-0.3.1-alt1 1290564262 installed
<13>May 29 13:21:42 rpmi: libXt-1.2.0-alt1 sisyphus+247690.400.1.1 1584000596 installed
<13>May 29 13:21:42 rpmi: libXmu-1.1.3-alt1 sisyphus+225206.1200.1.2 1552949641 installed
<13>May 29 13:21:42 rpmi: xset-1.2.4-alt1 sisyphus.213358.100 1537438594 installed
<13>May 29 13:21:42 rpmi: xprop-1.2.4-alt1 sisyphus+225764.100.1.1 1553680703 installed
<13>May 29 13:21:42 rpmi: xdg-utils-1.1.3-alt6 sisyphus+233067.100.1.1 1561332512 installed
<13>May 29 13:21:42 rpmi: desktop-file-utils-0.23-alt2 sisyphus+226879.100.1.1 1554744356 installed
<13>May 29 13:21:42 rpmi: libqt5-concurrent-5.12.8-alt3 sisyphus+251241.100.1.1 1588762798 installed
<13>May 29 13:21:42 rpmi: xxd-4:8.2.0011-alt2 sisyphus+249605.100.1.1 1586355662 installed
<13>May 29 13:21:43 rpmi: libxkbcommon-devel-0.10.0-alt1 sisyphus+244530.100.1.1 1579516274 installed
<13>May 29 13:21:43 rpmi: libGLES-7:1.3.1-alt1 sisyphus+247547.100.1.2 1583859568 installed
<13>May 29 13:21:43 rpmi: libOpenGL-7:1.3.1-alt1 sisyphus+247547.100.1.2 1583859568 installed
<13>May 29 13:21:43 rpmi: xorg-proto-devel-2020.1-alt1 sisyphus+250406.100.1.1 1587554810 installed
<13>May 29 13:21:43 rpmi: libX11-devel-3:1.6.9-alt1 sisyphus+239210.100.1.1 1571056801 installed
<13>May 29 13:21:43 rpmi: libglvnd-devel-7:1.3.1-alt1 sisyphus+247547.100.1.2 1583859568 installed
<13>May 29 13:21:43 rpmi: gcc-c++-common-1.4.24-alt3 sisyphus+243033.100.1.1 1576462403 installed
<13>May 29 13:21:43 rpmi: libstdc++9-devel-9.3.1-alt1 sisyphus+251917.40.3.1 1589812684 installed
<13>May 29 13:21:44 rpmi: gcc9-c++-9.3.1-alt1 sisyphus+251917.40.3.1 1589812684 installed
<13>May 29 13:21:44 rpmi: gcc-c++-9-alt2 sisyphus+251923.100.2.2 1589881401 installed
<13>May 29 13:21:44 rpmi: qt5-xmlpatterns-common-5.12.8-alt2 sisyphus+250091.300.1.1 1587048483 installed
<13>May 29 13:21:44 rpmi: libqt5-xmlpatterns-5.12.8-alt2 sisyphus+250091.300.1.1 1587049816 installed
<13>May 29 13:21:44 rpmi: qt5-x11extras-common-5.12.8-alt1 sisyphus+249726.1500.3.1 1586853661 installed
<13>May 29 13:21:44 rpmi: libqt5-x11extras-5.12.8-alt1 sisyphus+249726.1500.3.1 1586853548 installed
<13>May 29 13:21:44 rpmi: libkf5windowsystem-5.70.0-alt1 sisyphus+251665.1700.1.2 1589466895 installed
<13>May 29 13:21:44 rpmi: libkf5globalaccel-5.70.0-alt1 sisyphus+251665.4000.1.2 1589468816 installed
<13>May 29 13:21:45 rpmi: libkf5guiaddons-5.70.0-alt1 sisyphus+251665.1200.1.2 1589466251 installed
<13>May 29 13:21:45 rpmi: libkf5configwidgets-5.70.0-alt1 sisyphus+251665.3600.1.2 1589468602 installed
<13>May 29 13:21:45 rpmi: libkf5dbusaddons-5.70.0-alt1 sisyphus+251665.2200.1.2 1589467285 installed
<13>May 29 13:21:45 rpmi: libkf5crash-5.70.0-alt1 sisyphus+251665.2600.1.2 1589467693 installed
<13>May 29 13:21:45 rpmi: kf5-kwindowsystem-devel-5.70.0-alt1 sisyphus+251665.1700.1.2 1589466895 installed
<13>May 29 13:21:45 rpmi: libkf5jobwidgets-5.70.0-alt1 sisyphus+251665.2700.1.2 1589467783 installed
<13>May 29 13:21:45 rpmi: libkf5globalaccelprivate-5.70.0-alt1 sisyphus+251665.4000.1.2 1589468816 installed
<13>May 29 13:21:45 rpmi: qt5-websockets-common-5.12.8-alt1 sisyphus+249726.500.3.1 1586851880 installed
<13>May 29 13:21:45 rpmi: libqt5-websockets-5.12.8-alt1 sisyphus+249726.500.3.1 1586851861 installed
<13>May 29 13:21:45 rpmi: qt5-webkit-common-5.212.0-alt16 sisyphus+249726.4300.3.1 1586862903 installed
<13>May 29 13:21:45 rpmi: qt5-webchannel-common-5.12.8-alt1 sisyphus+249726.1200.3.1 1586853167 installed
<13>May 29 13:21:45 rpmi: libqt5-webchannel-5.12.8-alt1 sisyphus+249726.1200.3.1 1586853068 installed
<13>May 29 13:21:46 rpmi: libqt5-webkit-5.212.0-alt16 sisyphus+249726.4300.3.1 1586862193 installed
<13>May 29 13:21:46 rpmi: qt5-svg-common-5.12.8-alt1 sisyphus+249726.1700.3.1 1586853867 installed
<13>May 29 13:21:46 rpmi: libqt5-svg-5.12.8-alt1 sisyphus+249726.1700.3.1 1586853706 installed
<13>May 29 13:21:46 rpmi: libkf5iconthemes-5.70.0-alt1 sisyphus+251665.4100.1.2 1589468912 installed
<13>May 29 13:21:46 rpmi: qt5-sensors-common-5.12.8-alt1 sisyphus+249726.1100.3.1 1586853072 installed
<13>May 29 13:21:46 rpmi: libqt5-sensors-5.12.8-alt1 sisyphus+249726.1100.3.1 1586852976 installed
<13>May 29 13:21:46 rpmi: qt5-remoteobjects-common-5.12.8-alt1 sisyphus+249726.4200.3.1 1586862078 installed
<13>May 29 13:21:46 rpmi: libqt5-remoteobjects-5.12.8-alt1 sisyphus+249726.4200.3.1 1586861383 installed
<13>May 29 13:21:46 rpmi: qt5-networkauth-common-5.12.8-alt1 sisyphus+249726.4100.3.1 1586861933 installed
<13>May 29 13:21:46 rpmi: libqt5-networkauth-5.12.8-alt1 sisyphus+249726.4100.3.1 1586861272 installed
<13>May 29 13:21:46 rpmi: qt5-multimedia-common-5.12.8-alt1 sisyphus+249726.600.3.1 1586852229 installed
<13>May 29 13:21:46 rpmi: libopenal1-1.19.1-alt1 sisyphus+222956.100.1.1 1551298524 installed
<13>May 29 13:21:46 rpmi: libzeromq-4.2.3-alt1 1513846894 installed
<13>May 29 13:21:46 rpmi: libmpeg2-0.5.1-alt3.svn20120718 1410845588 installed
<13>May 29 13:21:46 rpmi: libcdio-2.1.0-alt1 sisyphus+242329.100.3.1 1575837114 installed
<13>May 29 13:21:46 rpmi: liba52-0.7.4-alt9 1528303351 installed
<13>May 29 13:21:46 rpmi: libwebrtc-0.3-alt2 sisyphus+229377.100.1.1 1557873871 installed
<13>May 29 13:21:46 rpmi: vulkan-filesystem-1.1.121-alt1.1 sisyphus+236811.500.2.1 1567091259 installed
<13>May 29 13:21:46 rpmi: libvulkan1-1.1.121-alt1.1 sisyphus+236811.500.2.1 1567091322 installed
<13>May 29 13:21:46 rpmi: libvo-amrwbenc-0.1.3-alt1 1465493713 installed
<13>May 29 13:21:46 rpmi: libvo-aacenc-0.1.3-alt1 1393497440 installed
<13>May 29 13:21:46 rpmi: libsbc-1.2-alt1.1 1501780340 installed
<13>May 29 13:21:46 rpmi: libtbb-2020.2-alt1 sisyphus+249584.500.4.1 1586357620 installed
<13>May 29 13:21:47 rpmi: libprotobuf22-3.11.4-alt1 sisyphus+247781.40.2.1 1584113681 installed
<13>May 29 13:21:47 rpmi: libgflags-2.2.2-alt1 sisyphus+235324.400.2.1 1564663147 installed
<13>May 29 13:21:47 rpmi: libjson-c5-0.14-alt1 sisyphus+251354.100.1.1 1588981964 installed
<13>May 29 13:21:47 rpmi: libCharLS2-2.0.0-alt1_3 sisyphus+246862.100.1.1 1582570533 installed
<13>May 29 13:21:47 rpmi: gdcm-3.0.5-alt1_0 sisyphus+251558.100.1.1 1589218627 installed
<13>May 29 13:21:47 rpmi: libgme-0.6.1-alt1 1521318055 installed
<13>May 29 13:21:47 rpmi: libudfread-1.0.0-alt3 1528906339 installed
<13>May 29 13:21:47 rpmi: libbluray-1.0.2-alt2 sisyphus+238344.100.1.1 1569839188 installed
<13>May 29 13:21:47 rpmi: libsoxr-0.1.2-alt4 sisyphus+222649.100.1.1 1550964843 installed
<13>May 29 13:21:47 rpmi: libswresample3-2:4.2.3-alt1 sisyphus+252236.200.2.1 1590410990 installed
<13>May 29 13:21:47 rpmi: libzvbi-0.2.35-alt1 sisyphus+223374.100.1.1 1551507906 installed
<13>May 29 13:21:47 rpmi: libxvid-1.3.4-alt1 1507033991 installed
<13>May 29 13:21:47 rpmi: libsnappy-1.1.7-alt1 sisyphus+227320.100.1.3 1555618694 installed
<13>May 29 13:21:47 rpmi: libdav1d-0.5.2-alt1 sisyphus+245080.100.1.1 1580063364 installed
<13>May 29 13:21:47 rpmi: libcodec2-0.8.1-alt1 1533802541 installed
<13>May 29 13:21:48 rpmi: libaom-1.0.0-alt2 sisyphus+235903.100.1.1 1565598682 installed
<13>May 29 13:21:48 rpmi: libfftw3-common-3.3.8-alt1 sisyphus+247390.100.1.1 1583426835 installed
<13>May 29 13:21:48 rpmi: libfftw3-3.3.8-alt1 sisyphus+247390.100.1.1 1583426459 installed
<13>May 29 13:21:48 rpmi: libofa-0.9.3-alt4.1.qa3 1506957671 installed
<13>May 29 13:21:48 rpmi: librubberband-1.8.1-alt1.hg20140905.1 1434271537 installed
<13>May 29 13:21:48 rpmi: libmodplug-0.8.9.0-alt1 sisyphus+224334.100.1.1 1552243563 installed
<13>May 29 13:21:48 rpmi: libmms-0.6.4-alt1 1409679935 installed
<13>May 29 13:21:48 rpmi: libyajl-2.1.0-alt1 1399891591 installed
<13>May 29 13:21:48 rpmi: libkate-0.4.1-alt1.4 sisyphus+223368.100.1.1 1551503985 installed
<13>May 29 13:21:48 rpmi: liblash-1:0.5.4-alt1_40 sisyphus+237783.100.1.1 1568832182 installed
<13>May 29 13:21:48 rpmi: libSDL2-2.0.12-alt2 sisyphus+247917.100.1.1 1584363412 installed
<13>May 29 13:21:48 rpmi: libfaad2-2.7-alt6 sisyphus+220898.4600.11.1 1551973412 installed
<13>May 29 13:21:48 rpmi: libdca0-0.0.5-alt4.qa1 sisyphus+222535.100.1.1 1550881649 installed
<13>May 29 13:21:48 rpmi: libsoundtouch-2.1.2-alt1 sisyphus+222705.100.1.1 1551002623 installed
<13>May 29 13:21:48 rpmi: openexr24-common-2.3.0-alt2 sisyphus+237980.100.1.1 1569181634 installed
<13>May 29 13:21:48 rpmi: libilmimf24-2.3.0-alt2 sisyphus+237980.100.1.1 1569181634 installed
<13>May 29 13:21:48 rpmi: libtag-1.11.1-alt1 1479892963 installed
<13>May 29 13:21:48 rpmi: libasyncns-0.8-alt2.qa1 1365949820 installed
<13>May 29 13:21:49 rpmi: libpulseaudio-13.0-alt3 sisyphus+242188.100.1.1 1575382773 installed
<13>May 29 13:21:49 rpmi: libmpg123-1.25.13-alt1 sisyphus+239777.100.1.1 1572114548 installed
<13>May 29 13:21:49 rpmi: libwayland-cursor-1.18.0-alt1 sisyphus+245906.100.1.1 1581492503 installed
<13>May 29 13:21:49 rpmi: libjbig-2.1-alt1 1401380926 installed
<13>May 29 13:21:49 rpmi: libtiff5-4.1.0-alt1 sisyphus+240802.100.1.1 1573743635 installed
<13>May 29 13:21:49 rpmi: libgdk-pixbuf-locales-2.40.0-alt1 sisyphus+238952.140.2.1 1570644607 installed
<13>May 29 13:21:49 rpmi: libavahi-0.7-alt3 sisyphus+250384.100.2.1 1587547019 installed
<13>May 29 13:21:49 rpmi: libcups-2.3.1-alt1 sisyphus+247381.100.2.2 1583841455 installed
<13>May 29 13:21:49 rpmi: libqt5-printsupport-5.12.8-alt3 sisyphus+251241.100.1.1 1588762798 installed
<13>May 29 13:21:49 rpmi: libkf5xmlgui-5.70.0-alt1 sisyphus+251665.5000.1.2 1589469650 installed
<13>May 29 13:21:49 rpmi: libkf5bookmarks-5.70.0-alt1 sisyphus+251665.5100.1.2 1589469761 installed
<13>May 29 13:21:49 rpmi: kf5-kbookmarks-devel-5.70.0-alt1 sisyphus+251665.5100.1.2 1589469761 installed
<13>May 29 13:21:49 rpmi: libqt5-webkitwidgets-5.212.0-alt16 sisyphus+249726.4300.3.1 1586862193 installed
<13>May 29 13:21:49 rpmi: libXinerama-1.1.4-alt1 sisyphus+223149.300.2.1 1551268216 installed
<13>May 29 13:21:49 rpmi: libXi-1.7.10-alt1 sisyphus+232786.300.1.1 1561106978 installed
<13>May 29 13:21:49 rpmi: libXcursor-1.2.0-alt1 sisyphus+225206.400.1.2 1552949218 installed
<13>May 29 13:21:49 rpmi: libXcomposite-0.4.5-alt1 sisyphus+225206.300.1.2 1552949137 installed
<13>May 29 13:21:49 rpmi: gtk+3-themes-incompatible-3.20-alt3 1461944560 installed
<13>May 29 13:21:49 rpmi: perl-Try-Tiny-0.30-alt1 1514318058 installed
<13>May 29 13:21:49 rpmi: perl-IO-Socket-IP-0.39-alt1 1494508514 installed
<13>May 29 13:21:49 rpmi: perl-Compress-Raw-Bzip2-2.093-alt1 sisyphus+242765.100.1.1 1576089363 installed
<13>May 29 13:21:49 rpmi: perl-HTML-Tagset-3.20-alt2 1317725093 installed
<13>May 29 13:21:49 rpmi: perl-Term-ANSIColor-5.01-alt1 sisyphus+244783.100.1.2 1579747505 installed
<13>May 29 13:21:49 rpmi: perl-Data-Dump-1.23-alt1 1444601978 installed
<13>May 29 13:21:49 rpmi: perl-Filter-1.59-alt1.1 sisyphus+219907.400.1.1 1548343389 installed
<13>May 29 13:21:49 rpmi: perl-Encode-3.04-alt1 sisyphus+247835.100.1.1 1584190307 installed
<13>May 29 13:21:49 rpmi: perl-URI-1.76-alt1 sisyphus+220243.100.1.1 1548863244 installed
<13>May 29 13:21:49 rpmi: perl-IO-Compress-2.093-alt1 sisyphus+243543.100.1.1 1577294382 installed
<13>May 29 13:21:49 rpmi: perl-Net-HTTP-6.19-alt1 sisyphus+229756.100.1.1 1558454558 installed
<13>May 29 13:21:49 rpmi: perl-HTML-Parser-3.72-alt1.2 sisyphus+219907.600.1.1 1548343581 installed
<13>May 29 13:21:49 rpmi: perl-WWW-RobotRules-6.02-alt1 1329756211 installed
<13>May 29 13:21:49 rpmi: perl-Encode-Locale-1.05-alt1 1444608613 installed
<13>May 29 13:21:49 rpmi: perl-IO-HTML-1.001-alt1 1404821752 installed
<13>May 29 13:21:49 rpmi: perl-HTTP-Message-6.22-alt1 sisyphus+246933.100.1.1 1582638146 installed
<13>May 29 13:21:49 rpmi: perl-HTTP-Cookies-6.08-alt1 sisyphus+242242.100.1.1 1575454022 installed
<13>May 29 13:21:49 rpmi: perl-HTTP-Negotiate-6.01-alt1 1329760563 installed
<13>May 29 13:21:49 rpmi: perl-libwww-6.44-alt1 sisyphus+250417.100.1.1 1587558598 installed
<13>May 29 13:21:50 rpmi: perl-XML-LibXML-2.0202-alt1 sisyphus+246834.100.1.1 1582544040 installed
<13>May 29 13:21:50 rpmi: perl-XML-SAX-1.02-alt1 sisyphus+232322.100.1.1 1560758406 installed
<13>May 29 13:21:50 rpmi: perl-XML-Simple-2.25-alt1 1521437714 installed
<13>May 29 13:21:50 rpmi: icon-naming-utils-0.8.90-alt1 1236573102 installed
<13>May 29 13:21:50 rpmi: icon-theme-adwaita-3.36.1-alt1 sisyphus+250137.100.1.1 1587127395 installed
<13>May 29 13:21:50 rpmi: libvisual0.4-0.4.0-alt3 1301290260 installed
<13>May 29 13:21:50 rpmi: libdatrie-0.2.9-alt1_6 1511686676 installed
<13>May 29 13:21:51 rpmi: libthai-0.1.28-alt1_1 sisyphus+226107.100.1.1 1554123079 installed
<13>May 29 13:21:51 rpmi: libXft-2.3.3-alt1 sisyphus+225206.1000.3.2 1552987708 installed
<13>May 29 13:21:51 rpmi: libgraphene-1.10.0-alt1 sisyphus+237282.100.1.1 1567964936 installed
<13>May 29 13:21:51 rpmi: libcdparanoia-1:10.2-alt6 1501248110 installed
<13>May 29 13:21:51 rpmi: libpixman-3:0.40.0-alt1 sisyphus+250700.100.1.1 1587971055 installed
<13>May 29 13:21:51 rpmi: libcairo-1:1.16.0-alt1 sisyphus+226534.100.2.3 1554515535 installed
<13>May 29 13:21:51 rpmi: libpango-1.44.7-alt1 sisyphus+239731.100.1.1 1571986949 installed
<13>May 29 13:21:51 rpmi: libcairo-gobject-1:1.16.0-alt1 sisyphus+226534.100.2.3 1554515535 installed
<13>May 29 13:21:51 rpmi: qt5-serialport-common-5.12.8-alt1 sisyphus+249726.700.3.1 1586852369 installed
<13>May 29 13:21:51 rpmi: libqt5-serialport-5.12.8-alt1 sisyphus+249726.700.3.1 1586852330 installed
<13>May 29 13:21:51 rpmi: libqt5-positioning-5.12.8-alt1 sisyphus+249726.1000.3.1 1586852630 installed
<13>May 29 13:21:51 rpmi: libqt5-positioningquick-5.12.8-alt1 sisyphus+249726.1000.3.1 1586852630 installed
<13>May 29 13:21:51 rpmi: libqt5-location-5.12.8-alt1 sisyphus+249726.1000.3.1 1586852630 installed
<13>May 29 13:21:51 rpmi: rpm-macros-cmake-3.17.0-alt1 sisyphus+248174.100.1.1 1584748107 installed
<13>May 29 13:21:51 rpmi: rmt-0.4b44-alt2 sisyphus+250767.100.1.1 1588080613 installed
<13>May 29 13:21:51 rpmi: dump-0.4b44-alt2 sisyphus+250767.100.1.1 1588080613 installed
<13>May 29 13:21:51 rpmi: cmake-modules-3.17.0-alt1 sisyphus+248174.100.1.1 1584748064 installed
<13>May 29 13:21:51 rpmi: libuv-1.37.0-alt1 sisyphus+251308.100.1.1 1588855432 installed
<13>May 29 13:21:51 rpmi: librhash-1.3.5-alt2 1505156279 installed
<13>May 29 13:21:51 rpmi: libjsoncpp19-1.8.4-alt5 sisyphus+243670.100.1.1 1577521267 installed
<13>May 29 13:21:51 rpmi: publicsuffix-list-dafsa-20200401-alt1 sisyphus+249161.100.1.1 1585815856 installed
<13>May 29 13:21:51 rpmi: libpsl-0.21.0-alt2 sisyphus+237083.100.1.1 1567531657 installed
<13>May 29 13:21:51 rpmi: libnghttp2-1.40.0-alt1 sisyphus+244416.100.1.1 1579241942 installed
<13>May 29 13:21:51 rpmi: libverto-0.3.0-alt1_7 sisyphus+225932.100.1.1 1553994919 installed
<13>May 29 13:21:51 rpmi: libkeyutils-1.6-alt2 sisyphus+226520.100.2.1 1554512089 installed
<86>May 29 13:21:51 groupadd[2457600]: group added to /etc/group: name=_keytab, GID=498
<86>May 29 13:21:51 groupadd[2457600]: group added to /etc/gshadow: name=_keytab
<86>May 29 13:21:51 groupadd[2457600]: new group: name=_keytab, GID=498
<13>May 29 13:21:51 rpmi: libkrb5-1.17.1-alt1 sisyphus+242784.100.1.1 1576137330 installed
<86>May 29 13:21:51 groupadd[2458342]: group added to /etc/group: name=sasl, GID=497
<86>May 29 13:21:51 groupadd[2458342]: group added to /etc/gshadow: name=sasl
<86>May 29 13:21:51 groupadd[2458342]: new group: name=sasl, GID=497
<13>May 29 13:21:51 rpmi: libsasl2-3-2.1.27-alt2 sisyphus+228101.100.1.1 1556139863 installed
<13>May 29 13:21:52 rpmi: libldap-2.4.48-alt3 sisyphus+238816.100.1.1 1570449022 installed
<13>May 29 13:21:52 rpmi: libcurl-7.70.0-alt1 sisyphus+251607.100.1.1 1589303299 installed
<13>May 29 13:21:52 rpmi: cmake-3.17.0-alt1 sisyphus+248174.100.1.1 1584748107 installed
<13>May 29 13:21:52 rpmi: libraptor2-2.0.15-alt1 1417013332 installed
<13>May 29 13:21:52 rpmi: liblrdf-0.6.1-alt1 1493047570 installed
<13>May 29 13:21:52 rpmi: libneon-0.30.2-alt1 sisyphus+226834.100.1.1 1554686306 installed
<13>May 29 13:21:52 rpmi: libssh-0.9.3-alt2 sisyphus+247315.100.1.2 1583840783 installed
<13>May 29 13:21:52 rpmi: libffi7-1:3.3-alt1 sisyphus+251953.40.2.1 1589891229 installed
<13>May 29 13:21:54 rpmi: llvm10.0-libs-10.0.0-alt2 sisyphus+251194.300.5.1 1590062001 installed
<13>May 29 13:21:58 rpmi: clang10.0-libs-10.0.0-alt2 sisyphus+251194.300.5.1 1590062001 installed
<13>May 29 13:21:58 rpmi: libgdbm-1.8.3-alt10 1454943334 installed
<13>May 29 13:21:58 rpmi: libpython3-3.8.2-alt1 sisyphus+244999.100.3.1 1585218480 installed
<13>May 29 13:21:58 rpmi: python3-3.8.2-alt1 sisyphus+244999.100.3.1 1585218480 installed
<13>May 29 13:21:59 rpmi: python3-base-3.8.2-alt1 sisyphus+244999.100.3.1 1585218480 installed
<13>May 29 13:22:00 rpmi: clang10.0-10.0.0-alt2 sisyphus+251194.300.5.1 1590062001 installed
<13>May 29 13:22:00 rpmi: clang10.0-devel-10.0.0-alt2 sisyphus+251194.300.5.1 1590062001 installed
<13>May 29 13:22:00 rpmi: python3-module-clang-6.0.0.2-alt1 sisyphus+245609.100.1.1 1580989021 installed
<13>May 29 13:22:00 rpmi: python3-module-sip-4.19.19-alt3 sisyphus+245000.32720.79.1 1583252881 installed
<13>May 29 13:22:00 rpmi: python3-module-PyQt5-sip-4.19.19-alt3 sisyphus+245000.32720.79.1 1583252881 installed
<13>May 29 13:22:00 rpmi: libvulkan-devel-1.1.121-alt1.1 sisyphus+236811.500.2.1 1567091322 installed
<13>May 29 13:22:01 rpmi: qt5-base-devel-5.12.8-alt3 sisyphus+251241.100.1.1 1588762798 installed
<13>May 29 13:22:01 rpmi: kf5-kcoreaddons-devel-5.70.0-alt1 sisyphus+251665.2300.1.2 1589467391 installed
<13>May 29 13:22:01 rpmi: kf5-kjobwidgets-devel-5.70.0-alt1 sisyphus+251665.2700.1.2 1589467783 installed
<13>May 29 13:22:01 rpmi: kf5-attica-devel-5.70.0-alt1 sisyphus+251665.400.1.2 1589465640 installed
<13>May 29 13:22:01 rpmi: kf5-ki18n-devel-5.70.0-alt1 sisyphus+251665.3100.1.2 1589467987 installed
<13>May 29 13:22:01 rpmi: libmetis-5.1.0-alt1.1 1465299656 installed
<13>May 29 13:22:01 rpmi: libxblas-1.0.248-alt1.3 sisyphus+229150.100.1.1 1557388786 installed
<13>May 29 13:22:01 rpmi: libquadmath0-9.3.1-alt1 sisyphus+251917.40.3.1 1589812684 installed
<13>May 29 13:22:01 rpmi: libgfortran5-9.3.1-alt1 sisyphus+251917.40.3.1 1589812684 installed
<13>May 29 13:22:01 rpmi: liblapack-1:3.8.0-alt3 sisyphus+221521.100.1.1 1550134903 installed
<13>May 29 13:22:02 rpmi: libsuitesparse-5.4.0-alt1 sisyphus+231121.400.4.1 1559650115 installed
<13>May 29 13:22:02 rpmi: ceres-solver-1.13.0-alt1_8 sisyphus+226018.100.1.1 1554036834 installed
<13>May 29 13:22:02 rpmi: libatk-locales-2.36.0-alt1 sisyphus+249208.100.1.1 1585840405 installed
<13>May 29 13:22:02 rpmi: libatk-2.36.0-alt1 sisyphus+249208.100.1.1 1585840406 installed
<13>May 29 13:22:02 rpmi: gsettings-desktop-schemas-data-3.36.1-alt1 sisyphus+250870.100.1.1 1588227108 installed
<13>May 29 13:22:02 rpmi: libgio-2.64.2-alt1 sisyphus+249693.100.1.1 1586451180 installed
<13>May 29 13:22:02 rpmi: gsettings-desktop-schemas-3.36.1-alt1 sisyphus+250870.100.1.1 1588227105 installed
<13>May 29 13:22:02 rpmi: libgstreamer1.0-1.16.2-alt1 sisyphus+242248.100.2.1 1575475168 installed
<13>May 29 13:22:02 rpmi: libgst-plugins1.0-1.16.2-alt1 sisyphus+242248.200.2.1 1575475391 installed
<13>May 29 13:22:02 rpmi: libgdk-pixbuf-2.40.0-alt1 sisyphus+238952.140.2.1 1570644615 installed
<13>May 29 13:22:02 rpmi: gstreamer1.0-1.16.2-alt1 sisyphus+242248.100.2.1 1575475168 installed
<13>May 29 13:22:02 rpmi: librsvg-1:2.48.4-alt1 sisyphus+250527.100.1.1 1587667450 installed
<13>May 29 13:22:03 rpmi: libavcodec58-2:4.2.3-alt1 sisyphus+252236.200.2.1 1590410990 installed
<13>May 29 13:22:03 rpmi: libavformat58-2:4.2.3-alt1 sisyphus+252236.200.2.1 1590410990 installed
<13>May 29 13:22:03 rpmi: libgusb-0.3.4-alt1 sisyphus+247875.100.1.1 1584292779 installed
<13>May 29 13:22:03 rpmi: libcolord-1.4.4-alt2 sisyphus+229904.100.1.1 1558606569 installed
<13>May 29 13:22:03 rpmi: libpolkit-0.116-alt2 sisyphus+242835.100.1.1 1576161160 installed
<13>May 29 13:22:03 rpmi: gobject-introspection-1.64.1-alt1 sisyphus+249424.100.1.1 1586098528 installed
<13>May 29 13:22:03 rpmi: libgstreamer1.0-gir-1.16.2-alt1 sisyphus+242248.100.2.1 1575475168 installed
<13>May 29 13:22:03 rpmi: libgst-plugins1.0-gir-1.16.2-alt1 sisyphus+242248.200.2.1 1575475391 installed
<86>May 29 13:22:03 groupadd[2498317]: group added to /etc/group: name=colord, GID=496
<86>May 29 13:22:03 groupadd[2498317]: group added to /etc/gshadow: name=colord
<86>May 29 13:22:03 groupadd[2498317]: new group: name=colord, GID=496
<86>May 29 13:22:03 useradd[2498379]: new user: name=colord, UID=498, GID=496, home=/var/colord, shell=/dev/null
<13>May 29 13:22:03 rpmi: colord-1.4.4-alt2 sisyphus+229904.100.1.1 1558606569 installed
<13>May 29 13:22:03 rpmi: libpolkit-qt5-core-0.112.0-alt3 sisyphus+222979.100.1.2 1551378014 installed
<13>May 29 13:22:03 rpmi: libkf5auth-5.70.0-alt1 sisyphus+251665.2500.1.2 1589467607 installed
<13>May 29 13:22:03 rpmi: kf5-kauth-devel-5.70.0-alt1 sisyphus+251665.2500.1.2 1589467607 installed
<13>May 29 13:22:03 rpmi: kf5-kconfigwidgets-devel-5.70.0-alt1 sisyphus+251665.3600.1.2 1589468602 installed
<13>May 29 13:22:03 rpmi: kf5-kxmlgui-devel-5.70.0-alt1 sisyphus+251665.5000.1.2 1589469650 installed
<13>May 29 13:22:03 rpmi: gst-plugins-ugly1.0-1.16.2-alt1 sisyphus+250140.2100.12.1 1587564479 installed
<13>May 29 13:22:03 rpmi: gtk-update-icon-cache-3.24.20-alt1 sisyphus+250751.100.1.1 1588052725 installed
<13>May 29 13:22:03 rpmi: glib-networking-2.64.1-alt1 sisyphus+248832.1600.1.1 1585468516 installed
<13>May 29 13:22:03 rpmi: libsoup-2.70.0-alt1 sisyphus+247780.1300.3.2 1584200094 installed
<13>May 29 13:22:03 rpmi: libgssdp1.2-1.2.2-alt1 sisyphus+243789.100.1.1 1577980176 installed
<13>May 29 13:22:03 rpmi: libgupnp1.2-1.2.2-alt1 sisyphus+243789.200.1.1 1577980231 installed
<13>May 29 13:22:03 rpmi: libgupnp-igd-0.2.5-alt4 sisyphus+248925.100.1.1 1585587908 installed
<13>May 29 13:22:04 rpmi: libnice-0.1.16-alt1 sisyphus+229216.100.1.1 1557584955 installed
<13>May 29 13:22:04 rpmi: libsoup-gnome-2.70.0-alt1 sisyphus+247780.1300.3.2 1584200094 installed
<13>May 29 13:22:04 rpmi: librest-0.8.1-alt1 1508266400 installed
<13>May 29 13:22:04 rpmi: at-spi2-core-2.36.0-alt1 sisyphus+247780.1600.3.2 1584200495 installed
<13>May 29 13:22:04 rpmi: at-spi2-atk-2.34.2-alt1 sisyphus+247242.200.7.1 1583839952 installed
<13>May 29 13:22:04 rpmi: libdconf-0.36.0-alt1 sisyphus+247780.1000.3.2 1584199861 installed
<13>May 29 13:22:04 rpmi: dconf-0.36.0-alt1 sisyphus+247780.1000.3.2 1584199861 installed
<13>May 29 13:22:04 rpmi: libgtk+3-schemas-3.24.20-alt1 sisyphus+250751.100.1.1 1588052716 installed
<13>May 29 13:22:04 rpmi: libjson-glib-1.4.4-alt1 sisyphus.213175.100 1537249589 installed
<13>May 29 13:22:04 rpmi: libgtk+3-3.24.20-alt1 sisyphus+250751.100.1.1 1588052725 installed
<13>May 29 13:22:05 rpmi: gst-plugins-good1.0-1.16.2-alt1 sisyphus+242248.300.2.1 1575475529 installed
<13>May 29 13:22:06 rpmi: libopencv4.3-1:4.3.0-alt1 sisyphus+249541.200.3.2 1586370996 installed
<13>May 29 13:22:06 rpmi: altlinux-mime-defaults-0.435-alt1 sisyphus+233225.100.1.1 1561540568 installed
<13>May 29 13:22:06 rpmi: wm-common-freedesktop-1.3-alt1 1303402115 installed
<13>May 29 13:22:06 rpmi: altlinux-freedesktop-menu-common-0.67-alt1 sisyphus+232521.100.1.2 1560890506 installed
<13>May 29 13:22:06 rpmi: altlinux-freedesktop-menu-shallow-menu-0.67-alt1 sisyphus+232521.100.1.2 1560890506 installed
<13>May 29 13:22:06 rpmi: altlinux-freedesktop-menu-generic-0.67-alt1 sisyphus+232521.100.1.2 1560890506 installed
<13>May 29 13:22:06 rpmi: libkf5service-5.70.0-alt1 sisyphus+251665.3700.1.2 1589468702 installed
<13>May 29 13:22:06 rpmi: libkf5kiocore-5.70.1-alt2 sisyphus+251950.100.1.2 1589890197 installed
<13>May 29 13:22:06 rpmi: libkf5kiogui-5.70.1-alt2 sisyphus+251950.100.1.2 1589890197 installed
<13>May 29 13:22:06 rpmi: libkf5kiowidgets-5.70.1-alt2 sisyphus+251950.100.1.2 1589890197 installed
<13>May 29 13:22:06 rpmi: libkf5declarative-5.70.0-alt1 sisyphus+251665.6000.1.2 1589470734 installed
<13>May 29 13:22:06 rpmi: libkf5quickaddons-5.70.0-alt1 sisyphus+251665.6000.1.2 1589470734 installed
<13>May 29 13:22:06 rpmi: libkf5kiofilewidgets-5.70.1-alt2 sisyphus+251950.100.1.2 1589890197 installed
<13>May 29 13:22:06 rpmi: kf5-kservice-devel-5.70.0-alt1 sisyphus+251665.3700.1.2 1589468702 installed
<13>May 29 13:22:06 rpmi: alsa-ucm-conf-1.2.2-alt1 sisyphus+246761.200.1.1 1582270179 installed
<13>May 29 13:22:06 rpmi: alsa-topology-conf-1.2.2-alt1 sisyphus+246761.100.1.1 1582270157 installed
<13>May 29 13:22:06 rpmi: libalsa-1:1.2.2-alt1 sisyphus+246761.300.1.1 1582270238 installed
<13>May 29 13:22:08 rpmi: flite-2.1-alt1 sisyphus+222718.100.1.1 1551026084 installed
<13>May 29 13:22:09 rpmi: libavfilter7-2:4.2.3-alt1 sisyphus+252236.200.2.1 1590410990 installed
<13>May 29 13:22:09 rpmi: gst-libav-1.16.2-alt1 sisyphus+242248.700.2.1 1575475919 installed
<13>May 29 13:22:09 rpmi: gst-plugins-base1.0-1.16.2-alt1 sisyphus+242248.200.2.1 1575475391 installed
<13>May 29 13:22:09 rpmi: libfluidsynth-2.1.2-alt1 sisyphus+249490.100.1.1 1586180539 installed
<13>May 29 13:22:09 rpmi: libSDL-1.2.14-alt8 sisyphus+232545.100.1.1 1560879163 installed
<13>May 29 13:22:09 rpmi: libmjpegtools2.1-2.1.0-alt3 sisyphus+227903.100.1.1 1555879025 installed
<13>May 29 13:22:10 rpmi: gst-plugins-bad1.0-1.16.2-alt2 sisyphus+250140.1040.12.1 1587561870 installed
<13>May 29 13:22:10 rpmi: libqt5-multimedia-5.12.8-alt1 sisyphus+249726.600.3.1 1586852182 installed
<13>May 29 13:22:10 rpmi: libqt5-texttospeech-5.12.8-alt1 sisyphus+249726.3500.3.1 1586860833 installed
<13>May 29 13:22:10 rpmi: libkf5textwidgets-5.70.0-alt1 sisyphus+251665.4700.1.2 1589469541 installed
<13>May 29 13:22:10 rpmi: python3-module-PyQt5-5.13.1-alt2 sisyphus+245000.33520.84.1 1583642170 installed
<13>May 29 13:22:10 rpmi: libcanberra-0.30-alt3 1509034818 installed
<13>May 29 13:22:10 rpmi: libkf5notifications-5.70.0-alt1 sisyphus+251665.4200.1.2 1589469011 installed
<13>May 29 13:22:10 rpmi: libkf5plasma-5.70.1-alt1 sisyphus+251941.100.1.1 1589877107 installed
<13>May 29 13:22:11 rpmi: libkf5plasmaquick-5.70.1-alt1 sisyphus+251941.100.1.1 1589877107 installed
<13>May 29 13:22:11 rpmi: kf5-plasma-framework-devel-5.70.1-alt1 sisyphus+251941.100.1.1 1589877107 installed
<13>May 29 13:22:11 rpmi: extra-cmake-modules-5.70.0-alt1 sisyphus+251665.100.1.1 1589437073 installed
<13>May 29 13:22:11 rpmi: kf5-ktextwidgets-devel-5.70.0-alt1 sisyphus+251665.4700.1.2 1589469541 installed
<13>May 29 13:22:11 rpmi: kf5-kio-devel-5.70.1-alt2 sisyphus+251950.100.1.2 1589890197 installed
<13>May 29 13:22:11 rpmi: qt5-declarative-devel-5.12.8-alt2 sisyphus+250091.200.1.1 1587049220 installed
<13>May 29 13:22:11 rpmi: kf5-kiconthemes-devel-5.70.0-alt1 sisyphus+251665.4100.1.2 1589468912 installed
<13>May 29 13:22:11 rpmi: kf5-kglobalaccel-devel-5.70.0-alt1 sisyphus+251665.4000.1.2 1589468816 installed
<13>May 29 13:22:11 rpmi: kf5-kdbusaddons-devel-5.70.0-alt1 sisyphus+251665.2200.1.2 1589467285 installed
<13>May 29 13:22:11 rpmi: kf5-kguiaddons-devel-5.70.0-alt1 sisyphus+251665.1200.1.2 1589466251 installed
<13>May 29 13:22:11 rpmi: kf5-threadweaver-devel-5.70.0-alt1 sisyphus+251665.1000.1.2 1589466057 installed
<13>May 29 13:22:11 rpmi: kf5-kpackage-devel-5.70.0-alt1 sisyphus+251665.5200.1.2 1589469854 installed
Building target platforms: i586
Building for target i586
Wrote: /usr/src/in/nosrpm/kf5-krunner-5.70.0-alt1.nosrc.rpm
Installing kf5-krunner-5.70.0-alt1.src.rpm
Building target platforms: i586
Building for target i586
Executing(%prep): /bin/sh -e /usr/src/tmp/rpm-tmp.61196
+ umask 022
+ /bin/mkdir -p /usr/src/RPM/BUILD
+ cd /usr/src/RPM/BUILD
+ cd /usr/src/RPM/BUILD
+ rm -rf krunner-5.70.0
+ echo 'Source #0 (krunner-5.70.0.tar):'
Source #0 (krunner-5.70.0.tar):
+ /bin/tar -xf /usr/src/RPM/SOURCES/krunner-5.70.0.tar
+ cd krunner-5.70.0
+ /bin/chmod -c -Rf u+rwX,go-w .
+ exit 0
Executing(%build): /bin/sh -e /usr/src/tmp/rpm-tmp.61196
+ umask 022
+ /bin/mkdir -p /usr/src/RPM/BUILD
+ cd /usr/src/RPM/BUILD
+ cd krunner-5.70.0
+ __kf5_build
+ mkdir -p BUILD
+ __kf5_cmake
+ export PATH=/usr/lib/kf5/bin:/usr/src/bin:/bin:/usr/bin:/usr/X11R6/bin:/usr/games
+ PATH=/usr/lib/kf5/bin:/usr/src/bin:/bin:/usr/bin:/usr/X11R6/bin:/usr/games
+ export QTDIR=/usr/share/qt5
+ QTDIR=/usr/share/qt5
+ export 'CFLAGS=-pipe -frecord-gcc-switches -Wall -g -O2 -march=i586 -mtune=generic'
+ CFLAGS='-pipe -frecord-gcc-switches -Wall -g -O2 -march=i586 -mtune=generic'
+ export 'CXXFLAGS=-pipe -frecord-gcc-switches -Wall -g -O2 -march=i586 -mtune=generic'
+ CXXFLAGS='-pipe -frecord-gcc-switches -Wall -g -O2 -march=i586 -mtune=generic'
+ pushd BUILD
~/RPM/BUILD/krunner-5.70.0/BUILD ~/RPM/BUILD/krunner-5.70.0
+ cmake .. -DCMAKE_USE_RELATIVE_PATHS:BOOL=ON -DCMAKE_VERBOSE_MAKEFILE:BOOL=ON -DCMAKE_SKIP_RPATH:BOOL=ON -DBUILD_TESTING:BOOL=FALSE -DKDE_INSTALL_USE_QT_SYS_PATHS:BOOL=ON -DCMAKE_BUILD_TYPE=Release '-DCMAKE_EXE_LINKER_FLAGS:STRING=-L/usr/lib -L/usr/lib/kf5/devel' '-DCMAKE_MODULE_LINKER_FLAGS:STRING=-L/usr/lib -L/usr/lib/kf5/devel' '-DCMAKE_SHARED_LINKER_FLAGS:STRING=-L/usr/lib -L/usr/lib/kf5/devel' '-DCMAKE_LIBRARY_PATH=/usr/lib/kf5/devel;/usr/lib;/lib' '-DCMAKE_INCLUDE_PATH=/usr/include/KF5;/usr/include' -DCMAKE_INSTALL_PREFIX=/usr -DCMAKE_PREFIX_PATH=/usr -DCMAKE_INSTALL_BINDIR=/usr/lib/kf5/bin -DCMAKE_INSTALL_FULL_BINDIR=/usr/lib/kf5/bin -DBIN_INSTALL_DIR:PATH=/usr/lib/kf5/bin -DCMAKE_INSTALL_SBINDIR=/usr/lib/kf5/sbin -DCMAKE_INSTALL_FULL_SBINDIR=/usr/lib/kf5/sbin -DSBIN_INSTALL_DIR:PATH=/usr/lib/kf5/sbin -DLIBEXEC_INSTALL_DIR:PATH=/usr/libexec -DINCLUDE_INSTALL_DIR:PATH=/usr/include -DCMAKE_INSTALL_INCLUDEDIR_KF5=/usr/include/KF5 -DDATA_INSTALL_DIR:PATH=/usr/share -DCONFIG_INSTALL_DIR:PATH=/etc/kf5/xdg -DSERVICES_INSTALL_DIR:PATH=/usr/share/kservices5 -DSERVICETYPES_INSTALL_DIR:PATH=/usr/share/kservicetypes5 -DKNOTIFYRC_INSTALL_DIR:PATH=/usr/share/knotifications5 -DKXMLGUI_INSTALL_DIR:PATH=/usr/share/kxmlgui5 -DLIB_INSTALL_DIR:PATH=/usr/lib -DLIB_DESTINATION=lib -DLIB_SUFFIX= -DSYSCONF_INSTALL_DIR:PATH=/etc -DAUTOSTART_INSTALL_DIR=/etc/kf5/xdg/autostart -DHTML_INSTALL_DIR=/usr/share/kf5/doc/HTML -DICON_INSTALL_DIR=/usr/share/kf5/icons -DXDG_MIME_INSTALL_DIR=/usr/share/mime/packages -DXDG_APPS_INSTALL_DIR=/usr/share/kf5/applications/kf5 -DECM_MKSPECS_INSTALL_DIR:PATH=/usr/lib/qt5/mkspecs/modules -DKCFG_INSTALL_DIR:PATH=/usr/share/kf5/config.kcfg -DPLUGIN_INSTALL_DIR:PATH=/usr/lib/qt5/plugins -DQT_PLUGIN_INSTALL_DIR:PATH=/usr/lib/qt5/plugins -DQML_INSTALL_DIR:PATH=/usr/lib/qt5/qml -DIMPORTS_INSTALL_DIR:PATH=/usr/lib/qt5/imports -DDBUS_INTERFACES_INSTALL_DIR=/usr/share/kf5/dbus-1/interfaces -DDBUS_SERVICES_INSTALL_DIR=/usr/share/kf5/dbus-1/services -DDBUS_SYSTEM_SERVICES_INSTALL_DIR=/lib/dbus-1/system-services
-- The C compiler identification is GNU 9.3.1
-- The CXX compiler identification is GNU 9.3.1
-- Check for working C compiler: /usr/bin/cc
-- Check for working C compiler: /usr/bin/cc - works
-- Detecting C compiler ABI info
-- Detecting C compiler ABI info - done
-- Detecting C compile features
-- Detecting C compile features - done
-- Check for working CXX compiler: /usr/bin/c++
-- Check for working CXX compiler: /usr/bin/c++ - works
-- Detecting CXX compiler ABI info
-- Detecting CXX compiler ABI info - done
-- Detecting CXX compile features
-- Detecting CXX compile features - done
-- 

CMake Deprecation Warning at /usr/share/ECM/kde-modules/KDEInstallDirs.cmake:356 (message):
  BIN_INSTALL_DIR is deprecated, use KDE_INSTALL_BINDIR instead.
Call Stack (most recent call first):
  /usr/share/ECM/kde-modules/KDEInstallDirs.cmake:447 (_define_relative)
  CMakeLists.txt:15 (include)


CMake Deprecation Warning at /usr/share/ECM/kde-modules/KDEInstallDirs.cmake:356 (message):
  SBIN_INSTALL_DIR is deprecated, use KDE_INSTALL_SBINDIR instead.
Call Stack (most recent call first):
  /usr/share/ECM/kde-modules/KDEInstallDirs.cmake:450 (_define_relative)
  CMakeLists.txt:15 (include)


CMake Deprecation Warning at /usr/share/ECM/kde-modules/KDEInstallDirs.cmake:356 (message):
  LIB_INSTALL_DIR is deprecated, use KDE_INSTALL_LIBDIR instead.
Call Stack (most recent call first):
  /usr/share/ECM/kde-modules/KDEInstallDirs.cmake:453 (_define_relative)
  CMakeLists.txt:15 (include)


CMake Deprecation Warning at /usr/share/ECM/kde-modules/KDEInstallDirs.cmake:356 (message):
  LIBEXEC_INSTALL_DIR is deprecated, use KDE_INSTALL_LIBEXECDIR instead.
Call Stack (most recent call first):
  /usr/share/ECM/kde-modules/KDEInstallDirs.cmake:463 (_define_relative)
  CMakeLists.txt:15 (include)


CMake Deprecation Warning at /usr/share/ECM/kde-modules/KDEInstallDirs.cmake:356 (message):
  QT_PLUGIN_INSTALL_DIR is deprecated, use KDE_INSTALL_QTPLUGINDIR instead.
Call Stack (most recent call first):
  /usr/share/ECM/kde-modules/KDEInstallDirs.cmake:411 (_define_relative)
  /usr/share/ECM/kde-modules/KDEInstallDirs.cmake:491 (_define_absolute)
  CMakeLists.txt:15 (include)


CMake Deprecation Warning at /usr/share/ECM/kde-modules/KDEInstallDirs.cmake:356 (message):
  IMPORTS_INSTALL_DIR is deprecated, use KDE_INSTALL_QTQUICKIMPORTSDIR
  instead.
Call Stack (most recent call first):
  /usr/share/ECM/kde-modules/KDEInstallDirs.cmake:411 (_define_relative)
  /usr/share/ECM/kde-modules/KDEInstallDirs.cmake:497 (_define_absolute)
  CMakeLists.txt:15 (include)


CMake Deprecation Warning at /usr/share/ECM/kde-modules/KDEInstallDirs.cmake:356 (message):
  QML_INSTALL_DIR is deprecated, use KDE_INSTALL_QMLDIR instead.
Call Stack (most recent call first):
  /usr/share/ECM/kde-modules/KDEInstallDirs.cmake:411 (_define_relative)
  /usr/share/ECM/kde-modules/KDEInstallDirs.cmake:503 (_define_absolute)
  CMakeLists.txt:15 (include)


CMake Deprecation Warning at /usr/share/ECM/kde-modules/KDEInstallDirs.cmake:356 (message):
  PLUGIN_INSTALL_DIR is deprecated, use KDE_INSTALL_PLUGINDIR instead.
Call Stack (most recent call first):
  /usr/share/ECM/kde-modules/KDEInstallDirs.cmake:525 (_define_relative)
  CMakeLists.txt:15 (include)


CMake Deprecation Warning at /usr/share/ECM/kde-modules/KDEInstallDirs.cmake:356 (message):
  INCLUDE_INSTALL_DIR is deprecated, use KDE_INSTALL_INCLUDEDIR instead.
Call Stack (most recent call first):
  /usr/share/ECM/kde-modules/KDEInstallDirs.cmake:411 (_define_relative)
  /usr/share/ECM/kde-modules/KDEInstallDirs.cmake:529 (_define_absolute)
  CMakeLists.txt:15 (include)


CMake Deprecation Warning at /usr/share/ECM/kde-modules/KDEInstallDirs.cmake:356 (message):
  DATA_INSTALL_DIR is deprecated, use KDE_INSTALL_DATADIR instead.
Call Stack (most recent call first):
  /usr/share/ECM/kde-modules/KDEInstallDirs.cmake:555 (_define_relative)
  CMakeLists.txt:15 (include)


CMake Deprecation Warning at /usr/share/ECM/kde-modules/KDEInstallDirs.cmake:356 (message):
  HTML_INSTALL_DIR is deprecated, use KDE_INSTALL_DOCBUNDLEDIR instead.
Call Stack (most recent call first):
  /usr/share/ECM/kde-modules/KDEInstallDirs.cmake:576 (_define_relative)
  CMakeLists.txt:15 (include)


CMake Deprecation Warning at /usr/share/ECM/kde-modules/KDEInstallDirs.cmake:356 (message):
  KCFG_INSTALL_DIR is deprecated, use KDE_INSTALL_KCFGDIR instead.
Call Stack (most recent call first):
  /usr/share/ECM/kde-modules/KDEInstallDirs.cmake:579 (_define_relative)
  CMakeLists.txt:15 (include)


CMake Deprecation Warning at /usr/share/ECM/kde-modules/KDEInstallDirs.cmake:356 (message):
  SERVICES_INSTALL_DIR is deprecated, use KDE_INSTALL_KSERVICES5DIR instead.
Call Stack (most recent call first):
  /usr/share/ECM/kde-modules/KDEInstallDirs.cmake:585 (_define_relative)
  CMakeLists.txt:15 (include)


CMake Deprecation Warning at /usr/share/ECM/kde-modules/KDEInstallDirs.cmake:356 (message):
  SERVICETYPES_INSTALL_DIR is deprecated, use KDE_INSTALL_KSERVICETYPES5DIR
  instead.
Call Stack (most recent call first):
  /usr/share/ECM/kde-modules/KDEInstallDirs.cmake:588 (_define_relative)
  CMakeLists.txt:15 (include)


CMake Deprecation Warning at /usr/share/ECM/kde-modules/KDEInstallDirs.cmake:356 (message):
  KNOTIFYRC_INSTALL_DIR is deprecated, use KDE_INSTALL_KNOTIFY5RCDIR instead.
Call Stack (most recent call first):
  /usr/share/ECM/kde-modules/KDEInstallDirs.cmake:591 (_define_relative)
  CMakeLists.txt:15 (include)


CMake Deprecation Warning at /usr/share/ECM/kde-modules/KDEInstallDirs.cmake:356 (message):
  KXMLGUI_INSTALL_DIR is deprecated, use KDE_INSTALL_KXMLGUI5DIR instead.
Call Stack (most recent call first):
  /usr/share/ECM/kde-modules/KDEInstallDirs.cmake:594 (_define_relative)
  CMakeLists.txt:15 (include)


CMake Deprecation Warning at /usr/share/ECM/kde-modules/KDEInstallDirs.cmake:356 (message):
  ICON_INSTALL_DIR is deprecated, use KDE_INSTALL_ICONDIR instead.
Call Stack (most recent call first):
  /usr/share/ECM/kde-modules/KDEInstallDirs.cmake:605 (_define_relative)
  CMakeLists.txt:15 (include)


CMake Deprecation Warning at /usr/share/ECM/kde-modules/KDEInstallDirs.cmake:356 (message):
  XDG_APPS_INSTALL_DIR is deprecated, use KDE_INSTALL_APPDIR instead.
Call Stack (most recent call first):
  /usr/share/ECM/kde-modules/KDEInstallDirs.cmake:620 (_define_relative)
  CMakeLists.txt:15 (include)


CMake Deprecation Warning at /usr/share/ECM/kde-modules/KDEInstallDirs.cmake:356 (message):
  XDG_MIME_INSTALL_DIR is deprecated, use KDE_INSTALL_MIMEDIR instead.
Call Stack (most recent call first):
  /usr/share/ECM/kde-modules/KDEInstallDirs.cmake:626 (_define_relative)
  CMakeLists.txt:15 (include)


CMake Deprecation Warning at /usr/share/ECM/kde-modules/KDEInstallDirs.cmake:356 (message):
  DBUS_INTERFACES_INSTALL_DIR is deprecated, use KDE_INSTALL_DBUSINTERFACEDIR
  instead.
Call Stack (most recent call first):
  /usr/share/ECM/kde-modules/KDEInstallDirs.cmake:640 (_define_relative)
  CMakeLists.txt:15 (include)


CMake Deprecation Warning at /usr/share/ECM/kde-modules/KDEInstallDirs.cmake:356 (message):
  DBUS_SERVICES_INSTALL_DIR is deprecated, use KDE_INSTALL_DBUSSERVICEDIR
  instead.
Call Stack (most recent call first):
  /usr/share/ECM/kde-modules/KDEInstallDirs.cmake:643 (_define_relative)
  CMakeLists.txt:15 (include)


CMake Deprecation Warning at /usr/share/ECM/kde-modules/KDEInstallDirs.cmake:356 (message):
  DBUS_SYSTEM_SERVICES_INSTALL_DIR is deprecated, use
  KDE_INSTALL_DBUSSYSTEMSERVICEDIR instead.
Call Stack (most recent call first):
  /usr/share/ECM/kde-modules/KDEInstallDirs.cmake:646 (_define_relative)
  CMakeLists.txt:15 (include)


CMake Deprecation Warning at /usr/share/ECM/kde-modules/KDEInstallDirs.cmake:356 (message):
  SYSCONF_INSTALL_DIR is deprecated, use KDE_INSTALL_SYSCONFDIR instead.
Call Stack (most recent call first):
  /usr/share/ECM/kde-modules/KDEInstallDirs.cmake:411 (_define_relative)
  /usr/share/ECM/kde-modules/KDEInstallDirs.cmake:663 (_define_absolute)
  CMakeLists.txt:15 (include)


CMake Deprecation Warning at /usr/share/ECM/kde-modules/KDEInstallDirs.cmake:356 (message):
  CONFIG_INSTALL_DIR is deprecated, use KDE_INSTALL_CONFDIR instead.
Call Stack (most recent call first):
  /usr/share/ECM/kde-modules/KDEInstallDirs.cmake:666 (_define_relative)
  CMakeLists.txt:15 (include)


CMake Deprecation Warning at /usr/share/ECM/kde-modules/KDEInstallDirs.cmake:356 (message):
  AUTOSTART_INSTALL_DIR is deprecated, use KDE_INSTALL_AUTOSTARTDIR instead.
Call Stack (most recent call first):
  /usr/share/ECM/kde-modules/KDEInstallDirs.cmake:669 (_define_relative)
  CMakeLists.txt:15 (include)


-- Looking for __GLIBC__
-- Looking for __GLIBC__ - found
-- Performing Test _OFFT_IS_64BIT
-- Performing Test _OFFT_IS_64BIT - Failed
-- Performing Test HAVE_DATE_TIME
-- Performing Test HAVE_DATE_TIME - Success
-- Found Gettext: /usr/bin/msgmerge (found version "0.20.2") 
-- Performing Test COMPILER_HAS_HIDDEN_VISIBILITY
-- Performing Test COMPILER_HAS_HIDDEN_VISIBILITY - Success
-- Performing Test COMPILER_HAS_HIDDEN_INLINE_VISIBILITY
-- Performing Test COMPILER_HAS_HIDDEN_INLINE_VISIBILITY - Success
-- Performing Test COMPILER_HAS_DEPRECATED_ATTR
-- Performing Test COMPILER_HAS_DEPRECATED_ATTR - Success
-- The following REQUIRED packages have been found:

 * Qt5Qml (required version >= 5.12.8)
 * Qt5Quick
 * Qt5 (required version >= 5.12.0)
 * Gettext
 * KF5I18n (required version >= 5.70.0)
 * KF5Completion (required version >= 5.70.0)
 * KF5ItemViews (required version >= 5.70.0)
 * KF5JobWidgets (required version >= 5.70.0)
 * KF5Solid (required version >= 5.70.0)
 * KF5Auth (required version >= 5.70.0)
 * KF5Codecs (required version >= 5.70.0)
 * KF5WidgetsAddons (required version >= 5.70.0)
 * KF5ConfigWidgets (required version >= 5.70.0)
 * KF5XmlGui (required version >= 5.70.0)
 * Qt5Network (required version >= 5.12.0)
 * KF5KIO (required version >= 5.70.0)
 * Qt5Gui (required version >= 5.12.0)
 * KF5Package (required version >= 5.70.0)
 * KF5CoreAddons (required version >= 5.70.0)
 * KF5Service (required version >= 5.70.0)
 * Qt5Widgets (required version >= 5.12.0)
 * KF5WindowSystem (required version >= 5.70.0)
 * ECM (required version >= 1.6.0), Extra CMake Modules., <https://commits.kde.org/extra-cmake-modules>
 * KF5Plasma (required version >= 5.70.0)
 * KF5ThreadWeaver (required version >= 5.70.0)
 * Qt5Core

-- The following features have been disabled:

 * QCH, API documentation in QCH format (for e.g. Qt Assistant, Qt Creator & KDevelop)

-- Configuring done
-- Generating done
CMake Warning:
  Manually-specified variables were not used by the project:

    CMAKE_INCLUDE_PATH
    CMAKE_LIBRARY_PATH
    CMAKE_USE_RELATIVE_PATHS
    LIB_DESTINATION
    LIB_SUFFIX


-- Build files have been written to: /usr/src/RPM/BUILD/krunner-5.70.0/BUILD
+ popd
~/RPM/BUILD/krunner-5.70.0
+ __kf5_make
+ pushd BUILD
~/RPM/BUILD/krunner-5.70.0/BUILD ~/RPM/BUILD/krunner-5.70.0
+ make -j8
make: Entering directory '/usr/src/RPM/BUILD/krunner-5.70.0/BUILD'
/usr/bin/cmake -S/usr/src/RPM/BUILD/krunner-5.70.0 -B/usr/src/RPM/BUILD/krunner-5.70.0/BUILD --check-build-system CMakeFiles/Makefile.cmake 0
make: Leaving directory '/usr/src/RPM/BUILD/krunner-5.70.0/BUILD'
make: Entering directory '/usr/src/RPM/BUILD/krunner-5.70.0/BUILD'
/usr/bin/cmake -E cmake_progress_start /usr/src/RPM/BUILD/krunner-5.70.0/BUILD/CMakeFiles /usr/src/RPM/BUILD/krunner-5.70.0/BUILD/CMakeFiles/progress.marks
make: Leaving directory '/usr/src/RPM/BUILD/krunner-5.70.0/BUILD'
make -f CMakeFiles/Makefile2 all
make -f src/CMakeFiles/copy_servicetypes.dir/build.make src/CMakeFiles/copy_servicetypes.dir/depend
make -f templates/CMakeFiles/runner.dir/build.make templates/CMakeFiles/runner.dir/depend
make[2]: Entering directory '/usr/src/RPM/BUILD/krunner-5.70.0/BUILD'
cd /usr/src/RPM/BUILD/krunner-5.70.0/BUILD && /usr/bin/cmake -E cmake_depends "Unix Makefiles" /usr/src/RPM/BUILD/krunner-5.70.0 /usr/src/RPM/BUILD/krunner-5.70.0/src /usr/src/RPM/BUILD/krunner-5.70.0/BUILD /usr/src/RPM/BUILD/krunner-5.70.0/BUILD/src /usr/src/RPM/BUILD/krunner-5.70.0/BUILD/src/CMakeFiles/copy_servicetypes.dir/DependInfo.cmake --color=
Scanning dependencies of target copy_servicetypes
make[2]: Leaving directory '/usr/src/RPM/BUILD/krunner-5.70.0/BUILD'
make -f src/CMakeFiles/copy_servicetypes.dir/build.make src/CMakeFiles/copy_servicetypes.dir/build
make[2]: Entering directory '/usr/src/RPM/BUILD/krunner-5.70.0/BUILD'
cd /usr/src/RPM/BUILD/krunner-5.70.0/BUILD && /usr/bin/cmake -E cmake_depends "Unix Makefiles" /usr/src/RPM/BUILD/krunner-5.70.0 /usr/src/RPM/BUILD/krunner-5.70.0/templates /usr/src/RPM/BUILD/krunner-5.70.0/BUILD /usr/src/RPM/BUILD/krunner-5.70.0/BUILD/templates /usr/src/RPM/BUILD/krunner-5.70.0/BUILD/templates/CMakeFiles/runner.dir/DependInfo.cmake --color=
Scanning dependencies of target runner
make[2]: Leaving directory '/usr/src/RPM/BUILD/krunner-5.70.0/BUILD'
make -f templates/CMakeFiles/runner.dir/build.make templates/CMakeFiles/runner.dir/build
make[2]: Entering directory '/usr/src/RPM/BUILD/krunner-5.70.0/BUILD'
cd /usr/src/RPM/BUILD/krunner-5.70.0/BUILD/src && /usr/bin/cmake -E copy /usr/src/RPM/BUILD/krunner-5.70.0/src/data/servicetypes/plasma-runner.desktop /usr/src/RPM/BUILD/krunner-5.70.0/BUILD/bin/data/kservicetypes5
make[2]: Leaving directory '/usr/src/RPM/BUILD/krunner-5.70.0/BUILD'
make[1]: Entering directory '/usr/src/RPM/BUILD/krunner-5.70.0/BUILD'
[  5%] Built target copy_servicetypes
make[1]: Leaving directory '/usr/src/RPM/BUILD/krunner-5.70.0/BUILD'
make -f src/CMakeFiles/KF5Runner_autogen.dir/build.make src/CMakeFiles/KF5Runner_autogen.dir/depend
make[2]: Entering directory '/usr/src/RPM/BUILD/krunner-5.70.0/BUILD'
cd /usr/src/RPM/BUILD/krunner-5.70.0/BUILD && /usr/bin/cmake -E cmake_depends "Unix Makefiles" /usr/src/RPM/BUILD/krunner-5.70.0 /usr/src/RPM/BUILD/krunner-5.70.0/src /usr/src/RPM/BUILD/krunner-5.70.0/BUILD /usr/src/RPM/BUILD/krunner-5.70.0/BUILD/src /usr/src/RPM/BUILD/krunner-5.70.0/BUILD/src/CMakeFiles/KF5Runner_autogen.dir/DependInfo.cmake --color=
Scanning dependencies of target KF5Runner_autogen
make[2]: Leaving directory '/usr/src/RPM/BUILD/krunner-5.70.0/BUILD'
make -f src/CMakeFiles/KF5Runner_autogen.dir/build.make src/CMakeFiles/KF5Runner_autogen.dir/build
make[2]: Entering directory '/usr/src/RPM/BUILD/krunner-5.70.0/BUILD'
[  5%] Generating runner.tar.bz2
cd /usr/src/RPM/BUILD/krunner-5.70.0/templates/runner && /usr/bin/cmake -E tar cvfj /usr/src/RPM/BUILD/krunner-5.70.0/BUILD/templates/runner.tar.bz2 .
.
./src
./src/plasma-runner-%{APPNAMELC}.desktop
./src/CMakeLists.txt
./src/%{APPNAMELC}.h
./src/%{APPNAMELC}.cpp
./runner.png
./runner.kdevtemplate
./README
./Messages.sh
./LICENSES
./LICENSES/LGPL-2.1-or-later.txt
./CMakeLists.txt
make[2]: Leaving directory '/usr/src/RPM/BUILD/krunner-5.70.0/BUILD'
make[1]: Entering directory '/usr/src/RPM/BUILD/krunner-5.70.0/BUILD'
[ 11%] Built target runner
make[1]: Leaving directory '/usr/src/RPM/BUILD/krunner-5.70.0/BUILD'
make[2]: Entering directory '/usr/src/RPM/BUILD/krunner-5.70.0/BUILD'
[ 11%] Automatic MOC for target KF5Runner
cd /usr/src/RPM/BUILD/krunner-5.70.0/BUILD/src && /usr/bin/cmake -E cmake_autogen /usr/src/RPM/BUILD/krunner-5.70.0/BUILD/src/CMakeFiles/KF5Runner_autogen.dir/AutogenInfo.json Release
make[2]: Leaving directory '/usr/src/RPM/BUILD/krunner-5.70.0/BUILD'
make[1]: Entering directory '/usr/src/RPM/BUILD/krunner-5.70.0/BUILD'
[ 11%] Built target KF5Runner_autogen
make[1]: Leaving directory '/usr/src/RPM/BUILD/krunner-5.70.0/BUILD'
make -f src/CMakeFiles/KF5Runner.dir/build.make src/CMakeFiles/KF5Runner.dir/depend
make[2]: Entering directory '/usr/src/RPM/BUILD/krunner-5.70.0/BUILD'
cd /usr/src/RPM/BUILD/krunner-5.70.0/BUILD && /usr/bin/cmake -E cmake_depends "Unix Makefiles" /usr/src/RPM/BUILD/krunner-5.70.0 /usr/src/RPM/BUILD/krunner-5.70.0/src /usr/src/RPM/BUILD/krunner-5.70.0/BUILD /usr/src/RPM/BUILD/krunner-5.70.0/BUILD/src /usr/src/RPM/BUILD/krunner-5.70.0/BUILD/src/CMakeFiles/KF5Runner.dir/DependInfo.cmake --color=
Scanning dependencies of target KF5Runner
make[2]: Leaving directory '/usr/src/RPM/BUILD/krunner-5.70.0/BUILD'
make -f src/CMakeFiles/KF5Runner.dir/build.make src/CMakeFiles/KF5Runner.dir/build
make[2]: Entering directory '/usr/src/RPM/BUILD/krunner-5.70.0/BUILD'
[ 50%] Building CXX object src/CMakeFiles/KF5Runner.dir/runnerjobs.cpp.o
cd /usr/src/RPM/BUILD/krunner-5.70.0/BUILD/src && /usr/bin/c++  -DKCOREADDONS_LIB -DKF5Runner_EXPORTS -DKF_DEPRECATED_WARNINGS_SINCE=0x060000 -DKF_DISABLE_DEPRECATED_BEFORE_AND_AT=0x054400 -DKRUNNER_DEPRECATED_WARNINGS_SINCE=0x0 -DKRUNNER_DISABLE_DEPRECATED_BEFORE_AND_AT=0x0 -DPLASMA_DISABLE_DEPRECATED_BEFORE_AND_AT=0x050500 -DQT_CONCURRENT_LIB -DQT_CORE_LIB -DQT_DBUS_LIB -DQT_DEPRECATED_WARNINGS_SINCE=0x060000 -DQT_DISABLE_DEPRECATED_BEFORE=0x050d00 -DQT_GUI_LIB -DQT_NETWORK_LIB -DQT_NO_CAST_FROM_ASCII -DQT_NO_CAST_FROM_BYTEARRAY -DQT_NO_CAST_TO_ASCII -DQT_NO_DEBUG -DQT_NO_FOREACH -DQT_NO_NARROWING_CONVERSIONS_IN_CONNECT -DQT_NO_SIGNALS_SLOTS_KEYWORDS -DQT_NO_URL_CAST_FROM_STRING -DQT_STRICT_ITERATORS -DQT_USE_QSTRINGBUILDER -DQT_WIDGETS_LIB -D_FILE_OFFSET_BITS=64 -D_GNU_SOURCE -D_LARGEFILE64_SOURCE -I/usr/src/RPM/BUILD/krunner-5.70.0/BUILD/src -I/usr/src/RPM/BUILD/krunner-5.70.0/src -I/usr/src/RPM/BUILD/krunner-5.70.0/BUILD/src/KF5Runner_autogen/include -I/usr/src/RPM/BUILD/krunner-5.70.0/BUILD -isystem /usr/include/qt5 -isystem /usr/include/qt5/QtCore -isystem /usr/share/qt5/../../lib/qt5/mkspecs/linux-g++ -isystem /usr/include/KF5 -isystem /usr/include/KF5/Plasma -isystem /usr/include/KF5/KService -isystem /usr/include/KF5/KConfigCore -isystem /usr/include/KF5/KCoreAddons -isystem /usr/include/qt5/QtGui -isystem /usr/include/KF5/KPackage -isystem /usr/include/qt5/QtDBus -isystem /usr/include/qt5/QtWidgets -isystem /usr/include/KF5/KI18n -isystem /usr/include/KF5/ThreadWeaver -isystem /usr/include/KF5/KIOCore -isystem /usr/include/qt5/QtNetwork -isystem /usr/include/qt5/QtConcurrent  -pipe -frecord-gcc-switches -Wall -g -O2 -march=i586 -mtune=generic -fno-operator-names -fno-exceptions -Wall -Wextra -Wcast-align -Wchar-subscripts -Wformat-security -Wno-long-long -Wpointer-arith -Wundef -Wnon-virtual-dtor -Woverloaded-virtual -Werror=return-type -Wvla -Wdate-time -Wsuggest-override -Wlogical-op -pedantic -Wzero-as-null-pointer-constant -O2 -DNDEBUG -fPIC -fvisibility=hidden -fvisibility-inlines-hidden   -fPIC -std=gnu++11 -o CMakeFiles/KF5Runner.dir/runnerjobs.cpp.o -c /usr/src/RPM/BUILD/krunner-5.70.0/src/runnerjobs.cpp
make[2]: Leaving directory '/usr/src/RPM/BUILD/krunner-5.70.0/BUILD'
make[2]: Entering directory '/usr/src/RPM/BUILD/krunner-5.70.0/BUILD'
[ 55%] Building CXX object src/CMakeFiles/KF5Runner.dir/runnersyntax.cpp.o
cd /usr/src/RPM/BUILD/krunner-5.70.0/BUILD/src && /usr/bin/c++  -DKCOREADDONS_LIB -DKF5Runner_EXPORTS -DKF_DEPRECATED_WARNINGS_SINCE=0x060000 -DKF_DISABLE_DEPRECATED_BEFORE_AND_AT=0x054400 -DKRUNNER_DEPRECATED_WARNINGS_SINCE=0x0 -DKRUNNER_DISABLE_DEPRECATED_BEFORE_AND_AT=0x0 -DPLASMA_DISABLE_DEPRECATED_BEFORE_AND_AT=0x050500 -DQT_CONCURRENT_LIB -DQT_CORE_LIB -DQT_DBUS_LIB -DQT_DEPRECATED_WARNINGS_SINCE=0x060000 -DQT_DISABLE_DEPRECATED_BEFORE=0x050d00 -DQT_GUI_LIB -DQT_NETWORK_LIB -DQT_NO_CAST_FROM_ASCII -DQT_NO_CAST_FROM_BYTEARRAY -DQT_NO_CAST_TO_ASCII -DQT_NO_DEBUG -DQT_NO_FOREACH -DQT_NO_NARROWING_CONVERSIONS_IN_CONNECT -DQT_NO_SIGNALS_SLOTS_KEYWORDS -DQT_NO_URL_CAST_FROM_STRING -DQT_STRICT_ITERATORS -DQT_USE_QSTRINGBUILDER -DQT_WIDGETS_LIB -D_FILE_OFFSET_BITS=64 -D_GNU_SOURCE -D_LARGEFILE64_SOURCE -I/usr/src/RPM/BUILD/krunner-5.70.0/BUILD/src -I/usr/src/RPM/BUILD/krunner-5.70.0/src -I/usr/src/RPM/BUILD/krunner-5.70.0/BUILD/src/KF5Runner_autogen/include -I/usr/src/RPM/BUILD/krunner-5.70.0/BUILD -isystem /usr/include/qt5 -isystem /usr/include/qt5/QtCore -isystem /usr/share/qt5/../../lib/qt5/mkspecs/linux-g++ -isystem /usr/include/KF5 -isystem /usr/include/KF5/Plasma -isystem /usr/include/KF5/KService -isystem /usr/include/KF5/KConfigCore -isystem /usr/include/KF5/KCoreAddons -isystem /usr/include/qt5/QtGui -isystem /usr/include/KF5/KPackage -isystem /usr/include/qt5/QtDBus -isystem /usr/include/qt5/QtWidgets -isystem /usr/include/KF5/KI18n -isystem /usr/include/KF5/ThreadWeaver -isystem /usr/include/KF5/KIOCore -isystem /usr/include/qt5/QtNetwork -isystem /usr/include/qt5/QtConcurrent  -pipe -frecord-gcc-switches -Wall -g -O2 -march=i586 -mtune=generic -fno-operator-names -fno-exceptions -Wall -Wextra -Wcast-align -Wchar-subscripts -Wformat-security -Wno-long-long -Wpointer-arith -Wundef -Wnon-virtual-dtor -Woverloaded-virtual -Werror=return-type -Wvla -Wdate-time -Wsuggest-override -Wlogical-op -pedantic -Wzero-as-null-pointer-constant -O2 -DNDEBUG -fPIC -fvisibility=hidden -fvisibility-inlines-hidden   -fPIC -std=gnu++11 -o CMakeFiles/KF5Runner.dir/runnersyntax.cpp.o -c /usr/src/RPM/BUILD/krunner-5.70.0/src/runnersyntax.cpp
make[2]: Leaving directory '/usr/src/RPM/BUILD/krunner-5.70.0/BUILD'
make[2]: Entering directory '/usr/src/RPM/BUILD/krunner-5.70.0/BUILD'
[ 27%] Building CXX object src/CMakeFiles/KF5Runner.dir/querymatch.cpp.o
cd /usr/src/RPM/BUILD/krunner-5.70.0/BUILD/src && /usr/bin/c++  -DKCOREADDONS_LIB -DKF5Runner_EXPORTS -DKF_DEPRECATED_WARNINGS_SINCE=0x060000 -DKF_DISABLE_DEPRECATED_BEFORE_AND_AT=0x054400 -DKRUNNER_DEPRECATED_WARNINGS_SINCE=0x0 -DKRUNNER_DISABLE_DEPRECATED_BEFORE_AND_AT=0x0 -DPLASMA_DISABLE_DEPRECATED_BEFORE_AND_AT=0x050500 -DQT_CONCURRENT_LIB -DQT_CORE_LIB -DQT_DBUS_LIB -DQT_DEPRECATED_WARNINGS_SINCE=0x060000 -DQT_DISABLE_DEPRECATED_BEFORE=0x050d00 -DQT_GUI_LIB -DQT_NETWORK_LIB -DQT_NO_CAST_FROM_ASCII -DQT_NO_CAST_FROM_BYTEARRAY -DQT_NO_CAST_TO_ASCII -DQT_NO_DEBUG -DQT_NO_FOREACH -DQT_NO_NARROWING_CONVERSIONS_IN_CONNECT -DQT_NO_SIGNALS_SLOTS_KEYWORDS -DQT_NO_URL_CAST_FROM_STRING -DQT_STRICT_ITERATORS -DQT_USE_QSTRINGBUILDER -DQT_WIDGETS_LIB -D_FILE_OFFSET_BITS=64 -D_GNU_SOURCE -D_LARGEFILE64_SOURCE -I/usr/src/RPM/BUILD/krunner-5.70.0/BUILD/src -I/usr/src/RPM/BUILD/krunner-5.70.0/src -I/usr/src/RPM/BUILD/krunner-5.70.0/BUILD/src/KF5Runner_autogen/include -I/usr/src/RPM/BUILD/krunner-5.70.0/BUILD -isystem /usr/include/qt5 -isystem /usr/include/qt5/QtCore -isystem /usr/share/qt5/../../lib/qt5/mkspecs/linux-g++ -isystem /usr/include/KF5 -isystem /usr/include/KF5/Plasma -isystem /usr/include/KF5/KService -isystem /usr/include/KF5/KConfigCore -isystem /usr/include/KF5/KCoreAddons -isystem /usr/include/qt5/QtGui -isystem /usr/include/KF5/KPackage -isystem /usr/include/qt5/QtDBus -isystem /usr/include/qt5/QtWidgets -isystem /usr/include/KF5/KI18n -isystem /usr/include/KF5/ThreadWeaver -isystem /usr/include/KF5/KIOCore -isystem /usr/include/qt5/QtNetwork -isystem /usr/include/qt5/QtConcurrent  -pipe -frecord-gcc-switches -Wall -g -O2 -march=i586 -mtune=generic -fno-operator-names -fno-exceptions -Wall -Wextra -Wcast-align -Wchar-subscripts -Wformat-security -Wno-long-long -Wpointer-arith -Wundef -Wnon-virtual-dtor -Woverloaded-virtual -Werror=return-type -Wvla -Wdate-time -Wsuggest-override -Wlogical-op -pedantic -Wzero-as-null-pointer-constant -O2 -DNDEBUG -fPIC -fvisibility=hidden -fvisibility-inlines-hidden   -fPIC -std=gnu++11 -o CMakeFiles/KF5Runner.dir/querymatch.cpp.o -c /usr/src/RPM/BUILD/krunner-5.70.0/src/querymatch.cpp
make[2]: Leaving directory '/usr/src/RPM/BUILD/krunner-5.70.0/BUILD'
make[2]: Entering directory '/usr/src/RPM/BUILD/krunner-5.70.0/BUILD'
[ 61%] Building CXX object src/CMakeFiles/KF5Runner.dir/krunner_debug.cpp.o
cd /usr/src/RPM/BUILD/krunner-5.70.0/BUILD/src && /usr/bin/c++  -DKCOREADDONS_LIB -DKF5Runner_EXPORTS -DKF_DEPRECATED_WARNINGS_SINCE=0x060000 -DKF_DISABLE_DEPRECATED_BEFORE_AND_AT=0x054400 -DKRUNNER_DEPRECATED_WARNINGS_SINCE=0x0 -DKRUNNER_DISABLE_DEPRECATED_BEFORE_AND_AT=0x0 -DPLASMA_DISABLE_DEPRECATED_BEFORE_AND_AT=0x050500 -DQT_CONCURRENT_LIB -DQT_CORE_LIB -DQT_DBUS_LIB -DQT_DEPRECATED_WARNINGS_SINCE=0x060000 -DQT_DISABLE_DEPRECATED_BEFORE=0x050d00 -DQT_GUI_LIB -DQT_NETWORK_LIB -DQT_NO_CAST_FROM_ASCII -DQT_NO_CAST_FROM_BYTEARRAY -DQT_NO_CAST_TO_ASCII -DQT_NO_DEBUG -DQT_NO_FOREACH -DQT_NO_NARROWING_CONVERSIONS_IN_CONNECT -DQT_NO_SIGNALS_SLOTS_KEYWORDS -DQT_NO_URL_CAST_FROM_STRING -DQT_STRICT_ITERATORS -DQT_USE_QSTRINGBUILDER -DQT_WIDGETS_LIB -D_FILE_OFFSET_BITS=64 -D_GNU_SOURCE -D_LARGEFILE64_SOURCE -I/usr/src/RPM/BUILD/krunner-5.70.0/BUILD/src -I/usr/src/RPM/BUILD/krunner-5.70.0/src -I/usr/src/RPM/BUILD/krunner-5.70.0/BUILD/src/KF5Runner_autogen/include -I/usr/src/RPM/BUILD/krunner-5.70.0/BUILD -isystem /usr/include/qt5 -isystem /usr/include/qt5/QtCore -isystem /usr/share/qt5/../../lib/qt5/mkspecs/linux-g++ -isystem /usr/include/KF5 -isystem /usr/include/KF5/Plasma -isystem /usr/include/KF5/KService -isystem /usr/include/KF5/KConfigCore -isystem /usr/include/KF5/KCoreAddons -isystem /usr/include/qt5/QtGui -isystem /usr/include/KF5/KPackage -isystem /usr/include/qt5/QtDBus -isystem /usr/include/qt5/QtWidgets -isystem /usr/include/KF5/KI18n -isystem /usr/include/KF5/ThreadWeaver -isystem /usr/include/KF5/KIOCore -isystem /usr/include/qt5/QtNetwork -isystem /usr/include/qt5/QtConcurrent  -pipe -frecord-gcc-switches -Wall -g -O2 -march=i586 -mtune=generic -fno-operator-names -fno-exceptions -Wall -Wextra -Wcast-align -Wchar-subscripts -Wformat-security -Wno-long-long -Wpointer-arith -Wundef -Wnon-virtual-dtor -Woverloaded-virtual -Werror=return-type -Wvla -Wdate-time -Wsuggest-override -Wlogical-op -pedantic -Wzero-as-null-pointer-constant -O2 -DNDEBUG -fPIC -fvisibility=hidden -fvisibility-inlines-hidden   -fPIC -std=gnu++11 -o CMakeFiles/KF5Runner.dir/krunner_debug.cpp.o -c /usr/src/RPM/BUILD/krunner-5.70.0/BUILD/src/krunner_debug.cpp
make[2]: Leaving directory '/usr/src/RPM/BUILD/krunner-5.70.0/BUILD'
make[2]: Entering directory '/usr/src/RPM/BUILD/krunner-5.70.0/BUILD'
[ 16%] Building CXX object src/CMakeFiles/KF5Runner.dir/abstractrunner.cpp.o
cd /usr/src/RPM/BUILD/krunner-5.70.0/BUILD/src && /usr/bin/c++  -DKCOREADDONS_LIB -DKF5Runner_EXPORTS -DKF_DEPRECATED_WARNINGS_SINCE=0x060000 -DKF_DISABLE_DEPRECATED_BEFORE_AND_AT=0x054400 -DKRUNNER_DEPRECATED_WARNINGS_SINCE=0x0 -DKRUNNER_DISABLE_DEPRECATED_BEFORE_AND_AT=0x0 -DPLASMA_DISABLE_DEPRECATED_BEFORE_AND_AT=0x050500 -DQT_CONCURRENT_LIB -DQT_CORE_LIB -DQT_DBUS_LIB -DQT_DEPRECATED_WARNINGS_SINCE=0x060000 -DQT_DISABLE_DEPRECATED_BEFORE=0x050d00 -DQT_GUI_LIB -DQT_NETWORK_LIB -DQT_NO_CAST_FROM_ASCII -DQT_NO_CAST_FROM_BYTEARRAY -DQT_NO_CAST_TO_ASCII -DQT_NO_DEBUG -DQT_NO_FOREACH -DQT_NO_NARROWING_CONVERSIONS_IN_CONNECT -DQT_NO_SIGNALS_SLOTS_KEYWORDS -DQT_NO_URL_CAST_FROM_STRING -DQT_STRICT_ITERATORS -DQT_USE_QSTRINGBUILDER -DQT_WIDGETS_LIB -D_FILE_OFFSET_BITS=64 -D_GNU_SOURCE -D_LARGEFILE64_SOURCE -I/usr/src/RPM/BUILD/krunner-5.70.0/BUILD/src -I/usr/src/RPM/BUILD/krunner-5.70.0/src -I/usr/src/RPM/BUILD/krunner-5.70.0/BUILD/src/KF5Runner_autogen/include -I/usr/src/RPM/BUILD/krunner-5.70.0/BUILD -isystem /usr/include/qt5 -isystem /usr/include/qt5/QtCore -isystem /usr/share/qt5/../../lib/qt5/mkspecs/linux-g++ -isystem /usr/include/KF5 -isystem /usr/include/KF5/Plasma -isystem /usr/include/KF5/KService -isystem /usr/include/KF5/KConfigCore -isystem /usr/include/KF5/KCoreAddons -isystem /usr/include/qt5/QtGui -isystem /usr/include/KF5/KPackage -isystem /usr/include/qt5/QtDBus -isystem /usr/include/qt5/QtWidgets -isystem /usr/include/KF5/KI18n -isystem /usr/include/KF5/ThreadWeaver -isystem /usr/include/KF5/KIOCore -isystem /usr/include/qt5/QtNetwork -isystem /usr/include/qt5/QtConcurrent  -pipe -frecord-gcc-switches -Wall -g -O2 -march=i586 -mtune=generic -fno-operator-names -fno-exceptions -Wall -Wextra -Wcast-align -Wchar-subscripts -Wformat-security -Wno-long-long -Wpointer-arith -Wundef -Wnon-virtual-dtor -Woverloaded-virtual -Werror=return-type -Wvla -Wdate-time -Wsuggest-override -Wlogical-op -pedantic -Wzero-as-null-pointer-constant -O2 -DNDEBUG -fPIC -fvisibility=hidden -fvisibility-inlines-hidden   -fPIC -std=gnu++11 -o CMakeFiles/KF5Runner.dir/abstractrunner.cpp.o -c /usr/src/RPM/BUILD/krunner-5.70.0/src/abstractrunner.cpp
/usr/src/RPM/BUILD/krunner-5.70.0/src/abstractrunner.cpp: In member function 'Plasma::Package Plasma::AbstractRunner::package() const':
/usr/src/RPM/BUILD/krunner-5.70.0/src/abstractrunner.cpp:331:20: warning: 'Plasma::Package::Package(Plasma::PackageStructure*)' is deprecated: Since 5.6. Use KPackage API [-Wdeprecated-declarations]
  331 |     return Package();
      |                    ^
In file included from /usr/include/KF5/Plasma/Package:1,
                 from /usr/src/RPM/BUILD/krunner-5.70.0/src/abstractrunner.cpp:35:
/usr/include/KF5/plasma/package.h:98:14: note: declared here
   98 |     explicit Package(PackageStructure *structure = nullptr);
      |              ^~~~~~~
/usr/src/RPM/BUILD/krunner-5.70.0/src/abstractrunner.cpp:331:20: warning: 'Plasma::Package::Package(const Plasma::Package&)' is deprecated: Since 5.6. Use KPackage API [-Wdeprecated-declarations]
  331 |     return Package();
      |                    ^
In file included from /usr/include/KF5/Plasma/Package:1,
                 from /usr/src/RPM/BUILD/krunner-5.70.0/src/abstractrunner.cpp:35:
/usr/include/KF5/plasma/package.h:112:5: note: declared here
  112 |     Package(const Package &other);
      |     ^~~~~~~
/usr/src/RPM/BUILD/krunner-5.70.0/src/abstractrunner.cpp: In member function 'void Plasma::AbstractRunnerPrivate::init(KService::Ptr)':
/usr/src/RPM/BUILD/krunner-5.70.0/src/abstractrunner.cpp:378:44: warning: 'KPluginInfo::KPluginInfo(KService::Ptr)' is deprecated: Since 5.0. Use (Q|K)PluginLoader [-Wdeprecated-declarations]
  378 |     runnerDescription = KPluginInfo(service);
      |                                            ^
In file included from /usr/src/RPM/BUILD/krunner-5.70.0/src/abstractrunner.h:29,
                 from /usr/src/RPM/BUILD/krunner-5.70.0/src/abstractrunner.cpp:20:
/usr/include/KF5/KService/kplugininfo.h:119:14: note: declared here
  119 |     explicit KPluginInfo(const KService::Ptr service);
      |              ^~~~~~~~~~~
make[2]: Leaving directory '/usr/src/RPM/BUILD/krunner-5.70.0/BUILD'
make[2]: Entering directory '/usr/src/RPM/BUILD/krunner-5.70.0/BUILD'
[ 22%] Building CXX object src/CMakeFiles/KF5Runner.dir/KF5Runner_autogen/mocs_compilation.cpp.o
cd /usr/src/RPM/BUILD/krunner-5.70.0/BUILD/src && /usr/bin/c++  -DKCOREADDONS_LIB -DKF5Runner_EXPORTS -DKF_DEPRECATED_WARNINGS_SINCE=0x060000 -DKF_DISABLE_DEPRECATED_BEFORE_AND_AT=0x054400 -DKRUNNER_DEPRECATED_WARNINGS_SINCE=0x0 -DKRUNNER_DISABLE_DEPRECATED_BEFORE_AND_AT=0x0 -DPLASMA_DISABLE_DEPRECATED_BEFORE_AND_AT=0x050500 -DQT_CONCURRENT_LIB -DQT_CORE_LIB -DQT_DBUS_LIB -DQT_DEPRECATED_WARNINGS_SINCE=0x060000 -DQT_DISABLE_DEPRECATED_BEFORE=0x050d00 -DQT_GUI_LIB -DQT_NETWORK_LIB -DQT_NO_CAST_FROM_ASCII -DQT_NO_CAST_FROM_BYTEARRAY -DQT_NO_CAST_TO_ASCII -DQT_NO_DEBUG -DQT_NO_FOREACH -DQT_NO_NARROWING_CONVERSIONS_IN_CONNECT -DQT_NO_SIGNALS_SLOTS_KEYWORDS -DQT_NO_URL_CAST_FROM_STRING -DQT_STRICT_ITERATORS -DQT_USE_QSTRINGBUILDER -DQT_WIDGETS_LIB -D_FILE_OFFSET_BITS=64 -D_GNU_SOURCE -D_LARGEFILE64_SOURCE -I/usr/src/RPM/BUILD/krunner-5.70.0/BUILD/src -I/usr/src/RPM/BUILD/krunner-5.70.0/src -I/usr/src/RPM/BUILD/krunner-5.70.0/BUILD/src/KF5Runner_autogen/include -I/usr/src/RPM/BUILD/krunner-5.70.0/BUILD -isystem /usr/include/qt5 -isystem /usr/include/qt5/QtCore -isystem /usr/share/qt5/../../lib/qt5/mkspecs/linux-g++ -isystem /usr/include/KF5 -isystem /usr/include/KF5/Plasma -isystem /usr/include/KF5/KService -isystem /usr/include/KF5/KConfigCore -isystem /usr/include/KF5/KCoreAddons -isystem /usr/include/qt5/QtGui -isystem /usr/include/KF5/KPackage -isystem /usr/include/qt5/QtDBus -isystem /usr/include/qt5/QtWidgets -isystem /usr/include/KF5/KI18n -isystem /usr/include/KF5/ThreadWeaver -isystem /usr/include/KF5/KIOCore -isystem /usr/include/qt5/QtNetwork -isystem /usr/include/qt5/QtConcurrent  -pipe -frecord-gcc-switches -Wall -g -O2 -march=i586 -mtune=generic -fno-operator-names -fno-exceptions -Wall -Wextra -Wcast-align -Wchar-subscripts -Wformat-security -Wno-long-long -Wpointer-arith -Wundef -Wnon-virtual-dtor -Woverloaded-virtual -Werror=return-type -Wvla -Wdate-time -Wsuggest-override -Wlogical-op -pedantic -Wzero-as-null-pointer-constant -O2 -DNDEBUG -fPIC -fvisibility=hidden -fvisibility-inlines-hidden   -fPIC -std=gnu++11 -o CMakeFiles/KF5Runner.dir/KF5Runner_autogen/mocs_compilation.cpp.o -c /usr/src/RPM/BUILD/krunner-5.70.0/BUILD/src/KF5Runner_autogen/mocs_compilation.cpp
make[2]: Leaving directory '/usr/src/RPM/BUILD/krunner-5.70.0/BUILD'
make[2]: Entering directory '/usr/src/RPM/BUILD/krunner-5.70.0/BUILD'
[ 38%] Building CXX object src/CMakeFiles/KF5Runner.dir/runnermanager.cpp.o
cd /usr/src/RPM/BUILD/krunner-5.70.0/BUILD/src && /usr/bin/c++  -DKCOREADDONS_LIB -DKF5Runner_EXPORTS -DKF_DEPRECATED_WARNINGS_SINCE=0x060000 -DKF_DISABLE_DEPRECATED_BEFORE_AND_AT=0x054400 -DKRUNNER_DEPRECATED_WARNINGS_SINCE=0x0 -DKRUNNER_DISABLE_DEPRECATED_BEFORE_AND_AT=0x0 -DPLASMA_DISABLE_DEPRECATED_BEFORE_AND_AT=0x050500 -DQT_CONCURRENT_LIB -DQT_CORE_LIB -DQT_DBUS_LIB -DQT_DEPRECATED_WARNINGS_SINCE=0x060000 -DQT_DISABLE_DEPRECATED_BEFORE=0x050d00 -DQT_GUI_LIB -DQT_NETWORK_LIB -DQT_NO_CAST_FROM_ASCII -DQT_NO_CAST_FROM_BYTEARRAY -DQT_NO_CAST_TO_ASCII -DQT_NO_DEBUG -DQT_NO_FOREACH -DQT_NO_NARROWING_CONVERSIONS_IN_CONNECT -DQT_NO_SIGNALS_SLOTS_KEYWORDS -DQT_NO_URL_CAST_FROM_STRING -DQT_STRICT_ITERATORS -DQT_USE_QSTRINGBUILDER -DQT_WIDGETS_LIB -D_FILE_OFFSET_BITS=64 -D_GNU_SOURCE -D_LARGEFILE64_SOURCE -I/usr/src/RPM/BUILD/krunner-5.70.0/BUILD/src -I/usr/src/RPM/BUILD/krunner-5.70.0/src -I/usr/src/RPM/BUILD/krunner-5.70.0/BUILD/src/KF5Runner_autogen/include -I/usr/src/RPM/BUILD/krunner-5.70.0/BUILD -isystem /usr/include/qt5 -isystem /usr/include/qt5/QtCore -isystem /usr/share/qt5/../../lib/qt5/mkspecs/linux-g++ -isystem /usr/include/KF5 -isystem /usr/include/KF5/Plasma -isystem /usr/include/KF5/KService -isystem /usr/include/KF5/KConfigCore -isystem /usr/include/KF5/KCoreAddons -isystem /usr/include/qt5/QtGui -isystem /usr/include/KF5/KPackage -isystem /usr/include/qt5/QtDBus -isystem /usr/include/qt5/QtWidgets -isystem /usr/include/KF5/KI18n -isystem /usr/include/KF5/ThreadWeaver -isystem /usr/include/KF5/KIOCore -isystem /usr/include/qt5/QtNetwork -isystem /usr/include/qt5/QtConcurrent  -pipe -frecord-gcc-switches -Wall -g -O2 -march=i586 -mtune=generic -fno-operator-names -fno-exceptions -Wall -Wextra -Wcast-align -Wchar-subscripts -Wformat-security -Wno-long-long -Wpointer-arith -Wundef -Wnon-virtual-dtor -Woverloaded-virtual -Werror=return-type -Wvla -Wdate-time -Wsuggest-override -Wlogical-op -pedantic -Wzero-as-null-pointer-constant -O2 -DNDEBUG -fPIC -fvisibility=hidden -fvisibility-inlines-hidden   -fPIC -std=gnu++11 -o CMakeFiles/KF5Runner.dir/runnermanager.cpp.o -c /usr/src/RPM/BUILD/krunner-5.70.0/src/runnermanager.cpp
/usr/src/RPM/BUILD/krunner-5.70.0/src/runnermanager.cpp: In member function 'void Plasma::RunnerManagerPrivate::loadRunners()':
/usr/src/RPM/BUILD/krunner-5.70.0/src/runnermanager.cpp:209:70: warning: 'KService::Ptr KPluginInfo::service() const' is deprecated: Since 5.70. Use KPluginMetaData and KPluginLoader(info.libraryPath()) [-Wdeprecated-declarations]
  209 |                     runner = loadInstalledRunner(description.service());
      |                                                                      ^
In file included from /usr/src/RPM/BUILD/krunner-5.70.0/src/runnermanager.h:28,
                 from /usr/src/RPM/BUILD/krunner-5.70.0/src/runnermanager.cpp:22:
/usr/include/KF5/KService/kplugininfo.h:383:19: note: declared here
  383 |     KService::Ptr service() const;
      |                   ^~~~~~~
/usr/src/RPM/BUILD/krunner-5.70.0/src/runnermanager.cpp: In member function 'void Plasma::RunnerManager::loadRunner(KService::Ptr)':
/usr/src/RPM/BUILD/krunner-5.70.0/src/runnermanager.cpp:549:36: warning: 'KPluginInfo::KPluginInfo(KService::Ptr)' is deprecated: Since 5.0. Use (Q|K)PluginLoader [-Wdeprecated-declarations]
  549 |     KPluginInfo description(service);
      |                                    ^
In file included from /usr/src/RPM/BUILD/krunner-5.70.0/src/runnermanager.h:28,
                 from /usr/src/RPM/BUILD/krunner-5.70.0/src/runnermanager.cpp:22:
/usr/include/KF5/KService/kplugininfo.h:119:14: note: declared here
  119 |     explicit KPluginInfo(const KService::Ptr service);
      |              ^~~~~~~~~~~
/usr/src/RPM/BUILD/krunner-5.70.0/src/runnermanager.cpp: In static member function 'static KPluginInfo::List Plasma::RunnerManager::listRunnerInfo(const QString&)':
/usr/src/RPM/BUILD/krunner-5.70.0/src/runnermanager.cpp:718:25: warning: 'static KPluginInfo::List KPluginInfo::fromServices(const List&, const KConfigGroup&)' is deprecated: Since 5.0. Use fromMetaData and KPluginLoader(info.libraryPath()) [-Wdeprecated-declarations]
  718 |     return KPluginInfo::fromServices(offers);
      |                         ^~~~~~~~~~~~
In file included from /usr/src/RPM/BUILD/krunner-5.70.0/src/runnermanager.h:28,
                 from /usr/src/RPM/BUILD/krunner-5.70.0/src/runnermanager.cpp:22:
/usr/include/KF5/KService/kplugininfo.h:203:30: note: declared here
  203 |     static KPluginInfo::List fromServices(const KService::List &services, const KConfigGroup &config = KConfigGroup());
      |                              ^~~~~~~~~~~~
/usr/src/RPM/BUILD/krunner-5.70.0/src/runnermanager.cpp:718:44: warning: 'static KPluginInfo::List KPluginInfo::fromServices(const List&, const KConfigGroup&)' is deprecated: Since 5.0. Use fromMetaData and KPluginLoader(info.libraryPath()) [-Wdeprecated-declarations]
  718 |     return KPluginInfo::fromServices(offers);
      |                                            ^
In file included from /usr/src/RPM/BUILD/krunner-5.70.0/src/runnermanager.h:28,
                 from /usr/src/RPM/BUILD/krunner-5.70.0/src/runnermanager.cpp:22:
/usr/include/KF5/KService/kplugininfo.h:203:30: note: declared here
  203 |     static KPluginInfo::List fromServices(const KService::List &services, const KConfigGroup &config = KConfigGroup());
      |                              ^~~~~~~~~~~~
/usr/src/RPM/BUILD/krunner-5.70.0/src/runnermanager.cpp:718:44: warning: 'static KPluginInfo::List KPluginInfo::fromServices(const List&, const KConfigGroup&)' is deprecated: Since 5.0. Use fromMetaData and KPluginLoader(info.libraryPath()) [-Wdeprecated-declarations]
  718 |     return KPluginInfo::fromServices(offers);
      |                                            ^
In file included from /usr/src/RPM/BUILD/krunner-5.70.0/src/runnermanager.h:28,
                 from /usr/src/RPM/BUILD/krunner-5.70.0/src/runnermanager.cpp:22:
/usr/include/KF5/KService/kplugininfo.h:203:30: note: declared here
  203 |     static KPluginInfo::List fromServices(const KService::List &services, const KConfigGroup &config = KConfigGroup());
      |                              ^~~~~~~~~~~~
make[2]: Leaving directory '/usr/src/RPM/BUILD/krunner-5.70.0/BUILD'
make[2]: Entering directory '/usr/src/RPM/BUILD/krunner-5.70.0/BUILD'
[ 44%] Building CXX object src/CMakeFiles/KF5Runner.dir/dbusrunner.cpp.o
cd /usr/src/RPM/BUILD/krunner-5.70.0/BUILD/src && /usr/bin/c++  -DKCOREADDONS_LIB -DKF5Runner_EXPORTS -DKF_DEPRECATED_WARNINGS_SINCE=0x060000 -DKF_DISABLE_DEPRECATED_BEFORE_AND_AT=0x054400 -DKRUNNER_DEPRECATED_WARNINGS_SINCE=0x0 -DKRUNNER_DISABLE_DEPRECATED_BEFORE_AND_AT=0x0 -DPLASMA_DISABLE_DEPRECATED_BEFORE_AND_AT=0x050500 -DQT_CONCURRENT_LIB -DQT_CORE_LIB -DQT_DBUS_LIB -DQT_DEPRECATED_WARNINGS_SINCE=0x060000 -DQT_DISABLE_DEPRECATED_BEFORE=0x050d00 -DQT_GUI_LIB -DQT_NETWORK_LIB -DQT_NO_CAST_FROM_ASCII -DQT_NO_CAST_FROM_BYTEARRAY -DQT_NO_CAST_TO_ASCII -DQT_NO_DEBUG -DQT_NO_FOREACH -DQT_NO_NARROWING_CONVERSIONS_IN_CONNECT -DQT_NO_SIGNALS_SLOTS_KEYWORDS -DQT_NO_URL_CAST_FROM_STRING -DQT_STRICT_ITERATORS -DQT_USE_QSTRINGBUILDER -DQT_WIDGETS_LIB -D_FILE_OFFSET_BITS=64 -D_GNU_SOURCE -D_LARGEFILE64_SOURCE -I/usr/src/RPM/BUILD/krunner-5.70.0/BUILD/src -I/usr/src/RPM/BUILD/krunner-5.70.0/src -I/usr/src/RPM/BUILD/krunner-5.70.0/BUILD/src/KF5Runner_autogen/include -I/usr/src/RPM/BUILD/krunner-5.70.0/BUILD -isystem /usr/include/qt5 -isystem /usr/include/qt5/QtCore -isystem /usr/share/qt5/../../lib/qt5/mkspecs/linux-g++ -isystem /usr/include/KF5 -isystem /usr/include/KF5/Plasma -isystem /usr/include/KF5/KService -isystem /usr/include/KF5/KConfigCore -isystem /usr/include/KF5/KCoreAddons -isystem /usr/include/qt5/QtGui -isystem /usr/include/KF5/KPackage -isystem /usr/include/qt5/QtDBus -isystem /usr/include/qt5/QtWidgets -isystem /usr/include/KF5/KI18n -isystem /usr/include/KF5/ThreadWeaver -isystem /usr/include/KF5/KIOCore -isystem /usr/include/qt5/QtNetwork -isystem /usr/include/qt5/QtConcurrent  -pipe -frecord-gcc-switches -Wall -g -O2 -march=i586 -mtune=generic -fno-operator-names -fno-exceptions -Wall -Wextra -Wcast-align -Wchar-subscripts -Wformat-security -Wno-long-long -Wpointer-arith -Wundef -Wnon-virtual-dtor -Woverloaded-virtual -Werror=return-type -Wvla -Wdate-time -Wsuggest-override -Wlogical-op -pedantic -Wzero-as-null-pointer-constant -O2 -DNDEBUG -fPIC -fvisibility=hidden -fvisibility-inlines-hidden   -fPIC -std=gnu++11 -o CMakeFiles/KF5Runner.dir/dbusrunner.cpp.o -c /usr/src/RPM/BUILD/krunner-5.70.0/src/dbusrunner.cpp
make[2]: Leaving directory '/usr/src/RPM/BUILD/krunner-5.70.0/BUILD'
make[2]: Entering directory '/usr/src/RPM/BUILD/krunner-5.70.0/BUILD'
[ 33%] Building CXX object src/CMakeFiles/KF5Runner.dir/runnercontext.cpp.o
cd /usr/src/RPM/BUILD/krunner-5.70.0/BUILD/src && /usr/bin/c++  -DKCOREADDONS_LIB -DKF5Runner_EXPORTS -DKF_DEPRECATED_WARNINGS_SINCE=0x060000 -DKF_DISABLE_DEPRECATED_BEFORE_AND_AT=0x054400 -DKRUNNER_DEPRECATED_WARNINGS_SINCE=0x0 -DKRUNNER_DISABLE_DEPRECATED_BEFORE_AND_AT=0x0 -DPLASMA_DISABLE_DEPRECATED_BEFORE_AND_AT=0x050500 -DQT_CONCURRENT_LIB -DQT_CORE_LIB -DQT_DBUS_LIB -DQT_DEPRECATED_WARNINGS_SINCE=0x060000 -DQT_DISABLE_DEPRECATED_BEFORE=0x050d00 -DQT_GUI_LIB -DQT_NETWORK_LIB -DQT_NO_CAST_FROM_ASCII -DQT_NO_CAST_FROM_BYTEARRAY -DQT_NO_CAST_TO_ASCII -DQT_NO_DEBUG -DQT_NO_FOREACH -DQT_NO_NARROWING_CONVERSIONS_IN_CONNECT -DQT_NO_SIGNALS_SLOTS_KEYWORDS -DQT_NO_URL_CAST_FROM_STRING -DQT_STRICT_ITERATORS -DQT_USE_QSTRINGBUILDER -DQT_WIDGETS_LIB -D_FILE_OFFSET_BITS=64 -D_GNU_SOURCE -D_LARGEFILE64_SOURCE -I/usr/src/RPM/BUILD/krunner-5.70.0/BUILD/src -I/usr/src/RPM/BUILD/krunner-5.70.0/src -I/usr/src/RPM/BUILD/krunner-5.70.0/BUILD/src/KF5Runner_autogen/include -I/usr/src/RPM/BUILD/krunner-5.70.0/BUILD -isystem /usr/include/qt5 -isystem /usr/include/qt5/QtCore -isystem /usr/share/qt5/../../lib/qt5/mkspecs/linux-g++ -isystem /usr/include/KF5 -isystem /usr/include/KF5/Plasma -isystem /usr/include/KF5/KService -isystem /usr/include/KF5/KConfigCore -isystem /usr/include/KF5/KCoreAddons -isystem /usr/include/qt5/QtGui -isystem /usr/include/KF5/KPackage -isystem /usr/include/qt5/QtDBus -isystem /usr/include/qt5/QtWidgets -isystem /usr/include/KF5/KI18n -isystem /usr/include/KF5/ThreadWeaver -isystem /usr/include/KF5/KIOCore -isystem /usr/include/qt5/QtNetwork -isystem /usr/include/qt5/QtConcurrent  -pipe -frecord-gcc-switches -Wall -g -O2 -march=i586 -mtune=generic -fno-operator-names -fno-exceptions -Wall -Wextra -Wcast-align -Wchar-subscripts -Wformat-security -Wno-long-long -Wpointer-arith -Wundef -Wnon-virtual-dtor -Woverloaded-virtual -Werror=return-type -Wvla -Wdate-time -Wsuggest-override -Wlogical-op -pedantic -Wzero-as-null-pointer-constant -O2 -DNDEBUG -fPIC -fvisibility=hidden -fvisibility-inlines-hidden   -fPIC -std=gnu++11 -o CMakeFiles/KF5Runner.dir/runnercontext.cpp.o -c /usr/src/RPM/BUILD/krunner-5.70.0/src/runnercontext.cpp
make[2]: Leaving directory '/usr/src/RPM/BUILD/krunner-5.70.0/BUILD'
make[2]: Entering directory '/usr/src/RPM/BUILD/krunner-5.70.0/BUILD'
[ 66%] Linking CXX shared library ../bin/libKF5Runner.so
cd /usr/src/RPM/BUILD/krunner-5.70.0/BUILD/src && /usr/bin/cmake -E cmake_link_script CMakeFiles/KF5Runner.dir/link.txt --verbose=1
/usr/bin/c++ -fPIC -pipe -frecord-gcc-switches -Wall -g -O2 -march=i586 -mtune=generic -fno-operator-names -fno-exceptions -Wall -Wextra -Wcast-align -Wchar-subscripts -Wformat-security -Wno-long-long -Wpointer-arith -Wundef -Wnon-virtual-dtor -Woverloaded-virtual -Werror=return-type -Wvla -Wdate-time -Wsuggest-override -Wlogical-op -pedantic -Wzero-as-null-pointer-constant -O2 -DNDEBUG -Wl,--no-undefined -Wl,--fatal-warnings -Wl,--enable-new-dtags -L/usr/lib -L/usr/lib/kf5/devel -shared -Wl,-soname,libKF5Runner.so.5 -o ../bin/libKF5Runner.so.5.70.0 CMakeFiles/KF5Runner.dir/KF5Runner_autogen/mocs_compilation.cpp.o CMakeFiles/KF5Runner.dir/abstractrunner.cpp.o CMakeFiles/KF5Runner.dir/dbusrunner.cpp.o CMakeFiles/KF5Runner.dir/runnerjobs.cpp.o CMakeFiles/KF5Runner.dir/querymatch.cpp.o CMakeFiles/KF5Runner.dir/runnercontext.cpp.o CMakeFiles/KF5Runner.dir/runnermanager.cpp.o CMakeFiles/KF5Runner.dir/runnersyntax.cpp.o CMakeFiles/KF5Runner.dir/krunner_debug.cpp.o  /usr/lib/libKF5Plasma.so.5.70.0 /usr/lib/libKF5ThreadWeaver.so.5.70.0 /usr/lib/libKF5Package.so.5.70.0 /usr/lib/libKF5KIOCore.so.5.70.0 /usr/lib/libKF5Service.so.5.70.0 /usr/lib/libQt5Concurrent.so.5.12.8 /usr/lib/libQt5Network.so.5.12.8 /usr/lib/libKF5I18n.so.5.70.0 /usr/lib/libKF5ConfigCore.so.5.70.0 /usr/lib/libQt5DBus.so.5.12.8 /usr/lib/libKF5CoreAddons.so.5.70.0 /usr/lib/libQt5Widgets.so.5.12.8 /usr/lib/libQt5Gui.so.5.12.8 /usr/lib/libQt5Core.so.5.12.8 
cd /usr/src/RPM/BUILD/krunner-5.70.0/BUILD/src && /usr/bin/cmake -E cmake_symlink_library ../bin/libKF5Runner.so.5.70.0 ../bin/libKF5Runner.so.5 ../bin/libKF5Runner.so
make[2]: Leaving directory '/usr/src/RPM/BUILD/krunner-5.70.0/BUILD'
make[1]: Entering directory '/usr/src/RPM/BUILD/krunner-5.70.0/BUILD'
[ 66%] Built target KF5Runner
make[1]: Leaving directory '/usr/src/RPM/BUILD/krunner-5.70.0/BUILD'
make -f src/declarative/CMakeFiles/runnermodelplugin_autogen.dir/build.make src/declarative/CMakeFiles/runnermodelplugin_autogen.dir/depend
make[2]: Entering directory '/usr/src/RPM/BUILD/krunner-5.70.0/BUILD'
cd /usr/src/RPM/BUILD/krunner-5.70.0/BUILD && /usr/bin/cmake -E cmake_depends "Unix Makefiles" /usr/src/RPM/BUILD/krunner-5.70.0 /usr/src/RPM/BUILD/krunner-5.70.0/src/declarative /usr/src/RPM/BUILD/krunner-5.70.0/BUILD /usr/src/RPM/BUILD/krunner-5.70.0/BUILD/src/declarative /usr/src/RPM/BUILD/krunner-5.70.0/BUILD/src/declarative/CMakeFiles/runnermodelplugin_autogen.dir/DependInfo.cmake --color=
Scanning dependencies of target runnermodelplugin_autogen
make[2]: Leaving directory '/usr/src/RPM/BUILD/krunner-5.70.0/BUILD'
make -f src/declarative/CMakeFiles/runnermodelplugin_autogen.dir/build.make src/declarative/CMakeFiles/runnermodelplugin_autogen.dir/build
make[2]: Entering directory '/usr/src/RPM/BUILD/krunner-5.70.0/BUILD'
[ 72%] Automatic MOC for target runnermodelplugin
cd /usr/src/RPM/BUILD/krunner-5.70.0/BUILD/src/declarative && /usr/bin/cmake -E cmake_autogen /usr/src/RPM/BUILD/krunner-5.70.0/BUILD/src/declarative/CMakeFiles/runnermodelplugin_autogen.dir/AutogenInfo.json Release
make[2]: Leaving directory '/usr/src/RPM/BUILD/krunner-5.70.0/BUILD'
make[1]: Entering directory '/usr/src/RPM/BUILD/krunner-5.70.0/BUILD'
[ 72%] Built target runnermodelplugin_autogen
make[1]: Leaving directory '/usr/src/RPM/BUILD/krunner-5.70.0/BUILD'
make -f src/declarative/CMakeFiles/runnermodelplugin.dir/build.make src/declarative/CMakeFiles/runnermodelplugin.dir/depend
make[2]: Entering directory '/usr/src/RPM/BUILD/krunner-5.70.0/BUILD'
cd /usr/src/RPM/BUILD/krunner-5.70.0/BUILD && /usr/bin/cmake -E cmake_depends "Unix Makefiles" /usr/src/RPM/BUILD/krunner-5.70.0 /usr/src/RPM/BUILD/krunner-5.70.0/src/declarative /usr/src/RPM/BUILD/krunner-5.70.0/BUILD /usr/src/RPM/BUILD/krunner-5.70.0/BUILD/src/declarative /usr/src/RPM/BUILD/krunner-5.70.0/BUILD/src/declarative/CMakeFiles/runnermodelplugin.dir/DependInfo.cmake --color=
Scanning dependencies of target runnermodelplugin
make[2]: Leaving directory '/usr/src/RPM/BUILD/krunner-5.70.0/BUILD'
make -f src/declarative/CMakeFiles/runnermodelplugin.dir/build.make src/declarative/CMakeFiles/runnermodelplugin.dir/build
make[2]: Entering directory '/usr/src/RPM/BUILD/krunner-5.70.0/BUILD'
[ 88%] Building CXX object src/declarative/CMakeFiles/runnermodelplugin.dir/krunner_debug.cpp.o
cd /usr/src/RPM/BUILD/krunner-5.70.0/BUILD/src/declarative && /usr/bin/c++  -DKCOREADDONS_LIB -DKF_DEPRECATED_WARNINGS_SINCE=0x060000 -DKF_DISABLE_DEPRECATED_BEFORE_AND_AT=0x054400 -DKRUNNER_DEPRECATED_WARNINGS_SINCE=0x0 -DKRUNNER_DISABLE_DEPRECATED_BEFORE_AND_AT=0x0 -DPLASMA_DISABLE_DEPRECATED_BEFORE_AND_AT=0x050500 -DQT_CORE_LIB -DQT_DEPRECATED_WARNINGS_SINCE=0x060000 -DQT_DISABLE_DEPRECATED_BEFORE=0x050d00 -DQT_GUI_LIB -DQT_NETWORK_LIB -DQT_NO_CAST_FROM_ASCII -DQT_NO_CAST_FROM_BYTEARRAY -DQT_NO_CAST_TO_ASCII -DQT_NO_DEBUG -DQT_NO_FOREACH -DQT_NO_NARROWING_CONVERSIONS_IN_CONNECT -DQT_NO_SIGNALS_SLOTS_KEYWORDS -DQT_NO_URL_CAST_FROM_STRING -DQT_QML_LIB -DQT_QUICK_LIB -DQT_STRICT_ITERATORS -DQT_USE_QSTRINGBUILDER -DQT_WIDGETS_LIB -D_FILE_OFFSET_BITS=64 -D_GNU_SOURCE -D_LARGEFILE64_SOURCE -Drunnermodelplugin_EXPORTS -I/usr/src/RPM/BUILD/krunner-5.70.0/BUILD/src/declarative -I/usr/src/RPM/BUILD/krunner-5.70.0/src/declarative -I/usr/src/RPM/BUILD/krunner-5.70.0/BUILD/src/declarative/runnermodelplugin_autogen/include -I/usr/src/RPM/BUILD/krunner-5.70.0/BUILD -I/usr/src/RPM/BUILD/krunner-5.70.0/BUILD/src -I/usr/src/RPM/BUILD/krunner-5.70.0/src -isystem /usr/include/qt5 -isystem /usr/include/qt5/QtQuick -isystem /usr/include/qt5/QtQml -isystem /usr/include/qt5/QtNetwork -isystem /usr/include/qt5/QtCore -isystem /usr/share/qt5/../../lib/qt5/mkspecs/linux-g++ -isystem /usr/include/qt5/QtGui -isystem /usr/include/qt5/QtWidgets -isystem /usr/include/KF5/KI18n -isystem /usr/include/KF5 -isystem /usr/include/KF5/KService -isystem /usr/include/KF5/KConfigCore -isystem /usr/include/KF5/KCoreAddons -isystem /usr/include/KF5/Plasma -isystem /usr/include/KF5/KPackage  -pipe -frecord-gcc-switches -Wall -g -O2 -march=i586 -mtune=generic -fno-operator-names -fno-exceptions -Wall -Wextra -Wcast-align -Wchar-subscripts -Wformat-security -Wno-long-long -Wpointer-arith -Wundef -Wnon-virtual-dtor -Woverloaded-virtual -Werror=return-type -Wvla -Wdate-time -Wsuggest-override -Wlogical-op -pedantic -Wzero-as-null-pointer-constant -O2 -DNDEBUG -fPIC -fvisibility=hidden -fvisibility-inlines-hidden   -fPIC -std=gnu++11 -o CMakeFiles/runnermodelplugin.dir/krunner_debug.cpp.o -c /usr/src/RPM/BUILD/krunner-5.70.0/BUILD/src/declarative/krunner_debug.cpp
make[2]: Leaving directory '/usr/src/RPM/BUILD/krunner-5.70.0/BUILD'
make[2]: Entering directory '/usr/src/RPM/BUILD/krunner-5.70.0/BUILD'
[ 94%] Building CXX object src/declarative/CMakeFiles/runnermodelplugin.dir/runnermodelplugin_autogen/mocs_compilation.cpp.o
cd /usr/src/RPM/BUILD/krunner-5.70.0/BUILD/src/declarative && /usr/bin/c++  -DKCOREADDONS_LIB -DKF_DEPRECATED_WARNINGS_SINCE=0x060000 -DKF_DISABLE_DEPRECATED_BEFORE_AND_AT=0x054400 -DKRUNNER_DEPRECATED_WARNINGS_SINCE=0x0 -DKRUNNER_DISABLE_DEPRECATED_BEFORE_AND_AT=0x0 -DPLASMA_DISABLE_DEPRECATED_BEFORE_AND_AT=0x050500 -DQT_CORE_LIB -DQT_DEPRECATED_WARNINGS_SINCE=0x060000 -DQT_DISABLE_DEPRECATED_BEFORE=0x050d00 -DQT_GUI_LIB -DQT_NETWORK_LIB -DQT_NO_CAST_FROM_ASCII -DQT_NO_CAST_FROM_BYTEARRAY -DQT_NO_CAST_TO_ASCII -DQT_NO_DEBUG -DQT_NO_FOREACH -DQT_NO_NARROWING_CONVERSIONS_IN_CONNECT -DQT_NO_SIGNALS_SLOTS_KEYWORDS -DQT_NO_URL_CAST_FROM_STRING -DQT_QML_LIB -DQT_QUICK_LIB -DQT_STRICT_ITERATORS -DQT_USE_QSTRINGBUILDER -DQT_WIDGETS_LIB -D_FILE_OFFSET_BITS=64 -D_GNU_SOURCE -D_LARGEFILE64_SOURCE -Drunnermodelplugin_EXPORTS -I/usr/src/RPM/BUILD/krunner-5.70.0/BUILD/src/declarative -I/usr/src/RPM/BUILD/krunner-5.70.0/src/declarative -I/usr/src/RPM/BUILD/krunner-5.70.0/BUILD/src/declarative/runnermodelplugin_autogen/include -I/usr/src/RPM/BUILD/krunner-5.70.0/BUILD -I/usr/src/RPM/BUILD/krunner-5.70.0/BUILD/src -I/usr/src/RPM/BUILD/krunner-5.70.0/src -isystem /usr/include/qt5 -isystem /usr/include/qt5/QtQuick -isystem /usr/include/qt5/QtQml -isystem /usr/include/qt5/QtNetwork -isystem /usr/include/qt5/QtCore -isystem /usr/share/qt5/../../lib/qt5/mkspecs/linux-g++ -isystem /usr/include/qt5/QtGui -isystem /usr/include/qt5/QtWidgets -isystem /usr/include/KF5/KI18n -isystem /usr/include/KF5 -isystem /usr/include/KF5/KService -isystem /usr/include/KF5/KConfigCore -isystem /usr/include/KF5/KCoreAddons -isystem /usr/include/KF5/Plasma -isystem /usr/include/KF5/KPackage  -pipe -frecord-gcc-switches -Wall -g -O2 -march=i586 -mtune=generic -fno-operator-names -fno-exceptions -Wall -Wextra -Wcast-align -Wchar-subscripts -Wformat-security -Wno-long-long -Wpointer-arith -Wundef -Wnon-virtual-dtor -Woverloaded-virtual -Werror=return-type -Wvla -Wdate-time -Wsuggest-override -Wlogical-op -pedantic -Wzero-as-null-pointer-constant -O2 -DNDEBUG -fPIC -fvisibility=hidden -fvisibility-inlines-hidden   -fPIC -std=gnu++11 -o CMakeFiles/runnermodelplugin.dir/runnermodelplugin_autogen/mocs_compilation.cpp.o -c /usr/src/RPM/BUILD/krunner-5.70.0/BUILD/src/declarative/runnermodelplugin_autogen/mocs_compilation.cpp
make[2]: Leaving directory '/usr/src/RPM/BUILD/krunner-5.70.0/BUILD'
make[2]: Entering directory '/usr/src/RPM/BUILD/krunner-5.70.0/BUILD'
[ 83%] Building CXX object src/declarative/CMakeFiles/runnermodelplugin.dir/runnermodel.cpp.o
cd /usr/src/RPM/BUILD/krunner-5.70.0/BUILD/src/declarative && /usr/bin/c++  -DKCOREADDONS_LIB -DKF_DEPRECATED_WARNINGS_SINCE=0x060000 -DKF_DISABLE_DEPRECATED_BEFORE_AND_AT=0x054400 -DKRUNNER_DEPRECATED_WARNINGS_SINCE=0x0 -DKRUNNER_DISABLE_DEPRECATED_BEFORE_AND_AT=0x0 -DPLASMA_DISABLE_DEPRECATED_BEFORE_AND_AT=0x050500 -DQT_CORE_LIB -DQT_DEPRECATED_WARNINGS_SINCE=0x060000 -DQT_DISABLE_DEPRECATED_BEFORE=0x050d00 -DQT_GUI_LIB -DQT_NETWORK_LIB -DQT_NO_CAST_FROM_ASCII -DQT_NO_CAST_FROM_BYTEARRAY -DQT_NO_CAST_TO_ASCII -DQT_NO_DEBUG -DQT_NO_FOREACH -DQT_NO_NARROWING_CONVERSIONS_IN_CONNECT -DQT_NO_SIGNALS_SLOTS_KEYWORDS -DQT_NO_URL_CAST_FROM_STRING -DQT_QML_LIB -DQT_QUICK_LIB -DQT_STRICT_ITERATORS -DQT_USE_QSTRINGBUILDER -DQT_WIDGETS_LIB -D_FILE_OFFSET_BITS=64 -D_GNU_SOURCE -D_LARGEFILE64_SOURCE -Drunnermodelplugin_EXPORTS -I/usr/src/RPM/BUILD/krunner-5.70.0/BUILD/src/declarative -I/usr/src/RPM/BUILD/krunner-5.70.0/src/declarative -I/usr/src/RPM/BUILD/krunner-5.70.0/BUILD/src/declarative/runnermodelplugin_autogen/include -I/usr/src/RPM/BUILD/krunner-5.70.0/BUILD -I/usr/src/RPM/BUILD/krunner-5.70.0/BUILD/src -I/usr/src/RPM/BUILD/krunner-5.70.0/src -isystem /usr/include/qt5 -isystem /usr/include/qt5/QtQuick -isystem /usr/include/qt5/QtQml -isystem /usr/include/qt5/QtNetwork -isystem /usr/include/qt5/QtCore -isystem /usr/share/qt5/../../lib/qt5/mkspecs/linux-g++ -isystem /usr/include/qt5/QtGui -isystem /usr/include/qt5/QtWidgets -isystem /usr/include/KF5/KI18n -isystem /usr/include/KF5 -isystem /usr/include/KF5/KService -isystem /usr/include/KF5/KConfigCore -isystem /usr/include/KF5/KCoreAddons -isystem /usr/include/KF5/Plasma -isystem /usr/include/KF5/KPackage  -pipe -frecord-gcc-switches -Wall -g -O2 -march=i586 -mtune=generic -fno-operator-names -fno-exceptions -Wall -Wextra -Wcast-align -Wchar-subscripts -Wformat-security -Wno-long-long -Wpointer-arith -Wundef -Wnon-virtual-dtor -Woverloaded-virtual -Werror=return-type -Wvla -Wdate-time -Wsuggest-override -Wlogical-op -pedantic -Wzero-as-null-pointer-constant -O2 -DNDEBUG -fPIC -fvisibility=hidden -fvisibility-inlines-hidden   -fPIC -std=gnu++11 -o CMakeFiles/runnermodelplugin.dir/runnermodel.cpp.o -c /usr/src/RPM/BUILD/krunner-5.70.0/src/declarative/runnermodel.cpp
make[2]: Leaving directory '/usr/src/RPM/BUILD/krunner-5.70.0/BUILD'
make[2]: Entering directory '/usr/src/RPM/BUILD/krunner-5.70.0/BUILD'
[ 77%] Building CXX object src/declarative/CMakeFiles/runnermodelplugin.dir/runnermodelplugin.cpp.o
cd /usr/src/RPM/BUILD/krunner-5.70.0/BUILD/src/declarative && /usr/bin/c++  -DKCOREADDONS_LIB -DKF_DEPRECATED_WARNINGS_SINCE=0x060000 -DKF_DISABLE_DEPRECATED_BEFORE_AND_AT=0x054400 -DKRUNNER_DEPRECATED_WARNINGS_SINCE=0x0 -DKRUNNER_DISABLE_DEPRECATED_BEFORE_AND_AT=0x0 -DPLASMA_DISABLE_DEPRECATED_BEFORE_AND_AT=0x050500 -DQT_CORE_LIB -DQT_DEPRECATED_WARNINGS_SINCE=0x060000 -DQT_DISABLE_DEPRECATED_BEFORE=0x050d00 -DQT_GUI_LIB -DQT_NETWORK_LIB -DQT_NO_CAST_FROM_ASCII -DQT_NO_CAST_FROM_BYTEARRAY -DQT_NO_CAST_TO_ASCII -DQT_NO_DEBUG -DQT_NO_FOREACH -DQT_NO_NARROWING_CONVERSIONS_IN_CONNECT -DQT_NO_SIGNALS_SLOTS_KEYWORDS -DQT_NO_URL_CAST_FROM_STRING -DQT_QML_LIB -DQT_QUICK_LIB -DQT_STRICT_ITERATORS -DQT_USE_QSTRINGBUILDER -DQT_WIDGETS_LIB -D_FILE_OFFSET_BITS=64 -D_GNU_SOURCE -D_LARGEFILE64_SOURCE -Drunnermodelplugin_EXPORTS -I/usr/src/RPM/BUILD/krunner-5.70.0/BUILD/src/declarative -I/usr/src/RPM/BUILD/krunner-5.70.0/src/declarative -I/usr/src/RPM/BUILD/krunner-5.70.0/BUILD/src/declarative/runnermodelplugin_autogen/include -I/usr/src/RPM/BUILD/krunner-5.70.0/BUILD -I/usr/src/RPM/BUILD/krunner-5.70.0/BUILD/src -I/usr/src/RPM/BUILD/krunner-5.70.0/src -isystem /usr/include/qt5 -isystem /usr/include/qt5/QtQuick -isystem /usr/include/qt5/QtQml -isystem /usr/include/qt5/QtNetwork -isystem /usr/include/qt5/QtCore -isystem /usr/share/qt5/../../lib/qt5/mkspecs/linux-g++ -isystem /usr/include/qt5/QtGui -isystem /usr/include/qt5/QtWidgets -isystem /usr/include/KF5/KI18n -isystem /usr/include/KF5 -isystem /usr/include/KF5/KService -isystem /usr/include/KF5/KConfigCore -isystem /usr/include/KF5/KCoreAddons -isystem /usr/include/KF5/Plasma -isystem /usr/include/KF5/KPackage  -pipe -frecord-gcc-switches -Wall -g -O2 -march=i586 -mtune=generic -fno-operator-names -fno-exceptions -Wall -Wextra -Wcast-align -Wchar-subscripts -Wformat-security -Wno-long-long -Wpointer-arith -Wundef -Wnon-virtual-dtor -Woverloaded-virtual -Werror=return-type -Wvla -Wdate-time -Wsuggest-override -Wlogical-op -pedantic -Wzero-as-null-pointer-constant -O2 -DNDEBUG -fPIC -fvisibility=hidden -fvisibility-inlines-hidden   -fPIC -std=gnu++11 -o CMakeFiles/runnermodelplugin.dir/runnermodelplugin.cpp.o -c /usr/src/RPM/BUILD/krunner-5.70.0/src/declarative/runnermodelplugin.cpp
make[2]: Leaving directory '/usr/src/RPM/BUILD/krunner-5.70.0/BUILD'
make[2]: Entering directory '/usr/src/RPM/BUILD/krunner-5.70.0/BUILD'
[100%] Linking CXX shared library ../../bin/librunnermodelplugin.so
cd /usr/src/RPM/BUILD/krunner-5.70.0/BUILD/src/declarative && /usr/bin/cmake -E cmake_link_script CMakeFiles/runnermodelplugin.dir/link.txt --verbose=1
/usr/bin/c++ -fPIC -pipe -frecord-gcc-switches -Wall -g -O2 -march=i586 -mtune=generic -fno-operator-names -fno-exceptions -Wall -Wextra -Wcast-align -Wchar-subscripts -Wformat-security -Wno-long-long -Wpointer-arith -Wundef -Wnon-virtual-dtor -Woverloaded-virtual -Werror=return-type -Wvla -Wdate-time -Wsuggest-override -Wlogical-op -pedantic -Wzero-as-null-pointer-constant -O2 -DNDEBUG -Wl,--no-undefined -Wl,--fatal-warnings -Wl,--enable-new-dtags -L/usr/lib -L/usr/lib/kf5/devel -shared -Wl,-soname,librunnermodelplugin.so -o ../../bin/librunnermodelplugin.so CMakeFiles/runnermodelplugin.dir/runnermodelplugin_autogen/mocs_compilation.cpp.o CMakeFiles/runnermodelplugin.dir/runnermodel.cpp.o CMakeFiles/runnermodelplugin.dir/runnermodelplugin.cpp.o CMakeFiles/runnermodelplugin.dir/krunner_debug.cpp.o  /usr/lib/libQt5Quick.so.5.12.8 /usr/lib/libQt5Qml.so.5.12.8 ../../bin/libKF5Runner.so.5.70.0 /usr/lib/libKF5Plasma.so.5.70.0 /usr/lib/libKF5Package.so.5.70.0 /usr/lib/libQt5Widgets.so.5.12.8 /usr/lib/libQt5Gui.so.5.12.8 /usr/lib/libKF5Service.so.5.70.0 /usr/lib/libKF5I18n.so.5.70.0 /usr/lib/libKF5ConfigCore.so.5.70.0 /usr/lib/libQt5Network.so.5.12.8 /usr/lib/libKF5CoreAddons.so.5.70.0 /usr/lib/libQt5Core.so.5.12.8 
make[2]: Leaving directory '/usr/src/RPM/BUILD/krunner-5.70.0/BUILD'
make[1]: Entering directory '/usr/src/RPM/BUILD/krunner-5.70.0/BUILD'
[100%] Built target runnermodelplugin
make[1]: Leaving directory '/usr/src/RPM/BUILD/krunner-5.70.0/BUILD'
make: Entering directory '/usr/src/RPM/BUILD/krunner-5.70.0/BUILD'
/usr/bin/cmake -E cmake_progress_start /usr/src/RPM/BUILD/krunner-5.70.0/BUILD/CMakeFiles 0
make: Leaving directory '/usr/src/RPM/BUILD/krunner-5.70.0/BUILD'
+ popd
~/RPM/BUILD/krunner-5.70.0
+ exit 0
Executing(%install): /bin/sh -e /usr/src/tmp/rpm-tmp.16692
+ umask 022
+ /bin/mkdir -p /usr/src/RPM/BUILD
+ cd /usr/src/RPM/BUILD
+ /bin/chmod -Rf u+rwX -- /usr/src/tmp/kf5-krunner-buildroot
+ :
+ /bin/rm -rf -- /usr/src/tmp/kf5-krunner-buildroot
+ cd krunner-5.70.0
+ __kf5_install
+ make -C BUILD DESTDIR=/usr/src/tmp/kf5-krunner-buildroot install
make: Entering directory '/usr/src/RPM/BUILD/krunner-5.70.0/BUILD'
/usr/bin/cmake -S/usr/src/RPM/BUILD/krunner-5.70.0 -B/usr/src/RPM/BUILD/krunner-5.70.0/BUILD --check-build-system CMakeFiles/Makefile.cmake 0
/usr/bin/cmake -E cmake_progress_start /usr/src/RPM/BUILD/krunner-5.70.0/BUILD/CMakeFiles /usr/src/RPM/BUILD/krunner-5.70.0/BUILD/CMakeFiles/progress.marks
make -f CMakeFiles/Makefile2 all
make[1]: Entering directory '/usr/src/RPM/BUILD/krunner-5.70.0/BUILD'
make -f src/CMakeFiles/copy_servicetypes.dir/build.make src/CMakeFiles/copy_servicetypes.dir/depend
make[2]: Entering directory '/usr/src/RPM/BUILD/krunner-5.70.0/BUILD'
cd /usr/src/RPM/BUILD/krunner-5.70.0/BUILD && /usr/bin/cmake -E cmake_depends "Unix Makefiles" /usr/src/RPM/BUILD/krunner-5.70.0 /usr/src/RPM/BUILD/krunner-5.70.0/src /usr/src/RPM/BUILD/krunner-5.70.0/BUILD /usr/src/RPM/BUILD/krunner-5.70.0/BUILD/src /usr/src/RPM/BUILD/krunner-5.70.0/BUILD/src/CMakeFiles/copy_servicetypes.dir/DependInfo.cmake --color=
make[2]: Leaving directory '/usr/src/RPM/BUILD/krunner-5.70.0/BUILD'
make -f src/CMakeFiles/copy_servicetypes.dir/build.make src/CMakeFiles/copy_servicetypes.dir/build
make[2]: Entering directory '/usr/src/RPM/BUILD/krunner-5.70.0/BUILD'
cd /usr/src/RPM/BUILD/krunner-5.70.0/BUILD/src && /usr/bin/cmake -E copy /usr/src/RPM/BUILD/krunner-5.70.0/src/data/servicetypes/plasma-runner.desktop /usr/src/RPM/BUILD/krunner-5.70.0/BUILD/bin/data/kservicetypes5
make[2]: Leaving directory '/usr/src/RPM/BUILD/krunner-5.70.0/BUILD'
[  0%] Built target copy_servicetypes
make -f src/CMakeFiles/KF5Runner_autogen.dir/build.make src/CMakeFiles/KF5Runner_autogen.dir/depend
make[2]: Entering directory '/usr/src/RPM/BUILD/krunner-5.70.0/BUILD'
cd /usr/src/RPM/BUILD/krunner-5.70.0/BUILD && /usr/bin/cmake -E cmake_depends "Unix Makefiles" /usr/src/RPM/BUILD/krunner-5.70.0 /usr/src/RPM/BUILD/krunner-5.70.0/src /usr/src/RPM/BUILD/krunner-5.70.0/BUILD /usr/src/RPM/BUILD/krunner-5.70.0/BUILD/src /usr/src/RPM/BUILD/krunner-5.70.0/BUILD/src/CMakeFiles/KF5Runner_autogen.dir/DependInfo.cmake --color=
make[2]: Leaving directory '/usr/src/RPM/BUILD/krunner-5.70.0/BUILD'
make -f src/CMakeFiles/KF5Runner_autogen.dir/build.make src/CMakeFiles/KF5Runner_autogen.dir/build
make[2]: Entering directory '/usr/src/RPM/BUILD/krunner-5.70.0/BUILD'
[  5%] Automatic MOC for target KF5Runner
cd /usr/src/RPM/BUILD/krunner-5.70.0/BUILD/src && /usr/bin/cmake -E cmake_autogen /usr/src/RPM/BUILD/krunner-5.70.0/BUILD/src/CMakeFiles/KF5Runner_autogen.dir/AutogenInfo.json Release
make[2]: Leaving directory '/usr/src/RPM/BUILD/krunner-5.70.0/BUILD'
[  5%] Built target KF5Runner_autogen
make -f src/CMakeFiles/KF5Runner.dir/build.make src/CMakeFiles/KF5Runner.dir/depend
make[2]: Entering directory '/usr/src/RPM/BUILD/krunner-5.70.0/BUILD'
cd /usr/src/RPM/BUILD/krunner-5.70.0/BUILD && /usr/bin/cmake -E cmake_depends "Unix Makefiles" /usr/src/RPM/BUILD/krunner-5.70.0 /usr/src/RPM/BUILD/krunner-5.70.0/src /usr/src/RPM/BUILD/krunner-5.70.0/BUILD /usr/src/RPM/BUILD/krunner-5.70.0/BUILD/src /usr/src/RPM/BUILD/krunner-5.70.0/BUILD/src/CMakeFiles/KF5Runner.dir/DependInfo.cmake --color=
make[2]: Leaving directory '/usr/src/RPM/BUILD/krunner-5.70.0/BUILD'
make -f src/CMakeFiles/KF5Runner.dir/build.make src/CMakeFiles/KF5Runner.dir/build
make[2]: Entering directory '/usr/src/RPM/BUILD/krunner-5.70.0/BUILD'
make[2]: Nothing to be done for 'src/CMakeFiles/KF5Runner.dir/build'.
make[2]: Leaving directory '/usr/src/RPM/BUILD/krunner-5.70.0/BUILD'
[ 61%] Built target KF5Runner
make -f src/declarative/CMakeFiles/runnermodelplugin_autogen.dir/build.make src/declarative/CMakeFiles/runnermodelplugin_autogen.dir/depend
make[2]: Entering directory '/usr/src/RPM/BUILD/krunner-5.70.0/BUILD'
cd /usr/src/RPM/BUILD/krunner-5.70.0/BUILD && /usr/bin/cmake -E cmake_depends "Unix Makefiles" /usr/src/RPM/BUILD/krunner-5.70.0 /usr/src/RPM/BUILD/krunner-5.70.0/src/declarative /usr/src/RPM/BUILD/krunner-5.70.0/BUILD /usr/src/RPM/BUILD/krunner-5.70.0/BUILD/src/declarative /usr/src/RPM/BUILD/krunner-5.70.0/BUILD/src/declarative/CMakeFiles/runnermodelplugin_autogen.dir/DependInfo.cmake --color=
make[2]: Leaving directory '/usr/src/RPM/BUILD/krunner-5.70.0/BUILD'
make -f src/declarative/CMakeFiles/runnermodelplugin_autogen.dir/build.make src/declarative/CMakeFiles/runnermodelplugin_autogen.dir/build
make[2]: Entering directory '/usr/src/RPM/BUILD/krunner-5.70.0/BUILD'
[ 66%] Automatic MOC for target runnermodelplugin
cd /usr/src/RPM/BUILD/krunner-5.70.0/BUILD/src/declarative && /usr/bin/cmake -E cmake_autogen /usr/src/RPM/BUILD/krunner-5.70.0/BUILD/src/declarative/CMakeFiles/runnermodelplugin_autogen.dir/AutogenInfo.json Release
make[2]: Leaving directory '/usr/src/RPM/BUILD/krunner-5.70.0/BUILD'
[ 66%] Built target runnermodelplugin_autogen
make -f src/declarative/CMakeFiles/runnermodelplugin.dir/build.make src/declarative/CMakeFiles/runnermodelplugin.dir/depend
make[2]: Entering directory '/usr/src/RPM/BUILD/krunner-5.70.0/BUILD'
cd /usr/src/RPM/BUILD/krunner-5.70.0/BUILD && /usr/bin/cmake -E cmake_depends "Unix Makefiles" /usr/src/RPM/BUILD/krunner-5.70.0 /usr/src/RPM/BUILD/krunner-5.70.0/src/declarative /usr/src/RPM/BUILD/krunner-5.70.0/BUILD /usr/src/RPM/BUILD/krunner-5.70.0/BUILD/src/declarative /usr/src/RPM/BUILD/krunner-5.70.0/BUILD/src/declarative/CMakeFiles/runnermodelplugin.dir/DependInfo.cmake --color=
make[2]: Leaving directory '/usr/src/RPM/BUILD/krunner-5.70.0/BUILD'
make -f src/declarative/CMakeFiles/runnermodelplugin.dir/build.make src/declarative/CMakeFiles/runnermodelplugin.dir/build
make[2]: Entering directory '/usr/src/RPM/BUILD/krunner-5.70.0/BUILD'
make[2]: Nothing to be done for 'src/declarative/CMakeFiles/runnermodelplugin.dir/build'.
make[2]: Leaving directory '/usr/src/RPM/BUILD/krunner-5.70.0/BUILD'
[ 94%] Built target runnermodelplugin
make -f templates/CMakeFiles/runner.dir/build.make templates/CMakeFiles/runner.dir/depend
make[2]: Entering directory '/usr/src/RPM/BUILD/krunner-5.70.0/BUILD'
cd /usr/src/RPM/BUILD/krunner-5.70.0/BUILD && /usr/bin/cmake -E cmake_depends "Unix Makefiles" /usr/src/RPM/BUILD/krunner-5.70.0 /usr/src/RPM/BUILD/krunner-5.70.0/templates /usr/src/RPM/BUILD/krunner-5.70.0/BUILD /usr/src/RPM/BUILD/krunner-5.70.0/BUILD/templates /usr/src/RPM/BUILD/krunner-5.70.0/BUILD/templates/CMakeFiles/runner.dir/DependInfo.cmake --color=
make[2]: Leaving directory '/usr/src/RPM/BUILD/krunner-5.70.0/BUILD'
make -f templates/CMakeFiles/runner.dir/build.make templates/CMakeFiles/runner.dir/build
make[2]: Entering directory '/usr/src/RPM/BUILD/krunner-5.70.0/BUILD'
make[2]: Nothing to be done for 'templates/CMakeFiles/runner.dir/build'.
make[2]: Leaving directory '/usr/src/RPM/BUILD/krunner-5.70.0/BUILD'
[100%] Built target runner
make[1]: Leaving directory '/usr/src/RPM/BUILD/krunner-5.70.0/BUILD'
/usr/bin/cmake -E cmake_progress_start /usr/src/RPM/BUILD/krunner-5.70.0/BUILD/CMakeFiles 0
make -f CMakeFiles/Makefile2 preinstall
make[1]: Entering directory '/usr/src/RPM/BUILD/krunner-5.70.0/BUILD'
make[1]: Nothing to be done for 'preinstall'.
make[1]: Leaving directory '/usr/src/RPM/BUILD/krunner-5.70.0/BUILD'
Install the project...
/usr/bin/cmake -P cmake_install.cmake
-- Install configuration: "Release"
-- Installing: /usr/src/tmp/kf5-krunner-buildroot/usr/lib/cmake/KF5Runner/KF5RunnerConfig.cmake
-- Installing: /usr/src/tmp/kf5-krunner-buildroot/usr/lib/cmake/KF5Runner/KF5RunnerConfigVersion.cmake
-- Installing: /usr/src/tmp/kf5-krunner-buildroot/usr/lib/cmake/KF5Runner/KF5RunnerTargets.cmake
-- Installing: /usr/src/tmp/kf5-krunner-buildroot/usr/lib/cmake/KF5Runner/KF5RunnerTargets-release.cmake
-- Installing: /usr/src/tmp/kf5-krunner-buildroot/usr/include/KF5/krunner_version.h
-- Installing: /usr/src/tmp/kf5-krunner-buildroot/usr/lib/libKF5Runner.so.5.70.0
-- Installing: /usr/src/tmp/kf5-krunner-buildroot/usr/lib/libKF5Runner.so.5
-- Installing: /usr/src/tmp/kf5-krunner-buildroot/usr/lib/libKF5Runner.so
-- Installing: /usr/src/tmp/kf5-krunner-buildroot/usr/include/KF5/KRunner/KRunner/AbstractRunner
-- Installing: /usr/src/tmp/kf5-krunner-buildroot/usr/include/KF5/KRunner/KRunner/RunnerContext
-- Installing: /usr/src/tmp/kf5-krunner-buildroot/usr/include/KF5/KRunner/KRunner/RunnerManager
-- Installing: /usr/src/tmp/kf5-krunner-buildroot/usr/include/KF5/KRunner/KRunner/RunnerSyntax
-- Installing: /usr/src/tmp/kf5-krunner-buildroot/usr/include/KF5/KRunner/KRunner/QueryMatch
-- Installing: /usr/src/tmp/kf5-krunner-buildroot/usr/include/KF5/KRunner/krunner/krunner_export.h
-- Installing: /usr/src/tmp/kf5-krunner-buildroot/usr/include/KF5/KRunner/krunner/abstractrunner.h
-- Installing: /usr/src/tmp/kf5-krunner-buildroot/usr/include/KF5/KRunner/krunner/runnercontext.h
-- Installing: /usr/src/tmp/kf5-krunner-buildroot/usr/include/KF5/KRunner/krunner/runnermanager.h
-- Installing: /usr/src/tmp/kf5-krunner-buildroot/usr/include/KF5/KRunner/krunner/runnersyntax.h
-- Installing: /usr/src/tmp/kf5-krunner-buildroot/usr/include/KF5/KRunner/krunner/querymatch.h
-- Installing: /usr/src/tmp/kf5-krunner-buildroot/usr/share/kservicetypes5/plasma-runner.desktop
-- Installing: /usr/src/tmp/kf5-krunner-buildroot/usr/share/qlogging-categories5/krunner.categories
-- Installing: /usr/src/tmp/kf5-krunner-buildroot/usr/lib/qt5/mkspecs/modules/qt_KRunner.pri
-- Installing: /usr/src/tmp/kf5-krunner-buildroot/usr/share/kf5/dbus-1/interfaces/kf5_org.kde.krunner1.xml
-- Installing: /usr/src/tmp/kf5-krunner-buildroot/usr/lib/qt5/qml/org/kde/runnermodel/librunnermodelplugin.so
-- Installing: /usr/src/tmp/kf5-krunner-buildroot/usr/lib/qt5/qml/org/kde/runnermodel/qmldir
-- Installing: /usr/src/tmp/kf5-krunner-buildroot/usr/share/kdevappwizard/templates/runner.tar.bz2
make: Leaving directory '/usr/src/RPM/BUILD/krunner-5.70.0/BUILD'
+ '[' -d /usr/src/tmp/kf5-krunner-buildroot//usr/share ']'
+ ls -1d '/usr/src/tmp/kf5-krunner-buildroot//usr/share/kf5/k*5'
+ read d
ls: cannot access '/usr/src/tmp/kf5-krunner-buildroot//usr/share/kf5/k*5': No such file or directory
+ '[' -d /usr/src/tmp/kf5-krunner-buildroot//usr/share/kf5/lib64 ']'
+ '[' -d /usr/src/tmp/kf5-krunner-buildroot//usr/share/kf5/lib ']'
+ ls -1 /usr/src/tmp/kf5-krunner-buildroot//usr/lib/libKF5Runner.so
+ read p
+ '[' -L /usr/src/tmp/kf5-krunner-buildroot//usr/lib/libKF5Runner.so ']'
+ mkdir -p /usr/src/tmp/kf5-krunner-buildroot//usr/lib/kf5/devel
++ readlink /usr/src/tmp/kf5-krunner-buildroot//usr/lib/libKF5Runner.so
+ f=libKF5Runner.so.5
++ basename /usr/src/tmp/kf5-krunner-buildroot//usr/lib/libKF5Runner.so
+ l=libKF5Runner.so
++ relative /usr/src/tmp/kf5-krunner-buildroot//usr/lib/libKF5Runner.so.5 /usr/src/tmp/kf5-krunner-buildroot//usr/lib/kf5/devel/libKF5Runner.so.5
+ ln -sf ../../libKF5Runner.so.5 /usr/src/tmp/kf5-krunner-buildroot//usr/lib/kf5/devel/libKF5Runner.so
+ rm -f /usr/src/tmp/kf5-krunner-buildroot//usr/lib/libKF5Runner.so
+ read p
+ '[' -d /usr/src/tmp/kf5-krunner-buildroot//usr/share/kf5/bin ']'
+ '[' -d /usr/src/tmp/kf5-krunner-buildroot//usr/share/kf5/include ']'
+ '[' -d /usr/src/tmp/kf5-krunner-buildroot//usr/lib/kf5/bin -a true == true ']'
+ ls -1 '/usr/src/tmp/kf5-krunner-buildroot//usr/share/kf5/dbus-1/services/*5*.service'
+ read s
+ '[' -d /usr/src/tmp/kf5-krunner-buildroot//usr/share/akonadi ']'
+ '[' -d /usr/src/tmp/kf5-krunner-buildroot//usr/share/kf5/akonadi ']'
+ '[' -d /usr/src/tmp/kf5-krunner-buildroot//usr/share/man -a remove == remove ']'
+ '[' -d /usr/src/tmp/kf5-krunner-buildroot//usr/share/appdata -a keep == remove ']'
+ '[' -d /usr/src/tmp/kf5-krunner-buildroot//usr/share/metainfo -a keep == remove ']'
+ '[' -d /usr/src/tmp/kf5-krunner-buildroot//usr/lib/cmake/ ']'
+ find /usr/src/tmp/kf5-krunner-buildroot//usr/lib/cmake/ -type f -name '*.cmake'
+ read f
+ sed -i -e 's|\(set(.*\)${PACKAGE_PREFIX_DIR}//usr/|\1${PACKAGE_PREFIX_DIR}/|' /usr/src/tmp/kf5-krunner-buildroot//usr/lib/cmake/KF5Runner/KF5RunnerTargets-release.cmake
+ sed -i -e 's|/usr//usr/|/usr/|' /usr/src/tmp/kf5-krunner-buildroot//usr/lib/cmake/KF5Runner/KF5RunnerTargets-release.cmake
+ read f
+ sed -i -e 's|\(set(.*\)${PACKAGE_PREFIX_DIR}//usr/|\1${PACKAGE_PREFIX_DIR}/|' /usr/src/tmp/kf5-krunner-buildroot//usr/lib/cmake/KF5Runner/KF5RunnerTargets.cmake
+ sed -i -e 's|/usr//usr/|/usr/|' /usr/src/tmp/kf5-krunner-buildroot//usr/lib/cmake/KF5Runner/KF5RunnerTargets.cmake
+ read f
+ sed -i -e 's|\(set(.*\)${PACKAGE_PREFIX_DIR}//usr/|\1${PACKAGE_PREFIX_DIR}/|' /usr/src/tmp/kf5-krunner-buildroot//usr/lib/cmake/KF5Runner/KF5RunnerConfigVersion.cmake
+ sed -i -e 's|/usr//usr/|/usr/|' /usr/src/tmp/kf5-krunner-buildroot//usr/lib/cmake/KF5Runner/KF5RunnerConfigVersion.cmake
+ read f
+ sed -i -e 's|\(set(.*\)${PACKAGE_PREFIX_DIR}//usr/|\1${PACKAGE_PREFIX_DIR}/|' /usr/src/tmp/kf5-krunner-buildroot//usr/lib/cmake/KF5Runner/KF5RunnerConfig.cmake
+ sed -i -e 's|/usr//usr/|/usr/|' /usr/src/tmp/kf5-krunner-buildroot//usr/lib/cmake/KF5Runner/KF5RunnerConfig.cmake
+ read f
+ __kf5_install_move data kdevappwizard
+ local src_dir=/usr/src/tmp/kf5-krunner-buildroot//usr
+ local dst_dir=/usr/src/tmp/kf5-krunner-buildroot//usr/share
+ local type=data
+ shift
+ local item=kdevappwizard
+ case "$type" in
+ src_dir=/usr/src/tmp/kf5-krunner-buildroot//usr/share
+ dst_dir=/usr/src/tmp/kf5-krunner-buildroot//usr/share/kf5
+ '[' -d /usr/src/tmp/kf5-krunner-buildroot//usr/share ']'
+ '[' kdevappwizard == all ']'
++ dirname /usr/src/tmp/kf5-krunner-buildroot//usr/share/kf5/kdevappwizard
+ mkdir -p /usr/src/tmp/kf5-krunner-buildroot//usr/share/kf5
+ '[' -n kdevappwizard ']'
++ dirname /usr/src/tmp/kf5-krunner-buildroot//usr/share/kf5/kdevappwizard
+ mv /usr/src/tmp/kf5-krunner-buildroot//usr/share/kdevappwizard /usr/src/tmp/kf5-krunner-buildroot//usr/share/kf5
+ shift
+ item=
+ '[' -n '' ']'
+ /usr/lib/rpm/find-lang kf5-krunner --all-name
+ rpm-build-kf5-find-qtlang kf5-krunner --all-name
+ /usr/lib/rpm/brp-alt
Cleaning files in /usr/src/tmp/kf5-krunner-buildroot (auto)
mode of './usr/lib/qt5/qml/org/kde/runnermodel/librunnermodelplugin.so' changed from 0755 (rwxr-xr-x) to 0644 (rw-r--r--)
mode of './usr/lib/libKF5Runner.so.5.70.0' changed from 0755 (rwxr-xr-x) to 0644 (rw-r--r--)
Verifying and fixing files in /usr/src/tmp/kf5-krunner-buildroot (binconfig,pkgconfig,libtool,desktop)
Checking contents of files in /usr/src/tmp/kf5-krunner-buildroot/ (default)
Compressing files in /usr/src/tmp/kf5-krunner-buildroot (auto)
Adjusting library links in /usr/src/tmp/kf5-krunner-buildroot
./usr/lib:
	libKF5Runner.so.5 -> libKF5Runner.so.5.70.0
Verifying ELF objects in /usr/src/tmp/kf5-krunner-buildroot (arch=normal,fhs=normal,lfs=relaxed,lint=relaxed,rpath=normal,stack=normal,textrel=normal,unresolved=normal)
Hardlinking identical .pyc and .pyo files
Processing files: kf5-krunner-common-5.70.0-alt1
Executing(%doc): /bin/sh -e /usr/src/tmp/rpm-tmp.55993
+ umask 022
+ /bin/mkdir -p /usr/src/RPM/BUILD
+ cd /usr/src/RPM/BUILD
+ cd krunner-5.70.0
+ DOCDIR=/usr/src/tmp/kf5-krunner-buildroot/usr/share/doc/kf5-krunner-common-5.70.0
+ export DOCDIR
+ rm -rf /usr/src/tmp/kf5-krunner-buildroot/usr/share/doc/kf5-krunner-common-5.70.0
+ /bin/mkdir -p /usr/src/tmp/kf5-krunner-buildroot/usr/share/doc/kf5-krunner-common-5.70.0
+ cp -prL README.md /usr/src/tmp/kf5-krunner-buildroot/usr/share/doc/kf5-krunner-common-5.70.0
+ chmod -R go-w /usr/src/tmp/kf5-krunner-buildroot/usr/share/doc/kf5-krunner-common-5.70.0
+ chmod -R a+rX /usr/src/tmp/kf5-krunner-buildroot/usr/share/doc/kf5-krunner-common-5.70.0
+ exit 0
Finding Provides (using /usr/lib/rpm/find-provides)
Executing: /bin/sh -e /usr/src/tmp/rpm-tmp.MHEFxR
find-provides: running scripts (alternatives,debuginfo,lib,pam,perl,pkgconfig,python,qml,shell)
Finding Requires (using /usr/lib/rpm/find-requires)
Executing: /bin/sh -e /usr/src/tmp/rpm-tmp.7b8XTQ
find-requires: running scripts (cpp,debuginfo,files,lib,pam,perl,pkgconfig,pkgconfiglib,python,qml,rpmlib,shebang,shell,static,symlinks,systemd-services)
Requires: kf5-filesystem
Processing files: kf5-krunner-devel-5.70.0-alt1
Finding Provides (using /usr/lib/rpm/find-provides)
Executing: /bin/sh -e /usr/src/tmp/rpm-tmp.s6EiRR
find-provides: running scripts (alternatives,debuginfo,lib,pam,perl,pkgconfig,python,qml,shell)
Finding Requires (using /usr/lib/rpm/find-requires)
Executing: /bin/sh -e /usr/src/tmp/rpm-tmp.Gj9OYQ
find-requires: running scripts (cpp,debuginfo,files,lib,pam,perl,pkgconfig,pkgconfiglib,python,qml,rpmlib,shebang,shell,static,symlinks,systemd-services)
/usr/src/tmp/kf5-krunner-buildroot/usr/include/KF5/KRunner/krunner/querymatch.h:23:10: fatal error: QList: No such file or directory
   23 | #include <QList>
      |          ^~~~~~~
compilation terminated.
cpp.req: /usr/src/tmp/kf5-krunner-buildroot/usr/include/KF5/KRunner/krunner/querymatch.h: cpp failed, trying c++ mode
/usr/src/tmp/kf5-krunner-buildroot/usr/include/KF5/KRunner/krunner/querymatch.h:23:10: fatal error: QList: No such file or directory
   23 | #include <QList>
      |          ^~~~~~~
compilation terminated.
cpp.req: WARNING: /usr/src/tmp/kf5-krunner-buildroot/usr/include/KF5/KRunner/krunner/querymatch.h: cpp failed
/usr/src/tmp/kf5-krunner-buildroot/usr/include/KF5/KRunner/krunner/runnersyntax.h:23:10: fatal error: QStringList: No such file or directory
   23 | #include <QStringList>
      |          ^~~~~~~~~~~~~
compilation terminated.
cpp.req: /usr/src/tmp/kf5-krunner-buildroot/usr/include/KF5/KRunner/krunner/runnersyntax.h: cpp failed, trying c++ mode
/usr/src/tmp/kf5-krunner-buildroot/usr/include/KF5/KRunner/krunner/runnersyntax.h:23:10: fatal error: QStringList: No such file or directory
   23 | #include <QStringList>
      |          ^~~~~~~~~~~~~
compilation terminated.
cpp.req: WARNING: /usr/src/tmp/kf5-krunner-buildroot/usr/include/KF5/KRunner/krunner/runnersyntax.h: cpp failed
/usr/src/tmp/kf5-krunner-buildroot/usr/include/KF5/KRunner/krunner/runnercontext.h:23:10: fatal error: QList: No such file or directory
   23 | #include <QList>
      |          ^~~~~~~
compilation terminated.
cpp.req: /usr/src/tmp/kf5-krunner-buildroot/usr/include/KF5/KRunner/krunner/runnercontext.h: cpp failed, trying c++ mode
/usr/src/tmp/kf5-krunner-buildroot/usr/include/KF5/KRunner/krunner/runnercontext.h:23:10: fatal error: QList: No such file or directory
   23 | #include <QList>
      |          ^~~~~~~
compilation terminated.
cpp.req: WARNING: /usr/src/tmp/kf5-krunner-buildroot/usr/include/KF5/KRunner/krunner/runnercontext.h: cpp failed
/usr/src/tmp/kf5-krunner-buildroot/usr/include/KF5/KRunner/krunner/runnermanager.h:25:10: fatal error: QList: No such file or directory
   25 | #include <QList>
      |          ^~~~~~~
compilation terminated.
cpp.req: /usr/src/tmp/kf5-krunner-buildroot/usr/include/KF5/KRunner/krunner/runnermanager.h: cpp failed, trying c++ mode
/usr/src/tmp/kf5-krunner-buildroot/usr/include/KF5/KRunner/krunner/runnermanager.h:25:10: fatal error: QList: No such file or directory
   25 | #include <QList>
      |          ^~~~~~~
compilation terminated.
cpp.req: WARNING: /usr/src/tmp/kf5-krunner-buildroot/usr/include/KF5/KRunner/krunner/runnermanager.h: cpp failed
/usr/src/tmp/kf5-krunner-buildroot/usr/include/KF5/KRunner/krunner/abstractrunner.h:23:10: fatal error: QObject: No such file or directory
   23 | #include <QObject>
      |          ^~~~~~~~~
compilation terminated.
cpp.req: /usr/src/tmp/kf5-krunner-buildroot/usr/include/KF5/KRunner/krunner/abstractrunner.h: cpp failed, trying c++ mode
/usr/src/tmp/kf5-krunner-buildroot/usr/include/KF5/KRunner/krunner/abstractrunner.h:23:10: fatal error: QObject: No such file or directory
   23 | #include <QObject>
      |          ^~~~~~~~~
compilation terminated.
cpp.req: WARNING: /usr/src/tmp/kf5-krunner-buildroot/usr/include/KF5/KRunner/krunner/abstractrunner.h: cpp failed
Requires: kf5-plasma-framework-devel, /usr/lib/libKF5Runner.so.5
Finding debuginfo files (using /usr/lib/rpm/find-debuginfo-files)
Executing: /bin/sh -e /usr/src/tmp/rpm-tmp.Y7neXQ
Processing files: libkf5runner-5.70.0-alt1
Finding Provides (using /usr/lib/rpm/find-provides)
Executing: /bin/sh -e /usr/src/tmp/rpm-tmp.zReUFR
find-provides: running scripts (alternatives,debuginfo,lib,pam,perl,pkgconfig,python,qml,shell)
lib.prov: /usr/src/tmp/kf5-krunner-buildroot/usr/lib/libKF5Runner.so.5: 199 symbols, 18 bpp
Finding Requires (using /usr/lib/rpm/find-requires)
Executing: /bin/sh -e /usr/src/tmp/rpm-tmp.EO956Q
find-requires: running scripts (cpp,debuginfo,files,lib,pam,perl,pkgconfig,pkgconfiglib,python,qml,rpmlib,shebang,shell,static,symlinks,systemd-services)
Provides: libKF5Runner.so.5 = set:ldw9URQXqB5soRMeXfGIRueaCkW0ASHBYNCX0qmSPGfcDQrwYeLZhVrebD2sq0wZlmkFx1ZrCS1H7GquFklbhc7sLc00nGag4cPElZ1Wljbvh5Y6MHPa5NZ0YFwhpMZhQTRldjqOEeV4Ztaa6SzWnKoXvvBDvFisAHdcWL4rdZr44xJ8PwIkmjJoFUhndDn17BZJW30sVGYSaetKvnhhAOjvTZ6ZCbLD2W9Qjd62ahXVDdxFRqgaq3i4ITwMgDjkmvpUpNhz5egeKxauXpFPw5C9zM63QMTsFAkIsYcwY1OXVmYerXqpjLV5wNgifacsdOpjZfsEVAUi5CPtLLx7OmylaXd25GfLPmlO2hmO6DyVgd6qRRvZzl5mBhNZyY6tpIAa5l4KGxnBjGI
Requires: kf5-krunner-common = 5.70.0-alt1, libKF5ConfigCore.so.5 >= set:njcRrmUIHoB9oZy7ZjlkO9GqOTieDg6lqCfAgkTZn1, libKF5CoreAddons.so.5 >= set:nj9pvrydVj6EEzwHTlxD2SC5Nu0, libKF5I18n.so.5 >= set:kiLpluFQNf, libKF5KIOCore.so.5 >= set:onRyA6, libKF5Plasma.so.5 >= set:nkUviEK0UWoiSyW21lJgf, libKF5Service.so.5 >= set:niGztWsv7wjk0B7JR5OwZrquAk3kBjqIjhTUNAyzhxFa1J1ob2rJ0EWgZrUIEq6Z0GI5, libKF5ThreadWeaver.so.5 >= set:mhOU21nY6a7ZbadHZuGdZJoZLaInsksy2dQEa01li0v6gzsIYpQotPZzjli8YWFJ4, libQt5Core.so.5 >= set:qizYIJddkjGdE49NyUVi8oZy12Aw0JGOGOhZKBL94d3xZzahuz9RyH518HqU79jrMfCFpDNwSBfqNsQpaalb38xrkL0cJzlYJc61PHPq8ToR9AX6PbOnmP0vQORMojINjRtwIHEGwix5BRNwLux2L9AcgfFfsq7Nw83nVyOoysiW03jMPsVHZvDNtadLMdlewKfRA6iAF7f54K25byzCntBswdR83jGl9ZlP4Ry4GLPhdFt1iQCDLkBHJAZimZqgM9gQpCESMeZc7R6hLZE7Hib1Jymmnv9L8NCJAs86raM0z0KEZ6jhWr4sZ3tfiU9fuDCZcL6uHZgylJ37h3DmiX4gouNHe4rPSwQ6WsNmGetLPfX5gtJ7UiPeHaeaFMydB0Obhw9kYi2RH4sqlSX906D4NC6d5p6cZH8ql0ZgILQzqYejrT3lfCJt882SZhZfVGzRH1LNk0yBOUSpBLK6l5dJdzUOfVqFJ19cC1mOmzkb7YVpfhF3yTFoSjJjeirE1qQEe6NNb6UdBN7scFZy7GpQOOFlBZbUD3FfnqeOkZm9tU59SnMknEgclVAkj1aWJym3RTqApdxERdQ2ZceFYMVdWnvrgQLaMGoQZr4fKZzf2phkLnTFiqd0, libQt5Core.so.5(Qt_5), libQt5Core.so.5(Qt_5.12), libQt5DBus.so.5 >= set:mgbNqgjbS2u5IACjZnr17bYiFOPTbhqw4cihZgepvxCrgZIYn8yAhZGwZ8gKGyjMhorKVQFstdCWf0piOf7h3dJZ9aRksOHRqUmdxqLOpGvT66h6N6MLo2IWLGMJeWcKIve6cWDz5zmOCIBXn9JzsaOD2, libQt5DBus.so.5(Qt_5), libQt5Gui.so.5 >= set:rorCCpUJ9wwjxIBiVYy0olABf, libQt5Gui.so.5(Qt_5), libQt5Qml.so.5 >= set:plfu9bRVKjZtj8xoIYLlskhh6ueZyyyGHwA0, libQt5Qml.so.5(Qt_5), libQt5Widgets.so.5 >= set:rpWTh2ZCkFUa3n1, libQt5Widgets.so.5(Qt_5), libc.so.6(GLIBC_2.0), libc.so.6(GLIBC_2.1.3), libc.so.6(GLIBC_2.4), libm.so.6(GLIBC_2.29), libstdc++.so.6(CXXABI_1.3), libstdc++.so.6(GLIBCXX_3.4), rtld(GNU_HASH)
Requires(rpmlib): rpmlib(SetVersions)
Finding debuginfo files (using /usr/lib/rpm/find-debuginfo-files)
Executing: /bin/sh -e /usr/src/tmp/rpm-tmp.4YukzS
Creating libkf5runner-debuginfo package
Processing files: libkf5runner-debuginfo-5.70.0-alt1
Finding Provides (using /usr/lib/rpm/find-provides)
Executing: /bin/sh -e /usr/src/tmp/rpm-tmp.frySPR
find-provides: running scripts (debuginfo)
Finding Requires (using /usr/lib/rpm/find-requires)
Executing: /bin/sh -e /usr/src/tmp/rpm-tmp.KGk3ZT
find-requires: running scripts (debuginfo)
Provides: debug(libKF5Runner.so.5)
Requires: libkf5runner = 5.70.0-alt1, debug(libKF5ConfigCore.so.5), debug(libKF5CoreAddons.so.5), debug(libKF5I18n.so.5), debug(libKF5KIOCore.so.5), debug(libKF5Plasma.so.5), debug(libKF5Service.so.5), debug(libKF5ThreadWeaver.so.5), debug(libQt5Core.so.5), debug(libQt5DBus.so.5), debug(libQt5Gui.so.5), debug(libQt5Qml.so.5), debug(libQt5Widgets.so.5), debug(libc.so.6), debug(libm.so.6), debug(libstdc++.so.6)
Adding to libkf5runner a strict dependency on kf5-krunner-common
Adding to libkf5runner-debuginfo a strict dependency on libkf5runner
Adding to kf5-krunner-devel a strict dependency on libkf5runner
Removing 1 extra deps from kf5-krunner-devel due to dependency on libkf5runner
Wrote: /usr/src/RPM/RPMS/noarch/kf5-krunner-common-5.70.0-alt1.noarch.rpm
Wrote: /usr/src/RPM/RPMS/i586/kf5-krunner-devel-5.70.0-alt1.i586.rpm
Wrote: /usr/src/RPM/RPMS/i586/libkf5runner-5.70.0-alt1.i586.rpm
Wrote: /usr/src/RPM/RPMS/i586/libkf5runner-debuginfo-5.70.0-alt1.i586.rpm
37.26user 6.54system 0:40.81elapsed 107%CPU (0avgtext+0avgdata 193304maxresident)k
0inputs+0outputs (0major+1554750minor)pagefaults 0swaps
/.out/kf5-krunner-common-5.70.0-alt1.noarch.rpm: bad symbols in the license tag: /
/.out/kf5-krunner-devel-5.70.0-alt1.i586.rpm: bad symbols in the license tag: /
/.out/libkf5runner-5.70.0-alt1.i586.rpm: bad symbols in the license tag: /
/.out/libkf5runner-debuginfo-5.70.0-alt1.i586.rpm: bad symbols in the license tag: /
77.08user 15.20system 1:45.91elapsed 87%CPU (0avgtext+0avgdata 193304maxresident)k
3352inputs+0outputs (0major+2805938minor)pagefaults 0swaps