<86>Jan 17 14:01:56 userdel[69225]: delete user 'rooter'
<86>Jan 17 14:01:56 userdel[69225]: removed shadow group 'rooter' owned by 'rooter'
<86>Jan 17 14:01:56 groupadd[69232]: group added to /etc/group: name=rooter, GID=627
<86>Jan 17 14:01:56 groupadd[69232]: group added to /etc/gshadow: name=rooter
<86>Jan 17 14:01:56 groupadd[69232]: new group: name=rooter, GID=627
<86>Jan 17 14:01:56 useradd[69240]: new user: name=rooter, UID=627, GID=627, home=/root, shell=/bin/bash
<86>Jan 17 14:01:56 userdel[69248]: delete user 'builder'
<86>Jan 17 14:01:56 userdel[69248]: removed group 'builder' owned by 'builder'
<86>Jan 17 14:01:56 userdel[69248]: removed shadow group 'builder' owned by 'builder'
<86>Jan 17 14:01:56 groupadd[69255]: group added to /etc/group: name=builder, GID=628
<86>Jan 17 14:01:56 groupadd[69255]: group added to /etc/gshadow: name=builder
<86>Jan 17 14:01:56 groupadd[69255]: new group: name=builder, GID=628
<86>Jan 17 14:01:56 useradd[69259]: new user: name=builder, UID=628, GID=628, home=/usr/src, shell=/bin/bash
/usr/src/in/srpm/kf5-krunner-5.66.0-alt1.src.rpm: bad symbols in the license tag: /
<13>Jan 17 14:01:58 rpmi: libxkbcommon-0.9.1-alt1 sisyphus+239553.100.1.1 1571659627 installed
<13>Jan 17 14:01:58 rpmi: qt5-base-common-5.12.6-alt2 sisyphus+243340.100.2.1 1577090572 installed
<13>Jan 17 14:01:58 rpmi: qt5-declarative-common-5.12.6-alt1 sisyphus+243095.140.2.1 1576585282 installed
<13>Jan 17 14:01:58 rpmi: libexpat-2.2.4-alt1 1503305345 installed
<13>Jan 17 14:01:58 rpmi: libmtdev-1.1.5-alt1 sisyphus+220715.100.1.1 1549364509 installed
<13>Jan 17 14:01:58 rpmi: udev-rules-1:244.1-alt1 sisyphus+243289.100.2.3 1576850544 installed
<13>Jan 17 14:01:58 rpmi: libpng16-1.6.37-alt1 sisyphus+236677.100.2.1 1566917998 installed
<13>Jan 17 14:01:58 rpmi: libICE-1.0.9-alt1 1409902721 installed
<13>Jan 17 14:01:58 rpmi: libglvnd-7:1.2.0-alt4 sisyphus+241659.100.1.1 1574755345 installed
<13>Jan 17 14:01:58 rpmi: libwayland-server-1.17.0-alt1 sisyphus+225894.100.1.1 1553872805 installed
<13>Jan 17 14:01:58 rpmi: libSM-1.2.3-alt1 sisyphus+226734.100.2.1 1554586158 installed
<13>Jan 17 14:01:58 rpmi: rpm-macros-qt5-5.12.6-alt2 sisyphus+243340.100.2.1 1577090177 installed
<13>Jan 17 14:01:58 rpmi: rpm-macros-ubt-0.3-alt1 sisyphus+231357.100.1.1 1559550805 installed
<13>Jan 17 14:01:58 rpmi: rpm-build-xdg-0.2-alt1 1250461503 installed
<13>Jan 17 14:01:59 rpmi: libsqlite3-3.30.1-alt3 sisyphus+242073.100.1.1 1575236094 installed
<13>Jan 17 14:01:59 rpmi: libts-1.0-alt1.qa1 1366249315 installed
<13>Jan 17 14:01:59 rpmi: libproxy-0.4.15-alt3 sisyphus+227885.100.1.2 1555818599 installed
<13>Jan 17 14:01:59 rpmi: libpcre2-10.34-alt1 sisyphus+241619.100.1.1 1574686794 installed
<13>Jan 17 14:01:59 rpmi: libjpeg-2:2.0.2-alt1 sisyphus+226996.100.1.1 1554902907 installed
<13>Jan 17 14:01:59 rpmi: libwacom-data-1.2-alt1 sisyphus+243430.100.1.1 1577100525 installed
<13>Jan 17 14:01:59 rpmi: libicu65-1:6.5.1-alt1 sisyphus+238768.100.16.1 1571427455 installed
<13>Jan 17 14:02:00 rpmi: libqt5-core-5.12.6-alt2 sisyphus+243340.100.2.1 1577090572 installed
<13>Jan 17 14:02:00 rpmi: libqt5-sql-5.12.6-alt2 sisyphus+243340.100.2.1 1577090572 installed
<13>Jan 17 14:02:00 rpmi: libgudev-1:233-alt1 sisyphus+235422.100.1.1 1564855273 installed
<13>Jan 17 14:02:00 rpmi: libwacom-1.2-alt1 sisyphus+243430.100.1.1 1577100528 installed
<13>Jan 17 14:02:00 rpmi: libgraphite2-1.3.13-alt2 sisyphus+226799.100.1.1 1554648241 installed
<13>Jan 17 14:02:00 rpmi: libharfbuzz-2.6.4-alt1 sisyphus+240033.100.1.1 1572506773 installed
<13>Jan 17 14:02:00 rpmi: libfreetype-2.10.1-alt1 sisyphus+237471.100.1.1 1568276356 installed
<13>Jan 17 14:02:00 rpmi: fontconfig-2.13.1-alt1 sisyphus+226691.100.2.2 1554598726 installed
Updating fonts cache: <29>Jan 17 14:02:01 fontconfig: Updating fonts cache: succeeded
[ DONE ]
<13>Jan 17 14:02:01 rpmi: libevdev-1.8.0-alt1 sisyphus+236608.100.1.1 1566815743 installed
<13>Jan 17 14:02:01 rpmi: libinput-1.15.0-alt1 sisyphus+243850.100.1.1 1578158165 installed
<13>Jan 17 14:02:01 rpmi: liblz4-1:1.9.2-alt1 sisyphus+238585.100.2.2 1570066927 installed
<13>Jan 17 14:02:01 rpmi: libgpg-error-1.36-alt1 sisyphus+225621.300.1.1 1553521082 installed
<13>Jan 17 14:02:01 rpmi: libgcrypt20-1.8.5-alt3 sisyphus+239622.100.1.1 1571746654 installed
<13>Jan 17 14:02:01 rpmi: libsystemd-1:244.1-alt1 sisyphus+243289.100.2.3 1576850590 installed
<13>Jan 17 14:02:01 rpmi: libdbus-1.12.16-alt2 sisyphus+240566.100.2.1 1573547696 installed
<13>Jan 17 14:02:01 rpmi: libqt5-dbus-5.12.6-alt2 sisyphus+243340.100.2.1 1577090572 installed
<13>Jan 17 14:02:01 rpmi: libxshmfence-1.3-alt1 sisyphus+223149.1000.2.1 1551268571 installed
<13>Jan 17 14:02:01 rpmi: libX11-locales-3:1.6.9-alt1 sisyphus+239210.100.1.1 1571056781 installed
<13>Jan 17 14:02:01 rpmi: libXdmcp-1.1.3-alt1 sisyphus+225206.600.1.2 1552949353 installed
<13>Jan 17 14:02:01 rpmi: libXau-1.0.9-alt1 sisyphus+223149.200.2.1 1551268152 installed
<13>Jan 17 14:02:01 rpmi: libxcb-1.13.1-alt1 sisyphus+226527.100.2.2 1554593801 installed
<13>Jan 17 14:02:01 rpmi: libX11-3:1.6.9-alt1 sisyphus+239210.100.1.1 1571056801 installed
<13>Jan 17 14:02:01 rpmi: libXext-1.3.4-alt1 sisyphus+225206.700.1.2 1552949429 installed
<13>Jan 17 14:02:01 rpmi: libXxf86vm-1.1.4-alt2 1527672187 installed
<13>Jan 17 14:02:01 rpmi: libXdamage-1.1.5-alt1 sisyphus+225206.500.1.2 1552949286 installed
<13>Jan 17 14:02:01 rpmi: libXfixes-5.0.3-alt1 sisyphus+226736.100.2.2 1554614841 installed
<13>Jan 17 14:02:01 rpmi: libXrender-0.9.8-alt1 1371312112 installed
<13>Jan 17 14:02:01 rpmi: libxcbutil-icccm-0.4.1-alt2 sisyphus+229000.100.1.1 1557152221 installed
<13>Jan 17 14:02:01 rpmi: libxcbutil-1:0.4.0-alt1 1413392888 installed
<13>Jan 17 14:02:01 rpmi: libxcbutil-image-0.4.0-alt1 1446204182 installed
<13>Jan 17 14:02:01 rpmi: libxcbutil-keysyms-0.4.0-alt1 1446204124 installed
<13>Jan 17 14:02:01 rpmi: libxcb-render-util-0.3.9-alt3 sisyphus+222674.100.1.1 1550989886 installed
<13>Jan 17 14:02:01 rpmi: libxkbcommon-x11-0.9.1-alt1 sisyphus+239553.100.1.1 1571659627 installed
<13>Jan 17 14:02:01 rpmi: libwayland-client-1.17.0-alt1 sisyphus+225894.100.1.1 1553872805 installed
<13>Jan 17 14:02:01 rpmi: libpciaccess-1:0.16-alt1 sisyphus+234814.100.1.1 1563438291 installed
<13>Jan 17 14:02:01 rpmi: libdrm-1:2.4.100-alt1 sisyphus+240099.100.1.1 1572599774 installed
<13>Jan 17 14:02:01 rpmi: libGLX-mesa-4:19.2.8-alt1 sisyphus+243247.100.1.3 1576828020 installed
<13>Jan 17 14:02:01 rpmi: libgbm-4:19.2.8-alt1 sisyphus+243247.100.1.3 1576828020 installed
<13>Jan 17 14:02:01 rpmi: libEGL-mesa-4:19.2.8-alt1 sisyphus+243247.100.1.3 1576828020 installed
<13>Jan 17 14:02:01 rpmi: libEGL-7:1.2.0-alt4 sisyphus+241659.100.1.1 1574755345 installed
<13>Jan 17 14:02:01 rpmi: libGLX-7:1.2.0-alt4 sisyphus+241659.100.1.1 1574755345 installed
<13>Jan 17 14:02:01 rpmi: libGL-7:1.2.0-alt4 sisyphus+241659.100.1.1 1574755345 installed
<13>Jan 17 14:02:01 rpmi: libp11-kit-0.23.15-alt1 sisyphus+226408.100.2.1 1554288204 installed
<13>Jan 17 14:02:01 rpmi: libtasn1-4.15.0-alt1 sisyphus+241940.100.1.1 1574959866 installed
<13>Jan 17 14:02:01 rpmi: rpm-macros-alternatives-0.5.1-alt1 sisyphus+226946.100.1.1 1554830426 installed
<13>Jan 17 14:02:01 rpmi: alternatives-0.5.1-alt1 sisyphus+226946.100.1.1 1554830426 installed
<13>Jan 17 14:02:01 rpmi: ca-certificates-2019.10.28-alt1 sisyphus+239875.300.1.1 1572267834 installed
<13>Jan 17 14:02:01 rpmi: ca-trust-0.1.2-alt1 sisyphus+233348.100.1.1 1561653823 installed
<13>Jan 17 14:02:01 rpmi: p11-kit-trust-0.23.15-alt1 sisyphus+226408.100.2.1 1554288204 installed
<13>Jan 17 14:02:01 rpmi: libcrypto1.1-1.1.1d-alt1.1 sisyphus+237931.100.2.1 1569235729 installed
<13>Jan 17 14:02:01 rpmi: libssl1.1-1.1.1d-alt1.1 sisyphus+237931.100.2.1 1569235729 installed
<13>Jan 17 14:02:01 rpmi: libqt5-network-5.12.6-alt2 sisyphus+243340.100.2.1 1577090572 installed
<13>Jan 17 14:02:01 rpmi: libqt5-xcbqpa-5.12.6-alt2 sisyphus+243340.100.2.1 1577090572 installed
<13>Jan 17 14:02:02 rpmi: libqt5-eglfskmssupport-5.12.6-alt2 sisyphus+243340.100.2.1 1577090572 installed
<13>Jan 17 14:02:02 rpmi: libqt5-eglfsdeviceintegration-5.12.6-alt2 sisyphus+243340.100.2.1 1577090572 installed
<13>Jan 17 14:02:02 rpmi: libqt5-gui-5.12.6-alt2 sisyphus+243340.100.2.1 1577090572 installed
<13>Jan 17 14:02:02 rpmi: libqt5-quickshapes-5.12.6-alt1 sisyphus+243095.140.2.1 1576585282 installed
<13>Jan 17 14:02:02 rpmi: libqt5-quick-5.12.6-alt1 sisyphus+243095.140.2.1 1576585282 installed
<13>Jan 17 14:02:02 rpmi: libqt5-qml-5.12.6-alt1 sisyphus+243095.140.2.1 1576585282 installed
<13>Jan 17 14:02:02 rpmi: rpm-build-qml-5.12.6-alt1 sisyphus+243095.140.2.1 1576585282 installed
<13>Jan 17 14:02:02 rpmi: rpm-build-kf5-5.12.0-alt2 sisyphus+226903.100.1.1 1554799142 installed
<13>Jan 17 14:02:02 rpmi: rpm-build-ubt-0.3.1-alt3 sisyphus+226718.100.2.1 1554584225 installed
<13>Jan 17 14:02:07 rpmi: kf5-filesystem-5.60.0-alt1 sisyphus+234706.100.1.1 1563356908 installed
<13>Jan 17 14:02:07 rpmi: libqt5-widgets-5.12.6-alt2 sisyphus+243340.100.2.1 1577090572 installed
<13>Jan 17 14:02:07 rpmi: libqt5-xml-5.12.6-alt2 sisyphus+243340.100.2.1 1577090572 installed
<13>Jan 17 14:02:07 rpmi: libogg-1.3.3-alt1 sisyphus+221902.4000.4.1 1550598661 installed
<13>Jan 17 14:02:07 rpmi: libvorbis-1.3.6-alt2 sisyphus+220072.200.2.2 1548744475 installed
<13>Jan 17 14:02:07 rpmi: libwebp7-1.1.0-alt1 sisyphus+243895.100.1.1 1578410873 installed
<13>Jan 17 14:02:07 rpmi: libraw1394-11-2.1.2-alt1 sisyphus+225496.100.2.1 1553244590 installed
<13>Jan 17 14:02:07 rpmi: libtheora-2:1.1.1-alt6 sisyphus+223372.100.2.1 1551525762 installed
<13>Jan 17 14:02:07 rpmi: libv4l-1.18.0-alt1 sisyphus+238247.100.1.1 1569587655 installed
<13>Jan 17 14:02:07 rpmi: libusb-1.0.23-alt1 sisyphus+237317.100.1.1 1568059905 installed
<13>Jan 17 14:02:07 rpmi: perl-HTTP-Date-6.04-alt1 sisyphus+241046.100.1.1 1574192946 installed
<13>Jan 17 14:02:07 rpmi: liborc-0.4.31-alt1 sisyphus+240181.100.1.1 1572853315 installed
<13>Jan 17 14:02:07 rpmi: libfribidi-1.0.8-alt1 sisyphus+243018.200.3.3 1576821924 installed
<13>Jan 17 14:02:07 rpmi: libqt5-opengl-5.12.6-alt2 sisyphus+243340.100.2.1 1577090572 installed
<13>Jan 17 14:02:07 rpmi: libqt5-test-5.12.6-alt2 sisyphus+243340.100.2.1 1577090572 installed
<13>Jan 17 14:02:07 rpmi: libva-2.6.0-alt1 sisyphus+244172.200.1.1 1578917903 installed
<13>Jan 17 14:02:07 rpmi: libopenjpeg2.0-2.3.1-alt1 sisyphus+226454.100.1.1 1554284337 installed
<13>Jan 17 14:02:07 rpmi: libserd-0.30.2-alt1_1 sisyphus+243654.100.1.1 1577467451 installed
<13>Jan 17 14:02:07 rpmi: libdvdread-5.0.0-alt1 1414228694 installed
<13>Jan 17 14:02:07 rpmi: libspeex-1.2-alt1 1528115225 installed
<13>Jan 17 14:02:07 rpmi: libgsm-1.0.17-alt1 1523356165 installed
<13>Jan 17 14:02:07 rpmi: liblcms2-2.9-alt1 1516411892 installed
<13>Jan 17 14:02:07 rpmi: perl-XML-NamespaceSupport-1.12-alt1 1491296348 installed
<13>Jan 17 14:02:07 rpmi: libopus-1.2.1-alt1.1 1504605295 installed
<13>Jan 17 14:02:07 rpmi: libidn2-2.3.0-alt1 sisyphus+240846.100.1.2 1573870475 installed
<13>Jan 17 14:02:07 rpmi: libnettle7-3.5.1-alt1 sisyphus+235265.40.6.1 1566223065 installed
<13>Jan 17 14:02:07 rpmi: libgomp1-9.2.1-alt2 sisyphus+240563.200.2.1 1573479396 installed
<13>Jan 17 14:02:07 rpmi: libsord-0.16.4-alt1_1 sisyphus+243655.100.1.3 1577468690 installed
<13>Jan 17 14:02:07 rpmi: libass9-0.14.0-alt1 sisyphus+220287.100.1.1 1548927397 installed
<13>Jan 17 14:02:07 rpmi: libdc1394-22-2.2.5-alt1 1529659263 installed
<13>Jan 17 14:02:07 rpmi: libunicap-0.9.12-alt1 sisyphus+225152.100.1.1 1552760624 installed
<13>Jan 17 14:02:07 rpmi: libflac8-1.3.2-alt2 sisyphus+220898.4400.11.1 1551973321 installed
<13>Jan 17 14:02:07 rpmi: libsndfile-1.0.28-alt2 sisyphus.212728.100 1536333068 installed
<13>Jan 17 14:02:07 rpmi: libqt5-quickwidgets-5.12.6-alt1 sisyphus+243095.140.2.1 1576585282 installed
<13>Jan 17 14:02:07 rpmi: kf5-kdeclarative-common-5.66.0-alt1 sisyphus+244190.6000.3.1 1579095631 installed
<13>Jan 17 14:02:08 rpmi: kf5-kio-common-5.66.0-alt1 sisyphus+244190.5400.3.1 1579095034 installed
<13>Jan 17 14:02:08 rpmi: libvdpau-1:1.3-alt1 sisyphus+236768.100.1.1 1567066130 installed
<13>Jan 17 14:02:08 rpmi: libavutil56-2:4.2.2-alt1 sisyphus+243947.100.1.1 1578561009 installed
<13>Jan 17 14:02:08 rpmi: libswscale5-2:4.2.2-alt1 sisyphus+243947.100.1.1 1578561009 installed
<13>Jan 17 14:02:08 rpmi: libx265-176-3.1.2-alt1 sisyphus+242600.100.2.1 1576573626 installed
<13>Jan 17 14:02:08 rpmi: libx264-148-alt2 1496163832 installed
<13>Jan 17 14:02:08 rpmi: libopencore-amrwb0-0.1.5-alt1 1529659346 installed
<13>Jan 17 14:02:08 rpmi: libopencore-amrnb0-0.1.5-alt1 1529659346 installed
<13>Jan 17 14:02:08 rpmi: ilmbase12-common-2.2.0-alt2 sisyphus+237892.200.2.1 1568981888 installed
<13>Jan 17 14:02:08 rpmi: libiex12-2.2.0-alt2 sisyphus+237892.200.2.1 1568981888 installed
<13>Jan 17 14:02:08 rpmi: libxslt-1.1.34-alt1 sisyphus+240826.100.1.1 1573801860 installed
<13>Jan 17 14:02:08 rpmi: libbs2b-3.1.0-alt1.3 1327614927 installed
<13>Jan 17 14:02:08 rpmi: ilmbase24-common-2.3.0-alt1 sisyphus+237892.300.1.1 1568978210 installed
<13>Jan 17 14:02:08 rpmi: libiex24-2.3.0-alt1 sisyphus+237892.300.1.1 1568978210 installed
<13>Jan 17 14:02:08 rpmi: libhalf24-2.3.0-alt1 sisyphus+237892.300.1.1 1568978210 installed
<13>Jan 17 14:02:08 rpmi: libwavpack-5.1.0-alt1 1486754497 installed
<13>Jan 17 14:02:08 rpmi: libvpx6-1.8.2-alt1 sisyphus+243422.100.1.1 1577075240 installed
<13>Jan 17 14:02:08 rpmi: libtwolame-0.4.0-alt1 sisyphus+239176.100.2.1 1571294398 installed
<13>Jan 17 14:02:08 rpmi: liblame-3.100-alt1 1527082574 installed
<13>Jan 17 14:02:08 rpmi: libjack-1:1.9.12-alt2 sisyphus+222776.100.1.1 1551043818 installed
<13>Jan 17 14:02:08 rpmi: libjasper-2.0.16-alt1 sisyphus+231386.100.1.1 1559568070 installed
<13>Jan 17 14:02:08 rpmi: libepoxy-1.5.4-alt1 sisyphus+242061.100.1.1 1575190160 installed
<13>Jan 17 14:02:08 rpmi: libXrandr-1.5.2-alt1 sisyphus+225206.1300.1.2 1552949710 installed
<13>Jan 17 14:02:08 rpmi: perl-LWP-MediaTypes-6.04-alt1 sisyphus+225468.100.1.1 1553186684 installed
<13>Jan 17 14:02:08 rpmi: perl-Compress-Raw-Zlib-2.093-alt1 sisyphus+242766.100.1.1 1576089368 installed
<13>Jan 17 14:02:08 rpmi: perl-libnet-1:3.11-alt1 1511423541 installed
<13>Jan 17 14:02:08 rpmi: perl-XML-SAX-Base-1.09-alt1 1494364363 installed
<13>Jan 17 14:02:08 rpmi: libdv-1.0.0-alt5.7 sisyphus+220898.5400.11.1 1551973592 installed
<13>Jan 17 14:02:08 rpmi: libwayland-egl-4:18.1.0-alt1 sisyphus+225894.100.1.1 1553872805 installed
<13>Jan 17 14:02:08 rpmi: libXv-1.0.11-alt1 1527685499 installed
<13>Jan 17 14:02:08 rpmi: qt5-location-common-5.12.6-alt1 sisyphus+243095.1000.2.1 1576587287 installed
<13>Jan 17 14:02:08 rpmi: qt5-tools-common-5.12.6-alt1 sisyphus+243095.340.2.1 1576586218 installed
<13>Jan 17 14:02:08 rpmi: qt5-connectivity-common-5.12.6-alt1 sisyphus+243095.2100.3.1 1576651942 installed
<13>Jan 17 14:02:08 rpmi: libgdbm-1.8.3-alt10 1454943334 installed
<13>Jan 17 14:02:08 rpmi: libpython3-3.7.4-alt2 sisyphus+239418.100.1.1 1571389913 installed
<13>Jan 17 14:02:08 rpmi: python3-3.7.4-alt2 sisyphus+239418.100.1.1 1571389913 installed
<13>Jan 17 14:02:09 rpmi: python3-base-3.7.4-alt2 sisyphus+239418.100.1.1 1571389913 installed
<13>Jan 17 14:02:09 rpmi: libglog-0.3.4-alt4 sisyphus+235324.300.2.1 1564663103 installed
<13>Jan 17 14:02:09 rpmi: libopenblas-0.2.20-alt2 sisyphus+229410.100.1.1 1557920019 installed
<13>Jan 17 14:02:09 rpmi: libat-spi2-core-2.34.0-alt1 sisyphus+237956.1100.4.2 1569333019 installed
<13>Jan 17 14:02:09 rpmi: shared-mime-info-1.15-alt1 sisyphus+240378.100.1.1 1573073800 installed
<13>Jan 17 14:02:09 rpmi: libXtst-1.2.2-alt1 1369984893 installed
<13>Jan 17 14:02:09 rpmi: icon-theme-hicolor-0.17-alt1 1505715846 installed
<13>Jan 17 14:02:09 rpmi: menu-icons-default-0.2.0.20-alt1 1479213521 installed
<13>Jan 17 14:02:09 rpmi: altlinux-freedesktop-menu-icon-theme-default-0.0.26-alt1 1366231495 installed
<13>Jan 17 14:02:09 rpmi: python3-module-sip-4.19.19-alt1 sisyphus+238813.100.26.1 1571984098 installed
<13>Jan 17 14:02:09 rpmi: python3-module-PyQt5-sip-4.19.19-alt1 sisyphus+238813.100.26.1 1571984098 installed
<13>Jan 17 14:02:09 rpmi: libqt5-bluetooth-5.12.6-alt1 sisyphus+243095.2100.3.1 1576651899 installed
<13>Jan 17 14:02:09 rpmi: libqt5-nfc-5.12.6-alt1 sisyphus+243095.2100.3.1 1576651899 installed
<13>Jan 17 14:02:10 rpmi: libqt5-designer-5.12.6-alt1 sisyphus+243095.340.2.1 1576586290 installed
<13>Jan 17 14:02:10 rpmi: libqt5-help-5.12.6-alt1 sisyphus+243095.340.2.1 1576586290 installed
<13>Jan 17 14:02:10 rpmi: libzbar-0.23-alt1 sisyphus+243602.100.1.1 1577380339 installed
<13>Jan 17 14:02:10 rpmi: libilmthread24-2.3.0-alt1 sisyphus+237892.300.1.1 1568978210 installed
<13>Jan 17 14:02:10 rpmi: libilmthread12-2.2.0-alt2 sisyphus+237892.200.2.1 1568981888 installed
<13>Jan 17 14:02:10 rpmi: libhalf12-2.2.0-alt2 sisyphus+237892.200.2.1 1568981888 installed
<13>Jan 17 14:02:10 rpmi: libpostproc55-2:4.2.2-alt1 sisyphus+243947.100.1.1 1578561009 installed
<13>Jan 17 14:02:10 rpmi: libavresample4-2:4.2.2-alt1 sisyphus+243947.100.1.1 1578561009 installed
<13>Jan 17 14:02:10 rpmi: libkf5calendarevents-5.66.0-alt1 sisyphus+244190.6000.3.1 1579096955 installed
<13>Jan 17 14:02:10 rpmi: libsamplerate-0.1.9-alt2 1487790086 installed
<13>Jan 17 14:02:10 rpmi: libsratom-0.6.2-alt1_3 sisyphus+221691.100.1.1 1550345184 installed
<13>Jan 17 14:02:10 rpmi: liblilv-0.24.4-alt1_7 sisyphus+241123.100.1.1 1574262400 installed
<13>Jan 17 14:02:10 rpmi: libvidstab-1.1.0-alt2 sisyphus+222665.100.1.1 1550985430 installed
<13>Jan 17 14:02:10 rpmi: libarchive13-3.4.0-alt1 sisyphus+235265.640.9.1 1566482857 installed
<13>Jan 17 14:02:10 rpmi: libhogweed5-3.5.1-alt1 sisyphus+235265.40.6.1 1566223065 installed
<13>Jan 17 14:02:10 rpmi: libgnutls30-3.6.11-alt1 sisyphus+242147.100.1.1 1575311041 installed
<13>Jan 17 14:02:10 rpmi: libshout2-2.2.2-alt3 1303374835 installed
<13>Jan 17 14:02:10 rpmi: libqt5-quicktest-5.12.6-alt1 sisyphus+243095.140.2.1 1576585282 installed
<13>Jan 17 14:02:10 rpmi: perl-File-Listing-6.04-alt1 1329758996 installed
<13>Jan 17 14:02:10 rpmi: libavc1394-0.5.4-alt1.qa1 1460816781 installed
<13>Jan 17 14:02:10 rpmi: libiec61883-1.2.0-alt1.qa1 1460815903 installed
<13>Jan 17 14:02:10 rpmi: qt5-quickcontrols-5.12.6-alt1 sisyphus+243095.1300.2.1 1576588027 installed
<13>Jan 17 14:02:10 rpmi: libdbusmenu-qt52-0.9.3-alt0.3 1463760060 installed
<13>Jan 17 14:02:10 rpmi: kf5-attica-common-5.66.0-alt1 sisyphus+244190.400.3.1 1579091059 installed
<13>Jan 17 14:02:10 rpmi: libkf5attica-5.66.0-alt1 sisyphus+244190.400.3.1 1579091159 installed
<13>Jan 17 14:02:10 rpmi: kf5-kactivities-common-5.66.0-alt1 sisyphus+244190.10200.3.1 1579097671 installed
<13>Jan 17 14:02:10 rpmi: kf5-karchive-common-5.66.0-alt1 sisyphus+244190.2100.3.1 1579092318 installed
<13>Jan 17 14:02:10 rpmi: libkf5archive-5.66.0-alt1 sisyphus+244190.2100.3.1 1579092805 installed
<13>Jan 17 14:02:10 rpmi: kf5-kauth-common-5.66.0-alt1 sisyphus+244190.2500.3.1 1579092675 installed
<13>Jan 17 14:02:10 rpmi: kf5-kcoreaddons-common-5.66.0-alt1 sisyphus+244190.2300.3.1 1579092494 installed
<13>Jan 17 14:02:10 rpmi: libkf5coreaddons-5.66.0-alt1 sisyphus+244190.2300.3.1 1579093053 installed
<13>Jan 17 14:02:10 rpmi: libkf5authcore-5.66.0-alt1 sisyphus+244190.2500.3.1 1579093301 installed
<13>Jan 17 14:02:10 rpmi: libkf5kiontlm-5.66.0-alt1 sisyphus+244190.5400.3.1 1579096360 installed
<13>Jan 17 14:02:10 rpmi: kf5-kbookmarks-common-5.66.0-alt1 sisyphus+244190.5100.3.1 1579094630 installed
<13>Jan 17 14:02:10 rpmi: kf5-kcodecs-common-5.66.0-alt1 sisyphus+244190.1100.3.1 1579091484 installed
<13>Jan 17 14:02:10 rpmi: libkf5codecs-5.66.0-alt1 sisyphus+244190.1100.3.1 1579091730 installed
<13>Jan 17 14:02:10 rpmi: kf5-kcodecs-devel-5.66.0-alt1 sisyphus+244190.1100.3.1 1579091730 installed
<13>Jan 17 14:02:10 rpmi: kf5-kconfig-common-5.66.0-alt1 sisyphus+244190.1600.3.1 1579092029 installed
<13>Jan 17 14:02:10 rpmi: libkf5configcore-5.66.0-alt1 sisyphus+244190.1600.3.1 1579092452 installed
<13>Jan 17 14:02:10 rpmi: libkf5configgui-5.66.0-alt1 sisyphus+244190.1600.3.1 1579092452 installed
<13>Jan 17 14:02:10 rpmi: kf5-kconfig-devel-5.66.0-alt1 sisyphus+244190.1600.3.1 1579092452 installed
<13>Jan 17 14:02:10 rpmi: libkf5activities-5.66.0-alt1 sisyphus+244190.10200.3.1 1579099066 installed
<13>Jan 17 14:02:11 rpmi: kf5-kwidgetsaddons-common-5.66.0-alt1 sisyphus+244190.1400.3.1 1579091752 installed
<13>Jan 17 14:02:11 rpmi: libkf5widgetsaddons-5.66.0-alt1 sisyphus+244190.1400.3.1 1579092069 installed
<13>Jan 17 14:02:11 rpmi: kf5-kwidgetsaddons-devel-5.66.0-alt1 sisyphus+244190.1400.3.1 1579092069 installed
<13>Jan 17 14:02:11 rpmi: kf5-kguiaddons-common-5.66.0-alt1 sisyphus+244190.1200.3.1 1579091832 installed
<13>Jan 17 14:02:11 rpmi: kf5-ki18n-common-5.66.0-alt1 sisyphus+244190.3100.3.1 1579093018 installed
<13>Jan 17 14:02:11 rpmi: libkf5i18n-5.66.0-alt1 sisyphus+244190.3100.3.1 1579093729 installed
<13>Jan 17 14:02:11 rpmi: kf5-ki18n-devel-5.66.0-alt1 sisyphus+244190.3100.3.1 1579093729 installed
<13>Jan 17 14:02:11 rpmi: kf5-kconfigwidgets-common-5.66.0-alt1 sisyphus+244190.3600.3.1 1579093537 installed
<13>Jan 17 14:02:11 rpmi: kf5-kglobalaccel-common-5.66.0-alt1 sisyphus+244190.4000.3.1 1579093740 installed
<13>Jan 17 14:02:11 rpmi: kf5-kitemviews-common-5.66.0-alt1 sisyphus+244190.600.3.1 1579091239 installed
<13>Jan 17 14:02:11 rpmi: libkf5itemviews-5.66.0-alt1 sisyphus+244190.600.3.1 1579091397 installed
<13>Jan 17 14:02:11 rpmi: kf5-kitemviews-devel-5.66.0-alt1 sisyphus+244190.600.3.1 1579091397 installed
<13>Jan 17 14:02:11 rpmi: kf5-kiconthemes-common-5.66.0-alt1 sisyphus+244190.4100.3.1 1579093831 installed
<13>Jan 17 14:02:11 rpmi: kf5-kwindowsystem-common-5.66.0-alt1 sisyphus+244190.1700.3.1 1579092124 installed
<13>Jan 17 14:02:11 rpmi: kf5-kxmlgui-common-5.66.0-alt1 sisyphus+244190.5000.3.1 1579094491 installed
<13>Jan 17 14:02:11 rpmi: kf5-kcompletion-common-5.66.0-alt1 sisyphus+244190.3000.3.1 1579092929 installed
<13>Jan 17 14:02:11 rpmi: libkf5completion-5.66.0-alt1 sisyphus+244190.3000.3.1 1579093621 installed
<13>Jan 17 14:02:11 rpmi: kf5-kcompletion-devel-5.66.0-alt1 sisyphus+244190.3000.3.1 1579093621 installed
<13>Jan 17 14:02:11 rpmi: kf5-kcrash-common-5.66.0-alt1 sisyphus+244190.2600.3.1 1579092757 installed
<13>Jan 17 14:02:11 rpmi: kf5-kdbusaddons-common-5.66.0-alt1 sisyphus+244190.2200.3.1 1579092405 installed
<13>Jan 17 14:02:11 rpmi: kf5-kjobwidgets-common-5.66.0-alt1 sisyphus+244190.2700.3.1 1579092838 installed
<13>Jan 17 14:02:11 rpmi: kf5-kservice-common-5.66.0-alt1 sisyphus+244190.3700.3.1 1579093624 installed
<13>Jan 17 14:02:11 rpmi: kf5-solid-common-5.66.0-alt1 sisyphus+244190.2000.3.1 1579092224 installed
<13>Jan 17 14:02:11 rpmi: kf5-knotifications-common-5.66.0-alt1 sisyphus+244190.4200.3.1 1579093924 installed
<13>Jan 17 14:02:11 rpmi: kf5-kpackage-common-5.66.0-alt1 sisyphus+244190.5200.3.1 1579094716 installed
<13>Jan 17 14:02:11 rpmi: libkf5package-5.66.0-alt1 sisyphus+244190.5200.3.1 1579095924 installed
<13>Jan 17 14:02:11 rpmi: kf5-ktextwidgets-common-5.66.0-alt1 sisyphus+244190.4700.3.1 1579094394 installed
<13>Jan 17 14:02:11 rpmi: kf5-sonnet-common-5.66.0-alt1 sisyphus+244190.1500.3.1 1579092244 installed
<13>Jan 17 14:02:11 rpmi: kf5-kwayland-common-5.66.0-alt1 sisyphus+244190.300.3.1 1579090955 installed
<13>Jan 17 14:02:11 rpmi: libkf5waylandclient-5.66.0-alt1 sisyphus+244190.300.3.1 1579091004 installed
<13>Jan 17 14:02:11 rpmi: kf5-plasma-framework-common-5.66.0-alt1 sisyphus+244190.10400.3.1 1579098298 installed
<86>Jan 17 14:02:11 groupadd[98654]: group added to /etc/group: name=messagebus, GID=499
<86>Jan 17 14:02:11 groupadd[98654]: group added to /etc/gshadow: name=messagebus
<86>Jan 17 14:02:11 groupadd[98654]: new group: name=messagebus, GID=499
<86>Jan 17 14:02:11 useradd[98694]: new user: name=messagebus, UID=499, GID=499, home=/run/dbus, shell=/dev/null
<13>Jan 17 14:02:11 rpmi: dbus-1.12.16-alt2 sisyphus+240566.100.2.1 1573547696 installed
<13>Jan 17 14:02:11 rpmi: dbus-tools-1.12.16-alt2 sisyphus+240566.100.2.1 1573547696 installed
<13>Jan 17 14:02:11 rpmi: dbus-tools-gui-1.12.16-alt2 sisyphus+240566.100.2.1 1573547696 installed
<13>Jan 17 14:02:11 rpmi: libqt5-quickparticles-5.12.6-alt1 sisyphus+243095.140.2.1 1576585282 installed
<13>Jan 17 14:02:11 rpmi: libkf5threadweaver-5.66.0-alt1 sisyphus+244190.1000.3.1 1579091625 installed
<13>Jan 17 14:02:11 rpmi: libtdb-1.3.18-alt1 sisyphus+225625.2440.91.1 1555281603 installed
<13>Jan 17 14:02:11 rpmi: libltdl7-2.4.6-alt1 sisyphus+226971.100.2.1 1554906368 installed
<13>Jan 17 14:02:12 rpmi: sound-theme-freedesktop-0.8-alt1 1402011605 installed
<13>Jan 17 14:02:12 rpmi: qt5-speech-common-5.12.6-alt1 sisyphus+243095.3500.3.2 1576701867 installed
<13>Jan 17 14:02:12 rpmi: libspeechd-0.8.8-alt2 sisyphus+227564.400.1.2 1555993493 installed
<13>Jan 17 14:02:12 rpmi: libhunspell-1.7.0-alt1 sisyphus+226731.100.2.1 1554585904 installed
<13>Jan 17 14:02:12 rpmi: libkf5sonnetcore-5.66.0-alt1 sisyphus+244190.1500.3.1 1579092244 installed
<13>Jan 17 14:02:12 rpmi: libkf5sonnetui-5.66.0-alt1 sisyphus+244190.1500.3.1 1579092244 installed
<13>Jan 17 14:02:12 rpmi: kf5-sonnet-devel-5.66.0-alt1 sisyphus+244190.1500.3.1 1579092244 installed
<13>Jan 17 14:02:12 rpmi: media-player-info-24-alt1 sisyphus+238163.100.1.2 1569417389 installed
<13>Jan 17 14:02:12 rpmi: libkf5solid-5.66.0-alt1 sisyphus+244190.2000.3.1 1579092688 installed
<13>Jan 17 14:02:12 rpmi: kf5-solid-devel-5.66.0-alt1 sisyphus+244190.2000.3.1 1579092688 installed
<13>Jan 17 14:02:12 rpmi: su-0.60-alt35 1484567251 installed
<13>Jan 17 14:02:12 rpmi: url_handler-0.3.1-alt1 1290564262 installed
<13>Jan 17 14:02:12 rpmi: libXt-1.1.4-alt1 1369984722 installed
<13>Jan 17 14:02:12 rpmi: libXmu-1.1.3-alt1 sisyphus+225206.1200.1.2 1552949641 installed
<13>Jan 17 14:02:12 rpmi: xset-1.2.4-alt1 sisyphus.213358.100 1537438594 installed
<13>Jan 17 14:02:12 rpmi: xprop-1.2.4-alt1 sisyphus+225764.100.1.1 1553680703 installed
<13>Jan 17 14:02:12 rpmi: xdg-utils-1.1.3-alt6 sisyphus+233067.100.1.1 1561332512 installed
<13>Jan 17 14:02:12 rpmi: desktop-file-utils-0.23-alt2 sisyphus+226879.100.1.1 1554744356 installed
<13>Jan 17 14:02:12 rpmi: libqt5-concurrent-5.12.6-alt2 sisyphus+243340.100.2.1 1577090572 installed
<13>Jan 17 14:02:12 rpmi: xxd-4:8.2.0011-alt1 sisyphus+243069.100.2.2 1577124772 installed
<13>Jan 17 14:02:12 rpmi: libGLES-7:1.2.0-alt4 sisyphus+241659.100.1.1 1574755345 installed
<13>Jan 17 14:02:12 rpmi: libOpenGL-7:1.2.0-alt4 sisyphus+241659.100.1.1 1574755345 installed
<13>Jan 17 14:02:12 rpmi: xorg-proto-devel-2019.1-alt1 sisyphus+232786.100.1.1 1561106722 installed
<13>Jan 17 14:02:13 rpmi: libxcb-devel-1.13.1-alt1 sisyphus+226527.100.2.2 1554593801 installed
<13>Jan 17 14:02:13 rpmi: libX11-devel-3:1.6.9-alt1 sisyphus+239210.100.1.1 1571056801 installed
<13>Jan 17 14:02:13 rpmi: libglvnd-devel-7:1.2.0-alt4 sisyphus+241659.100.1.1 1574755345 installed
<13>Jan 17 14:02:13 rpmi: gcc-c++-common-1.4.24-alt3 sisyphus+243033.100.1.1 1576462403 installed
<13>Jan 17 14:02:14 rpmi: libstdc++9-devel-9.2.1-alt2 sisyphus+240563.200.2.1 1573479396 installed
<13>Jan 17 14:02:15 rpmi: gcc9-c++-9.2.1-alt2 sisyphus+240563.200.2.1 1573479396 installed
<13>Jan 17 14:02:15 rpmi: gcc-c++-9-alt1 sisyphus+239632.300.3.1 1571788297 installed
<13>Jan 17 14:02:15 rpmi: qt5-xmlpatterns-common-5.12.6-alt1 sisyphus+243095.240.2.1 1576585802 installed
<13>Jan 17 14:02:15 rpmi: libqt5-xmlpatterns-5.12.6-alt1 sisyphus+243095.240.2.1 1576585886 installed
<13>Jan 17 14:02:15 rpmi: qt5-x11extras-common-5.12.6-alt1 sisyphus+243095.1500.3.1 1576651444 installed
<13>Jan 17 14:02:15 rpmi: libqt5-x11extras-5.12.6-alt1 sisyphus+243095.1500.3.1 1576651372 installed
<13>Jan 17 14:02:15 rpmi: libkf5windowsystem-5.66.0-alt1 sisyphus+244190.1700.3.1 1579092565 installed
<13>Jan 17 14:02:15 rpmi: libkf5globalaccel-5.66.0-alt1 sisyphus+244190.4000.3.1 1579094684 installed
<13>Jan 17 14:02:15 rpmi: libkf5guiaddons-5.66.0-alt1 sisyphus+244190.1200.3.1 1579091832 installed
<13>Jan 17 14:02:15 rpmi: libkf5configwidgets-5.66.0-alt1 sisyphus+244190.3600.3.1 1579094384 installed
<13>Jan 17 14:02:15 rpmi: libkf5dbusaddons-5.66.0-alt1 sisyphus+244190.2200.3.1 1579092932 installed
<13>Jan 17 14:02:15 rpmi: libkf5crash-5.66.0-alt1 sisyphus+244190.2600.3.1 1579093419 installed
<13>Jan 17 14:02:15 rpmi: libkf5jobwidgets-5.66.0-alt1 sisyphus+244190.2700.3.1 1579093518 installed
<13>Jan 17 14:02:15 rpmi: libkf5globalaccelprivate-5.66.0-alt1 sisyphus+244190.4000.3.1 1579094684 installed
<13>Jan 17 14:02:15 rpmi: kf5-kwindowsystem-devel-5.66.0-alt1 sisyphus+244190.1700.3.1 1579092565 installed
<13>Jan 17 14:02:15 rpmi: qt5-websockets-common-5.12.6-alt1 sisyphus+243095.500.2.1 1576586599 installed
<13>Jan 17 14:02:15 rpmi: libqt5-websockets-5.12.6-alt1 sisyphus+243095.500.2.1 1576586635 installed
<13>Jan 17 14:02:15 rpmi: qt5-webkit-common-5.212.0-alt15 sisyphus+243095.4200.3.1 1576659627 installed
<13>Jan 17 14:02:15 rpmi: qt5-webchannel-common-5.12.6-alt1 sisyphus+243095.1200.2.1 1576587796 installed
<13>Jan 17 14:02:15 rpmi: libqt5-webchannel-5.12.6-alt1 sisyphus+243095.1200.2.1 1576587921 installed
<13>Jan 17 14:02:16 rpmi: libqt5-webkit-5.212.0-alt15 sisyphus+243095.4200.3.1 1576659267 installed
<13>Jan 17 14:02:16 rpmi: qt5-svg-common-5.12.6-alt1 sisyphus+243095.1700.3.1 1576651569 installed
<13>Jan 17 14:02:16 rpmi: libqt5-svg-5.12.6-alt1 sisyphus+243095.1700.3.1 1576651505 installed
<13>Jan 17 14:02:16 rpmi: libkf5iconthemes-5.66.0-alt1 sisyphus+244190.4100.3.1 1579094807 installed
<13>Jan 17 14:02:16 rpmi: qt5-sensors-common-5.12.6-alt1 sisyphus+243095.1100.2.1 1576587706 installed
<13>Jan 17 14:02:16 rpmi: libqt5-sensors-5.12.6-alt1 sisyphus+243095.1100.2.1 1576587803 installed
<13>Jan 17 14:02:16 rpmi: qt5-remoteobjects-common-5.12.4-alt1 sisyphus+236580.100.1.1 1566745993 installed
<13>Jan 17 14:02:16 rpmi: qt5-remoteobjects-5.12.4-alt1 sisyphus+236580.100.1.1 1566745992 installed
<13>Jan 17 14:02:16 rpmi: qt5-networkauth-common-5.12.6-alt1 sisyphus+243095.4040.3.1 1576658724 installed
<13>Jan 17 14:02:16 rpmi: libqt5-networkauth-5.12.6-alt1 sisyphus+243095.4040.3.1 1576658403 installed
<13>Jan 17 14:02:16 rpmi: qt5-multimedia-common-5.12.6-alt1 sisyphus+243095.600.3.2 1576697381 installed
<13>Jan 17 14:02:16 rpmi: libopenal1-1.19.1-alt1 sisyphus+222956.100.1.1 1551298524 installed
<13>Jan 17 14:02:16 rpmi: libzeromq-4.2.3-alt1 1513846894 installed
<13>Jan 17 14:02:16 rpmi: libmpeg2-0.5.1-alt3.svn20120718 1410845588 installed
<13>Jan 17 14:02:16 rpmi: libcdio-2.1.0-alt1 sisyphus+242329.100.3.1 1575837114 installed
<13>Jan 17 14:02:16 rpmi: liba52-0.7.4-alt9 1528303351 installed
<13>Jan 17 14:02:16 rpmi: libwebrtc-0.3-alt2 sisyphus+229377.100.1.1 1557873871 installed
<13>Jan 17 14:02:16 rpmi: vulkan-filesystem-1.1.121-alt1.1 sisyphus+236811.500.2.1 1567091259 installed
<13>Jan 17 14:02:16 rpmi: libvulkan1-1.1.121-alt1.1 sisyphus+236811.500.2.1 1567091322 installed
<13>Jan 17 14:02:16 rpmi: libvulkan-devel-1.1.121-alt1.1 sisyphus+236811.500.2.1 1567091322 installed
<13>Jan 17 14:02:16 rpmi: libvo-amrwbenc-0.1.3-alt1 1465493713 installed
<13>Jan 17 14:02:16 rpmi: libvo-aacenc-0.1.3-alt1 1393497440 installed
<13>Jan 17 14:02:16 rpmi: libsbc-1.2-alt1.1 1501780340 installed
<13>Jan 17 14:02:16 rpmi: libtbb-2019-alt1.u8 sisyphus+235076.100.2.1 1563979152 installed
<13>Jan 17 14:02:17 rpmi: libprotobuf17-3.6.1.3-alt2 sisyphus+227259.100.1.1 1555610584 installed
<13>Jan 17 14:02:17 rpmi: libgflags-2.2.2-alt1 sisyphus+235324.400.2.1 1564663147 installed
<13>Jan 17 14:02:17 rpmi: libjson-c4-0.13.1-alt1 sisyphus+226468.100.8.1 1554723266 installed
<13>Jan 17 14:02:17 rpmi: libCharLS-1.0-alt2 1389518019 installed
<13>Jan 17 14:02:17 rpmi: gdcm-2.8.4-alt3_11 sisyphus+238653.100.1.1 1570182566 installed
<13>Jan 17 14:02:17 rpmi: libgme-0.6.1-alt1 1521318055 installed
<13>Jan 17 14:02:17 rpmi: libudfread-1.0.0-alt3 1528906339 installed
<13>Jan 17 14:02:17 rpmi: libbluray-1.0.2-alt2 sisyphus+238344.100.1.1 1569839188 installed
<13>Jan 17 14:02:17 rpmi: libsoxr-0.1.2-alt4 sisyphus+222649.100.1.1 1550964843 installed
<13>Jan 17 14:02:17 rpmi: libswresample3-2:4.2.2-alt1 sisyphus+243947.100.1.1 1578561009 installed
<13>Jan 17 14:02:17 rpmi: libzvbi-0.2.35-alt1 sisyphus+223374.100.1.1 1551507906 installed
<13>Jan 17 14:02:17 rpmi: libxvid-1.3.4-alt1 1507033991 installed
<13>Jan 17 14:02:17 rpmi: libsnappy-1.1.7-alt1 sisyphus+227320.100.1.3 1555618694 installed
<13>Jan 17 14:02:17 rpmi: libcodec2-0.8.1-alt1 1533802541 installed
<13>Jan 17 14:02:17 rpmi: libaom-1.0.0-alt2 sisyphus+235903.100.1.1 1565598682 installed
<13>Jan 17 14:02:17 rpmi: tinyxml-2.6.2-alt1.2 1465754828 installed
<13>Jan 17 14:02:17 rpmi: openni-1.5.7.10-alt2_17 sisyphus+242541.100.1.1 1575759144 installed
<13>Jan 17 14:02:17 rpmi: openexr22-common-2.2.0-alt5 sisyphus+238339.100.1.1 1569837260 installed
<13>Jan 17 14:02:17 rpmi: libilmimf22-2.2.0-alt5 sisyphus+238339.100.1.1 1569837260 installed
<13>Jan 17 14:02:17 rpmi: libfftw3-common-3.3.8-alt1 sisyphus+226899.100.1.1 1554782385 installed
<13>Jan 17 14:02:17 rpmi: libfftw3-3.3.8-alt1 sisyphus+226899.100.1.1 1554783258 installed
<13>Jan 17 14:02:17 rpmi: libofa-0.9.3-alt4.1.qa3 1506957671 installed
<13>Jan 17 14:02:17 rpmi: librubberband-1.8.1-alt1.hg20140905.1 1434271537 installed
<13>Jan 17 14:02:17 rpmi: libmodplug-0.8.9.0-alt1 sisyphus+224334.100.1.1 1552243563 installed
<13>Jan 17 14:02:17 rpmi: libmms-0.6.4-alt1 1409679935 installed
<13>Jan 17 14:02:17 rpmi: libyajl-2.1.0-alt1 1399891591 installed
<13>Jan 17 14:02:17 rpmi: libkate-0.4.1-alt1.4 sisyphus+223368.100.1.1 1551503985 installed
<13>Jan 17 14:02:17 rpmi: liblash-1:0.5.4-alt1_40 sisyphus+237783.100.1.1 1568832182 installed
<13>Jan 17 14:02:17 rpmi: libfaad2-2.7-alt6 sisyphus+220898.4600.11.1 1551973412 installed
<13>Jan 17 14:02:17 rpmi: libdvdcss-1.3.0-alt1 1414269644 installed
<13>Jan 17 14:02:17 rpmi: libdvdnav-5.0.1-alt1 1414229735 installed
<13>Jan 17 14:02:17 rpmi: libdca0-0.0.5-alt4.qa1 sisyphus+222535.100.1.1 1550881649 installed
<13>Jan 17 14:02:17 rpmi: libsoundtouch-2.1.2-alt1 sisyphus+222705.100.1.1 1551002623 installed
<13>Jan 17 14:02:17 rpmi: openexr24-common-2.3.0-alt2 sisyphus+237980.100.1.1 1569181634 installed
<13>Jan 17 14:02:17 rpmi: libilmimf24-2.3.0-alt2 sisyphus+237980.100.1.1 1569181634 installed
<13>Jan 17 14:02:17 rpmi: libtag-1.11.1-alt1 1479892963 installed
<13>Jan 17 14:02:17 rpmi: libasyncns-0.8-alt2.qa1 1365949820 installed
<13>Jan 17 14:02:17 rpmi: libpulseaudio-13.0-alt3 sisyphus+242188.100.1.1 1575382773 installed
<13>Jan 17 14:02:17 rpmi: libmpg123-1.25.13-alt1 sisyphus+239777.100.1.1 1572114548 installed
<13>Jan 17 14:02:17 rpmi: libwayland-cursor-1.17.0-alt1 sisyphus+225894.100.1.1 1553872805 installed
<13>Jan 17 14:02:17 rpmi: libjbig-2.1-alt1 1401380926 installed
<13>Jan 17 14:02:18 rpmi: libtiff5-4.1.0-alt1 sisyphus+240802.100.1.1 1573743635 installed
<13>Jan 17 14:02:18 rpmi: libgdk-pixbuf-locales-2.40.0-alt1 sisyphus+238952.140.2.1 1570644607 installed
<13>Jan 17 14:02:18 rpmi: libavahi-0.7-alt1 sisyphus+237493.100.1.1 1568299481 installed
<13>Jan 17 14:02:18 rpmi: libcups-2.2.12-alt4 sisyphus+242884.100.1.1 1576235865 installed
<13>Jan 17 14:02:18 rpmi: libqt5-printsupport-5.12.6-alt2 sisyphus+243340.100.2.1 1577090572 installed
<13>Jan 17 14:02:18 rpmi: libkf5xmlgui-5.66.0-alt1 sisyphus+244190.5000.3.1 1579095680 installed
<13>Jan 17 14:02:18 rpmi: qt5-base-devel-5.12.6-alt2 sisyphus+243340.100.2.1 1577090572 installed
<13>Jan 17 14:02:18 rpmi: kf5-kcoreaddons-devel-5.66.0-alt1 sisyphus+244190.2300.3.1 1579093053 installed
<13>Jan 17 14:02:18 rpmi: libkf5bookmarks-5.66.0-alt1 sisyphus+244190.5100.3.1 1579095811 installed
<13>Jan 17 14:02:18 rpmi: kf5-kbookmarks-devel-5.66.0-alt1 sisyphus+244190.5100.3.1 1579095811 installed
<13>Jan 17 14:02:18 rpmi: kf5-kjobwidgets-devel-5.66.0-alt1 sisyphus+244190.2700.3.1 1579093518 installed
<13>Jan 17 14:02:18 rpmi: kf5-attica-devel-5.66.0-alt1 sisyphus+244190.400.3.1 1579091159 installed
<13>Jan 17 14:02:18 rpmi: libqt5-webkitwidgets-5.212.0-alt15 sisyphus+243095.4200.3.1 1576659267 installed
<13>Jan 17 14:02:18 rpmi: libXinerama-1.1.4-alt1 sisyphus+223149.300.2.1 1551268216 installed
<13>Jan 17 14:02:18 rpmi: libXi-1.7.10-alt1 sisyphus+232786.300.1.1 1561106978 installed
<13>Jan 17 14:02:18 rpmi: libXcursor-1.2.0-alt1 sisyphus+225206.400.1.2 1552949218 installed
<13>Jan 17 14:02:18 rpmi: libXcomposite-0.4.5-alt1 sisyphus+225206.300.1.2 1552949137 installed
<13>Jan 17 14:02:18 rpmi: gtk+3-themes-incompatible-3.20-alt3 1461944560 installed
<13>Jan 17 14:02:18 rpmi: perl-Try-Tiny-0.30-alt1 1514318058 installed
<13>Jan 17 14:02:18 rpmi: perl-IO-Socket-IP-0.39-alt1 1494508514 installed
<13>Jan 17 14:02:18 rpmi: perl-Compress-Raw-Bzip2-2.093-alt1 sisyphus+242765.100.1.1 1576089363 installed
<13>Jan 17 14:02:18 rpmi: perl-HTML-Tagset-3.20-alt2 1317725093 installed
<13>Jan 17 14:02:18 rpmi: perl-Term-ANSIColor-5.00-alt1 sisyphus+243915.100.1.3 1578495666 installed
<13>Jan 17 14:02:18 rpmi: perl-Data-Dump-1.23-alt1 1444601978 installed
<13>Jan 17 14:02:18 rpmi: perl-Filter-1.59-alt1.1 sisyphus+219907.400.1.1 1548343389 installed
<13>Jan 17 14:02:18 rpmi: perl-Encode-3.01-alt1 sisyphus+224923.100.1.1 1552474122 installed
<13>Jan 17 14:02:18 rpmi: perl-URI-1.76-alt1 sisyphus+220243.100.1.1 1548863244 installed
<13>Jan 17 14:02:18 rpmi: perl-IO-Compress-2.093-alt1 sisyphus+243543.100.1.1 1577294382 installed
<13>Jan 17 14:02:18 rpmi: perl-Net-HTTP-6.19-alt1 sisyphus+229756.100.1.1 1558454558 installed
<13>Jan 17 14:02:18 rpmi: perl-HTML-Parser-3.72-alt1.2 sisyphus+219907.600.1.1 1548343581 installed
<13>Jan 17 14:02:18 rpmi: perl-WWW-RobotRules-6.02-alt1 1329756211 installed
<13>Jan 17 14:02:18 rpmi: perl-Encode-Locale-1.05-alt1 1444608613 installed
<13>Jan 17 14:02:18 rpmi: perl-IO-HTML-1.001-alt1 1404821752 installed
<13>Jan 17 14:02:18 rpmi: perl-HTTP-Message-6.18-alt1 1528288416 installed
<13>Jan 17 14:02:18 rpmi: perl-HTTP-Cookies-6.08-alt1 sisyphus+242242.100.1.1 1575454022 installed
<13>Jan 17 14:02:18 rpmi: perl-HTTP-Negotiate-6.01-alt1 1329760563 installed
<13>Jan 17 14:02:18 rpmi: perl-libwww-6.43-alt1 sisyphus+241824.100.1.3 1574885081 installed
<13>Jan 17 14:02:18 rpmi: perl-XML-LibXML-2.0201-alt2 sisyphus+240586.100.1.1 1573669072 installed
<13>Jan 17 14:02:18 rpmi: perl-XML-SAX-1.02-alt1 sisyphus+232322.100.1.1 1560758406 installed
<13>Jan 17 14:02:18 rpmi: perl-XML-Simple-2.25-alt1 1521437714 installed
<13>Jan 17 14:02:18 rpmi: icon-naming-utils-0.8.90-alt1 1236573102 installed
<13>Jan 17 14:02:19 rpmi: icon-theme-adwaita-3.34.3-alt1 sisyphus+240473.100.1.2 1573463296 installed
<13>Jan 17 14:02:19 rpmi: libvisual0.4-0.4.0-alt3 1301290260 installed
<13>Jan 17 14:02:19 rpmi: libdatrie-0.2.9-alt1_6 1511686676 installed
<13>Jan 17 14:02:19 rpmi: libthai-0.1.28-alt1_1 sisyphus+226107.100.1.1 1554123079 installed
<13>Jan 17 14:02:19 rpmi: libXft-2.3.3-alt1 sisyphus+225206.1000.3.2 1552987708 installed
<13>Jan 17 14:02:19 rpmi: libgraphene-1.10.0-alt1 sisyphus+237282.100.1.1 1567964936 installed
<13>Jan 17 14:02:19 rpmi: libcdparanoia-1:10.2-alt6 1501248110 installed
<13>Jan 17 14:02:19 rpmi: libpixman-3:0.38.4-alt1 sisyphus+228006.100.1.1 1556013870 installed
<13>Jan 17 14:02:19 rpmi: libcairo-1:1.16.0-alt1 sisyphus+226534.100.2.3 1554515535 installed
<13>Jan 17 14:02:19 rpmi: libpango-1.44.7-alt1 sisyphus+239731.100.1.1 1571986949 installed
<13>Jan 17 14:02:19 rpmi: libcairo-gobject-1:1.16.0-alt1 sisyphus+226534.100.2.3 1554515535 installed
<13>Jan 17 14:02:19 rpmi: qt5-serialport-common-5.12.6-alt1 sisyphus+243095.700.2.1 1576586985 installed
<13>Jan 17 14:02:19 rpmi: libqt5-serialport-5.12.6-alt1 sisyphus+243095.700.2.1 1576587060 installed
<13>Jan 17 14:02:19 rpmi: libqt5-positioning-5.12.6-alt1 sisyphus+243095.1000.2.1 1576587372 installed
<13>Jan 17 14:02:19 rpmi: libqt5-positioningquick-5.12.6-alt1 sisyphus+243095.1000.2.1 1576587372 installed
<13>Jan 17 14:02:20 rpmi: libqt5-location-5.12.6-alt1 sisyphus+243095.1000.2.1 1576587372 installed
<13>Jan 17 14:02:20 rpmi: rpm-macros-cmake-3.15.4-alt1 sisyphus+239520.100.1.1 1571611961 installed
<13>Jan 17 14:02:20 rpmi: cmake-modules-3.15.4-alt1 sisyphus+239520.100.1.1 1571611942 installed
<13>Jan 17 14:02:20 rpmi: libuv-1.33.1-alt1 sisyphus+239990.100.1.1 1572378437 installed
<13>Jan 17 14:02:20 rpmi: librhash-1.3.5-alt2 1505156279 installed
<13>Jan 17 14:02:20 rpmi: libjsoncpp19-1.8.4-alt5 sisyphus+243670.100.1.1 1577521267 installed
<13>Jan 17 14:02:20 rpmi: publicsuffix-list-dafsa-20200106-alt1 sisyphus+244007.100.1.1 1578588044 installed
<13>Jan 17 14:02:20 rpmi: libpsl-0.21.0-alt2 sisyphus+237083.100.1.1 1567531657 installed
<13>Jan 17 14:02:20 rpmi: libnghttp2-1.39.2-alt1 sisyphus+236978.100.1.1 1567325198 installed
<13>Jan 17 14:02:20 rpmi: libbrotlicommon-1.0.7-alt1 sisyphus+226738.100.2.1 1554554568 installed
<13>Jan 17 14:02:20 rpmi: libbrotlidec-1.0.7-alt1 sisyphus+226738.100.2.1 1554554568 installed
<13>Jan 17 14:02:21 rpmi: llvm7.0-libs-7.0.1-alt4.rel sisyphus+229878.100.2.1 1558604700 installed
<13>Jan 17 14:02:21 rpmi: clang7.0-libs-7.0.1-alt4.rel sisyphus+229878.100.2.1 1558604700 installed
<13>Jan 17 14:02:21 rpmi: libverto-0.3.0-alt1_7 sisyphus+225932.100.1.1 1553994919 installed
<13>Jan 17 14:02:21 rpmi: libkeyutils-1.6-alt2 sisyphus+226520.100.2.1 1554512089 installed
<13>Jan 17 14:02:21 rpmi: libcom_err-1.44.6-alt1 sisyphus+224154.100.1.1 1552091678 installed
<86>Jan 17 14:02:21 groupadd[112707]: group added to /etc/group: name=_keytab, GID=498
<86>Jan 17 14:02:21 groupadd[112707]: group added to /etc/gshadow: name=_keytab
<86>Jan 17 14:02:21 groupadd[112707]: new group: name=_keytab, GID=498
<13>Jan 17 14:02:21 rpmi: libkrb5-1.17.1-alt1 sisyphus+242784.100.1.1 1576137330 installed
<13>Jan 17 14:02:21 rpmi: libtirpc-1.0.3-alt1 1532008017 installed
<13>Jan 17 14:02:21 rpmi: libnsl2-1.1.0-alt1_1 1511548749 installed
<13>Jan 17 14:02:21 rpmi: python-modules-encodings-2.7.17-alt3 sisyphus+240580.200.5.1 1573517321 installed
<13>Jan 17 14:02:21 rpmi: python-modules-compiler-2.7.17-alt3 sisyphus+240580.200.5.1 1573517321 installed
<13>Jan 17 14:02:21 rpmi: python-modules-email-2.7.17-alt3 sisyphus+240580.200.5.1 1573517321 installed
<13>Jan 17 14:02:22 rpmi: python-modules-unittest-2.7.17-alt3 sisyphus+240580.200.5.1 1573517321 installed
<13>Jan 17 14:02:22 rpmi: python-modules-nis-2.7.17-alt3 sisyphus+240580.200.5.1 1573517321 installed
<13>Jan 17 14:02:22 rpmi: python-modules-2.7.17-alt3 sisyphus+240580.200.5.1 1573517321 installed
<86>Jan 17 14:02:22 groupadd[113577]: group added to /etc/group: name=sasl, GID=497
<86>Jan 17 14:02:22 groupadd[113577]: group added to /etc/gshadow: name=sasl
<86>Jan 17 14:02:22 groupadd[113577]: new group: name=sasl, GID=497
<13>Jan 17 14:02:22 rpmi: libsasl2-3-2.1.27-alt2 sisyphus+228101.100.1.1 1556139863 installed
<13>Jan 17 14:02:22 rpmi: libldap-2.4.48-alt3 sisyphus+238816.100.1.1 1570449022 installed
<13>Jan 17 14:02:22 rpmi: libcurl-7.68.0-alt1 sisyphus+244054.100.1.1 1578655327 installed
<13>Jan 17 14:02:22 rpmi: cmake-3.15.4-alt1 sisyphus+239520.100.1.1 1571611961 installed
<13>Jan 17 14:02:22 rpmi: libraptor2-2.0.15-alt1 1417013332 installed
<13>Jan 17 14:02:22 rpmi: liblrdf-0.6.1-alt1 1493047570 installed
<13>Jan 17 14:02:22 rpmi: libneon-0.30.2-alt1 sisyphus+226834.100.1.1 1554686306 installed
<13>Jan 17 14:02:22 rpmi: libssh-0.9.3-alt1 sisyphus+242717.100.1.1 1576055583 installed
<13>Jan 17 14:02:22 rpmi: python-base-2.7.17-alt3 sisyphus+240580.60.5.1 1573516905 installed
<13>Jan 17 14:02:26 rpmi: clang7.0-7.0.1-alt4.rel sisyphus+229878.100.2.1 1558604700 installed
<13>Jan 17 14:02:26 rpmi: clang7.0-devel-7.0.1-alt4.rel sisyphus+229878.100.2.1 1558604700 installed
<13>Jan 17 14:02:26 rpmi: python3-module-clang-5.0-alt1 sisyphus+228352.1100.3.1 1556555939 installed
<13>Jan 17 14:02:26 rpmi: libmetis-5.1.0-alt1.1 1465299656 installed
<13>Jan 17 14:02:26 rpmi: libxblas-1.0.248-alt1.3 sisyphus+229150.100.1.1 1557388786 installed
<13>Jan 17 14:02:26 rpmi: libquadmath0-9.2.1-alt2 sisyphus+240563.200.2.1 1573479396 installed
<13>Jan 17 14:02:26 rpmi: libgfortran5-9.2.1-alt2 sisyphus+240563.200.2.1 1573479396 installed
<13>Jan 17 14:02:26 rpmi: liblapack-1:3.8.0-alt3 sisyphus+221521.100.1.1 1550134903 installed
<13>Jan 17 14:02:26 rpmi: libsuitesparse-5.4.0-alt1 sisyphus+231121.400.4.1 1559650115 installed
<13>Jan 17 14:02:27 rpmi: ceres-solver-1.13.0-alt1_8 sisyphus+226018.100.1.1 1554036834 installed
<13>Jan 17 14:02:27 rpmi: libatk-locales-2.34.1-alt1 sisyphus+237956.700.4.2 1569332333 installed
<13>Jan 17 14:02:27 rpmi: libatk-2.34.1-alt1 sisyphus+237956.700.4.2 1569332796 installed
<13>Jan 17 14:02:27 rpmi: gsettings-desktop-schemas-data-3.34.0-alt1 sisyphus+237956.300.4.2 1569331130 installed
<13>Jan 17 14:02:27 rpmi: libgio-2.62.4-alt1 sisyphus+243311.100.1.3 1576855800 installed
<13>Jan 17 14:02:27 rpmi: gsettings-desktop-schemas-3.34.0-alt1 sisyphus+237956.300.4.2 1569331192 installed
<13>Jan 17 14:02:27 rpmi: libgstreamer1.0-1.16.2-alt1 sisyphus+242248.100.2.1 1575475168 installed
<13>Jan 17 14:02:27 rpmi: libgst-plugins1.0-1.16.2-alt1 sisyphus+242248.200.2.1 1575475391 installed
<13>Jan 17 14:02:27 rpmi: libgdk-pixbuf-2.40.0-alt1 sisyphus+238952.140.2.1 1570644615 installed
<13>Jan 17 14:02:27 rpmi: gstreamer1.0-1.16.2-alt1 sisyphus+242248.100.2.1 1575475168 installed
<13>Jan 17 14:02:27 rpmi: librsvg-1:2.46.4-alt1 sisyphus+241586.500.1.2 1574679453 installed
<13>Jan 17 14:02:28 rpmi: libavcodec58-2:4.2.2-alt1 sisyphus+243947.100.1.1 1578561009 installed
<13>Jan 17 14:02:28 rpmi: libavformat58-2:4.2.2-alt1 sisyphus+243947.100.1.1 1578561009 installed
<13>Jan 17 14:02:28 rpmi: libgusb-0.3.2-alt1 sisyphus+243897.100.1.1 1578411305 installed
<13>Jan 17 14:02:28 rpmi: libcolord-1.4.4-alt2 sisyphus+229904.100.1.1 1558606569 installed
<13>Jan 17 14:02:28 rpmi: libpolkit-0.116-alt2 sisyphus+242835.100.1.1 1576161160 installed
<13>Jan 17 14:02:28 rpmi: gobject-introspection-1.62.0-alt1 sisyphus+237956.200.4.2 1569331106 installed
<13>Jan 17 14:02:28 rpmi: libgstreamer1.0-gir-1.16.2-alt1 sisyphus+242248.100.2.1 1575475168 installed
<13>Jan 17 14:02:28 rpmi: libgst-plugins1.0-gir-1.16.2-alt1 sisyphus+242248.200.2.1 1575475391 installed
<86>Jan 17 14:02:28 groupadd[124213]: group added to /etc/group: name=colord, GID=496
<86>Jan 17 14:02:28 groupadd[124213]: group added to /etc/gshadow: name=colord
<86>Jan 17 14:02:28 groupadd[124213]: new group: name=colord, GID=496
<86>Jan 17 14:02:28 useradd[124238]: new user: name=colord, UID=498, GID=496, home=/var/colord, shell=/dev/null
<13>Jan 17 14:02:28 rpmi: colord-1.4.4-alt2 sisyphus+229904.100.1.1 1558606569 installed
<13>Jan 17 14:02:28 rpmi: libpolkit-qt5-core-0.112.0-alt3 sisyphus+222979.100.1.2 1551378014 installed
<13>Jan 17 14:02:28 rpmi: libkf5auth-5.66.0-alt1 sisyphus+244190.2500.3.1 1579093301 installed
<13>Jan 17 14:02:28 rpmi: kf5-kauth-devel-5.66.0-alt1 sisyphus+244190.2500.3.1 1579093301 installed
<13>Jan 17 14:02:28 rpmi: kf5-kconfigwidgets-devel-5.66.0-alt1 sisyphus+244190.3600.3.1 1579094384 installed
<13>Jan 17 14:02:28 rpmi: kf5-kxmlgui-devel-5.66.0-alt1 sisyphus+244190.5000.3.1 1579095680 installed
<13>Jan 17 14:02:28 rpmi: gst-plugins-ugly1.0-1.16.2-alt1 sisyphus+242329.500.3.1 1575837462 installed
<13>Jan 17 14:02:28 rpmi: gtk-update-icon-cache-3.24.13-alt1 sisyphus+241862.100.1.1 1574928027 installed
<13>Jan 17 14:02:28 rpmi: glib-networking-2.62.3-alt1 sisyphus+243839.100.1.1 1578128835 installed
<13>Jan 17 14:02:28 rpmi: libsoup-2.68.3-alt1 sisyphus+242263.100.1.1 1575463144 installed
<13>Jan 17 14:02:28 rpmi: libgssdp1.2-1.2.2-alt1 sisyphus+243789.100.1.1 1577980176 installed
<13>Jan 17 14:02:28 rpmi: libgupnp1.2-1.2.2-alt1 sisyphus+243789.200.1.1 1577980231 installed
<13>Jan 17 14:02:28 rpmi: libgupnp-igd-0.2.5-alt3 sisyphus+243713.100.1.1 1577692631 installed
<13>Jan 17 14:02:28 rpmi: libnice-0.1.16-alt1 sisyphus+229216.100.1.1 1557584955 installed
<13>Jan 17 14:02:28 rpmi: libsoup-gnome-2.68.3-alt1 sisyphus+242263.100.1.1 1575463144 installed
<13>Jan 17 14:02:28 rpmi: librest-0.8.1-alt1 1508266400 installed
<13>Jan 17 14:02:28 rpmi: at-spi2-core-2.34.0-alt1 sisyphus+237956.1100.4.2 1569333019 installed
<13>Jan 17 14:02:28 rpmi: at-spi2-atk-2.34.1-alt1 sisyphus+238952.300.2.1 1570644687 installed
<13>Jan 17 14:02:28 rpmi: libdconf-0.34.0-alt1 sisyphus+237956.1500.4.2 1569334549 installed
<13>Jan 17 14:02:28 rpmi: dconf-0.34.0-alt1 sisyphus+237956.1500.4.2 1569334549 installed
<13>Jan 17 14:02:28 rpmi: libgtk+3-schemas-3.24.13-alt1 sisyphus+241862.100.1.1 1574928005 installed
<13>Jan 17 14:02:28 rpmi: libjson-glib-1.4.4-alt1 sisyphus.213175.100 1537249589 installed
<13>Jan 17 14:02:29 rpmi: libgtk+3-3.24.13-alt1 sisyphus+241862.100.1.1 1574928027 installed
<13>Jan 17 14:02:29 rpmi: gst-plugins-good1.0-1.16.2-alt1 sisyphus+242248.300.2.1 1575475529 installed
<13>Jan 17 14:02:29 rpmi: altlinux-mime-defaults-0.435-alt1 sisyphus+233225.100.1.1 1561540568 installed
<13>Jan 17 14:02:29 rpmi: wm-common-freedesktop-1.3-alt1 1303402115 installed
<13>Jan 17 14:02:29 rpmi: altlinux-freedesktop-menu-common-0.67-alt1 sisyphus+232521.100.1.2 1560890506 installed
<13>Jan 17 14:02:29 rpmi: altlinux-freedesktop-menu-shallow-menu-0.67-alt1 sisyphus+232521.100.1.2 1560890506 installed
<13>Jan 17 14:02:29 rpmi: altlinux-freedesktop-menu-generic-0.67-alt1 sisyphus+232521.100.1.2 1560890506 installed
<13>Jan 17 14:02:29 rpmi: libkf5service-5.66.0-alt1 sisyphus+244190.3700.3.1 1579094497 installed
<13>Jan 17 14:02:29 rpmi: libkf5kiocore-5.66.0-alt1 sisyphus+244190.5400.3.1 1579096360 installed
<13>Jan 17 14:02:29 rpmi: libkf5kiowidgets-5.66.0-alt1 sisyphus+244190.5400.3.1 1579096360 installed
<13>Jan 17 14:02:29 rpmi: libkf5declarative-5.66.0-alt1 sisyphus+244190.6000.3.1 1579096955 installed
<13>Jan 17 14:02:29 rpmi: libkf5quickaddons-5.66.0-alt1 sisyphus+244190.6000.3.1 1579096955 installed
<13>Jan 17 14:02:29 rpmi: libkf5kiofilewidgets-5.66.0-alt1 sisyphus+244190.5400.3.1 1579096360 installed
<13>Jan 17 14:02:29 rpmi: libkf5kiogui-5.66.0-alt1 sisyphus+244190.5400.3.1 1579096360 installed
<13>Jan 17 14:02:29 rpmi: kf5-kservice-devel-5.66.0-alt1 sisyphus+244190.3700.3.1 1579094497 installed
<13>Jan 17 14:02:29 rpmi: alsa-ucm-conf-1.2.1.2-alt1 sisyphus+242075.200.1.1 1575268256 installed
<13>Jan 17 14:02:29 rpmi: alsa-topology-conf-1.2.1-alt1 sisyphus+240942.100.4.1 1574247451 installed
<13>Jan 17 14:02:29 rpmi: libalsa-1:1.2.1.2-alt1 sisyphus+242075.100.1.1 1575268262 installed
<13>Jan 17 14:02:30 rpmi: flite-2.1-alt1 sisyphus+222718.100.1.1 1551026084 installed
<13>Jan 17 14:02:30 rpmi: libavfilter7-2:4.2.2-alt1 sisyphus+243947.100.1.1 1578561009 installed
<13>Jan 17 14:02:30 rpmi: gst-libav-1.16.2-alt1 sisyphus+242248.700.2.1 1575475919 installed
<13>Jan 17 14:02:30 rpmi: gst-plugins-base1.0-1.16.2-alt1 sisyphus+242248.200.2.1 1575475391 installed
<13>Jan 17 14:02:30 rpmi: libfluidsynth-2.0.9-alt1 sisyphus+241722.100.1.1 1574794854 installed
<13>Jan 17 14:02:30 rpmi: libSDL-1.2.14-alt8 sisyphus+232545.100.1.1 1560879163 installed
<13>Jan 17 14:02:30 rpmi: libmjpegtools2.1-2.1.0-alt3 sisyphus+227903.100.1.1 1555879025 installed
<13>Jan 17 14:02:30 rpmi: libucil2-0.9.10-alt3_12 sisyphus+233445.100.1.1 1561809424 installed
<13>Jan 17 14:02:31 rpmi: libopencv3.4-1:3.4.6-alt1 sisyphus+233908.200.1.1 1562316737 installed
<13>Jan 17 14:02:31 rpmi: gst-plugins-bad1.0-1.16.2-alt1 sisyphus+242600.200.4.1 1576605221 installed
<13>Jan 17 14:02:31 rpmi: libqt5-multimedia-5.12.6-alt1 sisyphus+243095.600.3.2 1576697397 installed
<13>Jan 17 14:02:31 rpmi: libqt5-texttospeech-5.12.6-alt1 sisyphus+243095.3500.3.2 1576701867 installed
<13>Jan 17 14:02:31 rpmi: libkf5textwidgets-5.66.0-alt1 sisyphus+244190.4700.3.1 1579095556 installed
<13>Jan 17 14:02:32 rpmi: python3-module-PyQt5-5.13.1-alt1 sisyphus+238813.302.27.1 1571993227 installed
<13>Jan 17 14:02:32 rpmi: libcanberra-0.30-alt3 1509034818 installed
<13>Jan 17 14:02:32 rpmi: libkf5notifications-5.66.0-alt1 sisyphus+244190.4200.3.1 1579094915 installed
<13>Jan 17 14:02:32 rpmi: libkf5plasma-5.66.0-alt1 sisyphus+244190.10400.3.1 1579099853 installed
<13>Jan 17 14:02:32 rpmi: libkf5plasmaquick-5.66.0-alt1 sisyphus+244190.10400.3.1 1579099853 installed
<13>Jan 17 14:02:32 rpmi: kf5-plasma-framework-devel-5.66.0-alt1 sisyphus+244190.10400.3.1 1579099853 installed
<13>Jan 17 14:02:32 rpmi: extra-cmake-modules-5.66.0-alt1 sisyphus+244190.100.1.1 1578928531 installed
<13>Jan 17 14:02:32 rpmi: kf5-ktextwidgets-devel-5.66.0-alt1 sisyphus+244190.4700.3.1 1579095556 installed
<13>Jan 17 14:02:32 rpmi: kf5-kio-devel-5.66.0-alt1 sisyphus+244190.5400.3.1 1579096360 installed
<13>Jan 17 14:02:32 rpmi: qt5-declarative-devel-5.12.6-alt1 sisyphus+243095.140.2.1 1576585282 installed
<13>Jan 17 14:02:32 rpmi: kf5-kiconthemes-devel-5.66.0-alt1 sisyphus+244190.4100.3.1 1579094807 installed
<13>Jan 17 14:02:32 rpmi: kf5-kglobalaccel-devel-5.66.0-alt1 sisyphus+244190.4000.3.1 1579094684 installed
<13>Jan 17 14:02:32 rpmi: kf5-kdbusaddons-devel-5.66.0-alt1 sisyphus+244190.2200.3.1 1579092932 installed
<13>Jan 17 14:02:32 rpmi: kf5-kguiaddons-devel-5.66.0-alt1 sisyphus+244190.1200.3.1 1579091832 installed
<13>Jan 17 14:02:32 rpmi: kf5-threadweaver-devel-5.66.0-alt1 sisyphus+244190.1000.3.1 1579091625 installed
<13>Jan 17 14:02:32 rpmi: kf5-kpackage-devel-5.66.0-alt1 sisyphus+244190.5200.3.1 1579095924 installed
Building target platforms: i586
Building for target i586
Wrote: /usr/src/in/nosrpm/kf5-krunner-5.66.0-alt1.nosrc.rpm
Installing kf5-krunner-5.66.0-alt1.src.rpm
Building target platforms: i586
Building for target i586
Executing(%prep): /bin/sh -e /usr/src/tmp/rpm-tmp.58869
+ umask 022
+ /bin/mkdir -p /usr/src/RPM/BUILD
+ cd /usr/src/RPM/BUILD
+ cd /usr/src/RPM/BUILD
+ rm -rf krunner-5.66.0
+ echo 'Source #0 (krunner-5.66.0.tar):'
Source #0 (krunner-5.66.0.tar):
+ /bin/tar -xf /usr/src/RPM/SOURCES/krunner-5.66.0.tar
+ cd krunner-5.66.0
+ /bin/chmod -c -Rf u+rwX,go-w .
+ exit 0
Executing(%build): /bin/sh -e /usr/src/tmp/rpm-tmp.96955
+ umask 022
+ /bin/mkdir -p /usr/src/RPM/BUILD
+ cd /usr/src/RPM/BUILD
+ cd krunner-5.66.0
+ __kf5_build
+ mkdir -p BUILD
+ __kf5_cmake
+ export PATH=/usr/lib/kf5/bin:/usr/src/bin:/bin:/usr/bin:/usr/X11R6/bin:/usr/games
+ PATH=/usr/lib/kf5/bin:/usr/src/bin:/bin:/usr/bin:/usr/X11R6/bin:/usr/games
+ export QTDIR=/usr/share/qt5
+ QTDIR=/usr/share/qt5
+ export 'CFLAGS=-pipe -frecord-gcc-switches -Wall -g -O2 -march=i586 -mtune=generic'
+ CFLAGS='-pipe -frecord-gcc-switches -Wall -g -O2 -march=i586 -mtune=generic'
+ export 'CXXFLAGS=-pipe -frecord-gcc-switches -Wall -g -O2 -march=i586 -mtune=generic'
+ CXXFLAGS='-pipe -frecord-gcc-switches -Wall -g -O2 -march=i586 -mtune=generic'
+ pushd BUILD
~/RPM/BUILD/krunner-5.66.0/BUILD ~/RPM/BUILD/krunner-5.66.0
+ cmake .. -DCMAKE_USE_RELATIVE_PATHS:BOOL=ON -DCMAKE_VERBOSE_MAKEFILE:BOOL=ON -DCMAKE_SKIP_RPATH:BOOL=ON -DBUILD_TESTING:BOOL=FALSE -DKDE_INSTALL_USE_QT_SYS_PATHS:BOOL=ON -DCMAKE_BUILD_TYPE=Release '-DCMAKE_EXE_LINKER_FLAGS:STRING=-L/usr/lib -L/usr/lib/kf5/devel' '-DCMAKE_MODULE_LINKER_FLAGS:STRING=-L/usr/lib -L/usr/lib/kf5/devel' '-DCMAKE_SHARED_LINKER_FLAGS:STRING=-L/usr/lib -L/usr/lib/kf5/devel' '-DCMAKE_LIBRARY_PATH=/usr/lib/kf5/devel;/usr/lib;/lib' '-DCMAKE_INCLUDE_PATH=/usr/include/KF5;/usr/include' -DCMAKE_INSTALL_PREFIX=/usr -DCMAKE_PREFIX_PATH=/usr -DCMAKE_INSTALL_BINDIR=/usr/lib/kf5/bin -DCMAKE_INSTALL_FULL_BINDIR=/usr/lib/kf5/bin -DBIN_INSTALL_DIR:PATH=/usr/lib/kf5/bin -DCMAKE_INSTALL_SBINDIR=/usr/lib/kf5/sbin -DCMAKE_INSTALL_FULL_SBINDIR=/usr/lib/kf5/sbin -DSBIN_INSTALL_DIR:PATH=/usr/lib/kf5/sbin -DLIBEXEC_INSTALL_DIR:PATH=/usr/libexec -DINCLUDE_INSTALL_DIR:PATH=/usr/include -DCMAKE_INSTALL_INCLUDEDIR_KF5=/usr/include/KF5 -DDATA_INSTALL_DIR:PATH=/usr/share -DCONFIG_INSTALL_DIR:PATH=/etc/kf5/xdg -DSERVICES_INSTALL_DIR:PATH=/usr/share/kservices5 -DSERVICETYPES_INSTALL_DIR:PATH=/usr/share/kservicetypes5 -DKNOTIFYRC_INSTALL_DIR:PATH=/usr/share/knotifications5 -DKXMLGUI_INSTALL_DIR:PATH=/usr/share/kxmlgui5 -DLIB_INSTALL_DIR:PATH=/usr/lib -DLIB_DESTINATION=lib -DLIB_SUFFIX= -DSYSCONF_INSTALL_DIR:PATH=/etc -DAUTOSTART_INSTALL_DIR=/etc/kf5/xdg/autostart -DHTML_INSTALL_DIR=/usr/share/kf5/doc/HTML -DICON_INSTALL_DIR=/usr/share/kf5/icons -DXDG_MIME_INSTALL_DIR=/usr/share/mime/packages -DXDG_APPS_INSTALL_DIR=/usr/share/kf5/applications/kf5 -DECM_MKSPECS_INSTALL_DIR:PATH=/usr/lib/qt5/mkspecs/modules -DKCFG_INSTALL_DIR:PATH=/usr/share/kf5/config.kcfg -DPLUGIN_INSTALL_DIR:PATH=/usr/lib/qt5/plugins -DQT_PLUGIN_INSTALL_DIR:PATH=/usr/lib/qt5/plugins -DQML_INSTALL_DIR:PATH=/usr/lib/qt5/qml -DIMPORTS_INSTALL_DIR:PATH=/usr/lib/qt5/imports -DDBUS_INTERFACES_INSTALL_DIR=/usr/share/kf5/dbus-1/interfaces -DDBUS_SERVICES_INSTALL_DIR=/usr/share/kf5/dbus-1/services -DDBUS_SYSTEM_SERVICES_INSTALL_DIR=/lib/dbus-1/system-services
-- The C compiler identification is GNU 9.2.1
-- The CXX compiler identification is GNU 9.2.1
-- Check for working C compiler: /usr/bin/cc
-- Check for working C compiler: /usr/bin/cc -- works
-- Detecting C compiler ABI info
-- Detecting C compiler ABI info - done
-- Detecting C compile features
-- Detecting C compile features - done
-- Check for working CXX compiler: /usr/bin/c++
-- Check for working CXX compiler: /usr/bin/c++ -- works
-- Detecting CXX compiler ABI info
-- Detecting CXX compiler ABI info - done
-- Detecting CXX compile features
-- Detecting CXX compile features - done
-- 

CMake Deprecation Warning at /usr/share/ECM/kde-modules/KDEInstallDirs.cmake:356 (message):
  BIN_INSTALL_DIR is deprecated, use KDE_INSTALL_BINDIR instead.
Call Stack (most recent call first):
  /usr/share/ECM/kde-modules/KDEInstallDirs.cmake:447 (_define_relative)
  CMakeLists.txt:15 (include)


CMake Deprecation Warning at /usr/share/ECM/kde-modules/KDEInstallDirs.cmake:356 (message):
  SBIN_INSTALL_DIR is deprecated, use KDE_INSTALL_SBINDIR instead.
Call Stack (most recent call first):
  /usr/share/ECM/kde-modules/KDEInstallDirs.cmake:450 (_define_relative)
  CMakeLists.txt:15 (include)


CMake Deprecation Warning at /usr/share/ECM/kde-modules/KDEInstallDirs.cmake:356 (message):
  LIB_INSTALL_DIR is deprecated, use KDE_INSTALL_LIBDIR instead.
Call Stack (most recent call first):
  /usr/share/ECM/kde-modules/KDEInstallDirs.cmake:453 (_define_relative)
  CMakeLists.txt:15 (include)


CMake Deprecation Warning at /usr/share/ECM/kde-modules/KDEInstallDirs.cmake:356 (message):
  LIBEXEC_INSTALL_DIR is deprecated, use KDE_INSTALL_LIBEXECDIR instead.
Call Stack (most recent call first):
  /usr/share/ECM/kde-modules/KDEInstallDirs.cmake:463 (_define_relative)
  CMakeLists.txt:15 (include)


CMake Deprecation Warning at /usr/share/ECM/kde-modules/KDEInstallDirs.cmake:356 (message):
  QT_PLUGIN_INSTALL_DIR is deprecated, use KDE_INSTALL_QTPLUGINDIR instead.
Call Stack (most recent call first):
  /usr/share/ECM/kde-modules/KDEInstallDirs.cmake:411 (_define_relative)
  /usr/share/ECM/kde-modules/KDEInstallDirs.cmake:491 (_define_absolute)
  CMakeLists.txt:15 (include)


CMake Deprecation Warning at /usr/share/ECM/kde-modules/KDEInstallDirs.cmake:356 (message):
  IMPORTS_INSTALL_DIR is deprecated, use KDE_INSTALL_QTQUICKIMPORTSDIR
  instead.
Call Stack (most recent call first):
  /usr/share/ECM/kde-modules/KDEInstallDirs.cmake:411 (_define_relative)
  /usr/share/ECM/kde-modules/KDEInstallDirs.cmake:497 (_define_absolute)
  CMakeLists.txt:15 (include)


CMake Deprecation Warning at /usr/share/ECM/kde-modules/KDEInstallDirs.cmake:356 (message):
  QML_INSTALL_DIR is deprecated, use KDE_INSTALL_QMLDIR instead.
Call Stack (most recent call first):
  /usr/share/ECM/kde-modules/KDEInstallDirs.cmake:411 (_define_relative)
  /usr/share/ECM/kde-modules/KDEInstallDirs.cmake:503 (_define_absolute)
  CMakeLists.txt:15 (include)


CMake Deprecation Warning at /usr/share/ECM/kde-modules/KDEInstallDirs.cmake:356 (message):
  PLUGIN_INSTALL_DIR is deprecated, use KDE_INSTALL_PLUGINDIR instead.
Call Stack (most recent call first):
  /usr/share/ECM/kde-modules/KDEInstallDirs.cmake:525 (_define_relative)
  CMakeLists.txt:15 (include)


CMake Deprecation Warning at /usr/share/ECM/kde-modules/KDEInstallDirs.cmake:356 (message):
  INCLUDE_INSTALL_DIR is deprecated, use KDE_INSTALL_INCLUDEDIR instead.
Call Stack (most recent call first):
  /usr/share/ECM/kde-modules/KDEInstallDirs.cmake:411 (_define_relative)
  /usr/share/ECM/kde-modules/KDEInstallDirs.cmake:529 (_define_absolute)
  CMakeLists.txt:15 (include)


CMake Deprecation Warning at /usr/share/ECM/kde-modules/KDEInstallDirs.cmake:356 (message):
  DATA_INSTALL_DIR is deprecated, use KDE_INSTALL_DATADIR instead.
Call Stack (most recent call first):
  /usr/share/ECM/kde-modules/KDEInstallDirs.cmake:555 (_define_relative)
  CMakeLists.txt:15 (include)


CMake Deprecation Warning at /usr/share/ECM/kde-modules/KDEInstallDirs.cmake:356 (message):
  HTML_INSTALL_DIR is deprecated, use KDE_INSTALL_DOCBUNDLEDIR instead.
Call Stack (most recent call first):
  /usr/share/ECM/kde-modules/KDEInstallDirs.cmake:576 (_define_relative)
  CMakeLists.txt:15 (include)


CMake Deprecation Warning at /usr/share/ECM/kde-modules/KDEInstallDirs.cmake:356 (message):
  KCFG_INSTALL_DIR is deprecated, use KDE_INSTALL_KCFGDIR instead.
Call Stack (most recent call first):
  /usr/share/ECM/kde-modules/KDEInstallDirs.cmake:579 (_define_relative)
  CMakeLists.txt:15 (include)


CMake Deprecation Warning at /usr/share/ECM/kde-modules/KDEInstallDirs.cmake:356 (message):
  SERVICES_INSTALL_DIR is deprecated, use KDE_INSTALL_KSERVICES5DIR instead.
Call Stack (most recent call first):
  /usr/share/ECM/kde-modules/KDEInstallDirs.cmake:585 (_define_relative)
  CMakeLists.txt:15 (include)


CMake Deprecation Warning at /usr/share/ECM/kde-modules/KDEInstallDirs.cmake:356 (message):
  SERVICETYPES_INSTALL_DIR is deprecated, use KDE_INSTALL_KSERVICETYPES5DIR
  instead.
Call Stack (most recent call first):
  /usr/share/ECM/kde-modules/KDEInstallDirs.cmake:588 (_define_relative)
  CMakeLists.txt:15 (include)


CMake Deprecation Warning at /usr/share/ECM/kde-modules/KDEInstallDirs.cmake:356 (message):
  KNOTIFYRC_INSTALL_DIR is deprecated, use KDE_INSTALL_KNOTIFY5RCDIR instead.
Call Stack (most recent call first):
  /usr/share/ECM/kde-modules/KDEInstallDirs.cmake:591 (_define_relative)
  CMakeLists.txt:15 (include)


CMake Deprecation Warning at /usr/share/ECM/kde-modules/KDEInstallDirs.cmake:356 (message):
  KXMLGUI_INSTALL_DIR is deprecated, use KDE_INSTALL_KXMLGUI5DIR instead.
Call Stack (most recent call first):
  /usr/share/ECM/kde-modules/KDEInstallDirs.cmake:594 (_define_relative)
  CMakeLists.txt:15 (include)


CMake Deprecation Warning at /usr/share/ECM/kde-modules/KDEInstallDirs.cmake:356 (message):
  ICON_INSTALL_DIR is deprecated, use KDE_INSTALL_ICONDIR instead.
Call Stack (most recent call first):
  /usr/share/ECM/kde-modules/KDEInstallDirs.cmake:605 (_define_relative)
  CMakeLists.txt:15 (include)


CMake Deprecation Warning at /usr/share/ECM/kde-modules/KDEInstallDirs.cmake:356 (message):
  XDG_APPS_INSTALL_DIR is deprecated, use KDE_INSTALL_APPDIR instead.
Call Stack (most recent call first):
  /usr/share/ECM/kde-modules/KDEInstallDirs.cmake:620 (_define_relative)
  CMakeLists.txt:15 (include)


CMake Deprecation Warning at /usr/share/ECM/kde-modules/KDEInstallDirs.cmake:356 (message):
  XDG_MIME_INSTALL_DIR is deprecated, use KDE_INSTALL_MIMEDIR instead.
Call Stack (most recent call first):
  /usr/share/ECM/kde-modules/KDEInstallDirs.cmake:626 (_define_relative)
  CMakeLists.txt:15 (include)


CMake Deprecation Warning at /usr/share/ECM/kde-modules/KDEInstallDirs.cmake:356 (message):
  DBUS_INTERFACES_INSTALL_DIR is deprecated, use KDE_INSTALL_DBUSINTERFACEDIR
  instead.
Call Stack (most recent call first):
  /usr/share/ECM/kde-modules/KDEInstallDirs.cmake:640 (_define_relative)
  CMakeLists.txt:15 (include)


CMake Deprecation Warning at /usr/share/ECM/kde-modules/KDEInstallDirs.cmake:356 (message):
  DBUS_SERVICES_INSTALL_DIR is deprecated, use KDE_INSTALL_DBUSSERVICEDIR
  instead.
Call Stack (most recent call first):
  /usr/share/ECM/kde-modules/KDEInstallDirs.cmake:643 (_define_relative)
  CMakeLists.txt:15 (include)


CMake Deprecation Warning at /usr/share/ECM/kde-modules/KDEInstallDirs.cmake:356 (message):
  DBUS_SYSTEM_SERVICES_INSTALL_DIR is deprecated, use
  KDE_INSTALL_DBUSSYSTEMSERVICEDIR instead.
Call Stack (most recent call first):
  /usr/share/ECM/kde-modules/KDEInstallDirs.cmake:646 (_define_relative)
  CMakeLists.txt:15 (include)


CMake Deprecation Warning at /usr/share/ECM/kde-modules/KDEInstallDirs.cmake:356 (message):
  SYSCONF_INSTALL_DIR is deprecated, use KDE_INSTALL_SYSCONFDIR instead.
Call Stack (most recent call first):
  /usr/share/ECM/kde-modules/KDEInstallDirs.cmake:411 (_define_relative)
  /usr/share/ECM/kde-modules/KDEInstallDirs.cmake:663 (_define_absolute)
  CMakeLists.txt:15 (include)


CMake Deprecation Warning at /usr/share/ECM/kde-modules/KDEInstallDirs.cmake:356 (message):
  CONFIG_INSTALL_DIR is deprecated, use KDE_INSTALL_CONFDIR instead.
Call Stack (most recent call first):
  /usr/share/ECM/kde-modules/KDEInstallDirs.cmake:666 (_define_relative)
  CMakeLists.txt:15 (include)


CMake Deprecation Warning at /usr/share/ECM/kde-modules/KDEInstallDirs.cmake:356 (message):
  AUTOSTART_INSTALL_DIR is deprecated, use KDE_INSTALL_AUTOSTARTDIR instead.
Call Stack (most recent call first):
  /usr/share/ECM/kde-modules/KDEInstallDirs.cmake:669 (_define_relative)
  CMakeLists.txt:15 (include)


-- Looking for __GLIBC__
-- Looking for __GLIBC__ - found
-- Performing Test _OFFT_IS_64BIT
-- Performing Test _OFFT_IS_64BIT - Failed
-- Performing Test HAVE_DATE_TIME
-- Performing Test HAVE_DATE_TIME - Success
-- Found Gettext: /usr/bin/msgmerge (found version "0.20.1") 
-- Performing Test COMPILER_HAS_HIDDEN_VISIBILITY
-- Performing Test COMPILER_HAS_HIDDEN_VISIBILITY - Success
-- Performing Test COMPILER_HAS_HIDDEN_INLINE_VISIBILITY
-- Performing Test COMPILER_HAS_HIDDEN_INLINE_VISIBILITY - Success
-- Performing Test COMPILER_HAS_DEPRECATED_ATTR
-- Performing Test COMPILER_HAS_DEPRECATED_ATTR - Success
-- The following REQUIRED packages have been found:

 * Qt5Qml (required version >= 5.12.6)
 * Qt5Quick
 * Qt5 (required version >= 5.12.0)
 * Gettext
 * KF5I18n (required version >= 5.66.0)
 * KF5Completion (required version >= 5.66.0)
 * KF5ItemViews (required version >= 5.66.0)
 * KF5JobWidgets (required version >= 5.66.0)
 * KF5Solid (required version >= 5.66.0)
 * KF5Auth (required version >= 5.66.0)
 * KF5Codecs (required version >= 5.66.0)
 * KF5WidgetsAddons (required version >= 5.66.0)
 * KF5ConfigWidgets (required version >= 5.66.0)
 * KF5XmlGui (required version >= 5.66.0)
 * Qt5Network (required version >= 5.12.0)
 * KF5KIO (required version >= 5.66.0)
 * Qt5Gui (required version >= 5.12.0)
 * KF5Package (required version >= 5.66.0)
 * KF5CoreAddons (required version >= 5.66.0)
 * KF5Service (required version >= 5.66.0)
 * Qt5Widgets (required version >= 5.12.0)
 * KF5WindowSystem (required version >= 5.66.0)
 * ECM (required version >= 1.6.0), Extra CMake Modules., <https://commits.kde.org/extra-cmake-modules>
 * KF5Plasma (required version >= 5.66.0)
 * KF5ThreadWeaver (required version >= 5.66.0)
 * Qt5Core

-- The following features have been disabled:

 * QCH, API documentation in QCH format (for e.g. Qt Assistant, Qt Creator & KDevelop)

-- Configuring done
-- Generating done
CMake Warning:
  Manually-specified variables were not used by the project:

    CMAKE_INCLUDE_PATH
    CMAKE_LIBRARY_PATH
    CMAKE_USE_RELATIVE_PATHS
    LIB_DESTINATION
    LIB_SUFFIX


-- Build files have been written to: /usr/src/RPM/BUILD/krunner-5.66.0/BUILD
+ popd
~/RPM/BUILD/krunner-5.66.0
+ __kf5_make
+ pushd BUILD
~/RPM/BUILD/krunner-5.66.0/BUILD ~/RPM/BUILD/krunner-5.66.0
+ make -j8
make: Entering directory '/usr/src/RPM/BUILD/krunner-5.66.0/BUILD'
/usr/bin/cmake -S/usr/src/RPM/BUILD/krunner-5.66.0 -B/usr/src/RPM/BUILD/krunner-5.66.0/BUILD --check-build-system CMakeFiles/Makefile.cmake 0
make: Leaving directory '/usr/src/RPM/BUILD/krunner-5.66.0/BUILD'
make: Entering directory '/usr/src/RPM/BUILD/krunner-5.66.0/BUILD'
/usr/bin/cmake -E cmake_progress_start /usr/src/RPM/BUILD/krunner-5.66.0/BUILD/CMakeFiles /usr/src/RPM/BUILD/krunner-5.66.0/BUILD/CMakeFiles/progress.marks
make: Leaving directory '/usr/src/RPM/BUILD/krunner-5.66.0/BUILD'
make -f CMakeFiles/Makefile2 all
make -f src/CMakeFiles/copy_servicetypes.dir/build.make src/CMakeFiles/copy_servicetypes.dir/depend
make -f templates/CMakeFiles/runner.dir/build.make templates/CMakeFiles/runner.dir/depend
make[2]: Entering directory '/usr/src/RPM/BUILD/krunner-5.66.0/BUILD'
cd /usr/src/RPM/BUILD/krunner-5.66.0/BUILD && /usr/bin/cmake -E cmake_depends "Unix Makefiles" /usr/src/RPM/BUILD/krunner-5.66.0 /usr/src/RPM/BUILD/krunner-5.66.0/templates /usr/src/RPM/BUILD/krunner-5.66.0/BUILD /usr/src/RPM/BUILD/krunner-5.66.0/BUILD/templates /usr/src/RPM/BUILD/krunner-5.66.0/BUILD/templates/CMakeFiles/runner.dir/DependInfo.cmake --color=
Scanning dependencies of target runner
make[2]: Leaving directory '/usr/src/RPM/BUILD/krunner-5.66.0/BUILD'
make -f templates/CMakeFiles/runner.dir/build.make templates/CMakeFiles/runner.dir/build
make[2]: Entering directory '/usr/src/RPM/BUILD/krunner-5.66.0/BUILD'
cd /usr/src/RPM/BUILD/krunner-5.66.0/BUILD && /usr/bin/cmake -E cmake_depends "Unix Makefiles" /usr/src/RPM/BUILD/krunner-5.66.0 /usr/src/RPM/BUILD/krunner-5.66.0/src /usr/src/RPM/BUILD/krunner-5.66.0/BUILD /usr/src/RPM/BUILD/krunner-5.66.0/BUILD/src /usr/src/RPM/BUILD/krunner-5.66.0/BUILD/src/CMakeFiles/copy_servicetypes.dir/DependInfo.cmake --color=
Scanning dependencies of target copy_servicetypes
make[2]: Leaving directory '/usr/src/RPM/BUILD/krunner-5.66.0/BUILD'
make -f src/CMakeFiles/copy_servicetypes.dir/build.make src/CMakeFiles/copy_servicetypes.dir/build
make[2]: Entering directory '/usr/src/RPM/BUILD/krunner-5.66.0/BUILD'
cd /usr/src/RPM/BUILD/krunner-5.66.0/BUILD/src && /usr/bin/cmake -E copy /usr/src/RPM/BUILD/krunner-5.66.0/src/data/servicetypes/plasma-runner.desktop /usr/src/RPM/BUILD/krunner-5.66.0/BUILD/bin/data/kservicetypes5
make[2]: Leaving directory '/usr/src/RPM/BUILD/krunner-5.66.0/BUILD'
make[2]: Entering directory '/usr/src/RPM/BUILD/krunner-5.66.0/BUILD'
[  5%] Generating runner.tar.bz2
cd /usr/src/RPM/BUILD/krunner-5.66.0/templates/runner && /usr/bin/cmake -E tar cvfj /usr/src/RPM/BUILD/krunner-5.66.0/BUILD/templates/runner.tar.bz2 .
.
./src
./src/plasma-runner-%{APPNAMELC}.desktop
./src/CMakeLists.txt
./src/%{APPNAMELC}.h
./src/%{APPNAMELC}.cpp
./runner.png
./runner.kdevtemplate
./README
./Messages.sh
./CMakeLists.txt
make[2]: Leaving directory '/usr/src/RPM/BUILD/krunner-5.66.0/BUILD'
make[1]: Entering directory '/usr/src/RPM/BUILD/krunner-5.66.0/BUILD'
[  5%] Built target copy_servicetypes
make[1]: Leaving directory '/usr/src/RPM/BUILD/krunner-5.66.0/BUILD'
make -f src/CMakeFiles/KF5Runner_autogen.dir/build.make src/CMakeFiles/KF5Runner_autogen.dir/depend
make[1]: Entering directory '/usr/src/RPM/BUILD/krunner-5.66.0/BUILD'
[  5%] Built target runner
make[1]: Leaving directory '/usr/src/RPM/BUILD/krunner-5.66.0/BUILD'
make[2]: Entering directory '/usr/src/RPM/BUILD/krunner-5.66.0/BUILD'
cd /usr/src/RPM/BUILD/krunner-5.66.0/BUILD && /usr/bin/cmake -E cmake_depends "Unix Makefiles" /usr/src/RPM/BUILD/krunner-5.66.0 /usr/src/RPM/BUILD/krunner-5.66.0/src /usr/src/RPM/BUILD/krunner-5.66.0/BUILD /usr/src/RPM/BUILD/krunner-5.66.0/BUILD/src /usr/src/RPM/BUILD/krunner-5.66.0/BUILD/src/CMakeFiles/KF5Runner_autogen.dir/DependInfo.cmake --color=
Scanning dependencies of target KF5Runner_autogen
make[2]: Leaving directory '/usr/src/RPM/BUILD/krunner-5.66.0/BUILD'
make -f src/CMakeFiles/KF5Runner_autogen.dir/build.make src/CMakeFiles/KF5Runner_autogen.dir/build
make[2]: Entering directory '/usr/src/RPM/BUILD/krunner-5.66.0/BUILD'
[ 11%] Automatic MOC for target KF5Runner
cd /usr/src/RPM/BUILD/krunner-5.66.0/BUILD/src && /usr/bin/cmake -E cmake_autogen /usr/src/RPM/BUILD/krunner-5.66.0/BUILD/src/CMakeFiles/KF5Runner_autogen.dir/AutogenInfo.cmake Release
make[2]: Leaving directory '/usr/src/RPM/BUILD/krunner-5.66.0/BUILD'
make[1]: Entering directory '/usr/src/RPM/BUILD/krunner-5.66.0/BUILD'
[ 11%] Built target KF5Runner_autogen
make[1]: Leaving directory '/usr/src/RPM/BUILD/krunner-5.66.0/BUILD'
make -f src/CMakeFiles/KF5Runner.dir/build.make src/CMakeFiles/KF5Runner.dir/depend
make[2]: Entering directory '/usr/src/RPM/BUILD/krunner-5.66.0/BUILD'
cd /usr/src/RPM/BUILD/krunner-5.66.0/BUILD && /usr/bin/cmake -E cmake_depends "Unix Makefiles" /usr/src/RPM/BUILD/krunner-5.66.0 /usr/src/RPM/BUILD/krunner-5.66.0/src /usr/src/RPM/BUILD/krunner-5.66.0/BUILD /usr/src/RPM/BUILD/krunner-5.66.0/BUILD/src /usr/src/RPM/BUILD/krunner-5.66.0/BUILD/src/CMakeFiles/KF5Runner.dir/DependInfo.cmake --color=
Scanning dependencies of target KF5Runner
make[2]: Leaving directory '/usr/src/RPM/BUILD/krunner-5.66.0/BUILD'
make -f src/CMakeFiles/KF5Runner.dir/build.make src/CMakeFiles/KF5Runner.dir/build
make[2]: Entering directory '/usr/src/RPM/BUILD/krunner-5.66.0/BUILD'
[ 27%] Building CXX object src/CMakeFiles/KF5Runner.dir/querymatch.cpp.o
cd /usr/src/RPM/BUILD/krunner-5.66.0/BUILD/src && /usr/bin/c++  -DKCOREADDONS_LIB -DKF5Runner_EXPORTS -DKF_DEPRECATED_WARNINGS_SINCE=0x060000 -DKF_DISABLE_DEPRECATED_BEFORE_AND_AT=0x054100 -DKRUNNER_DEPRECATED_WARNINGS_SINCE=0x0 -DKRUNNER_DISABLE_DEPRECATED_BEFORE_AND_AT=0x0 -DPLASMA_DISABLE_DEPRECATED_BEFORE_AND_AT=0x050500 -DQT_CONCURRENT_LIB -DQT_CORE_LIB -DQT_DBUS_LIB -DQT_DEPRECATED_WARNINGS_SINCE=0x060000 -DQT_DISABLE_DEPRECATED_BEFORE=0x050d00 -DQT_GUI_LIB -DQT_NETWORK_LIB -DQT_NO_CAST_FROM_ASCII -DQT_NO_CAST_FROM_BYTEARRAY -DQT_NO_CAST_TO_ASCII -DQT_NO_DEBUG -DQT_NO_FOREACH -DQT_NO_NARROWING_CONVERSIONS_IN_CONNECT -DQT_NO_SIGNALS_SLOTS_KEYWORDS -DQT_NO_URL_CAST_FROM_STRING -DQT_STRICT_ITERATORS -DQT_USE_QSTRINGBUILDER -DQT_WIDGETS_LIB -D_FILE_OFFSET_BITS=64 -D_GNU_SOURCE -D_LARGEFILE64_SOURCE -I/usr/src/RPM/BUILD/krunner-5.66.0/BUILD/src -I/usr/src/RPM/BUILD/krunner-5.66.0/src -I/usr/src/RPM/BUILD/krunner-5.66.0/BUILD/src/KF5Runner_autogen/include -I/usr/src/RPM/BUILD/krunner-5.66.0/BUILD -isystem /usr/include/qt5 -isystem /usr/include/qt5/QtCore -isystem /usr/share/qt5/../../lib/qt5/mkspecs/linux-g++ -isystem /usr/include/KF5 -isystem /usr/include/KF5/Plasma -isystem /usr/include/KF5/KService -isystem /usr/include/KF5/KConfigCore -isystem /usr/include/KF5/KCoreAddons -isystem /usr/include/qt5/QtGui -isystem /usr/include/KF5/KPackage -isystem /usr/include/qt5/QtDBus -isystem /usr/include/qt5/QtWidgets -isystem /usr/include/KF5/KI18n -isystem /usr/include/KF5/ThreadWeaver -isystem /usr/include/KF5/KIOCore -isystem /usr/include/qt5/QtNetwork -isystem /usr/include/qt5/QtConcurrent  -pipe -frecord-gcc-switches -Wall -g -O2 -march=i586 -mtune=generic -fno-operator-names -fno-exceptions -Wall -Wextra -Wcast-align -Wchar-subscripts -Wformat-security -Wno-long-long -Wpointer-arith -Wundef -Wnon-virtual-dtor -Woverloaded-virtual -Werror=return-type -Wvla -Wdate-time -Wsuggest-override -Wlogical-op -pedantic -Wzero-as-null-pointer-constant -O2 -DNDEBUG -fPIC -fvisibility=hidden -fvisibility-inlines-hidden   -fPIC -std=gnu++11 -o CMakeFiles/KF5Runner.dir/querymatch.cpp.o -c /usr/src/RPM/BUILD/krunner-5.66.0/src/querymatch.cpp
make[2]: Leaving directory '/usr/src/RPM/BUILD/krunner-5.66.0/BUILD'
make[2]: Entering directory '/usr/src/RPM/BUILD/krunner-5.66.0/BUILD'
[ 22%] Building CXX object src/CMakeFiles/KF5Runner.dir/runnerjobs.cpp.o
cd /usr/src/RPM/BUILD/krunner-5.66.0/BUILD/src && /usr/bin/c++  -DKCOREADDONS_LIB -DKF5Runner_EXPORTS -DKF_DEPRECATED_WARNINGS_SINCE=0x060000 -DKF_DISABLE_DEPRECATED_BEFORE_AND_AT=0x054100 -DKRUNNER_DEPRECATED_WARNINGS_SINCE=0x0 -DKRUNNER_DISABLE_DEPRECATED_BEFORE_AND_AT=0x0 -DPLASMA_DISABLE_DEPRECATED_BEFORE_AND_AT=0x050500 -DQT_CONCURRENT_LIB -DQT_CORE_LIB -DQT_DBUS_LIB -DQT_DEPRECATED_WARNINGS_SINCE=0x060000 -DQT_DISABLE_DEPRECATED_BEFORE=0x050d00 -DQT_GUI_LIB -DQT_NETWORK_LIB -DQT_NO_CAST_FROM_ASCII -DQT_NO_CAST_FROM_BYTEARRAY -DQT_NO_CAST_TO_ASCII -DQT_NO_DEBUG -DQT_NO_FOREACH -DQT_NO_NARROWING_CONVERSIONS_IN_CONNECT -DQT_NO_SIGNALS_SLOTS_KEYWORDS -DQT_NO_URL_CAST_FROM_STRING -DQT_STRICT_ITERATORS -DQT_USE_QSTRINGBUILDER -DQT_WIDGETS_LIB -D_FILE_OFFSET_BITS=64 -D_GNU_SOURCE -D_LARGEFILE64_SOURCE -I/usr/src/RPM/BUILD/krunner-5.66.0/BUILD/src -I/usr/src/RPM/BUILD/krunner-5.66.0/src -I/usr/src/RPM/BUILD/krunner-5.66.0/BUILD/src/KF5Runner_autogen/include -I/usr/src/RPM/BUILD/krunner-5.66.0/BUILD -isystem /usr/include/qt5 -isystem /usr/include/qt5/QtCore -isystem /usr/share/qt5/../../lib/qt5/mkspecs/linux-g++ -isystem /usr/include/KF5 -isystem /usr/include/KF5/Plasma -isystem /usr/include/KF5/KService -isystem /usr/include/KF5/KConfigCore -isystem /usr/include/KF5/KCoreAddons -isystem /usr/include/qt5/QtGui -isystem /usr/include/KF5/KPackage -isystem /usr/include/qt5/QtDBus -isystem /usr/include/qt5/QtWidgets -isystem /usr/include/KF5/KI18n -isystem /usr/include/KF5/ThreadWeaver -isystem /usr/include/KF5/KIOCore -isystem /usr/include/qt5/QtNetwork -isystem /usr/include/qt5/QtConcurrent  -pipe -frecord-gcc-switches -Wall -g -O2 -march=i586 -mtune=generic -fno-operator-names -fno-exceptions -Wall -Wextra -Wcast-align -Wchar-subscripts -Wformat-security -Wno-long-long -Wpointer-arith -Wundef -Wnon-virtual-dtor -Woverloaded-virtual -Werror=return-type -Wvla -Wdate-time -Wsuggest-override -Wlogical-op -pedantic -Wzero-as-null-pointer-constant -O2 -DNDEBUG -fPIC -fvisibility=hidden -fvisibility-inlines-hidden   -fPIC -std=gnu++11 -o CMakeFiles/KF5Runner.dir/runnerjobs.cpp.o -c /usr/src/RPM/BUILD/krunner-5.66.0/src/runnerjobs.cpp
make[2]: Leaving directory '/usr/src/RPM/BUILD/krunner-5.66.0/BUILD'
make[2]: Entering directory '/usr/src/RPM/BUILD/krunner-5.66.0/BUILD'
[ 50%] Building CXX object src/CMakeFiles/KF5Runner.dir/runnersyntax.cpp.o
cd /usr/src/RPM/BUILD/krunner-5.66.0/BUILD/src && /usr/bin/c++  -DKCOREADDONS_LIB -DKF5Runner_EXPORTS -DKF_DEPRECATED_WARNINGS_SINCE=0x060000 -DKF_DISABLE_DEPRECATED_BEFORE_AND_AT=0x054100 -DKRUNNER_DEPRECATED_WARNINGS_SINCE=0x0 -DKRUNNER_DISABLE_DEPRECATED_BEFORE_AND_AT=0x0 -DPLASMA_DISABLE_DEPRECATED_BEFORE_AND_AT=0x050500 -DQT_CONCURRENT_LIB -DQT_CORE_LIB -DQT_DBUS_LIB -DQT_DEPRECATED_WARNINGS_SINCE=0x060000 -DQT_DISABLE_DEPRECATED_BEFORE=0x050d00 -DQT_GUI_LIB -DQT_NETWORK_LIB -DQT_NO_CAST_FROM_ASCII -DQT_NO_CAST_FROM_BYTEARRAY -DQT_NO_CAST_TO_ASCII -DQT_NO_DEBUG -DQT_NO_FOREACH -DQT_NO_NARROWING_CONVERSIONS_IN_CONNECT -DQT_NO_SIGNALS_SLOTS_KEYWORDS -DQT_NO_URL_CAST_FROM_STRING -DQT_STRICT_ITERATORS -DQT_USE_QSTRINGBUILDER -DQT_WIDGETS_LIB -D_FILE_OFFSET_BITS=64 -D_GNU_SOURCE -D_LARGEFILE64_SOURCE -I/usr/src/RPM/BUILD/krunner-5.66.0/BUILD/src -I/usr/src/RPM/BUILD/krunner-5.66.0/src -I/usr/src/RPM/BUILD/krunner-5.66.0/BUILD/src/KF5Runner_autogen/include -I/usr/src/RPM/BUILD/krunner-5.66.0/BUILD -isystem /usr/include/qt5 -isystem /usr/include/qt5/QtCore -isystem /usr/share/qt5/../../lib/qt5/mkspecs/linux-g++ -isystem /usr/include/KF5 -isystem /usr/include/KF5/Plasma -isystem /usr/include/KF5/KService -isystem /usr/include/KF5/KConfigCore -isystem /usr/include/KF5/KCoreAddons -isystem /usr/include/qt5/QtGui -isystem /usr/include/KF5/KPackage -isystem /usr/include/qt5/QtDBus -isystem /usr/include/qt5/QtWidgets -isystem /usr/include/KF5/KI18n -isystem /usr/include/KF5/ThreadWeaver -isystem /usr/include/KF5/KIOCore -isystem /usr/include/qt5/QtNetwork -isystem /usr/include/qt5/QtConcurrent  -pipe -frecord-gcc-switches -Wall -g -O2 -march=i586 -mtune=generic -fno-operator-names -fno-exceptions -Wall -Wextra -Wcast-align -Wchar-subscripts -Wformat-security -Wno-long-long -Wpointer-arith -Wundef -Wnon-virtual-dtor -Woverloaded-virtual -Werror=return-type -Wvla -Wdate-time -Wsuggest-override -Wlogical-op -pedantic -Wzero-as-null-pointer-constant -O2 -DNDEBUG -fPIC -fvisibility=hidden -fvisibility-inlines-hidden   -fPIC -std=gnu++11 -o CMakeFiles/KF5Runner.dir/runnersyntax.cpp.o -c /usr/src/RPM/BUILD/krunner-5.66.0/src/runnersyntax.cpp
make[2]: Leaving directory '/usr/src/RPM/BUILD/krunner-5.66.0/BUILD'
make[2]: Entering directory '/usr/src/RPM/BUILD/krunner-5.66.0/BUILD'
[ 44%] Building CXX object src/CMakeFiles/KF5Runner.dir/runnercontext.cpp.o
cd /usr/src/RPM/BUILD/krunner-5.66.0/BUILD/src && /usr/bin/c++  -DKCOREADDONS_LIB -DKF5Runner_EXPORTS -DKF_DEPRECATED_WARNINGS_SINCE=0x060000 -DKF_DISABLE_DEPRECATED_BEFORE_AND_AT=0x054100 -DKRUNNER_DEPRECATED_WARNINGS_SINCE=0x0 -DKRUNNER_DISABLE_DEPRECATED_BEFORE_AND_AT=0x0 -DPLASMA_DISABLE_DEPRECATED_BEFORE_AND_AT=0x050500 -DQT_CONCURRENT_LIB -DQT_CORE_LIB -DQT_DBUS_LIB -DQT_DEPRECATED_WARNINGS_SINCE=0x060000 -DQT_DISABLE_DEPRECATED_BEFORE=0x050d00 -DQT_GUI_LIB -DQT_NETWORK_LIB -DQT_NO_CAST_FROM_ASCII -DQT_NO_CAST_FROM_BYTEARRAY -DQT_NO_CAST_TO_ASCII -DQT_NO_DEBUG -DQT_NO_FOREACH -DQT_NO_NARROWING_CONVERSIONS_IN_CONNECT -DQT_NO_SIGNALS_SLOTS_KEYWORDS -DQT_NO_URL_CAST_FROM_STRING -DQT_STRICT_ITERATORS -DQT_USE_QSTRINGBUILDER -DQT_WIDGETS_LIB -D_FILE_OFFSET_BITS=64 -D_GNU_SOURCE -D_LARGEFILE64_SOURCE -I/usr/src/RPM/BUILD/krunner-5.66.0/BUILD/src -I/usr/src/RPM/BUILD/krunner-5.66.0/src -I/usr/src/RPM/BUILD/krunner-5.66.0/BUILD/src/KF5Runner_autogen/include -I/usr/src/RPM/BUILD/krunner-5.66.0/BUILD -isystem /usr/include/qt5 -isystem /usr/include/qt5/QtCore -isystem /usr/share/qt5/../../lib/qt5/mkspecs/linux-g++ -isystem /usr/include/KF5 -isystem /usr/include/KF5/Plasma -isystem /usr/include/KF5/KService -isystem /usr/include/KF5/KConfigCore -isystem /usr/include/KF5/KCoreAddons -isystem /usr/include/qt5/QtGui -isystem /usr/include/KF5/KPackage -isystem /usr/include/qt5/QtDBus -isystem /usr/include/qt5/QtWidgets -isystem /usr/include/KF5/KI18n -isystem /usr/include/KF5/ThreadWeaver -isystem /usr/include/KF5/KIOCore -isystem /usr/include/qt5/QtNetwork -isystem /usr/include/qt5/QtConcurrent  -pipe -frecord-gcc-switches -Wall -g -O2 -march=i586 -mtune=generic -fno-operator-names -fno-exceptions -Wall -Wextra -Wcast-align -Wchar-subscripts -Wformat-security -Wno-long-long -Wpointer-arith -Wundef -Wnon-virtual-dtor -Woverloaded-virtual -Werror=return-type -Wvla -Wdate-time -Wsuggest-override -Wlogical-op -pedantic -Wzero-as-null-pointer-constant -O2 -DNDEBUG -fPIC -fvisibility=hidden -fvisibility-inlines-hidden   -fPIC -std=gnu++11 -o CMakeFiles/KF5Runner.dir/runnercontext.cpp.o -c /usr/src/RPM/BUILD/krunner-5.66.0/src/runnercontext.cpp
make[2]: Leaving directory '/usr/src/RPM/BUILD/krunner-5.66.0/BUILD'
make[2]: Entering directory '/usr/src/RPM/BUILD/krunner-5.66.0/BUILD'
[ 38%] Building CXX object src/CMakeFiles/KF5Runner.dir/abstractrunner.cpp.o
cd /usr/src/RPM/BUILD/krunner-5.66.0/BUILD/src && /usr/bin/c++  -DKCOREADDONS_LIB -DKF5Runner_EXPORTS -DKF_DEPRECATED_WARNINGS_SINCE=0x060000 -DKF_DISABLE_DEPRECATED_BEFORE_AND_AT=0x054100 -DKRUNNER_DEPRECATED_WARNINGS_SINCE=0x0 -DKRUNNER_DISABLE_DEPRECATED_BEFORE_AND_AT=0x0 -DPLASMA_DISABLE_DEPRECATED_BEFORE_AND_AT=0x050500 -DQT_CONCURRENT_LIB -DQT_CORE_LIB -DQT_DBUS_LIB -DQT_DEPRECATED_WARNINGS_SINCE=0x060000 -DQT_DISABLE_DEPRECATED_BEFORE=0x050d00 -DQT_GUI_LIB -DQT_NETWORK_LIB -DQT_NO_CAST_FROM_ASCII -DQT_NO_CAST_FROM_BYTEARRAY -DQT_NO_CAST_TO_ASCII -DQT_NO_DEBUG -DQT_NO_FOREACH -DQT_NO_NARROWING_CONVERSIONS_IN_CONNECT -DQT_NO_SIGNALS_SLOTS_KEYWORDS -DQT_NO_URL_CAST_FROM_STRING -DQT_STRICT_ITERATORS -DQT_USE_QSTRINGBUILDER -DQT_WIDGETS_LIB -D_FILE_OFFSET_BITS=64 -D_GNU_SOURCE -D_LARGEFILE64_SOURCE -I/usr/src/RPM/BUILD/krunner-5.66.0/BUILD/src -I/usr/src/RPM/BUILD/krunner-5.66.0/src -I/usr/src/RPM/BUILD/krunner-5.66.0/BUILD/src/KF5Runner_autogen/include -I/usr/src/RPM/BUILD/krunner-5.66.0/BUILD -isystem /usr/include/qt5 -isystem /usr/include/qt5/QtCore -isystem /usr/share/qt5/../../lib/qt5/mkspecs/linux-g++ -isystem /usr/include/KF5 -isystem /usr/include/KF5/Plasma -isystem /usr/include/KF5/KService -isystem /usr/include/KF5/KConfigCore -isystem /usr/include/KF5/KCoreAddons -isystem /usr/include/qt5/QtGui -isystem /usr/include/KF5/KPackage -isystem /usr/include/qt5/QtDBus -isystem /usr/include/qt5/QtWidgets -isystem /usr/include/KF5/KI18n -isystem /usr/include/KF5/ThreadWeaver -isystem /usr/include/KF5/KIOCore -isystem /usr/include/qt5/QtNetwork -isystem /usr/include/qt5/QtConcurrent  -pipe -frecord-gcc-switches -Wall -g -O2 -march=i586 -mtune=generic -fno-operator-names -fno-exceptions -Wall -Wextra -Wcast-align -Wchar-subscripts -Wformat-security -Wno-long-long -Wpointer-arith -Wundef -Wnon-virtual-dtor -Woverloaded-virtual -Werror=return-type -Wvla -Wdate-time -Wsuggest-override -Wlogical-op -pedantic -Wzero-as-null-pointer-constant -O2 -DNDEBUG -fPIC -fvisibility=hidden -fvisibility-inlines-hidden   -fPIC -std=gnu++11 -o CMakeFiles/KF5Runner.dir/abstractrunner.cpp.o -c /usr/src/RPM/BUILD/krunner-5.66.0/src/abstractrunner.cpp
/usr/src/RPM/BUILD/krunner-5.66.0/src/abstractrunner.cpp: In member function 'Plasma::Package Plasma::AbstractRunner::package() const':
/usr/src/RPM/BUILD/krunner-5.66.0/src/abstractrunner.cpp:331:20: warning: 'Plasma::Package::Package(Plasma::PackageStructure*)' is deprecated: Since 5.6. Use KPackage API [-Wdeprecated-declarations]
  331 |     return Package();
      |                    ^
In file included from /usr/include/KF5/Plasma/Package:1,
                 from /usr/src/RPM/BUILD/krunner-5.66.0/src/abstractrunner.cpp:35:
/usr/include/KF5/plasma/package.h:98:14: note: declared here
   98 |     explicit Package(PackageStructure *structure = nullptr);
      |              ^~~~~~~
/usr/src/RPM/BUILD/krunner-5.66.0/src/abstractrunner.cpp:331:20: warning: 'Plasma::Package::Package(const Plasma::Package&)' is deprecated: Since 5.6. Use KPackage API [-Wdeprecated-declarations]
  331 |     return Package();
      |                    ^
In file included from /usr/include/KF5/Plasma/Package:1,
                 from /usr/src/RPM/BUILD/krunner-5.66.0/src/abstractrunner.cpp:35:
/usr/include/KF5/plasma/package.h:112:5: note: declared here
  112 |     Package(const Package &other);
      |     ^~~~~~~
/usr/src/RPM/BUILD/krunner-5.66.0/src/abstractrunner.cpp: In member function 'void Plasma::AbstractRunnerPrivate::init(KService::Ptr)':
/usr/src/RPM/BUILD/krunner-5.66.0/src/abstractrunner.cpp:378:44: warning: 'KPluginInfo::KPluginInfo(KService::Ptr)' is deprecated: Since 5.0. Use (Q|K)PluginLoader [-Wdeprecated-declarations]
  378 |     runnerDescription = KPluginInfo(service);
      |                                            ^
In file included from /usr/src/RPM/BUILD/krunner-5.66.0/src/abstractrunner.h:29,
                 from /usr/src/RPM/BUILD/krunner-5.66.0/src/abstractrunner.cpp:20:
/usr/include/KF5/KService/kplugininfo.h:116:14: note: declared here
  116 |     explicit KPluginInfo(const KService::Ptr service);
      |              ^~~~~~~~~~~
make[2]: Leaving directory '/usr/src/RPM/BUILD/krunner-5.66.0/BUILD'
make[2]: Entering directory '/usr/src/RPM/BUILD/krunner-5.66.0/BUILD'
[ 33%] Building CXX object src/CMakeFiles/KF5Runner.dir/KF5Runner_autogen/mocs_compilation.cpp.o
cd /usr/src/RPM/BUILD/krunner-5.66.0/BUILD/src && /usr/bin/c++  -DKCOREADDONS_LIB -DKF5Runner_EXPORTS -DKF_DEPRECATED_WARNINGS_SINCE=0x060000 -DKF_DISABLE_DEPRECATED_BEFORE_AND_AT=0x054100 -DKRUNNER_DEPRECATED_WARNINGS_SINCE=0x0 -DKRUNNER_DISABLE_DEPRECATED_BEFORE_AND_AT=0x0 -DPLASMA_DISABLE_DEPRECATED_BEFORE_AND_AT=0x050500 -DQT_CONCURRENT_LIB -DQT_CORE_LIB -DQT_DBUS_LIB -DQT_DEPRECATED_WARNINGS_SINCE=0x060000 -DQT_DISABLE_DEPRECATED_BEFORE=0x050d00 -DQT_GUI_LIB -DQT_NETWORK_LIB -DQT_NO_CAST_FROM_ASCII -DQT_NO_CAST_FROM_BYTEARRAY -DQT_NO_CAST_TO_ASCII -DQT_NO_DEBUG -DQT_NO_FOREACH -DQT_NO_NARROWING_CONVERSIONS_IN_CONNECT -DQT_NO_SIGNALS_SLOTS_KEYWORDS -DQT_NO_URL_CAST_FROM_STRING -DQT_STRICT_ITERATORS -DQT_USE_QSTRINGBUILDER -DQT_WIDGETS_LIB -D_FILE_OFFSET_BITS=64 -D_GNU_SOURCE -D_LARGEFILE64_SOURCE -I/usr/src/RPM/BUILD/krunner-5.66.0/BUILD/src -I/usr/src/RPM/BUILD/krunner-5.66.0/src -I/usr/src/RPM/BUILD/krunner-5.66.0/BUILD/src/KF5Runner_autogen/include -I/usr/src/RPM/BUILD/krunner-5.66.0/BUILD -isystem /usr/include/qt5 -isystem /usr/include/qt5/QtCore -isystem /usr/share/qt5/../../lib/qt5/mkspecs/linux-g++ -isystem /usr/include/KF5 -isystem /usr/include/KF5/Plasma -isystem /usr/include/KF5/KService -isystem /usr/include/KF5/KConfigCore -isystem /usr/include/KF5/KCoreAddons -isystem /usr/include/qt5/QtGui -isystem /usr/include/KF5/KPackage -isystem /usr/include/qt5/QtDBus -isystem /usr/include/qt5/QtWidgets -isystem /usr/include/KF5/KI18n -isystem /usr/include/KF5/ThreadWeaver -isystem /usr/include/KF5/KIOCore -isystem /usr/include/qt5/QtNetwork -isystem /usr/include/qt5/QtConcurrent  -pipe -frecord-gcc-switches -Wall -g -O2 -march=i586 -mtune=generic -fno-operator-names -fno-exceptions -Wall -Wextra -Wcast-align -Wchar-subscripts -Wformat-security -Wno-long-long -Wpointer-arith -Wundef -Wnon-virtual-dtor -Woverloaded-virtual -Werror=return-type -Wvla -Wdate-time -Wsuggest-override -Wlogical-op -pedantic -Wzero-as-null-pointer-constant -O2 -DNDEBUG -fPIC -fvisibility=hidden -fvisibility-inlines-hidden   -fPIC -std=gnu++11 -o CMakeFiles/KF5Runner.dir/KF5Runner_autogen/mocs_compilation.cpp.o -c /usr/src/RPM/BUILD/krunner-5.66.0/BUILD/src/KF5Runner_autogen/mocs_compilation.cpp
make[2]: Leaving directory '/usr/src/RPM/BUILD/krunner-5.66.0/BUILD'
make[2]: Entering directory '/usr/src/RPM/BUILD/krunner-5.66.0/BUILD'
[ 61%] Building CXX object src/CMakeFiles/KF5Runner.dir/krunner_debug.cpp.o
cd /usr/src/RPM/BUILD/krunner-5.66.0/BUILD/src && /usr/bin/c++  -DKCOREADDONS_LIB -DKF5Runner_EXPORTS -DKF_DEPRECATED_WARNINGS_SINCE=0x060000 -DKF_DISABLE_DEPRECATED_BEFORE_AND_AT=0x054100 -DKRUNNER_DEPRECATED_WARNINGS_SINCE=0x0 -DKRUNNER_DISABLE_DEPRECATED_BEFORE_AND_AT=0x0 -DPLASMA_DISABLE_DEPRECATED_BEFORE_AND_AT=0x050500 -DQT_CONCURRENT_LIB -DQT_CORE_LIB -DQT_DBUS_LIB -DQT_DEPRECATED_WARNINGS_SINCE=0x060000 -DQT_DISABLE_DEPRECATED_BEFORE=0x050d00 -DQT_GUI_LIB -DQT_NETWORK_LIB -DQT_NO_CAST_FROM_ASCII -DQT_NO_CAST_FROM_BYTEARRAY -DQT_NO_CAST_TO_ASCII -DQT_NO_DEBUG -DQT_NO_FOREACH -DQT_NO_NARROWING_CONVERSIONS_IN_CONNECT -DQT_NO_SIGNALS_SLOTS_KEYWORDS -DQT_NO_URL_CAST_FROM_STRING -DQT_STRICT_ITERATORS -DQT_USE_QSTRINGBUILDER -DQT_WIDGETS_LIB -D_FILE_OFFSET_BITS=64 -D_GNU_SOURCE -D_LARGEFILE64_SOURCE -I/usr/src/RPM/BUILD/krunner-5.66.0/BUILD/src -I/usr/src/RPM/BUILD/krunner-5.66.0/src -I/usr/src/RPM/BUILD/krunner-5.66.0/BUILD/src/KF5Runner_autogen/include -I/usr/src/RPM/BUILD/krunner-5.66.0/BUILD -isystem /usr/include/qt5 -isystem /usr/include/qt5/QtCore -isystem /usr/share/qt5/../../lib/qt5/mkspecs/linux-g++ -isystem /usr/include/KF5 -isystem /usr/include/KF5/Plasma -isystem /usr/include/KF5/KService -isystem /usr/include/KF5/KConfigCore -isystem /usr/include/KF5/KCoreAddons -isystem /usr/include/qt5/QtGui -isystem /usr/include/KF5/KPackage -isystem /usr/include/qt5/QtDBus -isystem /usr/include/qt5/QtWidgets -isystem /usr/include/KF5/KI18n -isystem /usr/include/KF5/ThreadWeaver -isystem /usr/include/KF5/KIOCore -isystem /usr/include/qt5/QtNetwork -isystem /usr/include/qt5/QtConcurrent  -pipe -frecord-gcc-switches -Wall -g -O2 -march=i586 -mtune=generic -fno-operator-names -fno-exceptions -Wall -Wextra -Wcast-align -Wchar-subscripts -Wformat-security -Wno-long-long -Wpointer-arith -Wundef -Wnon-virtual-dtor -Woverloaded-virtual -Werror=return-type -Wvla -Wdate-time -Wsuggest-override -Wlogical-op -pedantic -Wzero-as-null-pointer-constant -O2 -DNDEBUG -fPIC -fvisibility=hidden -fvisibility-inlines-hidden   -fPIC -std=gnu++11 -o CMakeFiles/KF5Runner.dir/krunner_debug.cpp.o -c /usr/src/RPM/BUILD/krunner-5.66.0/BUILD/src/krunner_debug.cpp
make[2]: Leaving directory '/usr/src/RPM/BUILD/krunner-5.66.0/BUILD'
make[2]: Entering directory '/usr/src/RPM/BUILD/krunner-5.66.0/BUILD'
[ 55%] Building CXX object src/CMakeFiles/KF5Runner.dir/runnermanager.cpp.o
cd /usr/src/RPM/BUILD/krunner-5.66.0/BUILD/src && /usr/bin/c++  -DKCOREADDONS_LIB -DKF5Runner_EXPORTS -DKF_DEPRECATED_WARNINGS_SINCE=0x060000 -DKF_DISABLE_DEPRECATED_BEFORE_AND_AT=0x054100 -DKRUNNER_DEPRECATED_WARNINGS_SINCE=0x0 -DKRUNNER_DISABLE_DEPRECATED_BEFORE_AND_AT=0x0 -DPLASMA_DISABLE_DEPRECATED_BEFORE_AND_AT=0x050500 -DQT_CONCURRENT_LIB -DQT_CORE_LIB -DQT_DBUS_LIB -DQT_DEPRECATED_WARNINGS_SINCE=0x060000 -DQT_DISABLE_DEPRECATED_BEFORE=0x050d00 -DQT_GUI_LIB -DQT_NETWORK_LIB -DQT_NO_CAST_FROM_ASCII -DQT_NO_CAST_FROM_BYTEARRAY -DQT_NO_CAST_TO_ASCII -DQT_NO_DEBUG -DQT_NO_FOREACH -DQT_NO_NARROWING_CONVERSIONS_IN_CONNECT -DQT_NO_SIGNALS_SLOTS_KEYWORDS -DQT_NO_URL_CAST_FROM_STRING -DQT_STRICT_ITERATORS -DQT_USE_QSTRINGBUILDER -DQT_WIDGETS_LIB -D_FILE_OFFSET_BITS=64 -D_GNU_SOURCE -D_LARGEFILE64_SOURCE -I/usr/src/RPM/BUILD/krunner-5.66.0/BUILD/src -I/usr/src/RPM/BUILD/krunner-5.66.0/src -I/usr/src/RPM/BUILD/krunner-5.66.0/BUILD/src/KF5Runner_autogen/include -I/usr/src/RPM/BUILD/krunner-5.66.0/BUILD -isystem /usr/include/qt5 -isystem /usr/include/qt5/QtCore -isystem /usr/share/qt5/../../lib/qt5/mkspecs/linux-g++ -isystem /usr/include/KF5 -isystem /usr/include/KF5/Plasma -isystem /usr/include/KF5/KService -isystem /usr/include/KF5/KConfigCore -isystem /usr/include/KF5/KCoreAddons -isystem /usr/include/qt5/QtGui -isystem /usr/include/KF5/KPackage -isystem /usr/include/qt5/QtDBus -isystem /usr/include/qt5/QtWidgets -isystem /usr/include/KF5/KI18n -isystem /usr/include/KF5/ThreadWeaver -isystem /usr/include/KF5/KIOCore -isystem /usr/include/qt5/QtNetwork -isystem /usr/include/qt5/QtConcurrent  -pipe -frecord-gcc-switches -Wall -g -O2 -march=i586 -mtune=generic -fno-operator-names -fno-exceptions -Wall -Wextra -Wcast-align -Wchar-subscripts -Wformat-security -Wno-long-long -Wpointer-arith -Wundef -Wnon-virtual-dtor -Woverloaded-virtual -Werror=return-type -Wvla -Wdate-time -Wsuggest-override -Wlogical-op -pedantic -Wzero-as-null-pointer-constant -O2 -DNDEBUG -fPIC -fvisibility=hidden -fvisibility-inlines-hidden   -fPIC -std=gnu++11 -o CMakeFiles/KF5Runner.dir/runnermanager.cpp.o -c /usr/src/RPM/BUILD/krunner-5.66.0/src/runnermanager.cpp
/usr/src/RPM/BUILD/krunner-5.66.0/src/runnermanager.cpp: In member function 'void Plasma::RunnerManager::loadRunner(KService::Ptr)':
/usr/src/RPM/BUILD/krunner-5.66.0/src/runnermanager.cpp:544:36: warning: 'KPluginInfo::KPluginInfo(KService::Ptr)' is deprecated: Since 5.0. Use (Q|K)PluginLoader [-Wdeprecated-declarations]
  544 |     KPluginInfo description(service);
      |                                    ^
In file included from /usr/src/RPM/BUILD/krunner-5.66.0/src/runnermanager.h:28,
                 from /usr/src/RPM/BUILD/krunner-5.66.0/src/runnermanager.cpp:22:
/usr/include/KF5/KService/kplugininfo.h:116:14: note: declared here
  116 |     explicit KPluginInfo(const KService::Ptr service);
      |              ^~~~~~~~~~~
/usr/src/RPM/BUILD/krunner-5.66.0/src/runnermanager.cpp: In static member function 'static KPluginInfo::List Plasma::RunnerManager::listRunnerInfo(const QString&)':
/usr/src/RPM/BUILD/krunner-5.66.0/src/runnermanager.cpp:713:25: warning: 'static KPluginInfo::List KPluginInfo::fromServices(const List&, const KConfigGroup&)' is deprecated: Since 5.0. Use (Q|K)PluginLoader [-Wdeprecated-declarations]
  713 |     return KPluginInfo::fromServices(offers);
      |                         ^~~~~~~~~~~~
In file included from /usr/src/RPM/BUILD/krunner-5.66.0/src/runnermanager.h:28,
                 from /usr/src/RPM/BUILD/krunner-5.66.0/src/runnermanager.cpp:22:
/usr/include/KF5/KService/kplugininfo.h:200:30: note: declared here
  200 |     static KPluginInfo::List fromServices(const KService::List &services, const KConfigGroup &config = KConfigGroup());
      |                              ^~~~~~~~~~~~
/usr/src/RPM/BUILD/krunner-5.66.0/src/runnermanager.cpp:713:44: warning: 'static KPluginInfo::List KPluginInfo::fromServices(const List&, const KConfigGroup&)' is deprecated: Since 5.0. Use (Q|K)PluginLoader [-Wdeprecated-declarations]
  713 |     return KPluginInfo::fromServices(offers);
      |                                            ^
In file included from /usr/src/RPM/BUILD/krunner-5.66.0/src/runnermanager.h:28,
                 from /usr/src/RPM/BUILD/krunner-5.66.0/src/runnermanager.cpp:22:
/usr/include/KF5/KService/kplugininfo.h:200:30: note: declared here
  200 |     static KPluginInfo::List fromServices(const KService::List &services, const KConfigGroup &config = KConfigGroup());
      |                              ^~~~~~~~~~~~
/usr/src/RPM/BUILD/krunner-5.66.0/src/runnermanager.cpp:713:44: warning: 'static KPluginInfo::List KPluginInfo::fromServices(const List&, const KConfigGroup&)' is deprecated: Since 5.0. Use (Q|K)PluginLoader [-Wdeprecated-declarations]
  713 |     return KPluginInfo::fromServices(offers);
      |                                            ^
In file included from /usr/src/RPM/BUILD/krunner-5.66.0/src/runnermanager.h:28,
                 from /usr/src/RPM/BUILD/krunner-5.66.0/src/runnermanager.cpp:22:
/usr/include/KF5/KService/kplugininfo.h:200:30: note: declared here
  200 |     static KPluginInfo::List fromServices(const KService::List &services, const KConfigGroup &config = KConfigGroup());
      |                              ^~~~~~~~~~~~
make[2]: Leaving directory '/usr/src/RPM/BUILD/krunner-5.66.0/BUILD'
make[2]: Entering directory '/usr/src/RPM/BUILD/krunner-5.66.0/BUILD'
[ 16%] Building CXX object src/CMakeFiles/KF5Runner.dir/dbusrunner.cpp.o
cd /usr/src/RPM/BUILD/krunner-5.66.0/BUILD/src && /usr/bin/c++  -DKCOREADDONS_LIB -DKF5Runner_EXPORTS -DKF_DEPRECATED_WARNINGS_SINCE=0x060000 -DKF_DISABLE_DEPRECATED_BEFORE_AND_AT=0x054100 -DKRUNNER_DEPRECATED_WARNINGS_SINCE=0x0 -DKRUNNER_DISABLE_DEPRECATED_BEFORE_AND_AT=0x0 -DPLASMA_DISABLE_DEPRECATED_BEFORE_AND_AT=0x050500 -DQT_CONCURRENT_LIB -DQT_CORE_LIB -DQT_DBUS_LIB -DQT_DEPRECATED_WARNINGS_SINCE=0x060000 -DQT_DISABLE_DEPRECATED_BEFORE=0x050d00 -DQT_GUI_LIB -DQT_NETWORK_LIB -DQT_NO_CAST_FROM_ASCII -DQT_NO_CAST_FROM_BYTEARRAY -DQT_NO_CAST_TO_ASCII -DQT_NO_DEBUG -DQT_NO_FOREACH -DQT_NO_NARROWING_CONVERSIONS_IN_CONNECT -DQT_NO_SIGNALS_SLOTS_KEYWORDS -DQT_NO_URL_CAST_FROM_STRING -DQT_STRICT_ITERATORS -DQT_USE_QSTRINGBUILDER -DQT_WIDGETS_LIB -D_FILE_OFFSET_BITS=64 -D_GNU_SOURCE -D_LARGEFILE64_SOURCE -I/usr/src/RPM/BUILD/krunner-5.66.0/BUILD/src -I/usr/src/RPM/BUILD/krunner-5.66.0/src -I/usr/src/RPM/BUILD/krunner-5.66.0/BUILD/src/KF5Runner_autogen/include -I/usr/src/RPM/BUILD/krunner-5.66.0/BUILD -isystem /usr/include/qt5 -isystem /usr/include/qt5/QtCore -isystem /usr/share/qt5/../../lib/qt5/mkspecs/linux-g++ -isystem /usr/include/KF5 -isystem /usr/include/KF5/Plasma -isystem /usr/include/KF5/KService -isystem /usr/include/KF5/KConfigCore -isystem /usr/include/KF5/KCoreAddons -isystem /usr/include/qt5/QtGui -isystem /usr/include/KF5/KPackage -isystem /usr/include/qt5/QtDBus -isystem /usr/include/qt5/QtWidgets -isystem /usr/include/KF5/KI18n -isystem /usr/include/KF5/ThreadWeaver -isystem /usr/include/KF5/KIOCore -isystem /usr/include/qt5/QtNetwork -isystem /usr/include/qt5/QtConcurrent  -pipe -frecord-gcc-switches -Wall -g -O2 -march=i586 -mtune=generic -fno-operator-names -fno-exceptions -Wall -Wextra -Wcast-align -Wchar-subscripts -Wformat-security -Wno-long-long -Wpointer-arith -Wundef -Wnon-virtual-dtor -Woverloaded-virtual -Werror=return-type -Wvla -Wdate-time -Wsuggest-override -Wlogical-op -pedantic -Wzero-as-null-pointer-constant -O2 -DNDEBUG -fPIC -fvisibility=hidden -fvisibility-inlines-hidden   -fPIC -std=gnu++11 -o CMakeFiles/KF5Runner.dir/dbusrunner.cpp.o -c /usr/src/RPM/BUILD/krunner-5.66.0/src/dbusrunner.cpp
make[2]: Leaving directory '/usr/src/RPM/BUILD/krunner-5.66.0/BUILD'
make[2]: Entering directory '/usr/src/RPM/BUILD/krunner-5.66.0/BUILD'
[ 66%] Linking CXX shared library ../bin/libKF5Runner.so
cd /usr/src/RPM/BUILD/krunner-5.66.0/BUILD/src && /usr/bin/cmake -E cmake_link_script CMakeFiles/KF5Runner.dir/link.txt --verbose=1
/usr/bin/c++ -fPIC -pipe -frecord-gcc-switches -Wall -g -O2 -march=i586 -mtune=generic -fno-operator-names -fno-exceptions -Wall -Wextra -Wcast-align -Wchar-subscripts -Wformat-security -Wno-long-long -Wpointer-arith -Wundef -Wnon-virtual-dtor -Woverloaded-virtual -Werror=return-type -Wvla -Wdate-time -Wsuggest-override -Wlogical-op -pedantic -Wzero-as-null-pointer-constant -O2 -DNDEBUG -Wl,--no-undefined -Wl,--fatal-warnings -Wl,--enable-new-dtags -L/usr/lib -L/usr/lib/kf5/devel -shared -Wl,-soname,libKF5Runner.so.5 -o ../bin/libKF5Runner.so.5.66.0 CMakeFiles/KF5Runner.dir/KF5Runner_autogen/mocs_compilation.cpp.o CMakeFiles/KF5Runner.dir/abstractrunner.cpp.o CMakeFiles/KF5Runner.dir/dbusrunner.cpp.o CMakeFiles/KF5Runner.dir/runnerjobs.cpp.o CMakeFiles/KF5Runner.dir/querymatch.cpp.o CMakeFiles/KF5Runner.dir/runnercontext.cpp.o CMakeFiles/KF5Runner.dir/runnermanager.cpp.o CMakeFiles/KF5Runner.dir/runnersyntax.cpp.o CMakeFiles/KF5Runner.dir/krunner_debug.cpp.o /usr/lib/libKF5Plasma.so.5.66.0 /usr/lib/libKF5ThreadWeaver.so.5.66.0 /usr/lib/libKF5Package.so.5.66.0 /usr/lib/libKF5KIOCore.so.5.66.0 /usr/lib/libKF5Service.so.5.66.0 /usr/lib/libQt5Concurrent.so.5.12.6 /usr/lib/libQt5Network.so.5.12.6 /usr/lib/libKF5I18n.so.5.66.0 /usr/lib/libKF5ConfigCore.so.5.66.0 /usr/lib/libQt5DBus.so.5.12.6 /usr/lib/libKF5CoreAddons.so.5.66.0 /usr/lib/libQt5Widgets.so.5.12.6 /usr/lib/libQt5Gui.so.5.12.6 /usr/lib/libQt5Core.so.5.12.6 
cd /usr/src/RPM/BUILD/krunner-5.66.0/BUILD/src && /usr/bin/cmake -E cmake_symlink_library ../bin/libKF5Runner.so.5.66.0 ../bin/libKF5Runner.so.5 ../bin/libKF5Runner.so
make[2]: Leaving directory '/usr/src/RPM/BUILD/krunner-5.66.0/BUILD'
make[1]: Entering directory '/usr/src/RPM/BUILD/krunner-5.66.0/BUILD'
[ 66%] Built target KF5Runner
make[1]: Leaving directory '/usr/src/RPM/BUILD/krunner-5.66.0/BUILD'
make -f src/declarative/CMakeFiles/runnermodelplugin_autogen.dir/build.make src/declarative/CMakeFiles/runnermodelplugin_autogen.dir/depend
make[2]: Entering directory '/usr/src/RPM/BUILD/krunner-5.66.0/BUILD'
cd /usr/src/RPM/BUILD/krunner-5.66.0/BUILD && /usr/bin/cmake -E cmake_depends "Unix Makefiles" /usr/src/RPM/BUILD/krunner-5.66.0 /usr/src/RPM/BUILD/krunner-5.66.0/src/declarative /usr/src/RPM/BUILD/krunner-5.66.0/BUILD /usr/src/RPM/BUILD/krunner-5.66.0/BUILD/src/declarative /usr/src/RPM/BUILD/krunner-5.66.0/BUILD/src/declarative/CMakeFiles/runnermodelplugin_autogen.dir/DependInfo.cmake --color=
Scanning dependencies of target runnermodelplugin_autogen
make[2]: Leaving directory '/usr/src/RPM/BUILD/krunner-5.66.0/BUILD'
make -f src/declarative/CMakeFiles/runnermodelplugin_autogen.dir/build.make src/declarative/CMakeFiles/runnermodelplugin_autogen.dir/build
make[2]: Entering directory '/usr/src/RPM/BUILD/krunner-5.66.0/BUILD'
[ 72%] Automatic MOC for target runnermodelplugin
cd /usr/src/RPM/BUILD/krunner-5.66.0/BUILD/src/declarative && /usr/bin/cmake -E cmake_autogen /usr/src/RPM/BUILD/krunner-5.66.0/BUILD/src/declarative/CMakeFiles/runnermodelplugin_autogen.dir/AutogenInfo.cmake Release
make[2]: Leaving directory '/usr/src/RPM/BUILD/krunner-5.66.0/BUILD'
make[1]: Entering directory '/usr/src/RPM/BUILD/krunner-5.66.0/BUILD'
[ 72%] Built target runnermodelplugin_autogen
make[1]: Leaving directory '/usr/src/RPM/BUILD/krunner-5.66.0/BUILD'
make -f src/declarative/CMakeFiles/runnermodelplugin.dir/build.make src/declarative/CMakeFiles/runnermodelplugin.dir/depend
make[2]: Entering directory '/usr/src/RPM/BUILD/krunner-5.66.0/BUILD'
cd /usr/src/RPM/BUILD/krunner-5.66.0/BUILD && /usr/bin/cmake -E cmake_depends "Unix Makefiles" /usr/src/RPM/BUILD/krunner-5.66.0 /usr/src/RPM/BUILD/krunner-5.66.0/src/declarative /usr/src/RPM/BUILD/krunner-5.66.0/BUILD /usr/src/RPM/BUILD/krunner-5.66.0/BUILD/src/declarative /usr/src/RPM/BUILD/krunner-5.66.0/BUILD/src/declarative/CMakeFiles/runnermodelplugin.dir/DependInfo.cmake --color=
Scanning dependencies of target runnermodelplugin
make[2]: Leaving directory '/usr/src/RPM/BUILD/krunner-5.66.0/BUILD'
make -f src/declarative/CMakeFiles/runnermodelplugin.dir/build.make src/declarative/CMakeFiles/runnermodelplugin.dir/build
make[2]: Entering directory '/usr/src/RPM/BUILD/krunner-5.66.0/BUILD'
[ 77%] Building CXX object src/declarative/CMakeFiles/runnermodelplugin.dir/runnermodelplugin_autogen/mocs_compilation.cpp.o
cd /usr/src/RPM/BUILD/krunner-5.66.0/BUILD/src/declarative && /usr/bin/c++  -DKCOREADDONS_LIB -DKF_DEPRECATED_WARNINGS_SINCE=0x060000 -DKF_DISABLE_DEPRECATED_BEFORE_AND_AT=0x054100 -DKRUNNER_DEPRECATED_WARNINGS_SINCE=0x0 -DKRUNNER_DISABLE_DEPRECATED_BEFORE_AND_AT=0x0 -DPLASMA_DISABLE_DEPRECATED_BEFORE_AND_AT=0x050500 -DQT_CORE_LIB -DQT_DEPRECATED_WARNINGS_SINCE=0x060000 -DQT_DISABLE_DEPRECATED_BEFORE=0x050d00 -DQT_GUI_LIB -DQT_NETWORK_LIB -DQT_NO_CAST_FROM_ASCII -DQT_NO_CAST_FROM_BYTEARRAY -DQT_NO_CAST_TO_ASCII -DQT_NO_DEBUG -DQT_NO_FOREACH -DQT_NO_NARROWING_CONVERSIONS_IN_CONNECT -DQT_NO_SIGNALS_SLOTS_KEYWORDS -DQT_NO_URL_CAST_FROM_STRING -DQT_QML_LIB -DQT_QUICK_LIB -DQT_STRICT_ITERATORS -DQT_USE_QSTRINGBUILDER -DQT_WIDGETS_LIB -D_FILE_OFFSET_BITS=64 -D_GNU_SOURCE -D_LARGEFILE64_SOURCE -Drunnermodelplugin_EXPORTS -I/usr/src/RPM/BUILD/krunner-5.66.0/BUILD/src/declarative -I/usr/src/RPM/BUILD/krunner-5.66.0/src/declarative -I/usr/src/RPM/BUILD/krunner-5.66.0/BUILD/src/declarative/runnermodelplugin_autogen/include -I/usr/src/RPM/BUILD/krunner-5.66.0/BUILD -I/usr/src/RPM/BUILD/krunner-5.66.0/BUILD/src -I/usr/src/RPM/BUILD/krunner-5.66.0/src -isystem /usr/include/qt5 -isystem /usr/include/qt5/QtQuick -isystem /usr/include/qt5/QtQml -isystem /usr/include/qt5/QtNetwork -isystem /usr/include/qt5/QtCore -isystem /usr/share/qt5/../../lib/qt5/mkspecs/linux-g++ -isystem /usr/include/qt5/QtGui -isystem /usr/include/qt5/QtWidgets -isystem /usr/include/KF5/KI18n -isystem /usr/include/KF5 -isystem /usr/include/KF5/KService -isystem /usr/include/KF5/KConfigCore -isystem /usr/include/KF5/KCoreAddons -isystem /usr/include/KF5/Plasma -isystem /usr/include/KF5/KPackage  -pipe -frecord-gcc-switches -Wall -g -O2 -march=i586 -mtune=generic -fno-operator-names -fno-exceptions -Wall -Wextra -Wcast-align -Wchar-subscripts -Wformat-security -Wno-long-long -Wpointer-arith -Wundef -Wnon-virtual-dtor -Woverloaded-virtual -Werror=return-type -Wvla -Wdate-time -Wsuggest-override -Wlogical-op -pedantic -Wzero-as-null-pointer-constant -O2 -DNDEBUG -fPIC -fvisibility=hidden -fvisibility-inlines-hidden   -fPIC -std=gnu++11 -o CMakeFiles/runnermodelplugin.dir/runnermodelplugin_autogen/mocs_compilation.cpp.o -c /usr/src/RPM/BUILD/krunner-5.66.0/BUILD/src/declarative/runnermodelplugin_autogen/mocs_compilation.cpp
make[2]: Leaving directory '/usr/src/RPM/BUILD/krunner-5.66.0/BUILD'
make[2]: Entering directory '/usr/src/RPM/BUILD/krunner-5.66.0/BUILD'
[ 88%] Building CXX object src/declarative/CMakeFiles/runnermodelplugin.dir/runnermodelplugin.cpp.o
cd /usr/src/RPM/BUILD/krunner-5.66.0/BUILD/src/declarative && /usr/bin/c++  -DKCOREADDONS_LIB -DKF_DEPRECATED_WARNINGS_SINCE=0x060000 -DKF_DISABLE_DEPRECATED_BEFORE_AND_AT=0x054100 -DKRUNNER_DEPRECATED_WARNINGS_SINCE=0x0 -DKRUNNER_DISABLE_DEPRECATED_BEFORE_AND_AT=0x0 -DPLASMA_DISABLE_DEPRECATED_BEFORE_AND_AT=0x050500 -DQT_CORE_LIB -DQT_DEPRECATED_WARNINGS_SINCE=0x060000 -DQT_DISABLE_DEPRECATED_BEFORE=0x050d00 -DQT_GUI_LIB -DQT_NETWORK_LIB -DQT_NO_CAST_FROM_ASCII -DQT_NO_CAST_FROM_BYTEARRAY -DQT_NO_CAST_TO_ASCII -DQT_NO_DEBUG -DQT_NO_FOREACH -DQT_NO_NARROWING_CONVERSIONS_IN_CONNECT -DQT_NO_SIGNALS_SLOTS_KEYWORDS -DQT_NO_URL_CAST_FROM_STRING -DQT_QML_LIB -DQT_QUICK_LIB -DQT_STRICT_ITERATORS -DQT_USE_QSTRINGBUILDER -DQT_WIDGETS_LIB -D_FILE_OFFSET_BITS=64 -D_GNU_SOURCE -D_LARGEFILE64_SOURCE -Drunnermodelplugin_EXPORTS -I/usr/src/RPM/BUILD/krunner-5.66.0/BUILD/src/declarative -I/usr/src/RPM/BUILD/krunner-5.66.0/src/declarative -I/usr/src/RPM/BUILD/krunner-5.66.0/BUILD/src/declarative/runnermodelplugin_autogen/include -I/usr/src/RPM/BUILD/krunner-5.66.0/BUILD -I/usr/src/RPM/BUILD/krunner-5.66.0/BUILD/src -I/usr/src/RPM/BUILD/krunner-5.66.0/src -isystem /usr/include/qt5 -isystem /usr/include/qt5/QtQuick -isystem /usr/include/qt5/QtQml -isystem /usr/include/qt5/QtNetwork -isystem /usr/include/qt5/QtCore -isystem /usr/share/qt5/../../lib/qt5/mkspecs/linux-g++ -isystem /usr/include/qt5/QtGui -isystem /usr/include/qt5/QtWidgets -isystem /usr/include/KF5/KI18n -isystem /usr/include/KF5 -isystem /usr/include/KF5/KService -isystem /usr/include/KF5/KConfigCore -isystem /usr/include/KF5/KCoreAddons -isystem /usr/include/KF5/Plasma -isystem /usr/include/KF5/KPackage  -pipe -frecord-gcc-switches -Wall -g -O2 -march=i586 -mtune=generic -fno-operator-names -fno-exceptions -Wall -Wextra -Wcast-align -Wchar-subscripts -Wformat-security -Wno-long-long -Wpointer-arith -Wundef -Wnon-virtual-dtor -Woverloaded-virtual -Werror=return-type -Wvla -Wdate-time -Wsuggest-override -Wlogical-op -pedantic -Wzero-as-null-pointer-constant -O2 -DNDEBUG -fPIC -fvisibility=hidden -fvisibility-inlines-hidden   -fPIC -std=gnu++11 -o CMakeFiles/runnermodelplugin.dir/runnermodelplugin.cpp.o -c /usr/src/RPM/BUILD/krunner-5.66.0/src/declarative/runnermodelplugin.cpp
make[2]: Leaving directory '/usr/src/RPM/BUILD/krunner-5.66.0/BUILD'
make[2]: Entering directory '/usr/src/RPM/BUILD/krunner-5.66.0/BUILD'
[ 94%] Building CXX object src/declarative/CMakeFiles/runnermodelplugin.dir/krunner_debug.cpp.o
cd /usr/src/RPM/BUILD/krunner-5.66.0/BUILD/src/declarative && /usr/bin/c++  -DKCOREADDONS_LIB -DKF_DEPRECATED_WARNINGS_SINCE=0x060000 -DKF_DISABLE_DEPRECATED_BEFORE_AND_AT=0x054100 -DKRUNNER_DEPRECATED_WARNINGS_SINCE=0x0 -DKRUNNER_DISABLE_DEPRECATED_BEFORE_AND_AT=0x0 -DPLASMA_DISABLE_DEPRECATED_BEFORE_AND_AT=0x050500 -DQT_CORE_LIB -DQT_DEPRECATED_WARNINGS_SINCE=0x060000 -DQT_DISABLE_DEPRECATED_BEFORE=0x050d00 -DQT_GUI_LIB -DQT_NETWORK_LIB -DQT_NO_CAST_FROM_ASCII -DQT_NO_CAST_FROM_BYTEARRAY -DQT_NO_CAST_TO_ASCII -DQT_NO_DEBUG -DQT_NO_FOREACH -DQT_NO_NARROWING_CONVERSIONS_IN_CONNECT -DQT_NO_SIGNALS_SLOTS_KEYWORDS -DQT_NO_URL_CAST_FROM_STRING -DQT_QML_LIB -DQT_QUICK_LIB -DQT_STRICT_ITERATORS -DQT_USE_QSTRINGBUILDER -DQT_WIDGETS_LIB -D_FILE_OFFSET_BITS=64 -D_GNU_SOURCE -D_LARGEFILE64_SOURCE -Drunnermodelplugin_EXPORTS -I/usr/src/RPM/BUILD/krunner-5.66.0/BUILD/src/declarative -I/usr/src/RPM/BUILD/krunner-5.66.0/src/declarative -I/usr/src/RPM/BUILD/krunner-5.66.0/BUILD/src/declarative/runnermodelplugin_autogen/include -I/usr/src/RPM/BUILD/krunner-5.66.0/BUILD -I/usr/src/RPM/BUILD/krunner-5.66.0/BUILD/src -I/usr/src/RPM/BUILD/krunner-5.66.0/src -isystem /usr/include/qt5 -isystem /usr/include/qt5/QtQuick -isystem /usr/include/qt5/QtQml -isystem /usr/include/qt5/QtNetwork -isystem /usr/include/qt5/QtCore -isystem /usr/share/qt5/../../lib/qt5/mkspecs/linux-g++ -isystem /usr/include/qt5/QtGui -isystem /usr/include/qt5/QtWidgets -isystem /usr/include/KF5/KI18n -isystem /usr/include/KF5 -isystem /usr/include/KF5/KService -isystem /usr/include/KF5/KConfigCore -isystem /usr/include/KF5/KCoreAddons -isystem /usr/include/KF5/Plasma -isystem /usr/include/KF5/KPackage  -pipe -frecord-gcc-switches -Wall -g -O2 -march=i586 -mtune=generic -fno-operator-names -fno-exceptions -Wall -Wextra -Wcast-align -Wchar-subscripts -Wformat-security -Wno-long-long -Wpointer-arith -Wundef -Wnon-virtual-dtor -Woverloaded-virtual -Werror=return-type -Wvla -Wdate-time -Wsuggest-override -Wlogical-op -pedantic -Wzero-as-null-pointer-constant -O2 -DNDEBUG -fPIC -fvisibility=hidden -fvisibility-inlines-hidden   -fPIC -std=gnu++11 -o CMakeFiles/runnermodelplugin.dir/krunner_debug.cpp.o -c /usr/src/RPM/BUILD/krunner-5.66.0/BUILD/src/declarative/krunner_debug.cpp
make[2]: Leaving directory '/usr/src/RPM/BUILD/krunner-5.66.0/BUILD'
make[2]: Entering directory '/usr/src/RPM/BUILD/krunner-5.66.0/BUILD'
[ 83%] Building CXX object src/declarative/CMakeFiles/runnermodelplugin.dir/runnermodel.cpp.o
cd /usr/src/RPM/BUILD/krunner-5.66.0/BUILD/src/declarative && /usr/bin/c++  -DKCOREADDONS_LIB -DKF_DEPRECATED_WARNINGS_SINCE=0x060000 -DKF_DISABLE_DEPRECATED_BEFORE_AND_AT=0x054100 -DKRUNNER_DEPRECATED_WARNINGS_SINCE=0x0 -DKRUNNER_DISABLE_DEPRECATED_BEFORE_AND_AT=0x0 -DPLASMA_DISABLE_DEPRECATED_BEFORE_AND_AT=0x050500 -DQT_CORE_LIB -DQT_DEPRECATED_WARNINGS_SINCE=0x060000 -DQT_DISABLE_DEPRECATED_BEFORE=0x050d00 -DQT_GUI_LIB -DQT_NETWORK_LIB -DQT_NO_CAST_FROM_ASCII -DQT_NO_CAST_FROM_BYTEARRAY -DQT_NO_CAST_TO_ASCII -DQT_NO_DEBUG -DQT_NO_FOREACH -DQT_NO_NARROWING_CONVERSIONS_IN_CONNECT -DQT_NO_SIGNALS_SLOTS_KEYWORDS -DQT_NO_URL_CAST_FROM_STRING -DQT_QML_LIB -DQT_QUICK_LIB -DQT_STRICT_ITERATORS -DQT_USE_QSTRINGBUILDER -DQT_WIDGETS_LIB -D_FILE_OFFSET_BITS=64 -D_GNU_SOURCE -D_LARGEFILE64_SOURCE -Drunnermodelplugin_EXPORTS -I/usr/src/RPM/BUILD/krunner-5.66.0/BUILD/src/declarative -I/usr/src/RPM/BUILD/krunner-5.66.0/src/declarative -I/usr/src/RPM/BUILD/krunner-5.66.0/BUILD/src/declarative/runnermodelplugin_autogen/include -I/usr/src/RPM/BUILD/krunner-5.66.0/BUILD -I/usr/src/RPM/BUILD/krunner-5.66.0/BUILD/src -I/usr/src/RPM/BUILD/krunner-5.66.0/src -isystem /usr/include/qt5 -isystem /usr/include/qt5/QtQuick -isystem /usr/include/qt5/QtQml -isystem /usr/include/qt5/QtNetwork -isystem /usr/include/qt5/QtCore -isystem /usr/share/qt5/../../lib/qt5/mkspecs/linux-g++ -isystem /usr/include/qt5/QtGui -isystem /usr/include/qt5/QtWidgets -isystem /usr/include/KF5/KI18n -isystem /usr/include/KF5 -isystem /usr/include/KF5/KService -isystem /usr/include/KF5/KConfigCore -isystem /usr/include/KF5/KCoreAddons -isystem /usr/include/KF5/Plasma -isystem /usr/include/KF5/KPackage  -pipe -frecord-gcc-switches -Wall -g -O2 -march=i586 -mtune=generic -fno-operator-names -fno-exceptions -Wall -Wextra -Wcast-align -Wchar-subscripts -Wformat-security -Wno-long-long -Wpointer-arith -Wundef -Wnon-virtual-dtor -Woverloaded-virtual -Werror=return-type -Wvla -Wdate-time -Wsuggest-override -Wlogical-op -pedantic -Wzero-as-null-pointer-constant -O2 -DNDEBUG -fPIC -fvisibility=hidden -fvisibility-inlines-hidden   -fPIC -std=gnu++11 -o CMakeFiles/runnermodelplugin.dir/runnermodel.cpp.o -c /usr/src/RPM/BUILD/krunner-5.66.0/src/declarative/runnermodel.cpp
make[2]: Leaving directory '/usr/src/RPM/BUILD/krunner-5.66.0/BUILD'
make[2]: Entering directory '/usr/src/RPM/BUILD/krunner-5.66.0/BUILD'
[100%] Linking CXX shared library ../../bin/librunnermodelplugin.so
cd /usr/src/RPM/BUILD/krunner-5.66.0/BUILD/src/declarative && /usr/bin/cmake -E cmake_link_script CMakeFiles/runnermodelplugin.dir/link.txt --verbose=1
/usr/bin/c++ -fPIC -pipe -frecord-gcc-switches -Wall -g -O2 -march=i586 -mtune=generic -fno-operator-names -fno-exceptions -Wall -Wextra -Wcast-align -Wchar-subscripts -Wformat-security -Wno-long-long -Wpointer-arith -Wundef -Wnon-virtual-dtor -Woverloaded-virtual -Werror=return-type -Wvla -Wdate-time -Wsuggest-override -Wlogical-op -pedantic -Wzero-as-null-pointer-constant -O2 -DNDEBUG -Wl,--no-undefined -Wl,--fatal-warnings -Wl,--enable-new-dtags -L/usr/lib -L/usr/lib/kf5/devel -shared -Wl,-soname,librunnermodelplugin.so -o ../../bin/librunnermodelplugin.so CMakeFiles/runnermodelplugin.dir/runnermodelplugin_autogen/mocs_compilation.cpp.o CMakeFiles/runnermodelplugin.dir/runnermodel.cpp.o CMakeFiles/runnermodelplugin.dir/runnermodelplugin.cpp.o CMakeFiles/runnermodelplugin.dir/krunner_debug.cpp.o /usr/lib/libQt5Quick.so.5.12.6 /usr/lib/libQt5Qml.so.5.12.6 ../../bin/libKF5Runner.so.5.66.0 /usr/lib/libKF5Plasma.so.5.66.0 /usr/lib/libKF5Package.so.5.66.0 /usr/lib/libQt5Widgets.so.5.12.6 /usr/lib/libQt5Gui.so.5.12.6 /usr/lib/libKF5Service.so.5.66.0 /usr/lib/libKF5I18n.so.5.66.0 /usr/lib/libKF5ConfigCore.so.5.66.0 /usr/lib/libQt5Network.so.5.12.6 /usr/lib/libKF5CoreAddons.so.5.66.0 /usr/lib/libQt5Core.so.5.12.6 
make[2]: Leaving directory '/usr/src/RPM/BUILD/krunner-5.66.0/BUILD'
make[1]: Entering directory '/usr/src/RPM/BUILD/krunner-5.66.0/BUILD'
[100%] Built target runnermodelplugin
make[1]: Leaving directory '/usr/src/RPM/BUILD/krunner-5.66.0/BUILD'
make: Entering directory '/usr/src/RPM/BUILD/krunner-5.66.0/BUILD'
/usr/bin/cmake -E cmake_progress_start /usr/src/RPM/BUILD/krunner-5.66.0/BUILD/CMakeFiles 0
make: Leaving directory '/usr/src/RPM/BUILD/krunner-5.66.0/BUILD'
+ popd
~/RPM/BUILD/krunner-5.66.0
+ exit 0
Executing(%install): /bin/sh -e /usr/src/tmp/rpm-tmp.6623
+ umask 022
+ /bin/mkdir -p /usr/src/RPM/BUILD
+ cd /usr/src/RPM/BUILD
+ /bin/chmod -Rf u+rwX -- /usr/src/tmp/kf5-krunner-buildroot
+ :
+ /bin/rm -rf -- /usr/src/tmp/kf5-krunner-buildroot
+ cd krunner-5.66.0
+ __kf5_install
+ make -C BUILD DESTDIR=/usr/src/tmp/kf5-krunner-buildroot install
make: Entering directory '/usr/src/RPM/BUILD/krunner-5.66.0/BUILD'
/usr/bin/cmake -S/usr/src/RPM/BUILD/krunner-5.66.0 -B/usr/src/RPM/BUILD/krunner-5.66.0/BUILD --check-build-system CMakeFiles/Makefile.cmake 0
/usr/bin/cmake -E cmake_progress_start /usr/src/RPM/BUILD/krunner-5.66.0/BUILD/CMakeFiles /usr/src/RPM/BUILD/krunner-5.66.0/BUILD/CMakeFiles/progress.marks
make -f CMakeFiles/Makefile2 all
make[1]: Entering directory '/usr/src/RPM/BUILD/krunner-5.66.0/BUILD'
make -f src/CMakeFiles/copy_servicetypes.dir/build.make src/CMakeFiles/copy_servicetypes.dir/depend
make[2]: Entering directory '/usr/src/RPM/BUILD/krunner-5.66.0/BUILD'
cd /usr/src/RPM/BUILD/krunner-5.66.0/BUILD && /usr/bin/cmake -E cmake_depends "Unix Makefiles" /usr/src/RPM/BUILD/krunner-5.66.0 /usr/src/RPM/BUILD/krunner-5.66.0/src /usr/src/RPM/BUILD/krunner-5.66.0/BUILD /usr/src/RPM/BUILD/krunner-5.66.0/BUILD/src /usr/src/RPM/BUILD/krunner-5.66.0/BUILD/src/CMakeFiles/copy_servicetypes.dir/DependInfo.cmake --color=
make[2]: Leaving directory '/usr/src/RPM/BUILD/krunner-5.66.0/BUILD'
make -f src/CMakeFiles/copy_servicetypes.dir/build.make src/CMakeFiles/copy_servicetypes.dir/build
make[2]: Entering directory '/usr/src/RPM/BUILD/krunner-5.66.0/BUILD'
cd /usr/src/RPM/BUILD/krunner-5.66.0/BUILD/src && /usr/bin/cmake -E copy /usr/src/RPM/BUILD/krunner-5.66.0/src/data/servicetypes/plasma-runner.desktop /usr/src/RPM/BUILD/krunner-5.66.0/BUILD/bin/data/kservicetypes5
make[2]: Leaving directory '/usr/src/RPM/BUILD/krunner-5.66.0/BUILD'
[  0%] Built target copy_servicetypes
make -f src/CMakeFiles/KF5Runner_autogen.dir/build.make src/CMakeFiles/KF5Runner_autogen.dir/depend
make[2]: Entering directory '/usr/src/RPM/BUILD/krunner-5.66.0/BUILD'
cd /usr/src/RPM/BUILD/krunner-5.66.0/BUILD && /usr/bin/cmake -E cmake_depends "Unix Makefiles" /usr/src/RPM/BUILD/krunner-5.66.0 /usr/src/RPM/BUILD/krunner-5.66.0/src /usr/src/RPM/BUILD/krunner-5.66.0/BUILD /usr/src/RPM/BUILD/krunner-5.66.0/BUILD/src /usr/src/RPM/BUILD/krunner-5.66.0/BUILD/src/CMakeFiles/KF5Runner_autogen.dir/DependInfo.cmake --color=
make[2]: Leaving directory '/usr/src/RPM/BUILD/krunner-5.66.0/BUILD'
make -f src/CMakeFiles/KF5Runner_autogen.dir/build.make src/CMakeFiles/KF5Runner_autogen.dir/build
make[2]: Entering directory '/usr/src/RPM/BUILD/krunner-5.66.0/BUILD'
[  5%] Automatic MOC for target KF5Runner
cd /usr/src/RPM/BUILD/krunner-5.66.0/BUILD/src && /usr/bin/cmake -E cmake_autogen /usr/src/RPM/BUILD/krunner-5.66.0/BUILD/src/CMakeFiles/KF5Runner_autogen.dir/AutogenInfo.cmake Release
make[2]: Leaving directory '/usr/src/RPM/BUILD/krunner-5.66.0/BUILD'
[  5%] Built target KF5Runner_autogen
make -f src/CMakeFiles/KF5Runner.dir/build.make src/CMakeFiles/KF5Runner.dir/depend
make[2]: Entering directory '/usr/src/RPM/BUILD/krunner-5.66.0/BUILD'
cd /usr/src/RPM/BUILD/krunner-5.66.0/BUILD && /usr/bin/cmake -E cmake_depends "Unix Makefiles" /usr/src/RPM/BUILD/krunner-5.66.0 /usr/src/RPM/BUILD/krunner-5.66.0/src /usr/src/RPM/BUILD/krunner-5.66.0/BUILD /usr/src/RPM/BUILD/krunner-5.66.0/BUILD/src /usr/src/RPM/BUILD/krunner-5.66.0/BUILD/src/CMakeFiles/KF5Runner.dir/DependInfo.cmake --color=
make[2]: Leaving directory '/usr/src/RPM/BUILD/krunner-5.66.0/BUILD'
make -f src/CMakeFiles/KF5Runner.dir/build.make src/CMakeFiles/KF5Runner.dir/build
make[2]: Entering directory '/usr/src/RPM/BUILD/krunner-5.66.0/BUILD'
make[2]: Nothing to be done for 'src/CMakeFiles/KF5Runner.dir/build'.
make[2]: Leaving directory '/usr/src/RPM/BUILD/krunner-5.66.0/BUILD'
[ 61%] Built target KF5Runner
make -f src/declarative/CMakeFiles/runnermodelplugin_autogen.dir/build.make src/declarative/CMakeFiles/runnermodelplugin_autogen.dir/depend
make[2]: Entering directory '/usr/src/RPM/BUILD/krunner-5.66.0/BUILD'
cd /usr/src/RPM/BUILD/krunner-5.66.0/BUILD && /usr/bin/cmake -E cmake_depends "Unix Makefiles" /usr/src/RPM/BUILD/krunner-5.66.0 /usr/src/RPM/BUILD/krunner-5.66.0/src/declarative /usr/src/RPM/BUILD/krunner-5.66.0/BUILD /usr/src/RPM/BUILD/krunner-5.66.0/BUILD/src/declarative /usr/src/RPM/BUILD/krunner-5.66.0/BUILD/src/declarative/CMakeFiles/runnermodelplugin_autogen.dir/DependInfo.cmake --color=
make[2]: Leaving directory '/usr/src/RPM/BUILD/krunner-5.66.0/BUILD'
make -f src/declarative/CMakeFiles/runnermodelplugin_autogen.dir/build.make src/declarative/CMakeFiles/runnermodelplugin_autogen.dir/build
make[2]: Entering directory '/usr/src/RPM/BUILD/krunner-5.66.0/BUILD'
[ 66%] Automatic MOC for target runnermodelplugin
cd /usr/src/RPM/BUILD/krunner-5.66.0/BUILD/src/declarative && /usr/bin/cmake -E cmake_autogen /usr/src/RPM/BUILD/krunner-5.66.0/BUILD/src/declarative/CMakeFiles/runnermodelplugin_autogen.dir/AutogenInfo.cmake Release
make[2]: Leaving directory '/usr/src/RPM/BUILD/krunner-5.66.0/BUILD'
[ 66%] Built target runnermodelplugin_autogen
make -f src/declarative/CMakeFiles/runnermodelplugin.dir/build.make src/declarative/CMakeFiles/runnermodelplugin.dir/depend
make[2]: Entering directory '/usr/src/RPM/BUILD/krunner-5.66.0/BUILD'
cd /usr/src/RPM/BUILD/krunner-5.66.0/BUILD && /usr/bin/cmake -E cmake_depends "Unix Makefiles" /usr/src/RPM/BUILD/krunner-5.66.0 /usr/src/RPM/BUILD/krunner-5.66.0/src/declarative /usr/src/RPM/BUILD/krunner-5.66.0/BUILD /usr/src/RPM/BUILD/krunner-5.66.0/BUILD/src/declarative /usr/src/RPM/BUILD/krunner-5.66.0/BUILD/src/declarative/CMakeFiles/runnermodelplugin.dir/DependInfo.cmake --color=
make[2]: Leaving directory '/usr/src/RPM/BUILD/krunner-5.66.0/BUILD'
make -f src/declarative/CMakeFiles/runnermodelplugin.dir/build.make src/declarative/CMakeFiles/runnermodelplugin.dir/build
make[2]: Entering directory '/usr/src/RPM/BUILD/krunner-5.66.0/BUILD'
make[2]: Nothing to be done for 'src/declarative/CMakeFiles/runnermodelplugin.dir/build'.
make[2]: Leaving directory '/usr/src/RPM/BUILD/krunner-5.66.0/BUILD'
[ 94%] Built target runnermodelplugin
make -f templates/CMakeFiles/runner.dir/build.make templates/CMakeFiles/runner.dir/depend
make[2]: Entering directory '/usr/src/RPM/BUILD/krunner-5.66.0/BUILD'
cd /usr/src/RPM/BUILD/krunner-5.66.0/BUILD && /usr/bin/cmake -E cmake_depends "Unix Makefiles" /usr/src/RPM/BUILD/krunner-5.66.0 /usr/src/RPM/BUILD/krunner-5.66.0/templates /usr/src/RPM/BUILD/krunner-5.66.0/BUILD /usr/src/RPM/BUILD/krunner-5.66.0/BUILD/templates /usr/src/RPM/BUILD/krunner-5.66.0/BUILD/templates/CMakeFiles/runner.dir/DependInfo.cmake --color=
make[2]: Leaving directory '/usr/src/RPM/BUILD/krunner-5.66.0/BUILD'
make -f templates/CMakeFiles/runner.dir/build.make templates/CMakeFiles/runner.dir/build
make[2]: Entering directory '/usr/src/RPM/BUILD/krunner-5.66.0/BUILD'
make[2]: Nothing to be done for 'templates/CMakeFiles/runner.dir/build'.
make[2]: Leaving directory '/usr/src/RPM/BUILD/krunner-5.66.0/BUILD'
[100%] Built target runner
make[1]: Leaving directory '/usr/src/RPM/BUILD/krunner-5.66.0/BUILD'
/usr/bin/cmake -E cmake_progress_start /usr/src/RPM/BUILD/krunner-5.66.0/BUILD/CMakeFiles 0
make -f CMakeFiles/Makefile2 preinstall
make[1]: Entering directory '/usr/src/RPM/BUILD/krunner-5.66.0/BUILD'
make[1]: Nothing to be done for 'preinstall'.
make[1]: Leaving directory '/usr/src/RPM/BUILD/krunner-5.66.0/BUILD'
Install the project...
/usr/bin/cmake -P cmake_install.cmake
-- Install configuration: "Release"
-- Installing: /usr/src/tmp/kf5-krunner-buildroot/usr/lib/cmake/KF5Runner/KF5RunnerConfig.cmake
-- Installing: /usr/src/tmp/kf5-krunner-buildroot/usr/lib/cmake/KF5Runner/KF5RunnerConfigVersion.cmake
-- Installing: /usr/src/tmp/kf5-krunner-buildroot/usr/lib/cmake/KF5Runner/KF5RunnerTargets.cmake
-- Installing: /usr/src/tmp/kf5-krunner-buildroot/usr/lib/cmake/KF5Runner/KF5RunnerTargets-release.cmake
-- Installing: /usr/src/tmp/kf5-krunner-buildroot/usr/include/KF5/krunner_version.h
-- Installing: /usr/src/tmp/kf5-krunner-buildroot/usr/share/qlogging-categories5/krunner.categories
-- Installing: /usr/src/tmp/kf5-krunner-buildroot/usr/lib/libKF5Runner.so.5.66.0
-- Installing: /usr/src/tmp/kf5-krunner-buildroot/usr/lib/libKF5Runner.so.5
-- Installing: /usr/src/tmp/kf5-krunner-buildroot/usr/lib/libKF5Runner.so
-- Installing: /usr/src/tmp/kf5-krunner-buildroot/usr/include/KF5/KRunner/KRunner/AbstractRunner
-- Installing: /usr/src/tmp/kf5-krunner-buildroot/usr/include/KF5/KRunner/KRunner/RunnerContext
-- Installing: /usr/src/tmp/kf5-krunner-buildroot/usr/include/KF5/KRunner/KRunner/RunnerManager
-- Installing: /usr/src/tmp/kf5-krunner-buildroot/usr/include/KF5/KRunner/KRunner/RunnerSyntax
-- Installing: /usr/src/tmp/kf5-krunner-buildroot/usr/include/KF5/KRunner/KRunner/QueryMatch
-- Installing: /usr/src/tmp/kf5-krunner-buildroot/usr/include/KF5/KRunner/krunner/krunner_export.h
-- Installing: /usr/src/tmp/kf5-krunner-buildroot/usr/include/KF5/KRunner/krunner/abstractrunner.h
-- Installing: /usr/src/tmp/kf5-krunner-buildroot/usr/include/KF5/KRunner/krunner/runnercontext.h
-- Installing: /usr/src/tmp/kf5-krunner-buildroot/usr/include/KF5/KRunner/krunner/runnermanager.h
-- Installing: /usr/src/tmp/kf5-krunner-buildroot/usr/include/KF5/KRunner/krunner/runnersyntax.h
-- Installing: /usr/src/tmp/kf5-krunner-buildroot/usr/include/KF5/KRunner/krunner/querymatch.h
-- Installing: /usr/src/tmp/kf5-krunner-buildroot/usr/share/kservicetypes5/plasma-runner.desktop
-- Installing: /usr/src/tmp/kf5-krunner-buildroot/usr/lib/qt5/mkspecs/modules/qt_KRunner.pri
-- Installing: /usr/src/tmp/kf5-krunner-buildroot/usr/share/kf5/dbus-1/interfaces/kf5_org.kde.krunner1.xml
-- Installing: /usr/src/tmp/kf5-krunner-buildroot/usr/lib/qt5/qml/org/kde/runnermodel/librunnermodelplugin.so
-- Installing: /usr/src/tmp/kf5-krunner-buildroot/usr/lib/qt5/qml/org/kde/runnermodel/qmldir
-- Installing: /usr/src/tmp/kf5-krunner-buildroot/usr/share/kdevappwizard/templates/runner.tar.bz2
make: Leaving directory '/usr/src/RPM/BUILD/krunner-5.66.0/BUILD'
+ '[' -d /usr/src/tmp/kf5-krunner-buildroot//usr/share ']'
+ read d
+ ls -1d '/usr/src/tmp/kf5-krunner-buildroot//usr/share/kf5/k*5'
ls: cannot access '/usr/src/tmp/kf5-krunner-buildroot//usr/share/kf5/k*5': No such file or directory
+ '[' -d /usr/src/tmp/kf5-krunner-buildroot//usr/share/kf5/lib64 ']'
+ '[' -d /usr/src/tmp/kf5-krunner-buildroot//usr/share/kf5/lib ']'
+ ls -1 /usr/src/tmp/kf5-krunner-buildroot//usr/lib/libKF5Runner.so
+ read p
+ '[' -L /usr/src/tmp/kf5-krunner-buildroot//usr/lib/libKF5Runner.so ']'
+ mkdir -p /usr/src/tmp/kf5-krunner-buildroot//usr/lib/kf5/devel
++ readlink /usr/src/tmp/kf5-krunner-buildroot//usr/lib/libKF5Runner.so
+ f=libKF5Runner.so.5
++ basename /usr/src/tmp/kf5-krunner-buildroot//usr/lib/libKF5Runner.so
+ l=libKF5Runner.so
++ relative /usr/src/tmp/kf5-krunner-buildroot//usr/lib/libKF5Runner.so.5 /usr/src/tmp/kf5-krunner-buildroot//usr/lib/kf5/devel/libKF5Runner.so.5
+ ln -sf ../../libKF5Runner.so.5 /usr/src/tmp/kf5-krunner-buildroot//usr/lib/kf5/devel/libKF5Runner.so
+ rm -f /usr/src/tmp/kf5-krunner-buildroot//usr/lib/libKF5Runner.so
+ read p
+ '[' -d /usr/src/tmp/kf5-krunner-buildroot//usr/share/kf5/bin ']'
+ '[' -d /usr/src/tmp/kf5-krunner-buildroot//usr/share/kf5/include ']'
+ '[' -d /usr/src/tmp/kf5-krunner-buildroot//usr/lib/kf5/bin -a true == true ']'
+ ls -1 '/usr/src/tmp/kf5-krunner-buildroot//usr/share/kf5/dbus-1/services/*5*.service'
+ read s
+ '[' -d /usr/src/tmp/kf5-krunner-buildroot//usr/share/akonadi ']'
+ '[' -d /usr/src/tmp/kf5-krunner-buildroot//usr/share/kf5/akonadi ']'
+ '[' -d /usr/src/tmp/kf5-krunner-buildroot//usr/share/man -a remove == remove ']'
+ '[' -d /usr/src/tmp/kf5-krunner-buildroot//usr/share/appdata -a keep == remove ']'
+ '[' -d /usr/src/tmp/kf5-krunner-buildroot//usr/share/metainfo -a keep == remove ']'
+ '[' -d /usr/src/tmp/kf5-krunner-buildroot//usr/lib/cmake/ ']'
+ find /usr/src/tmp/kf5-krunner-buildroot//usr/lib/cmake/ -type f -name '*.cmake'
+ read f
+ sed -i -e 's|\(set(.*\)${PACKAGE_PREFIX_DIR}//usr/|\1${PACKAGE_PREFIX_DIR}/|' /usr/src/tmp/kf5-krunner-buildroot//usr/lib/cmake/KF5Runner/KF5RunnerTargets-release.cmake
+ sed -i -e 's|/usr//usr/|/usr/|' /usr/src/tmp/kf5-krunner-buildroot//usr/lib/cmake/KF5Runner/KF5RunnerTargets-release.cmake
+ read f
+ sed -i -e 's|\(set(.*\)${PACKAGE_PREFIX_DIR}//usr/|\1${PACKAGE_PREFIX_DIR}/|' /usr/src/tmp/kf5-krunner-buildroot//usr/lib/cmake/KF5Runner/KF5RunnerTargets.cmake
+ sed -i -e 's|/usr//usr/|/usr/|' /usr/src/tmp/kf5-krunner-buildroot//usr/lib/cmake/KF5Runner/KF5RunnerTargets.cmake
+ read f
+ sed -i -e 's|\(set(.*\)${PACKAGE_PREFIX_DIR}//usr/|\1${PACKAGE_PREFIX_DIR}/|' /usr/src/tmp/kf5-krunner-buildroot//usr/lib/cmake/KF5Runner/KF5RunnerConfigVersion.cmake
+ sed -i -e 's|/usr//usr/|/usr/|' /usr/src/tmp/kf5-krunner-buildroot//usr/lib/cmake/KF5Runner/KF5RunnerConfigVersion.cmake
+ read f
+ sed -i -e 's|\(set(.*\)${PACKAGE_PREFIX_DIR}//usr/|\1${PACKAGE_PREFIX_DIR}/|' /usr/src/tmp/kf5-krunner-buildroot//usr/lib/cmake/KF5Runner/KF5RunnerConfig.cmake
+ sed -i -e 's|/usr//usr/|/usr/|' /usr/src/tmp/kf5-krunner-buildroot//usr/lib/cmake/KF5Runner/KF5RunnerConfig.cmake
+ read f
+ __kf5_install_move data kdevappwizard
+ local src_dir=/usr/src/tmp/kf5-krunner-buildroot//usr
+ local dst_dir=/usr/src/tmp/kf5-krunner-buildroot//usr/share
+ local type=data
+ shift
+ local item=kdevappwizard
+ case "$type" in
+ src_dir=/usr/src/tmp/kf5-krunner-buildroot//usr/share
+ dst_dir=/usr/src/tmp/kf5-krunner-buildroot//usr/share/kf5
+ '[' -d /usr/src/tmp/kf5-krunner-buildroot//usr/share ']'
+ '[' kdevappwizard == all ']'
++ dirname /usr/src/tmp/kf5-krunner-buildroot//usr/share/kf5/kdevappwizard
+ mkdir -p /usr/src/tmp/kf5-krunner-buildroot//usr/share/kf5
+ '[' -n kdevappwizard ']'
++ dirname /usr/src/tmp/kf5-krunner-buildroot//usr/share/kf5/kdevappwizard
+ mv /usr/src/tmp/kf5-krunner-buildroot//usr/share/kdevappwizard /usr/src/tmp/kf5-krunner-buildroot//usr/share/kf5
+ shift
+ item=
+ '[' -n '' ']'
+ /usr/lib/rpm/find-lang kf5-krunner --all-name
+ rpm-build-kf5-find-qtlang kf5-krunner --all-name
+ /usr/lib/rpm/brp-alt
Cleaning files in /usr/src/tmp/kf5-krunner-buildroot (auto)
mode of './usr/lib/qt5/qml/org/kde/runnermodel/librunnermodelplugin.so' changed from 0755 (rwxr-xr-x) to 0644 (rw-r--r--)
mode of './usr/lib/libKF5Runner.so.5.66.0' changed from 0755 (rwxr-xr-x) to 0644 (rw-r--r--)
Verifying and fixing files in /usr/src/tmp/kf5-krunner-buildroot (binconfig,pkgconfig,libtool,desktop)
Checking contents of files in /usr/src/tmp/kf5-krunner-buildroot/ (default)
Compressing files in /usr/src/tmp/kf5-krunner-buildroot (auto)
Adjusting library links in /usr/src/tmp/kf5-krunner-buildroot
./usr/lib:
	libKF5Runner.so.5 -> libKF5Runner.so.5.66.0
Verifying ELF objects in /usr/src/tmp/kf5-krunner-buildroot (arch=normal,fhs=normal,lfs=relaxed,lint=relaxed,rpath=normal,stack=normal,textrel=normal,unresolved=normal)
Hardlinking identical .pyc and .pyo files
Processing files: kf5-krunner-common-5.66.0-alt1
Executing(%doc): /bin/sh -e /usr/src/tmp/rpm-tmp.18638
+ umask 022
+ /bin/mkdir -p /usr/src/RPM/BUILD
+ cd /usr/src/RPM/BUILD
+ cd krunner-5.66.0
+ DOCDIR=/usr/src/tmp/kf5-krunner-buildroot/usr/share/doc/kf5-krunner-common-5.66.0
+ export DOCDIR
+ rm -rf /usr/src/tmp/kf5-krunner-buildroot/usr/share/doc/kf5-krunner-common-5.66.0
+ /bin/mkdir -p /usr/src/tmp/kf5-krunner-buildroot/usr/share/doc/kf5-krunner-common-5.66.0
+ cp -prL README.md /usr/src/tmp/kf5-krunner-buildroot/usr/share/doc/kf5-krunner-common-5.66.0
+ chmod -R go-w /usr/src/tmp/kf5-krunner-buildroot/usr/share/doc/kf5-krunner-common-5.66.0
+ chmod -R a+rX /usr/src/tmp/kf5-krunner-buildroot/usr/share/doc/kf5-krunner-common-5.66.0
+ exit 0
Finding Provides (using /usr/lib/rpm/find-provides)
Executing: /bin/sh -e /usr/src/tmp/rpm-tmp.iuaFTR
find-provides: running scripts (alternatives,debuginfo,lib,pam,perl,pkgconfig,python,qml,shell)
Finding Requires (using /usr/lib/rpm/find-requires)
Executing: /bin/sh -e /usr/src/tmp/rpm-tmp.zh1qdT
find-requires: running scripts (cpp,debuginfo,files,lib,pam,perl,pkgconfig,pkgconfiglib,python,qml,rpmlib,shebang,shell,static,symlinks,systemd-services)
Requires: kf5-filesystem
Processing files: kf5-krunner-devel-5.66.0-alt1
Finding Provides (using /usr/lib/rpm/find-provides)
Executing: /bin/sh -e /usr/src/tmp/rpm-tmp.ORxBgR
find-provides: running scripts (alternatives,debuginfo,lib,pam,perl,pkgconfig,python,qml,shell)
Finding Requires (using /usr/lib/rpm/find-requires)
Executing: /bin/sh -e /usr/src/tmp/rpm-tmp.Ls2AWU
find-requires: running scripts (cpp,debuginfo,files,lib,pam,perl,pkgconfig,pkgconfiglib,python,qml,rpmlib,shebang,shell,static,symlinks,systemd-services)
/usr/src/tmp/kf5-krunner-buildroot/usr/include/KF5/KRunner/krunner/querymatch.h:23:10: fatal error: QList: No such file or directory
   23 | #include <QList>
      |          ^~~~~~~
compilation terminated.
cpp.req: /usr/src/tmp/kf5-krunner-buildroot/usr/include/KF5/KRunner/krunner/querymatch.h: cpp failed, trying c++ mode
/usr/src/tmp/kf5-krunner-buildroot/usr/include/KF5/KRunner/krunner/querymatch.h:23:10: fatal error: QList: No such file or directory
   23 | #include <QList>
      |          ^~~~~~~
compilation terminated.
cpp.req: WARNING: /usr/src/tmp/kf5-krunner-buildroot/usr/include/KF5/KRunner/krunner/querymatch.h: cpp failed
/usr/src/tmp/kf5-krunner-buildroot/usr/include/KF5/KRunner/krunner/runnersyntax.h:23:10: fatal error: QStringList: No such file or directory
   23 | #include <QStringList>
      |          ^~~~~~~~~~~~~
compilation terminated.
cpp.req: /usr/src/tmp/kf5-krunner-buildroot/usr/include/KF5/KRunner/krunner/runnersyntax.h: cpp failed, trying c++ mode
/usr/src/tmp/kf5-krunner-buildroot/usr/include/KF5/KRunner/krunner/runnersyntax.h:23:10: fatal error: QStringList: No such file or directory
   23 | #include <QStringList>
      |          ^~~~~~~~~~~~~
compilation terminated.
cpp.req: WARNING: /usr/src/tmp/kf5-krunner-buildroot/usr/include/KF5/KRunner/krunner/runnersyntax.h: cpp failed
/usr/src/tmp/kf5-krunner-buildroot/usr/include/KF5/KRunner/krunner/runnercontext.h:23:10: fatal error: QList: No such file or directory
   23 | #include <QList>
      |          ^~~~~~~
compilation terminated.
cpp.req: /usr/src/tmp/kf5-krunner-buildroot/usr/include/KF5/KRunner/krunner/runnercontext.h: cpp failed, trying c++ mode
/usr/src/tmp/kf5-krunner-buildroot/usr/include/KF5/KRunner/krunner/runnercontext.h:23:10: fatal error: QList: No such file or directory
   23 | #include <QList>
      |          ^~~~~~~
compilation terminated.
cpp.req: WARNING: /usr/src/tmp/kf5-krunner-buildroot/usr/include/KF5/KRunner/krunner/runnercontext.h: cpp failed
/usr/src/tmp/kf5-krunner-buildroot/usr/include/KF5/KRunner/krunner/runnermanager.h:25:10: fatal error: QList: No such file or directory
   25 | #include <QList>
      |          ^~~~~~~
compilation terminated.
cpp.req: /usr/src/tmp/kf5-krunner-buildroot/usr/include/KF5/KRunner/krunner/runnermanager.h: cpp failed, trying c++ mode
/usr/src/tmp/kf5-krunner-buildroot/usr/include/KF5/KRunner/krunner/runnermanager.h:25:10: fatal error: QList: No such file or directory
   25 | #include <QList>
      |          ^~~~~~~
compilation terminated.
cpp.req: WARNING: /usr/src/tmp/kf5-krunner-buildroot/usr/include/KF5/KRunner/krunner/runnermanager.h: cpp failed
/usr/src/tmp/kf5-krunner-buildroot/usr/include/KF5/KRunner/krunner/abstractrunner.h:23:10: fatal error: QObject: No such file or directory
   23 | #include <QObject>
      |          ^~~~~~~~~
compilation terminated.
cpp.req: /usr/src/tmp/kf5-krunner-buildroot/usr/include/KF5/KRunner/krunner/abstractrunner.h: cpp failed, trying c++ mode
/usr/src/tmp/kf5-krunner-buildroot/usr/include/KF5/KRunner/krunner/abstractrunner.h:23:10: fatal error: QObject: No such file or directory
   23 | #include <QObject>
      |          ^~~~~~~~~
compilation terminated.
cpp.req: WARNING: /usr/src/tmp/kf5-krunner-buildroot/usr/include/KF5/KRunner/krunner/abstractrunner.h: cpp failed
Requires: kf5-plasma-framework-devel, /usr/lib/libKF5Runner.so.5
Finding debuginfo files (using /usr/lib/rpm/find-debuginfo-files)
Executing: /bin/sh -e /usr/src/tmp/rpm-tmp.RLkWCR
Processing files: libkf5runner-5.66.0-alt1
Finding Provides (using /usr/lib/rpm/find-provides)
Executing: /bin/sh -e /usr/src/tmp/rpm-tmp.pVQGuR
find-provides: running scripts (alternatives,debuginfo,lib,pam,perl,pkgconfig,python,qml,shell)
lib.prov: /usr/src/tmp/kf5-krunner-buildroot/usr/lib/libKF5Runner.so.5: 199 symbols, 18 bpp
Finding Requires (using /usr/lib/rpm/find-requires)
Executing: /bin/sh -e /usr/src/tmp/rpm-tmp.9nstYR
find-requires: running scripts (cpp,debuginfo,files,lib,pam,perl,pkgconfig,pkgconfiglib,python,qml,rpmlib,shebang,shell,static,symlinks,systemd-services)
Provides: libKF5Runner.so.5 = set:ldw9URQXqB5soRMeXfGIRueaCkW0ASHBYNCX0qmSPGfcDQrwYeLZhVrebD2sq0wZlmkFx1ZrCS1H7GquFklbhc7sLc00nGag4cPElZ1Wljbvh5Y6MHPa5NZ0YFwhpMZhQTRldjqOEeV4Ztaa6SzWnKoXvvBDvFisAHdcWL4rdZr44xJ8PwIkmjJoFUhndDn17BZJW30sVGYSaetKvnhhAOjvTZ6ZCbLD2W9Qjd62ahXVDdxFRqgaq3i4ITwMgDjkmvpUpNhz5egeKxauXpFPw5C9zM63QMTsFAkIsYcwY1OXVmYerXqpjLV5wNgifacsdOpjZfsEVAUi5CPtLLx7OmylaXd25GfLPmlO2hmO6DyVgd6qRRvZzl5mBhNZyY6tpIAa5l4KGxnBjGI
Requires: kf5-krunner-common = 5.66.0-alt1, libKF5ConfigCore.so.5 >= set:njcRrmUIHoB9oZy7ZjlkO9GqOTieDg6lqCfAgkTZn1, libKF5CoreAddons.so.5 >= set:nj9pvrydVj6EEzwHTlxD2SC5Nu0, libKF5I18n.so.5 >= set:kiLpluFQNf, libKF5KIOCore.so.5 >= set:onRyA6, libKF5Plasma.so.5 >= set:nkUviEK0MHkZy4kR2Z0, libKF5Service.so.5 >= set:mhEeSYg3YEr5gv0yh1kuQGbA1ZbNLGa1ZzdWoB5xlb0flWgZvnshmOZkkqyTFkBJ0, libKF5ThreadWeaver.so.5 >= set:mhOU21nY6a7ZbadHZuGdZJoZLaInsksy2dQEa01li0v6gzsIYpQotPZzjli8YWFJ4, libQt5Core.so.5 >= set:qizYIJddkjGdE49NyUVi8oZy12Aw0JGOGOhZKBL94d3xZza1xAiJ80pl3ZEAFdU7PQIPogXO7JoeWc5BGB1AMdGn0CSNaZmpAvY3V6HexlZ9LIC1ZomK66ryduGK3At5l5kaIEIe6YRbkUdxsZkc3R9Z1eJzogAxHshpche9twx9UpKYlZLPUeBCnUCa7gTDqi39OQ9Wfam47dLWaV0rUo6bNLC9G59kvDzqiX2AEdfvFanr9ZdDZvBuhwEPchJxtWVzqzETvYolq9ElQOWWbV59SIBA3Noj16o4MROfBZp26RHvWuAMjuYedXVn3LlvgIGtU8qUQiqDwzpUWwlYzYG3NSId8JxenIBGjTXYPu1knX1KQIPGyziaIoj9wYi4o25LAgZa4sqlSX906D4NC6d5p6cZH8ql0ZgILQzqYejrT3lfCJt882SZhZfVGzRH1LNk0yBOUSpBLK6l5dJdzUOfVqFJ19cC1mOmzkb7YVpfhF3yTFoSjJjeirE1qQEe6NNb6UdBN7scFZy7GpQOOFlBZbUD3FfnqeOkZm9tU59SnMknEgclVAkj1aWJym3RTqAXzTgbQPeFYMVdWnvrgQLaMGoQZr4fKZzf2phkLnTFiqd0, libQt5Core.so.5(Qt_5), libQt5Core.so.5(Qt_5.12), libQt5DBus.so.5 >= set:mgbNqgjbS2u5IACjZnr17bYiFOPTbhqw4cihZgepvxCrgZIYn8yAhZGwZ8gKGyjMhorKVQFstdCWf0piOf7h3dJZ9aRksOHRqUmdxqLOpGvT66h6N6MLo2IWLGMJeWcKIve6cWDz5zmOCIBXn9JzsaOD2, libQt5DBus.so.5(Qt_5), libQt5Gui.so.5 >= set:rorCCpUJ9wwjxIBiVYy0olABf, libQt5Gui.so.5(Qt_5), libQt5Qml.so.5 >= set:plfu9bRVKjZtj8xoIYLlskhh6ueZyyyGHwA0, libQt5Qml.so.5(Qt_5), libQt5Widgets.so.5 >= set:rpWTh2ZCkFUa3n1, libQt5Widgets.so.5(Qt_5), libc.so.6(GLIBC_2.0), libc.so.6(GLIBC_2.1.3), libc.so.6(GLIBC_2.4), libm.so.6(GLIBC_2.29), libstdc++.so.6(CXXABI_1.3), libstdc++.so.6(GLIBCXX_3.4), rtld(GNU_HASH)
Requires(rpmlib): rpmlib(SetVersions)
Finding debuginfo files (using /usr/lib/rpm/find-debuginfo-files)
Executing: /bin/sh -e /usr/src/tmp/rpm-tmp.JmbAJS
Creating libkf5runner-debuginfo package
Processing files: libkf5runner-debuginfo-5.66.0-alt1
Finding Provides (using /usr/lib/rpm/find-provides)
Executing: /bin/sh -e /usr/src/tmp/rpm-tmp.KU248R
find-provides: running scripts (debuginfo)
Finding Requires (using /usr/lib/rpm/find-requires)
Executing: /bin/sh -e /usr/src/tmp/rpm-tmp.C4FRxU
find-requires: running scripts (debuginfo)
Provides: debug(libKF5Runner.so.5)
Requires: libkf5runner = 5.66.0-alt1, debug(libKF5ConfigCore.so.5), debug(libKF5CoreAddons.so.5), debug(libKF5I18n.so.5), debug(libKF5KIOCore.so.5), debug(libKF5Plasma.so.5), debug(libKF5Service.so.5), debug(libKF5ThreadWeaver.so.5), debug(libQt5Core.so.5), debug(libQt5DBus.so.5), debug(libQt5Gui.so.5), debug(libQt5Qml.so.5), debug(libQt5Widgets.so.5), debug(libc.so.6), debug(libm.so.6), debug(libstdc++.so.6)
Adding to libkf5runner a strict dependency on kf5-krunner-common
Adding to libkf5runner-debuginfo a strict dependency on libkf5runner
Adding to kf5-krunner-devel a strict dependency on libkf5runner
Removing 1 extra deps from kf5-krunner-devel due to dependency on libkf5runner
Wrote: /usr/src/RPM/RPMS/noarch/kf5-krunner-common-5.66.0-alt1.noarch.rpm
Wrote: /usr/src/RPM/RPMS/i586/kf5-krunner-devel-5.66.0-alt1.i586.rpm
Wrote: /usr/src/RPM/RPMS/i586/libkf5runner-5.66.0-alt1.i586.rpm
Wrote: /usr/src/RPM/RPMS/i586/libkf5runner-debuginfo-5.66.0-alt1.i586.rpm
34.38user 4.47system 0:34.86elapsed 111%CPU (0avgtext+0avgdata 194776maxresident)k
0inputs+0outputs (0major+1461724minor)pagefaults 0swaps
/.out/kf5-krunner-common-5.66.0-alt1.noarch.rpm: bad symbols in the license tag: /
/.out/kf5-krunner-devel-5.66.0-alt1.i586.rpm: bad symbols in the license tag: /
/.out/libkf5runner-5.66.0-alt1.i586.rpm: bad symbols in the license tag: /
/.out/libkf5runner-debuginfo-5.66.0-alt1.i586.rpm: bad symbols in the license tag: /
68.60user 11.14system 1:19.74elapsed 100%CPU (0avgtext+0avgdata 194776maxresident)k
426392inputs+0outputs (0major+2638286minor)pagefaults 0swaps