<86>Jan  2 10:32:13 userdel[10447]: delete user 'rooter'
<86>Jan  2 10:32:13 userdel[10447]: removed group 'rooter' owned by 'rooter'
<86>Jan  2 10:32:13 userdel[10447]: removed shadow group 'rooter' owned by 'rooter'
<86>Jan  2 10:32:13 groupadd[10452]: group added to /etc/group: name=rooter, GID=585
<86>Jan  2 10:32:13 groupadd[10452]: group added to /etc/gshadow: name=rooter
<86>Jan  2 10:32:13 groupadd[10452]: new group: name=rooter, GID=585
<86>Jan  2 10:32:13 useradd[10459]: new user: name=rooter, UID=585, GID=585, home=/root, shell=/bin/bash
<86>Jan  2 10:32:13 userdel[10470]: delete user 'builder'
<86>Jan  2 10:32:13 userdel[10470]: removed group 'builder' owned by 'builder'
<86>Jan  2 10:32:13 userdel[10470]: removed shadow group 'builder' owned by 'builder'
<86>Jan  2 10:32:13 groupadd[10476]: group added to /etc/group: name=builder, GID=586
<86>Jan  2 10:32:13 groupadd[10476]: group added to /etc/gshadow: name=builder
<86>Jan  2 10:32:13 groupadd[10476]: new group: name=builder, GID=586
<86>Jan  2 10:32:13 useradd[10480]: new user: name=builder, UID=586, GID=586, home=/usr/src, shell=/bin/bash
warning: user aris does not exist - using root
warning: group aris does not exist - using root
warning: user aris does not exist - using root
warning: group aris does not exist - using root
warning: user aris does not exist - using root
warning: group aris does not exist - using root
warning: user aris does not exist - using root
warning: group aris does not exist - using root
<13>Jan  2 10:32:18 rpmi: python-base-2.7.17-alt3 sisyphus+240580.60.5.1 1573516905 installed
<13>Jan  2 10:32:18 rpmi: libexpat-2.2.4-alt1 1503305345 installed
<13>Jan  2 10:32:18 rpmi: libwayland-client-1.17.0-alt1 sisyphus+225894.100.1.1 1553872805 installed
<13>Jan  2 10:32:18 rpmi: libnspr-1:4.23-alt1 sisyphus+239875.100.1.1 1572267300 installed
<13>Jan  2 10:32:18 rpmi: libsqlite3-3.30.1-alt3 sisyphus+242073.100.1.1 1575236094 installed
<13>Jan  2 10:32:18 rpmi: libglvnd-7:1.2.0-alt4 sisyphus+241659.100.1.1 1574755345 installed
<13>Jan  2 10:32:18 rpmi: libwayland-server-1.17.0-alt1 sisyphus+225894.100.1.1 1553872805 installed
<13>Jan  2 10:32:18 rpmi: libidn2-2.3.0-alt1 sisyphus+240846.100.1.2 1573870475 installed
<13>Jan  2 10:32:18 rpmi: libnettle7-3.5.1-alt1 sisyphus+235265.40.6.1 1566223065 installed
<13>Jan  2 10:32:18 rpmi: libICE-1.0.9-alt1 1409902721 installed
<13>Jan  2 10:32:18 rpmi: libgdbm-1.8.3-alt10 1454943334 installed
<13>Jan  2 10:32:18 rpmi: libp11-kit-0.23.15-alt1 sisyphus+226408.100.2.1 1554288204 installed
<13>Jan  2 10:32:18 rpmi: libtasn1-4.15.0-alt1 sisyphus+241940.100.1.1 1574959866 installed
<13>Jan  2 10:32:18 rpmi: libSM-1.2.3-alt1 sisyphus+226734.100.2.1 1554586158 installed
<13>Jan  2 10:32:18 rpmi: libhogweed5-3.5.1-alt1 sisyphus+235265.40.6.1 1566223065 installed
<13>Jan  2 10:32:18 rpmi: libgnutls30-3.6.11-alt1 sisyphus+242147.100.1.1 1575311041 installed
<13>Jan  2 10:32:18 rpmi: libwayland-egl-4:18.1.0-alt1 sisyphus+225894.100.1.1 1553872805 installed
<13>Jan  2 10:32:18 rpmi: python-module-appdirs-1.4.3-alt1.1 sisyphus+227473.200.1.2 1555755564 installed
<13>Jan  2 10:32:18 rpmi: python-module-z3c-3.0.0-alt3 sisyphus+220440.100.1.1 1549119447 installed
<13>Jan  2 10:32:18 rpmi: python-module-enum34-1.1.6-alt3 1527251693 installed
<13>Jan  2 10:32:18 rpmi: libmeanwhile-1.1.1-alt1 sisyphus+224805.100.3.1 1553379544 installed
<13>Jan  2 10:32:18 rpmi: libidn-1.35-alt1 sisyphus+222603.100.1.1 1550916829 installed
<13>Jan  2 10:32:18 rpmi: liborc-0.4.31-alt1 sisyphus+240181.100.1.1 1572853315 installed
<13>Jan  2 10:32:18 rpmi: libgudev-1:233-alt1 sisyphus+235422.100.1.1 1564855273 installed
<13>Jan  2 10:32:18 rpmi: libprotobuf-c1-1.3.1-alt1 sisyphus+225595.200.9.3 1553790713 installed
<13>Jan  2 10:32:18 rpmi: libgadu-1.12.2-alt1 sisyphus+219570.100.1.1 1547751199 installed
<13>Jan  2 10:32:18 rpmi: publicsuffix-list-dafsa-20191108-alt1 sisyphus+240482.100.1.2 1573431390 installed
<13>Jan  2 10:32:18 rpmi: libpsl-0.21.0-alt2 sisyphus+237083.100.1.1 1567531657 installed
<13>Jan  2 10:32:18 rpmi: libxshmfence-1.3-alt1 sisyphus+223149.1000.2.1 1551268571 installed
<13>Jan  2 10:32:18 rpmi: libpciaccess-1:0.16-alt1 sisyphus+234814.100.1.1 1563438291 installed
<13>Jan  2 10:32:18 rpmi: libdrm-1:2.4.100-alt1 sisyphus+240099.100.1.1 1572599774 installed
<13>Jan  2 10:32:18 rpmi: libgbm-4:19.2.8-alt1 sisyphus+243247.100.1.3 1576828020 installed
<13>Jan  2 10:32:18 rpmi: xml-utils-1:2.9.10-alt3 sisyphus+243434.100.1.1 1577103645 installed
<13>Jan  2 10:32:18 rpmi: rpm-build-gir-0.7.3-alt3 sisyphus+242150.100.1.1 1575312005 installed
<13>Jan  2 10:32:18 rpmi: libproxy-0.4.15-alt3 sisyphus+227885.100.1.2 1555818599 installed
<13>Jan  2 10:32:18 rpmi: gsettings-desktop-schemas-data-3.34.0-alt1 sisyphus+237956.300.4.2 1569331130 installed
<13>Jan  2 10:32:18 rpmi: shared-mime-info-1.15-alt1 sisyphus+240378.100.1.1 1573073800 installed
<13>Jan  2 10:32:18 rpmi: libgio-2.62.4-alt1 sisyphus+243311.100.1.3 1576855800 installed
<13>Jan  2 10:32:18 rpmi: gsettings-desktop-schemas-3.34.0-alt1 sisyphus+237956.300.4.2 1569331192 installed
<13>Jan  2 10:32:19 rpmi: libgstreamer1.0-1.16.2-alt1 sisyphus+242248.100.2.1 1575475168 installed
<13>Jan  2 10:32:19 rpmi: libX11-locales-3:1.6.9-alt1 sisyphus+239210.100.1.1 1571056781 installed
<13>Jan  2 10:32:19 rpmi: libXdmcp-1.1.3-alt1 sisyphus+225206.600.1.2 1552949353 installed
<13>Jan  2 10:32:19 rpmi: libXau-1.0.9-alt1 sisyphus+223149.200.2.1 1551268152 installed
<13>Jan  2 10:32:19 rpmi: libxcb-1.13.1-alt1 sisyphus+226527.100.2.2 1554593801 installed
<13>Jan  2 10:32:19 rpmi: libX11-3:1.6.9-alt1 sisyphus+239210.100.1.1 1571056801 installed
<13>Jan  2 10:32:19 rpmi: libXext-1.3.4-alt1 sisyphus+225206.700.1.2 1552949429 installed
<13>Jan  2 10:32:19 rpmi: libXxf86vm-1.1.4-alt2 1527672187 installed
<13>Jan  2 10:32:19 rpmi: libXdamage-1.1.5-alt1 sisyphus+225206.500.1.2 1552949286 installed
<13>Jan  2 10:32:19 rpmi: libXfixes-5.0.3-alt1 sisyphus+226736.100.2.2 1554614841 installed
<13>Jan  2 10:32:19 rpmi: libGLX-mesa-4:19.2.8-alt1 sisyphus+243247.100.1.3 1576828020 installed
<13>Jan  2 10:32:19 rpmi: libEGL-mesa-4:19.2.8-alt1 sisyphus+243247.100.1.3 1576828020 installed
<13>Jan  2 10:32:19 rpmi: libEGL-7:1.2.0-alt4 sisyphus+241659.100.1.1 1574755345 installed
<13>Jan  2 10:32:19 rpmi: libGLX-7:1.2.0-alt4 sisyphus+241659.100.1.1 1574755345 installed
<13>Jan  2 10:32:19 rpmi: libGL-7:1.2.0-alt4 sisyphus+241659.100.1.1 1574755345 installed
<13>Jan  2 10:32:19 rpmi: libgst-plugins1.0-1.16.2-alt1 sisyphus+242248.200.2.1 1575475391 installed
<13>Jan  2 10:32:19 rpmi: liblz4-1:1.9.2-alt1 sisyphus+238585.100.2.2 1570066927 installed
<13>Jan  2 10:32:19 rpmi: libgpg-error-1.36-alt1 sisyphus+225621.300.1.1 1553521082 installed
<13>Jan  2 10:32:19 rpmi: libgcrypt20-1.8.5-alt3 sisyphus+239622.100.1.1 1571746654 installed
<13>Jan  2 10:32:19 rpmi: libsystemd-1:244.1-alt1 sisyphus+243289.100.2.3 1576850590 installed
<13>Jan  2 10:32:19 rpmi: libdbus-1.12.16-alt2 sisyphus+240566.100.2.1 1573547696 installed
<13>Jan  2 10:32:19 rpmi: libdbus-glib-1:0.106-alt1 1454672854 installed
<13>Jan  2 10:32:19 rpmi: libavahi-0.7-alt1 sisyphus+237493.100.1.1 1568299481 installed
<13>Jan  2 10:32:19 rpmi: libavahi-glib-0.7-alt1 sisyphus+237493.100.1.1 1568299481 installed
<13>Jan  2 10:32:19 rpmi: libpurple-client-2.13.0-alt6 sisyphus+234688.100.1.1 1563305381 installed
<13>Jan  2 10:32:19 rpmi: libtelepathy-glib-0.24.1-alt3.2 sisyphus+226614.100.1.1 1554423190 installed
<13>Jan  2 10:32:19 rpmi: dbus-tools-1.12.16-alt2 sisyphus+240566.100.2.1 1573547696 installed
<86>Jan  2 10:32:19 groupadd[14384]: group added to /etc/group: name=messagebus, GID=499
<86>Jan  2 10:32:19 groupadd[14384]: group added to /etc/gshadow: name=messagebus
<86>Jan  2 10:32:19 groupadd[14384]: new group: name=messagebus, GID=499
<86>Jan  2 10:32:19 useradd[14391]: new user: name=messagebus, UID=499, GID=499, home=/run/dbus, shell=/dev/null
<13>Jan  2 10:32:19 rpmi: dbus-1.12.16-alt2 sisyphus+240566.100.2.1 1573547696 installed
<13>Jan  2 10:32:20 rpmi: libdbus-devel-1.12.16-alt2 sisyphus+240566.100.2.1 1573547696 installed
<13>Jan  2 10:32:20 rpmi: libxslt-1.1.34-alt1 sisyphus+240826.100.1.1 1573801860 installed
<13>Jan  2 10:32:20 rpmi: python-modules-curses-2.7.17-alt3 sisyphus+240580.200.5.1 1573517321 installed
<13>Jan  2 10:32:20 rpmi: libtinfo-devel-6.1.20180407-alt2 sisyphus+222164.200.1.1 1550686226 installed
<13>Jan  2 10:32:20 rpmi: libncurses-devel-6.1.20180407-alt2 sisyphus+222164.200.1.1 1550686226 installed
<13>Jan  2 10:32:20 rpmi: libverto-0.3.0-alt1_7 sisyphus+225932.100.1.1 1553994919 installed
<13>Jan  2 10:32:20 rpmi: libkeyutils-1.6-alt2 sisyphus+226520.100.2.1 1554512089 installed
<13>Jan  2 10:32:20 rpmi: rpm-macros-alternatives-0.5.1-alt1 sisyphus+226946.100.1.1 1554830426 installed
<13>Jan  2 10:32:20 rpmi: alternatives-0.5.1-alt1 sisyphus+226946.100.1.1 1554830426 installed
<13>Jan  2 10:32:20 rpmi: ca-certificates-2019.10.28-alt1 sisyphus+239875.300.1.1 1572267834 installed
<13>Jan  2 10:32:20 rpmi: ca-trust-0.1.2-alt1 sisyphus+233348.100.1.1 1561653823 installed
<13>Jan  2 10:32:20 rpmi: p11-kit-trust-0.23.15-alt1 sisyphus+226408.100.2.1 1554288204 installed
<13>Jan  2 10:32:20 rpmi: libcrypto1.1-1.1.1d-alt1.1 sisyphus+237931.100.2.1 1569235729 installed
<13>Jan  2 10:32:20 rpmi: libssl1.1-1.1.1d-alt1.1 sisyphus+237931.100.2.1 1569235729 installed
<13>Jan  2 10:32:20 rpmi: libpython3-3.7.4-alt2 sisyphus+239418.100.1.1 1571389913 installed
<13>Jan  2 10:32:20 rpmi: python3-3.7.4-alt2 sisyphus+239418.100.1.1 1571389913 installed
<13>Jan  2 10:32:22 rpmi: python3-base-3.7.4-alt2 sisyphus+239418.100.1.1 1571389913 installed
<13>Jan  2 10:32:22 rpmi: glib2-devel-2.62.4-alt1 sisyphus+243311.100.1.3 1576855800 installed
<13>Jan  2 10:32:22 rpmi: libgio-devel-2.62.4-alt1 sisyphus+243311.100.1.3 1576855800 installed
<13>Jan  2 10:32:22 rpmi: libdbus-glib-devel-1:0.106-alt1 1454672854 installed
<13>Jan  2 10:32:22 rpmi: glib-networking-2.62.2-alt1 sisyphus+242638.100.1.1 1575956090 installed
<13>Jan  2 10:32:22 rpmi: libnss-3.47.1-alt1 sisyphus+242129.100.1.1 1575290987 installed
<13>Jan  2 10:32:22 rpmi: libcom_err-1.44.6-alt1 sisyphus+224154.100.1.1 1552091678 installed
<86>Jan  2 10:32:22 groupadd[15913]: group added to /etc/group: name=_keytab, GID=498
<86>Jan  2 10:32:22 groupadd[15913]: group added to /etc/gshadow: name=_keytab
<86>Jan  2 10:32:22 groupadd[15913]: new group: name=_keytab, GID=498
<13>Jan  2 10:32:22 rpmi: libkrb5-1.17.1-alt1 sisyphus+242784.100.1.1 1576137330 installed
<13>Jan  2 10:32:22 rpmi: libsoup-2.68.3-alt1 sisyphus+242263.100.1.1 1575463144 installed
<13>Jan  2 10:32:22 rpmi: libgssdp1.2-1.2.1-alt1 sisyphus+228860.100.1.1 1556775989 installed
<13>Jan  2 10:32:22 rpmi: libgupnp1.2-1.2.1-alt1 sisyphus+228860.200.1.1 1556776078 installed
<13>Jan  2 10:32:22 rpmi: libgupnp-igd-0.2.5-alt3 sisyphus+243713.100.1.1 1577692631 installed
<13>Jan  2 10:32:22 rpmi: libnice-0.1.16-alt1 sisyphus+229216.100.1.1 1557584955 installed
<13>Jan  2 10:32:22 rpmi: libfarstream0.2-0.2.8-alt1 1465068231 installed
<13>Jan  2 10:32:22 rpmi: libtirpc-1.0.3-alt1 1532008017 installed
<13>Jan  2 10:32:22 rpmi: libnsl2-1.1.0-alt1_1 1511548749 installed
<13>Jan  2 10:32:22 rpmi: python-modules-compiler-2.7.17-alt3 sisyphus+240580.200.5.1 1573517321 installed
<13>Jan  2 10:32:22 rpmi: python-modules-email-2.7.17-alt3 sisyphus+240580.200.5.1 1573517321 installed
<13>Jan  2 10:32:22 rpmi: python-modules-unittest-2.7.17-alt3 sisyphus+240580.200.5.1 1573517321 installed
<13>Jan  2 10:32:22 rpmi: python-modules-encodings-2.7.17-alt3 sisyphus+240580.200.5.1 1573517321 installed
<13>Jan  2 10:32:23 rpmi: python-modules-2.7.17-alt3 sisyphus+240580.200.5.1 1573517321 installed
<13>Jan  2 10:32:23 rpmi: python-modules-nis-2.7.17-alt3 sisyphus+240580.200.5.1 1573517321 installed
<13>Jan  2 10:32:23 rpmi: python-modules-ctypes-2.7.17-alt3 sisyphus+240580.200.5.1 1573517321 installed
<13>Jan  2 10:32:23 rpmi: python-module-six-1.13.0-alt1 sisyphus+240546.100.2.1 1573542703 installed
<13>Jan  2 10:32:23 rpmi: python-modules-xml-2.7.17-alt3 sisyphus+240580.200.5.1 1573517321 installed
<13>Jan  2 10:32:23 rpmi: python-module-pkg_resources-1:41.4.0-alt1 sisyphus+238787.100.2.1 1570608044 installed
<13>Jan  2 10:32:23 rpmi: python-module-ipaddress-1.0.18-alt1.1 sisyphus+227494.1700.1.3 1555839523 installed
<13>Jan  2 10:32:23 rpmi: python-modules-json-2.7.17-alt3 sisyphus+240580.200.5.1 1573517321 installed
<13>Jan  2 10:32:23 rpmi: python-module-constantly-15.1.0-alt5.qa1 sisyphus+228353.1600.3.1 1556554115 installed
<13>Jan  2 10:32:23 rpmi: python-modules-multiprocessing-2.7.17-alt3 sisyphus+240580.200.5.1 1573517321 installed
<13>Jan  2 10:32:23 rpmi: python-modules-logging-2.7.17-alt3 sisyphus+240580.200.5.1 1573517321 installed
<13>Jan  2 10:32:23 rpmi: python-tools-2to3-2.7.17-alt3 sisyphus+240580.200.5.1 1573517321 installed
<13>Jan  2 10:32:23 rpmi: python-module-pyasn1-0.4.8-alt1 sisyphus+241541.100.2.1 1574620393 installed
<13>Jan  2 10:32:23 rpmi: python-module-pyasn1-modules-0.2.8-alt1 sisyphus+241541.200.2.1 1574620466 installed
<13>Jan  2 10:32:23 rpmi: python-module-future-0.16.0-alt2 sisyphus+228356.200.3.3 1556645013 installed
<13>Jan  2 10:32:23 rpmi: python-module-serial-3.4-alt1 1508504506 installed
<13>Jan  2 10:32:23 rpmi: python-modules-hotshot-2.7.17-alt3 sisyphus+240580.200.5.1 1573517321 installed
<13>Jan  2 10:32:23 rpmi: python-modules-bsddb-2.7.17-alt3 sisyphus+240580.200.5.1 1573517321 installed
<13>Jan  2 10:32:23 rpmi: python-2.7.17-alt3 sisyphus+240580.200.5.1 1573517321 installed
<13>Jan  2 10:32:23 rpmi: python-strict-2.7.17-alt3 sisyphus+240580.200.5.1 1573517270 installed
<13>Jan  2 10:32:23 rpmi: python-module-attrs-19.3.0-alt1 sisyphus+240796.100.1.1 1573741715 installed
<13>Jan  2 10:32:23 rpmi: python-modules-distutils-2.7.17-alt3 sisyphus+240580.200.5.1 1573517321 installed
<13>Jan  2 10:32:23 rpmi: python-module-pycparser-2.19-alt1 sisyphus+228366.1000.2.3 1556706938 installed
<13>Jan  2 10:32:23 rpmi: python-module-cffi-1.13.2-alt1 sisyphus+240882.100.2.1 1573892898 installed
<13>Jan  2 10:32:23 rpmi: python-module-cryptography-2.8-alt1 sisyphus+239390.100.1.2 1571349426 installed
<13>Jan  2 10:32:23 rpmi: python-module-OpenSSL-19.0.0-alt1 sisyphus+238757.100.1.1 1570339901 installed
<13>Jan  2 10:32:23 rpmi: python-module-idna-2.8-alt1 sisyphus+227494.400.1.3 1555838720 installed
<13>Jan  2 10:32:23 rpmi: python-module-hyperlink-19.0.0-alt1 sisyphus+231791.100.1.1 1560104463 installed
<13>Jan  2 10:32:23 rpmi: python-module-zc-1.0.0-alt6.2 1458024175 installed
<13>Jan  2 10:32:23 rpmi: python-module-zope.interface-4.6.0-alt1 sisyphus+227562.100.3.1 1556009950 installed
<13>Jan  2 10:32:23 rpmi: python-module-zope-3.3.0-alt8.5 sisyphus+225625.33400.91.1 1555314837 installed
<13>Jan  2 10:32:24 rpmi: python-module-pygobject-2.28.7-alt1 1513944037 installed
<13>Jan  2 10:32:24 rpmi: python-module-click-7.0-alt1 sisyphus+233553.200.1.1 1561975479 installed
<13>Jan  2 10:32:24 rpmi: python-module-incremental-17.5.0-alt3 sisyphus+225625.45700.91.1 1555360824 installed
<13>Jan  2 10:32:24 rpmi: libnsl2-devel-1.1.0-alt1_1 1511548749 installed
<13>Jan  2 10:32:24 rpmi: python-dev-2.7.17-alt3 sisyphus+240580.200.5.1 1573517321 installed
<13>Jan  2 10:32:24 rpmi: python-module-setuptools-1:41.4.0-alt1 sisyphus+238787.100.2.1 1570608044 installed
<13>Jan  2 10:32:24 rpmi: python-module-pydoctor-16.3.0-alt1.qa1 sisyphus.214897.100 1539781872 installed
<13>Jan  2 10:32:24 rpmi: python-module-twisted-logger-18.9.0-alt1 sisyphus+225625.46000.91.1 1555354932 installed
<13>Jan  2 10:32:24 rpmi: python-module-automat-0.7.0-alt1 sisyphus+233511.100.1.1 1561912741 installed
<13>Jan  2 10:32:24 rpmi: python-module-twisted-core-18.9.0-alt1 sisyphus+225625.46000.91.1 1555354932 installed
<86>Jan  2 10:32:24 groupadd[16677]: group added to /etc/group: name=sasl, GID=497
<86>Jan  2 10:32:24 groupadd[16677]: group added to /etc/gshadow: name=sasl
<86>Jan  2 10:32:24 groupadd[16677]: new group: name=sasl, GID=497
<13>Jan  2 10:32:24 rpmi: libsasl2-3-2.1.27-alt2 sisyphus+228101.100.1.1 1556139863 installed
<13>Jan  2 10:32:24 rpmi: libpurple-2.13.0-alt6 sisyphus+234688.100.1.1 1563305381 installed
<13>Jan  2 10:32:24 rpmi: libpurple-devel-2.13.0-alt6 sisyphus+234688.100.1.1 1563305381 installed
<13>Jan  2 10:32:24 rpmi: python-module-twisted-core-gui-18.9.0-alt1 sisyphus+225625.46000.91.1 1555354932 installed
<13>Jan  2 10:32:24 rpmi: python-module-twisted-words-18.9.0-alt1 sisyphus+225625.46000.91.1 1555354932 installed
<13>Jan  2 10:32:24 rpmi: python-module-service-identity-18.1.0-alt1 sisyphus+221601.600.3.1 1550235163 installed
<13>Jan  2 10:32:24 rpmi: python-module-dbus-1.2.14-alt2 sisyphus+241891.100.2.1 1574942546 installed
<13>Jan  2 10:32:24 rpmi: libtelepathy-glib-devel-0.24.1-alt3.2 sisyphus+226614.100.1.1 1554423190 installed
<13>Jan  2 10:32:24 rpmi: xsltproc-1.1.34-alt1 sisyphus+240826.100.1.1 1573801860 installed
<13>Jan  2 10:32:24 rpmi: dbus-tools-gui-1.12.16-alt2 sisyphus+240566.100.2.1 1573547696 installed
Building target platforms: i586
Building for target i586
Wrote: /usr/src/in/nosrpm/telepathy-haze-0.8.0.1-alt0.7.nosrc.rpm
Installing telepathy-haze-0.8.0.1-alt0.7.src.rpm
Building target platforms: i586
Building for target i586
Executing(%prep): /bin/sh -e /usr/src/tmp/rpm-tmp.21358
+ umask 022
+ /bin/mkdir -p /usr/src/RPM/BUILD
+ cd /usr/src/RPM/BUILD
+ cd /usr/src/RPM/BUILD
+ rm -rf telepathy-haze-0.8.0.1
+ echo 'Source #0 (telepathy-haze-0.8.0.1.tar):'
Source #0 (telepathy-haze-0.8.0.1.tar):
+ /bin/tar -xf /usr/src/RPM/SOURCES/telepathy-haze-0.8.0.1.tar
+ cd telepathy-haze-0.8.0.1
+ /bin/chmod -c -Rf u+rwX,go-w .
+ echo 'Patch #0 (telepathy-haze-0.8.0-alt-purple_2.0.12.patch):'
Patch #0 (telepathy-haze-0.8.0-alt-purple_2.0.12.patch):
+ /usr/bin/patch -p0 -b --suffix .purple
patching file src/media-stream.c
+ echo 'Patch #1 (telepathy-haze-0.8.0-alt-unused_const_variable.patch):'
Patch #1 (telepathy-haze-0.8.0-alt-unused_const_variable.patch):
+ /usr/bin/patch -p0 -b --suffix .gcc6
patching file src/media-manager.c
+ exit 0
Executing(%build): /bin/sh -e /usr/src/tmp/rpm-tmp.21358
+ umask 022
+ /bin/mkdir -p /usr/src/RPM/BUILD
+ cd /usr/src/RPM/BUILD
+ cd telepathy-haze-0.8.0.1
+ autoreconf -fisv
autoreconf-default: Entering directory `.'
autoreconf-default: configure.ac: not using Gettext
autoreconf-default: running: aclocal --force -I m4
autoreconf-default: configure.ac: tracing
autoreconf-default: configure.ac: creating directory build-aux
autoreconf-default: running: libtoolize --force --install
libtoolize-default: putting auxiliary files in AC_CONFIG_AUX_DIR, 'build-aux'.
libtoolize-default: linking file 'build-aux/config.guess'
libtoolize-default: linking file 'build-aux/config.sub'
libtoolize-default: linking file 'build-aux/install-sh'
libtoolize-default: linking file 'build-aux/ltmain.sh'
libtoolize-default: putting macros in AC_CONFIG_MACRO_DIRS, 'm4'.
libtoolize-default: linking file 'm4/libtool.m4'
libtoolize-default: linking file 'm4/ltoptions.m4'
libtoolize-default: linking file 'm4/ltsugar.m4'
libtoolize-default: linking file 'm4/ltversion.m4'
libtoolize-default: linking file 'm4/lt~obsolete.m4'
autoreconf-default: configure.ac: not using Intltool
autoreconf-default: configure.ac: not using gtk-doc
autoreconf-default: running: /usr/bin/autoconf-2.60 --force
autoreconf-default: running: /usr/bin/autoheader-2.60 --force
autoreconf-default: running: automake --add-missing --force-missing
configure.ac:42: installing 'build-aux/compile'
configure.ac:27: installing 'build-aux/missing'
Makefile.am: installing './INSTALL'
extensions/Makefile.am:13: warning: source file '_gen/signals-marshal.c' is in a subdirectory,
extensions/Makefile.am:13: but option 'subdir-objects' is disabled
automake-default: warning: possible forward-incompatibility.
automake-default: At least a source file is in a subdirectory, but the 'subdir-objects'
automake-default: automake option hasn't been enabled.  For now, the corresponding output
automake-default: object file(s) will be placed in the top-level directory.  However,
automake-default: this behaviour will change in future Automake versions: they will
automake-default: unconditionally cause object files to be placed in the same subdirectory
automake-default: of the corresponding sources.
automake-default: You are advised to start using 'subdir-objects' option throughout your
automake-default: project, to avoid future incompatibilities.
extensions/Makefile.am:13: warning: source file '_gen/svc.c' is in a subdirectory,
extensions/Makefile.am:13: but option 'subdir-objects' is disabled
extensions/Makefile.am: installing 'build-aux/depcomp'
autoreconf-default: Leaving directory `.'
+ CFLAGS='-pipe -frecord-gcc-switches -Wall -g -O2 -march=i586 -mtune=generic -Wno-error=implicit-fallthrough -Wno-error=cast-function-type'
+ export CFLAGS
+ CXXFLAGS='-pipe -frecord-gcc-switches -Wall -g -O2 -march=i586 -mtune=generic -Wno-error=implicit-fallthrough -Wno-error=cast-function-type'
+ export CXXFLAGS
+ FFLAGS='-pipe -frecord-gcc-switches -Wall -g -O2 -march=i586 -mtune=generic -Wno-error=implicit-fallthrough -Wno-error=cast-function-type'
+ export FFLAGS
+ '[' -n '' ']'
++ printf %s '-pipe -frecord-gcc-switches -Wall -g -O2 -march=i586 -mtune=generic -Wno-error=implicit-fallthrough -Wno-error=cast-function-type'
++ sed -r 's/(^|[[:space:]]+)-[^m][^[:space:]]*//g'
+ ASFLAGS=' -march=i586 -mtune=generic'
+ export ASFLAGS
+ export lt_cv_deplibs_check_method=pass_all
+ lt_cv_deplibs_check_method=pass_all
+ readlink -e -- ./configure
+ xargs -ri dirname -- '{}'
+ xargs -ri find '{}' -type f '(' -name config.sub -or -name config.guess ')' -printf '%h/\n'
+ sort -u
+ xargs -rn1 install -pm755 -- /usr/share/gnu-config/config.sub /usr/share/gnu-config/config.guess
+ ./configure --build=i586-alt-linux --host=i586-alt-linux --prefix=/usr --exec-prefix=/usr --bindir=/usr/bin --sbindir=/usr/sbin --sysconfdir=/etc --datadir=/usr/share --includedir=/usr/include --libdir=/usr/lib --libexecdir=/usr/libexec --localstatedir=/var/lib --sharedstatedir=/var/lib --mandir=/usr/share/man --infodir=/usr/share/info --disable-dependency-tracking --disable-silent-rules --without-included-gettext
configure: WARNING: unrecognized options: --without-included-gettext
checking for a BSD-compatible install... /bin/install -c
checking whether build environment is sane... yes
checking for a thread-safe mkdir -p... /bin/mkdir -p
checking for gawk... gawk
checking whether make sets $(MAKE)... yes
checking whether make supports nested variables... yes
checking whether make supports nested variables... (cached) yes
checking for i586-alt-linux-gcc... i586-alt-linux-gcc
checking whether the C compiler works... yes
checking for C compiler default output file name... a.out
checking for suffix of executables... 
checking whether we are cross compiling... no
checking for suffix of object files... o
checking whether we are using the GNU C compiler... yes
checking whether i586-alt-linux-gcc accepts -g... yes
checking for i586-alt-linux-gcc option to accept ISO C89... none needed
checking whether i586-alt-linux-gcc understands -c and -o together... yes
checking whether make supports the include directive... yes (GNU style)
checking dependency style of i586-alt-linux-gcc... none
checking for i586-alt-linux-gcc option to accept ISO C99... none needed
checking for i586-alt-linux-gcc option to accept ISO Standard C... (cached) none needed
checking build system type... i586-alt-linux-gnu
checking host system type... i586-alt-linux-gnu
checking how to print strings... printf
checking for a sed that does not truncate output... /bin/sed
checking for grep that handles long lines and -e... /bin/grep
checking for egrep... /bin/grep -E
checking for fgrep... /bin/grep -F
checking for ld used by i586-alt-linux-gcc... /usr/bin/ld
checking if the linker (/usr/bin/ld) is GNU ld... yes
checking for BSD- or MS-compatible name lister (nm)... /usr/bin/nm -B
checking the name lister (/usr/bin/nm -B) interface... BSD nm
checking whether ln -s works... yes
checking the maximum length of command line arguments... 1572864
checking how to convert i586-alt-linux-gnu file names to i586-alt-linux-gnu format... func_convert_file_noop
checking how to convert i586-alt-linux-gnu file names to toolchain format... func_convert_file_noop
checking for /usr/bin/ld option to reload object files... -r
checking for i586-alt-linux-objdump... no
checking for objdump... objdump
checking how to recognize dependent libraries... (cached) pass_all
checking for i586-alt-linux-dlltool... no
checking for dlltool... no
checking how to associate runtime and link libraries... printf %s\n
checking for i586-alt-linux-ar... no
checking for ar... ar
checking for archiver @FILE support... @
checking for i586-alt-linux-strip... no
checking for strip... strip
checking for i586-alt-linux-ranlib... no
checking for ranlib... ranlib
checking command to parse /usr/bin/nm -B output from i586-alt-linux-gcc object... ok
checking for sysroot... no
checking for a working dd... /bin/dd
checking how to truncate binary pipes... /bin/dd bs=4096 count=1
checking for i586-alt-linux-mt... no
checking for mt... no
checking if : is a manifest tool... no
checking how to run the C preprocessor... i586-alt-linux-gcc -E
checking for ANSI C header files... yes
checking for sys/types.h... yes
checking for sys/stat.h... yes
checking for stdlib.h... yes
checking for string.h... yes
checking for memory.h... yes
checking for strings.h... yes
checking for inttypes.h... yes
checking for stdint.h... yes
checking for unistd.h... yes
checking for dlfcn.h... yes
checking for objdir... .libs
checking if i586-alt-linux-gcc supports -fno-rtti -fno-exceptions... no
checking for i586-alt-linux-gcc option to produce PIC... -fPIC -DPIC
checking if i586-alt-linux-gcc PIC flag -fPIC -DPIC works... yes
checking if i586-alt-linux-gcc static flag -static works... no
checking if i586-alt-linux-gcc supports -c -o file.o... yes
checking if i586-alt-linux-gcc supports -c -o file.o... (cached) yes
checking whether the i586-alt-linux-gcc linker (/usr/bin/ld) supports shared libraries... yes
checking whether -lc should be explicitly linked in... no
checking dynamic linker characteristics... GNU/Linux ld.so
checking how to hardcode library paths into programs... immediate
checking whether stripping libraries is possible... yes
checking if libtool supports shared libraries... yes
checking whether to build shared libraries... yes
checking whether to build static libraries... yes
checking whether linker supports -Wl,-O1... yes
checking to see if compiler understands ... yes
checking to see if compiler understands -Wall... yes
checking to see if compiler understands -Wextra... yes
checking to see if compiler understands -Wdeclaration-after-statement... yes
checking to see if compiler understands -Wshadow... yes
checking to see if compiler understands -Wstrict-prototypes... yes
checking to see if compiler understands -Wmissing-prototypes... yes
checking to see if compiler understands -Wsign-compare... yes
checking to see if compiler understands -Wnested-externs... yes
checking to see if compiler understands -Wpointer-arith... yes
checking to see if compiler understands -Wformat-security... yes
checking to see if compiler understands -Winit-self... yes
checking to see if compiler understands -Werror... yes
checking to see if compiler understands -Wno-missing-field-initializers... yes
checking to see if compiler understands -Wno-error=missing-field-initializers... yes
checking to see if compiler understands -Wno-unused-parameter... yes
checking to see if compiler understands -Wno-error=unused-parameter... yes
checking to see if compiler understands -Wno-deprecated-declarations... yes
checking to see if compiler understands -Wno-error=deprecated-declarations... yes
checking for libintl.h... yes
checking for i586-alt-linux-pkg-config... no
checking for pkg-config... /usr/bin/pkg-config
checking pkg-config is at least version 0.9.0... yes
checking for purple >= 2.7... yes
checking for telepathy-glib >= 0.15.1... yes
checking for glib-2.0 >= 2.22, gobject-2.0, gio-2.0... yes
checking for dbus-glib-1 >= 0.73... yes
checking for purple_dbus_uninit in -lpurple... yes
checking for xsltproc... xsltproc
checking for a Python interpreter with version >= 2.5... python
checking for python... /usr/bin/python
checking for python version... 2.7
checking for python platform... linux2
checking for python script directory... ${prefix}/lib/python2.7/site-packages
checking for python extension module directory... ${exec_prefix}/lib/python2.7/site-packages
checking for Python with Twisted and XMPP protocol support... /usr/bin/python
checking that generated files are newer than configure... done
configure: creating ./config.status
config.status: creating Makefile
config.status: creating src/Makefile
config.status: creating data/Makefile
config.status: creating m4/Makefile
config.status: creating tests/Makefile
config.status: creating tests/twisted/Makefile
config.status: creating tests/twisted/tools/Makefile
config.status: creating tools/Makefile
config.status: creating extensions/Makefile
config.status: creating config.h
config.status: executing depfiles commands
config.status: executing libtool commands
configure: WARNING: unrecognized options: --without-included-gettext
+ make -j8
make  all-recursive
Making all in tools
make[2]: Nothing to be done for 'all'.
Making all in extensions
make[2]: Entering directory '/usr/src/RPM/BUILD/telepathy-haze-0.8.0.1/extensions'
xsltproc --nonet --novalid --xinclude ../tools/identity.xsl \
	all.xml > _gen/all.xml
make[2]: Leaving directory '/usr/src/RPM/BUILD/telepathy-haze-0.8.0.1/extensions'
make[2]: Entering directory '/usr/src/RPM/BUILD/telepathy-haze-0.8.0.1/extensions'
/usr/bin/python ../tools/glib-interfaces-gen.py \
	Haze _gen/interfaces-body.h _gen/interfaces.h _gen/all.xml
make[2]: Leaving directory '/usr/src/RPM/BUILD/telepathy-haze-0.8.0.1/extensions'
make[2]: Entering directory '/usr/src/RPM/BUILD/telepathy-haze-0.8.0.1/extensions'
/usr/bin/python ../tools/glib-interfaces-gen.py \
	Haze _gen/interfaces-body.h _gen/interfaces.h _gen/all.xml
make[2]: Leaving directory '/usr/src/RPM/BUILD/telepathy-haze-0.8.0.1/extensions'
make[2]: Entering directory '/usr/src/RPM/BUILD/telepathy-haze-0.8.0.1/extensions'
xsltproc --nonet --novalid \
	--param "allow-undefined-interfaces" "true()" \
	../tools/doc-generator.xsl \
	_gen/all.xml > extensions.html
make[2]: Leaving directory '/usr/src/RPM/BUILD/telepathy-haze-0.8.0.1/extensions'
make[2]: Entering directory '/usr/src/RPM/BUILD/telepathy-haze-0.8.0.1/extensions'
/usr/bin/python ../tools/glib-signals-marshal-gen.py _gen/all.xml > _gen/signals-marshal.list
make[2]: Leaving directory '/usr/src/RPM/BUILD/telepathy-haze-0.8.0.1/extensions'
make[2]: Entering directory '/usr/src/RPM/BUILD/telepathy-haze-0.8.0.1/extensions'
/usr/bin/python ../tools/c-constants-gen.py Haze _gen/all.xml > _gen/enums.h
make[2]: Leaving directory '/usr/src/RPM/BUILD/telepathy-haze-0.8.0.1/extensions'
make[2]: Entering directory '/usr/src/RPM/BUILD/telepathy-haze-0.8.0.1/extensions'
/usr/bin/python ../tools/glib-ginterface-gen.py \
	--filename=_gen/svc --signal-marshal-prefix=_haze_ext \
	--include='<telepathy-glib/dbus.h>' \
	--include='"_gen/signals-marshal.h"' \
	--allow-unstable \
	--not-implemented-func='tp_dbus_g_method_return_not_implemented' \
	_gen/all.xml Haze_Svc_
make[2]: Leaving directory '/usr/src/RPM/BUILD/telepathy-haze-0.8.0.1/extensions'
make[2]: Entering directory '/usr/src/RPM/BUILD/telepathy-haze-0.8.0.1/extensions'
/usr/bin/python ../tools/glib-ginterface-gen.py \
	--filename=_gen/svc --signal-marshal-prefix=_haze_ext \
	--include='<telepathy-glib/dbus.h>' \
	--include='"_gen/signals-marshal.h"' \
	--allow-unstable \
	--not-implemented-func='tp_dbus_g_method_return_not_implemented' \
	_gen/all.xml Haze_Svc_
make[2]: Leaving directory '/usr/src/RPM/BUILD/telepathy-haze-0.8.0.1/extensions'
make[2]: Entering directory '/usr/src/RPM/BUILD/telepathy-haze-0.8.0.1/extensions'
/usr/bin/glib-genmarshal --header --prefix=_haze_ext_marshal _gen/signals-marshal.list > _gen/signals-marshal.h
INFO: Reading _gen/signals-marshal.list...
make[2]: Leaving directory '/usr/src/RPM/BUILD/telepathy-haze-0.8.0.1/extensions'
make[2]: Entering directory '/usr/src/RPM/BUILD/telepathy-haze-0.8.0.1/extensions'
{ echo '#include "_gen/signals-marshal.h"' && \
/usr/bin/glib-genmarshal --body --prefix=_haze_ext_marshal _gen/signals-marshal.list ; } > _gen/signals-marshal.c
INFO: Reading _gen/signals-marshal.list...
make[2]: Leaving directory '/usr/src/RPM/BUILD/telepathy-haze-0.8.0.1/extensions'
make[2]: Entering directory '/usr/src/RPM/BUILD/telepathy-haze-0.8.0.1/extensions'
/usr/bin/python ../tools/glib-gtypes-generator.py \
	_gen/all.xml _gen/gtypes Haze
make[2]: Leaving directory '/usr/src/RPM/BUILD/telepathy-haze-0.8.0.1/extensions'
make[2]: Entering directory '/usr/src/RPM/BUILD/telepathy-haze-0.8.0.1/extensions'
/usr/bin/python ../tools/glib-gtypes-generator.py \
	_gen/all.xml _gen/gtypes Haze
make[2]: Leaving directory '/usr/src/RPM/BUILD/telepathy-haze-0.8.0.1/extensions'
make  all-am
make[3]: Entering directory '/usr/src/RPM/BUILD/telepathy-haze-0.8.0.1/extensions'
/bin/sh ../libtool  --tag=CC   --mode=compile i586-alt-linux-gcc -DHAVE_CONFIG_H -I. -I..    -Wall -Wextra -Wdeclaration-after-statement -Wshadow -Wstrict-prototypes -Wmissing-prototypes -Wsign-compare -Wnested-externs -Wpointer-arith -Wformat-security -Winit-self -Wno-missing-field-initializers -Wno-unused-parameter -Wno-deprecated-declarations -Werror -Wno-error=missing-field-initializers -Wno-error=unused-parameter -Wno-error=deprecated-declarations -I/usr/include/dbus-1.0 -I/usr/lib/dbus-1.0/include -I/usr/include/glib-2.0 -I/usr/lib/glib-2.0/include -pthread -I/usr/include/telepathy-1.0 -I/usr/include/dbus-1.0 -I/usr/lib/dbus-1.0/include -I/usr/include/glib-2.0 -I/usr/lib/glib-2.0/include -pipe -frecord-gcc-switches -Wall -g -O2 -march=i586 -mtune=generic -Wno-error=implicit-fallthrough -Wno-error=cast-function-type -c -o extensions.lo extensions.c
libtool: compile:  i586-alt-linux-gcc -DHAVE_CONFIG_H -I. -I.. -Wall -Wextra -Wdeclaration-after-statement -Wshadow -Wstrict-prototypes -Wmissing-prototypes -Wsign-compare -Wnested-externs -Wpointer-arith -Wformat-security -Winit-self -Wno-missing-field-initializers -Wno-unused-parameter -Wno-deprecated-declarations -Werror -Wno-error=missing-field-initializers -Wno-error=unused-parameter -Wno-error=deprecated-declarations -I/usr/include/dbus-1.0 -I/usr/lib/dbus-1.0/include -I/usr/include/glib-2.0 -I/usr/lib/glib-2.0/include -pthread -I/usr/include/telepathy-1.0 -I/usr/include/dbus-1.0 -I/usr/lib/dbus-1.0/include -I/usr/include/glib-2.0 -I/usr/lib/glib-2.0/include -pipe -frecord-gcc-switches -Wall -g -O2 -march=i586 -mtune=generic -Wno-error=implicit-fallthrough -Wno-error=cast-function-type -c extensions.c  -fPIC -DPIC -o .libs/extensions.o
libtool: compile:  i586-alt-linux-gcc -DHAVE_CONFIG_H -I. -I.. -Wall -Wextra -Wdeclaration-after-statement -Wshadow -Wstrict-prototypes -Wmissing-prototypes -Wsign-compare -Wnested-externs -Wpointer-arith -Wformat-security -Winit-self -Wno-missing-field-initializers -Wno-unused-parameter -Wno-deprecated-declarations -Werror -Wno-error=missing-field-initializers -Wno-error=unused-parameter -Wno-error=deprecated-declarations -I/usr/include/dbus-1.0 -I/usr/lib/dbus-1.0/include -I/usr/include/glib-2.0 -I/usr/lib/glib-2.0/include -pthread -I/usr/include/telepathy-1.0 -I/usr/include/dbus-1.0 -I/usr/lib/dbus-1.0/include -I/usr/include/glib-2.0 -I/usr/lib/glib-2.0/include -pipe -frecord-gcc-switches -Wall -g -O2 -march=i586 -mtune=generic -Wno-error=implicit-fallthrough -Wno-error=cast-function-type -c extensions.c -o extensions.o >/dev/null 2>&1
make[3]: Leaving directory '/usr/src/RPM/BUILD/telepathy-haze-0.8.0.1/extensions'
make[3]: Entering directory '/usr/src/RPM/BUILD/telepathy-haze-0.8.0.1/extensions'
/bin/sh ../libtool  --tag=CC   --mode=compile i586-alt-linux-gcc -DHAVE_CONFIG_H -I. -I..    -Wall -Wextra -Wdeclaration-after-statement -Wshadow -Wstrict-prototypes -Wmissing-prototypes -Wsign-compare -Wnested-externs -Wpointer-arith -Wformat-security -Winit-self -Wno-missing-field-initializers -Wno-unused-parameter -Wno-deprecated-declarations -Werror -Wno-error=missing-field-initializers -Wno-error=unused-parameter -Wno-error=deprecated-declarations -I/usr/include/dbus-1.0 -I/usr/lib/dbus-1.0/include -I/usr/include/glib-2.0 -I/usr/lib/glib-2.0/include -pthread -I/usr/include/telepathy-1.0 -I/usr/include/dbus-1.0 -I/usr/lib/dbus-1.0/include -I/usr/include/glib-2.0 -I/usr/lib/glib-2.0/include -pipe -frecord-gcc-switches -Wall -g -O2 -march=i586 -mtune=generic -Wno-error=implicit-fallthrough -Wno-error=cast-function-type -c -o signals-marshal.lo `test -f '_gen/signals-marshal.c' || echo './'`_gen/signals-marshal.c
libtool: compile:  i586-alt-linux-gcc -DHAVE_CONFIG_H -I. -I.. -Wall -Wextra -Wdeclaration-after-statement -Wshadow -Wstrict-prototypes -Wmissing-prototypes -Wsign-compare -Wnested-externs -Wpointer-arith -Wformat-security -Winit-self -Wno-missing-field-initializers -Wno-unused-parameter -Wno-deprecated-declarations -Werror -Wno-error=missing-field-initializers -Wno-error=unused-parameter -Wno-error=deprecated-declarations -I/usr/include/dbus-1.0 -I/usr/lib/dbus-1.0/include -I/usr/include/glib-2.0 -I/usr/lib/glib-2.0/include -pthread -I/usr/include/telepathy-1.0 -I/usr/include/dbus-1.0 -I/usr/lib/dbus-1.0/include -I/usr/include/glib-2.0 -I/usr/lib/glib-2.0/include -pipe -frecord-gcc-switches -Wall -g -O2 -march=i586 -mtune=generic -Wno-error=implicit-fallthrough -Wno-error=cast-function-type -c _gen/signals-marshal.c  -fPIC -DPIC -o .libs/signals-marshal.o
libtool: compile:  i586-alt-linux-gcc -DHAVE_CONFIG_H -I. -I.. -Wall -Wextra -Wdeclaration-after-statement -Wshadow -Wstrict-prototypes -Wmissing-prototypes -Wsign-compare -Wnested-externs -Wpointer-arith -Wformat-security -Winit-self -Wno-missing-field-initializers -Wno-unused-parameter -Wno-deprecated-declarations -Werror -Wno-error=missing-field-initializers -Wno-error=unused-parameter -Wno-error=deprecated-declarations -I/usr/include/dbus-1.0 -I/usr/lib/dbus-1.0/include -I/usr/include/glib-2.0 -I/usr/lib/glib-2.0/include -pthread -I/usr/include/telepathy-1.0 -I/usr/include/dbus-1.0 -I/usr/lib/dbus-1.0/include -I/usr/include/glib-2.0 -I/usr/lib/glib-2.0/include -pipe -frecord-gcc-switches -Wall -g -O2 -march=i586 -mtune=generic -Wno-error=implicit-fallthrough -Wno-error=cast-function-type -c _gen/signals-marshal.c -o signals-marshal.o >/dev/null 2>&1
make[3]: Leaving directory '/usr/src/RPM/BUILD/telepathy-haze-0.8.0.1/extensions'
make[3]: Entering directory '/usr/src/RPM/BUILD/telepathy-haze-0.8.0.1/extensions'
/bin/sh ../libtool  --tag=CC   --mode=compile i586-alt-linux-gcc -DHAVE_CONFIG_H -I. -I..    -Wall -Wextra -Wdeclaration-after-statement -Wshadow -Wstrict-prototypes -Wmissing-prototypes -Wsign-compare -Wnested-externs -Wpointer-arith -Wformat-security -Winit-self -Wno-missing-field-initializers -Wno-unused-parameter -Wno-deprecated-declarations -Werror -Wno-error=missing-field-initializers -Wno-error=unused-parameter -Wno-error=deprecated-declarations -I/usr/include/dbus-1.0 -I/usr/lib/dbus-1.0/include -I/usr/include/glib-2.0 -I/usr/lib/glib-2.0/include -pthread -I/usr/include/telepathy-1.0 -I/usr/include/dbus-1.0 -I/usr/lib/dbus-1.0/include -I/usr/include/glib-2.0 -I/usr/lib/glib-2.0/include -pipe -frecord-gcc-switches -Wall -g -O2 -march=i586 -mtune=generic -Wno-error=implicit-fallthrough -Wno-error=cast-function-type -c -o svc.lo `test -f '_gen/svc.c' || echo './'`_gen/svc.c
libtool: compile:  i586-alt-linux-gcc -DHAVE_CONFIG_H -I. -I.. -Wall -Wextra -Wdeclaration-after-statement -Wshadow -Wstrict-prototypes -Wmissing-prototypes -Wsign-compare -Wnested-externs -Wpointer-arith -Wformat-security -Winit-self -Wno-missing-field-initializers -Wno-unused-parameter -Wno-deprecated-declarations -Werror -Wno-error=missing-field-initializers -Wno-error=unused-parameter -Wno-error=deprecated-declarations -I/usr/include/dbus-1.0 -I/usr/lib/dbus-1.0/include -I/usr/include/glib-2.0 -I/usr/lib/glib-2.0/include -pthread -I/usr/include/telepathy-1.0 -I/usr/include/dbus-1.0 -I/usr/lib/dbus-1.0/include -I/usr/include/glib-2.0 -I/usr/lib/glib-2.0/include -pipe -frecord-gcc-switches -Wall -g -O2 -march=i586 -mtune=generic -Wno-error=implicit-fallthrough -Wno-error=cast-function-type -c _gen/svc.c  -fPIC -DPIC -o .libs/svc.o
libtool: compile:  i586-alt-linux-gcc -DHAVE_CONFIG_H -I. -I.. -Wall -Wextra -Wdeclaration-after-statement -Wshadow -Wstrict-prototypes -Wmissing-prototypes -Wsign-compare -Wnested-externs -Wpointer-arith -Wformat-security -Winit-self -Wno-missing-field-initializers -Wno-unused-parameter -Wno-deprecated-declarations -Werror -Wno-error=missing-field-initializers -Wno-error=unused-parameter -Wno-error=deprecated-declarations -I/usr/include/dbus-1.0 -I/usr/lib/dbus-1.0/include -I/usr/include/glib-2.0 -I/usr/lib/glib-2.0/include -pthread -I/usr/include/telepathy-1.0 -I/usr/include/dbus-1.0 -I/usr/lib/dbus-1.0/include -I/usr/include/glib-2.0 -I/usr/lib/glib-2.0/include -pipe -frecord-gcc-switches -Wall -g -O2 -march=i586 -mtune=generic -Wno-error=implicit-fallthrough -Wno-error=cast-function-type -c _gen/svc.c -o svc.o >/dev/null 2>&1
make[3]: Leaving directory '/usr/src/RPM/BUILD/telepathy-haze-0.8.0.1/extensions'
make[3]: Entering directory '/usr/src/RPM/BUILD/telepathy-haze-0.8.0.1/extensions'
/bin/sh ../libtool  --tag=CC   --mode=link i586-alt-linux-gcc -Wall -Wextra -Wdeclaration-after-statement -Wshadow -Wstrict-prototypes -Wmissing-prototypes -Wsign-compare -Wnested-externs -Wpointer-arith -Wformat-security -Winit-self -Wno-missing-field-initializers -Wno-unused-parameter -Wno-deprecated-declarations -Werror -Wno-error=missing-field-initializers -Wno-error=unused-parameter -Wno-error=deprecated-declarations -I/usr/include/dbus-1.0 -I/usr/lib/dbus-1.0/include -I/usr/include/glib-2.0 -I/usr/lib/glib-2.0/include -pthread -I/usr/include/telepathy-1.0 -I/usr/include/dbus-1.0 -I/usr/lib/dbus-1.0/include -I/usr/include/glib-2.0 -I/usr/lib/glib-2.0/include -pipe -frecord-gcc-switches -Wall -g -O2 -march=i586 -mtune=generic -Wno-error=implicit-fallthrough -Wno-error=cast-function-type @DBUS_LIBS@ -lgio-2.0 -lgobject-2.0 -lglib-2.0 -ltelepathy-glib -Wl,-O1 -o libhaze-extensions.la  extensions.lo signals-marshal.lo svc.lo  
libtool: link: ar cr .libs/libhaze-extensions.a .libs/extensions.o .libs/signals-marshal.o .libs/svc.o 
libtool: link: ranlib .libs/libhaze-extensions.a
libtool: link: ( cd ".libs" && rm -f "libhaze-extensions.la" && ln -s "../libhaze-extensions.la" "libhaze-extensions.la" )
make[3]: Leaving directory '/usr/src/RPM/BUILD/telepathy-haze-0.8.0.1/extensions'
Making all in src
make[2]: Entering directory '/usr/src/RPM/BUILD/telepathy-haze-0.8.0.1/src'
i586-alt-linux-gcc -DHAVE_CONFIG_H -I. -I..    -I.. -I.. -DG_LOG_DOMAIN=\"haze\" -Wall -Wextra -Wdeclaration-after-statement -Wshadow -Wstrict-prototypes -Wmissing-prototypes -Wsign-compare -Wnested-externs -Wpointer-arith -Wformat-security -Winit-self -Wno-missing-field-initializers -Wno-unused-parameter -Wno-deprecated-declarations -Werror -Wno-error=missing-field-initializers -Wno-error=unused-parameter -Wno-error=deprecated-declarations -I/usr/include/libpurple -I/usr/include/glib-2.0 -I/usr/lib/glib-2.0/include -pthread -I/usr/include/telepathy-1.0 -I/usr/include/dbus-1.0 -I/usr/lib/dbus-1.0/include -I/usr/include/glib-2.0 -I/usr/lib/glib-2.0/include -I/usr/include/dbus-1.0 -I/usr/lib/dbus-1.0/include -I/usr/include/glib-2.0 -I/usr/lib/glib-2.0/include -pthread -I/usr/include/glib-2.0 -I/usr/lib/glib-2.0/include -pipe -frecord-gcc-switches -Wall -g -O2 -march=i586 -mtune=generic -Wno-error=implicit-fallthrough -Wno-error=cast-function-type -c -o connection-manager.o connection-manager.c
connection-manager.c: In function 'haze_connection_manager_init':
connection-manager.c:109:13: error: G_ADD_PRIVATE [-Werror]
  109 |         HAZE_TYPE_CONNECTION_MANAGER, HazeConnectionManagerPrivate);
      |             ^~~~~~~~~~~~~~~
cc1: all warnings being treated as errors
make[2]: *** [Makefile:572: connection-manager.o] Error 1
make[2]: Leaving directory '/usr/src/RPM/BUILD/telepathy-haze-0.8.0.1/src'
make[2]: *** Waiting for unfinished jobs....
make[2]: Entering directory '/usr/src/RPM/BUILD/telepathy-haze-0.8.0.1/src'
i586-alt-linux-gcc -DHAVE_CONFIG_H -I. -I..    -I.. -I.. -DG_LOG_DOMAIN=\"haze\" -Wall -Wextra -Wdeclaration-after-statement -Wshadow -Wstrict-prototypes -Wmissing-prototypes -Wsign-compare -Wnested-externs -Wpointer-arith -Wformat-security -Winit-self -Wno-missing-field-initializers -Wno-unused-parameter -Wno-deprecated-declarations -Werror -Wno-error=missing-field-initializers -Wno-error=unused-parameter -Wno-error=deprecated-declarations -I/usr/include/libpurple -I/usr/include/glib-2.0 -I/usr/lib/glib-2.0/include -pthread -I/usr/include/telepathy-1.0 -I/usr/include/dbus-1.0 -I/usr/lib/dbus-1.0/include -I/usr/include/glib-2.0 -I/usr/lib/glib-2.0/include -I/usr/include/dbus-1.0 -I/usr/lib/dbus-1.0/include -I/usr/include/glib-2.0 -I/usr/lib/glib-2.0/include -pthread -I/usr/include/glib-2.0 -I/usr/lib/glib-2.0/include -pipe -frecord-gcc-switches -Wall -g -O2 -march=i586 -mtune=generic -Wno-error=implicit-fallthrough -Wno-error=cast-function-type -c -o connection-aliasing.o connection-aliasing.c
make[2]: Leaving directory '/usr/src/RPM/BUILD/telepathy-haze-0.8.0.1/src'
make[2]: Entering directory '/usr/src/RPM/BUILD/telepathy-haze-0.8.0.1/src'
i586-alt-linux-gcc -DHAVE_CONFIG_H -I. -I..    -I.. -I.. -DG_LOG_DOMAIN=\"haze\" -Wall -Wextra -Wdeclaration-after-statement -Wshadow -Wstrict-prototypes -Wmissing-prototypes -Wsign-compare -Wnested-externs -Wpointer-arith -Wformat-security -Winit-self -Wno-missing-field-initializers -Wno-unused-parameter -Wno-deprecated-declarations -Werror -Wno-error=missing-field-initializers -Wno-error=unused-parameter -Wno-error=deprecated-declarations -I/usr/include/libpurple -I/usr/include/glib-2.0 -I/usr/lib/glib-2.0/include -pthread -I/usr/include/telepathy-1.0 -I/usr/include/dbus-1.0 -I/usr/lib/dbus-1.0/include -I/usr/include/glib-2.0 -I/usr/lib/glib-2.0/include -I/usr/include/dbus-1.0 -I/usr/lib/dbus-1.0/include -I/usr/include/glib-2.0 -I/usr/lib/glib-2.0/include -pthread -I/usr/include/glib-2.0 -I/usr/lib/glib-2.0/include -pipe -frecord-gcc-switches -Wall -g -O2 -march=i586 -mtune=generic -Wno-error=implicit-fallthrough -Wno-error=cast-function-type -c -o connection-avatars.o connection-avatars.c
make[2]: Leaving directory '/usr/src/RPM/BUILD/telepathy-haze-0.8.0.1/src'
make[2]: Entering directory '/usr/src/RPM/BUILD/telepathy-haze-0.8.0.1/src'
i586-alt-linux-gcc -DHAVE_CONFIG_H -I. -I..    -I.. -I.. -DG_LOG_DOMAIN=\"haze\" -Wall -Wextra -Wdeclaration-after-statement -Wshadow -Wstrict-prototypes -Wmissing-prototypes -Wsign-compare -Wnested-externs -Wpointer-arith -Wformat-security -Winit-self -Wno-missing-field-initializers -Wno-unused-parameter -Wno-deprecated-declarations -Werror -Wno-error=missing-field-initializers -Wno-error=unused-parameter -Wno-error=deprecated-declarations -I/usr/include/libpurple -I/usr/include/glib-2.0 -I/usr/lib/glib-2.0/include -pthread -I/usr/include/telepathy-1.0 -I/usr/include/dbus-1.0 -I/usr/lib/dbus-1.0/include -I/usr/include/glib-2.0 -I/usr/lib/glib-2.0/include -I/usr/include/dbus-1.0 -I/usr/lib/dbus-1.0/include -I/usr/include/glib-2.0 -I/usr/lib/glib-2.0/include -pthread -I/usr/include/glib-2.0 -I/usr/lib/glib-2.0/include -pipe -frecord-gcc-switches -Wall -g -O2 -march=i586 -mtune=generic -Wno-error=implicit-fallthrough -Wno-error=cast-function-type -c -o main.o main.c
make[2]: Leaving directory '/usr/src/RPM/BUILD/telepathy-haze-0.8.0.1/src'
make[2]: Entering directory '/usr/src/RPM/BUILD/telepathy-haze-0.8.0.1/src'
i586-alt-linux-gcc -DHAVE_CONFIG_H -I. -I..    -I.. -I.. -DG_LOG_DOMAIN=\"haze\" -Wall -Wextra -Wdeclaration-after-statement -Wshadow -Wstrict-prototypes -Wmissing-prototypes -Wsign-compare -Wnested-externs -Wpointer-arith -Wformat-security -Winit-self -Wno-missing-field-initializers -Wno-unused-parameter -Wno-deprecated-declarations -Werror -Wno-error=missing-field-initializers -Wno-error=unused-parameter -Wno-error=deprecated-declarations -I/usr/include/libpurple -I/usr/include/glib-2.0 -I/usr/lib/glib-2.0/include -pthread -I/usr/include/telepathy-1.0 -I/usr/include/dbus-1.0 -I/usr/lib/dbus-1.0/include -I/usr/include/glib-2.0 -I/usr/lib/glib-2.0/include -I/usr/include/dbus-1.0 -I/usr/lib/dbus-1.0/include -I/usr/include/glib-2.0 -I/usr/lib/glib-2.0/include -pthread -I/usr/include/glib-2.0 -I/usr/lib/glib-2.0/include -pipe -frecord-gcc-switches -Wall -g -O2 -march=i586 -mtune=generic -Wno-error=implicit-fallthrough -Wno-error=cast-function-type -c -o connection-capabilities.o connection-capabilities.c
make[2]: Leaving directory '/usr/src/RPM/BUILD/telepathy-haze-0.8.0.1/src'
make[2]: Entering directory '/usr/src/RPM/BUILD/telepathy-haze-0.8.0.1/src'
i586-alt-linux-gcc -DHAVE_CONFIG_H -I. -I..    -I.. -I.. -DG_LOG_DOMAIN=\"haze\" -Wall -Wextra -Wdeclaration-after-statement -Wshadow -Wstrict-prototypes -Wmissing-prototypes -Wsign-compare -Wnested-externs -Wpointer-arith -Wformat-security -Winit-self -Wno-missing-field-initializers -Wno-unused-parameter -Wno-deprecated-declarations -Werror -Wno-error=missing-field-initializers -Wno-error=unused-parameter -Wno-error=deprecated-declarations -I/usr/include/libpurple -I/usr/include/glib-2.0 -I/usr/lib/glib-2.0/include -pthread -I/usr/include/telepathy-1.0 -I/usr/include/dbus-1.0 -I/usr/lib/dbus-1.0/include -I/usr/include/glib-2.0 -I/usr/lib/glib-2.0/include -I/usr/include/dbus-1.0 -I/usr/lib/dbus-1.0/include -I/usr/include/glib-2.0 -I/usr/lib/glib-2.0/include -pthread -I/usr/include/glib-2.0 -I/usr/lib/glib-2.0/include -pipe -frecord-gcc-switches -Wall -g -O2 -march=i586 -mtune=generic -Wno-error=implicit-fallthrough -Wno-error=cast-function-type -c -o debug.o debug.c
make[2]: Leaving directory '/usr/src/RPM/BUILD/telepathy-haze-0.8.0.1/src'
make[2]: Entering directory '/usr/src/RPM/BUILD/telepathy-haze-0.8.0.1/src'
i586-alt-linux-gcc -DHAVE_CONFIG_H -I. -I..    -I.. -I.. -DG_LOG_DOMAIN=\"haze\" -Wall -Wextra -Wdeclaration-after-statement -Wshadow -Wstrict-prototypes -Wmissing-prototypes -Wsign-compare -Wnested-externs -Wpointer-arith -Wformat-security -Winit-self -Wno-missing-field-initializers -Wno-unused-parameter -Wno-deprecated-declarations -Werror -Wno-error=missing-field-initializers -Wno-error=unused-parameter -Wno-error=deprecated-declarations -I/usr/include/libpurple -I/usr/include/glib-2.0 -I/usr/lib/glib-2.0/include -pthread -I/usr/include/telepathy-1.0 -I/usr/include/dbus-1.0 -I/usr/lib/dbus-1.0/include -I/usr/include/glib-2.0 -I/usr/lib/glib-2.0/include -I/usr/include/dbus-1.0 -I/usr/lib/dbus-1.0/include -I/usr/include/glib-2.0 -I/usr/lib/glib-2.0/include -pthread -I/usr/include/glib-2.0 -I/usr/lib/glib-2.0/include -pipe -frecord-gcc-switches -Wall -g -O2 -march=i586 -mtune=generic -Wno-error=implicit-fallthrough -Wno-error=cast-function-type -c -o connection-presence.o connection-presence.c
make[2]: Leaving directory '/usr/src/RPM/BUILD/telepathy-haze-0.8.0.1/src'
make[2]: Entering directory '/usr/src/RPM/BUILD/telepathy-haze-0.8.0.1/src'
i586-alt-linux-gcc -DHAVE_CONFIG_H -I. -I..    -I.. -I.. -DG_LOG_DOMAIN=\"haze\" -Wall -Wextra -Wdeclaration-after-statement -Wshadow -Wstrict-prototypes -Wmissing-prototypes -Wsign-compare -Wnested-externs -Wpointer-arith -Wformat-security -Winit-self -Wno-missing-field-initializers -Wno-unused-parameter -Wno-deprecated-declarations -Werror -Wno-error=missing-field-initializers -Wno-error=unused-parameter -Wno-error=deprecated-declarations -I/usr/include/libpurple -I/usr/include/glib-2.0 -I/usr/lib/glib-2.0/include -pthread -I/usr/include/telepathy-1.0 -I/usr/include/dbus-1.0 -I/usr/lib/dbus-1.0/include -I/usr/include/glib-2.0 -I/usr/lib/glib-2.0/include -I/usr/include/dbus-1.0 -I/usr/lib/dbus-1.0/include -I/usr/include/glib-2.0 -I/usr/lib/glib-2.0/include -pthread -I/usr/include/glib-2.0 -I/usr/lib/glib-2.0/include -pipe -frecord-gcc-switches -Wall -g -O2 -march=i586 -mtune=generic -Wno-error=implicit-fallthrough -Wno-error=cast-function-type -c -o connection-mail.o connection-mail.c
make[2]: Leaving directory '/usr/src/RPM/BUILD/telepathy-haze-0.8.0.1/src'
make[1]: *** [Makefile:433: all-recursive] Error 1
make: *** [Makefile:364: all] Error 2
error: Bad exit status from /usr/src/tmp/rpm-tmp.21358 (%build)


RPM build errors:
    Bad exit status from /usr/src/tmp/rpm-tmp.21358 (%build)
Command exited with non-zero status 1
24.04user 4.11system 0:30.04elapsed 93%CPU (0avgtext+0avgdata 43844maxresident)k
0inputs+0outputs (0major+755628minor)pagefaults 0swaps
hsh-rebuild: rebuild of `telepathy-haze-0.8.0.1-alt0.7.src.rpm' failed.
Command exited with non-zero status 1
38.78user 10.21system 0:52.06elapsed 94%CPU (0avgtext+0avgdata 109340maxresident)k
2656inputs+0outputs (0major+1098131minor)pagefaults 0swaps