<86>Dec 16 10:56:55 userdel[96028]: delete user 'rooter'
<86>Dec 16 10:56:55 userdel[96028]: removed group 'rooter' owned by 'rooter'
<86>Dec 16 10:56:55 userdel[96028]: removed shadow group 'rooter' owned by 'rooter'
<86>Dec 16 10:56:55 groupadd[96036]: group added to /etc/group: name=rooter, GID=573
<86>Dec 16 10:56:55 groupadd[96036]: group added to /etc/gshadow: name=rooter
<86>Dec 16 10:56:55 groupadd[96036]: new group: name=rooter, GID=573
<86>Dec 16 10:56:55 useradd[96044]: new user: name=rooter, UID=573, GID=573, home=/root, shell=/bin/bash
<86>Dec 16 10:56:55 userdel[96055]: delete user 'builder'
<86>Dec 16 10:56:55 userdel[96055]: removed group 'builder' owned by 'builder'
<86>Dec 16 10:56:55 userdel[96055]: removed shadow group 'builder' owned by 'builder'
<86>Dec 16 10:56:55 groupadd[96062]: group added to /etc/group: name=builder, GID=574
<86>Dec 16 10:56:55 groupadd[96062]: group added to /etc/gshadow: name=builder
<86>Dec 16 10:56:55 groupadd[96062]: new group: name=builder, GID=574
<86>Dec 16 10:56:55 useradd[96068]: new user: name=builder, UID=574, GID=574, home=/usr/src, shell=/bin/bash
/usr/src/in/srpm/qoauth-qt5-2.0.1-alt2.3.src.rpm: The use of such a license name is ambiguous: GPL
warning: Macro %qmake_qt5 not found
warning: Macro %installqt5 not found
warning: Macro %_qt5_archdatadir not found
warning: Macro %ubt not found
warning: Macro %ubt not found
warning: Macro %ubt not found
<13>Dec 16 10:56:59 rpmi: libxkbcommon-0.9.1-alt1 sisyphus+239553.100.1.1 1571659627 installed
<13>Dec 16 10:56:59 rpmi: libglvnd-7:1.2.0-alt4 sisyphus+241659.100.1.1 1574755345 installed
<13>Dec 16 10:56:59 rpmi: libexpat-2.2.4-alt1 1503305345 installed
<13>Dec 16 10:56:59 rpmi: qt5-base-common-5.12.5-alt2 sisyphus+241679.100.1.1 1574765435 installed
<13>Dec 16 10:56:59 rpmi: libmtdev-1.1.5-alt1 sisyphus+220715.100.1.1 1549364509 installed
<13>Dec 16 10:56:59 rpmi: udev-rules-1:244-alt1 sisyphus+242291.100.1.1 1575476449 installed
<13>Dec 16 10:56:59 rpmi: libpng16-1.6.37-alt1 sisyphus+236677.100.2.1 1566917998 installed
<13>Dec 16 10:56:59 rpmi: libICE-1.0.9-alt1 1409902721 installed
<13>Dec 16 10:56:59 rpmi: libwayland-server-1.17.0-alt1 sisyphus+225894.100.1.1 1553872805 installed
<13>Dec 16 10:56:59 rpmi: libSM-1.2.3-alt1 sisyphus+226734.100.2.1 1554586158 installed
<13>Dec 16 10:56:59 rpmi: rpm-macros-qt5-5.12.5-alt2 sisyphus+241679.100.1.1 1574765577 installed
<13>Dec 16 10:56:59 rpmi: libGLES-7:1.2.0-alt4 sisyphus+241659.100.1.1 1574755345 installed
<13>Dec 16 10:56:59 rpmi: libOpenGL-7:1.2.0-alt4 sisyphus+241659.100.1.1 1574755345 installed
<13>Dec 16 10:56:59 rpmi: libts-1.0-alt1.qa1 1366249315 installed
<13>Dec 16 10:56:59 rpmi: libsqlite3-3.30.1-alt3 sisyphus+242073.100.1.1 1575236094 installed
<13>Dec 16 10:56:59 rpmi: xxd-4:8.1.2120-alt1 sisyphus+238838.100.1.1 1570455542 installed
<13>Dec 16 10:56:59 rpmi: libproxy-0.4.15-alt3 sisyphus+227885.100.1.2 1555818599 installed
<13>Dec 16 10:56:59 rpmi: libpcre2-10.34-alt1 sisyphus+241619.100.1.1 1574686794 installed
<13>Dec 16 10:56:59 rpmi: libjpeg-2:2.0.2-alt1 sisyphus+226996.100.1.1 1554902907 installed
<13>Dec 16 10:56:59 rpmi: libwacom-data-1.1-alt1 sisyphus+238155.300.2.1 1569408114 installed
<13>Dec 16 10:57:00 rpmi: libicu65-1:6.5.1-alt1 sisyphus+238768.100.16.1 1571427455 installed
<13>Dec 16 10:57:01 rpmi: libqt5-core-5.12.5-alt2 sisyphus+241679.100.1.1 1574765435 installed
<13>Dec 16 10:57:01 rpmi: libqt5-sql-5.12.5-alt2 sisyphus+241679.100.1.1 1574765435 installed
<13>Dec 16 10:57:01 rpmi: libqt5-xml-5.12.5-alt2 sisyphus+241679.100.1.1 1574765435 installed
<13>Dec 16 10:57:01 rpmi: libqt5-concurrent-5.12.5-alt2 sisyphus+241679.100.1.1 1574765435 installed
<13>Dec 16 10:57:01 rpmi: libqt5-test-5.12.5-alt2 sisyphus+241679.100.1.1 1574765435 installed
<13>Dec 16 10:57:01 rpmi: libgudev-1:233-alt1 sisyphus+235422.100.1.1 1564855273 installed
<13>Dec 16 10:57:01 rpmi: libwacom-1.1-alt1 sisyphus+238155.300.2.1 1569408208 installed
<13>Dec 16 10:57:01 rpmi: libgraphite2-1.3.13-alt2 sisyphus+226799.100.1.1 1554648241 installed
<13>Dec 16 10:57:01 rpmi: libharfbuzz-2.6.4-alt1 sisyphus+240033.100.1.1 1572506773 installed
<13>Dec 16 10:57:01 rpmi: libfreetype-2.10.1-alt1 sisyphus+237471.100.1.1 1568276356 installed
<13>Dec 16 10:57:01 rpmi: fontconfig-2.13.1-alt1 sisyphus+226691.100.2.2 1554598726 installed
Updating fonts cache: <29>Dec 16 10:57:02 fontconfig: Updating fonts cache: succeeded
[ DONE ]
<13>Dec 16 10:57:02 rpmi: libevdev-1.8.0-alt1 sisyphus+236608.100.1.1 1566815743 installed
<13>Dec 16 10:57:02 rpmi: libinput-1.14.3-alt1 sisyphus+239829.100.1.1 1572245315 installed
<13>Dec 16 10:57:02 rpmi: liblz4-1:1.9.2-alt1 sisyphus+238585.100.2.2 1570066927 installed
<13>Dec 16 10:57:02 rpmi: libgpg-error-1.36-alt1 sisyphus+225621.300.1.1 1553521082 installed
<13>Dec 16 10:57:02 rpmi: libgcrypt20-1.8.5-alt3 sisyphus+239622.100.1.1 1571746654 installed
<13>Dec 16 10:57:02 rpmi: libsystemd-1:244-alt1 sisyphus+242291.100.1.1 1575476478 installed
<13>Dec 16 10:57:02 rpmi: libdbus-1.12.16-alt2 sisyphus+240566.100.2.1 1573547696 installed
<13>Dec 16 10:57:02 rpmi: libavahi-0.7-alt1 sisyphus+237493.100.1.1 1568299481 installed
<13>Dec 16 10:57:02 rpmi: libcups-2.2.12-alt4 sisyphus+242884.100.1.1 1576235865 installed
<13>Dec 16 10:57:02 rpmi: libqt5-dbus-5.12.5-alt2 sisyphus+241679.100.1.1 1574765435 installed
<13>Dec 16 10:57:02 rpmi: xorg-proto-devel-2019.1-alt1 sisyphus+232786.100.1.1 1561106722 installed
<13>Dec 16 10:57:02 rpmi: libxshmfence-1.3-alt1 sisyphus+223149.1000.2.1 1551268571 installed
<13>Dec 16 10:57:02 rpmi: libX11-locales-3:1.6.9-alt1 sisyphus+239210.100.1.1 1571056781 installed
<13>Dec 16 10:57:02 rpmi: libXdmcp-1.1.3-alt1 sisyphus+225206.600.1.2 1552949353 installed
<13>Dec 16 10:57:02 rpmi: libXau-1.0.9-alt1 sisyphus+223149.200.2.1 1551268152 installed
<13>Dec 16 10:57:02 rpmi: libxcb-1.13.1-alt1 sisyphus+226527.100.2.2 1554593801 installed
<13>Dec 16 10:57:02 rpmi: libX11-3:1.6.9-alt1 sisyphus+239210.100.1.1 1571056801 installed
<13>Dec 16 10:57:02 rpmi: libXext-1.3.4-alt1 sisyphus+225206.700.1.2 1552949429 installed
<13>Dec 16 10:57:02 rpmi: libXxf86vm-1.1.4-alt2 1527672187 installed
<13>Dec 16 10:57:02 rpmi: libXdamage-1.1.5-alt1 sisyphus+225206.500.1.2 1552949286 installed
<13>Dec 16 10:57:02 rpmi: libXfixes-5.0.3-alt1 sisyphus+226736.100.2.2 1554614841 installed
<13>Dec 16 10:57:02 rpmi: libXrender-0.9.8-alt1 1371312112 installed
<13>Dec 16 10:57:04 rpmi: libxcb-devel-1.13.1-alt1 sisyphus+226527.100.2.2 1554593801 installed
<13>Dec 16 10:57:04 rpmi: libX11-devel-3:1.6.9-alt1 sisyphus+239210.100.1.1 1571056801 installed
<13>Dec 16 10:57:04 rpmi: libxcbutil-icccm-0.4.1-alt2 sisyphus+229000.100.1.1 1557152221 installed
<13>Dec 16 10:57:04 rpmi: libxcbutil-1:0.4.0-alt1 1413392888 installed
<13>Dec 16 10:57:04 rpmi: libxcbutil-image-0.4.0-alt1 1446204182 installed
<13>Dec 16 10:57:04 rpmi: libxcbutil-keysyms-0.4.0-alt1 1446204124 installed
<13>Dec 16 10:57:04 rpmi: libxcb-render-util-0.3.9-alt3 sisyphus+222674.100.1.1 1550989886 installed
<13>Dec 16 10:57:04 rpmi: libxkbcommon-x11-0.9.1-alt1 sisyphus+239553.100.1.1 1571659627 installed
<13>Dec 16 10:57:04 rpmi: libwayland-client-1.17.0-alt1 sisyphus+225894.100.1.1 1553872805 installed
<13>Dec 16 10:57:04 rpmi: libpciaccess-1:0.16-alt1 sisyphus+234814.100.1.1 1563438291 installed
<13>Dec 16 10:57:04 rpmi: libdrm-1:2.4.100-alt1 sisyphus+240099.100.1.1 1572599774 installed
<13>Dec 16 10:57:04 rpmi: libGLX-mesa-4:19.2.7-alt1 sisyphus+242428.100.1.2 1575624348 installed
<13>Dec 16 10:57:04 rpmi: libgbm-4:19.2.7-alt1 sisyphus+242428.100.1.2 1575624348 installed
<13>Dec 16 10:57:04 rpmi: libEGL-mesa-4:19.2.7-alt1 sisyphus+242428.100.1.2 1575624348 installed
<13>Dec 16 10:57:04 rpmi: libEGL-7:1.2.0-alt4 sisyphus+241659.100.1.1 1574755345 installed
<13>Dec 16 10:57:04 rpmi: libGLX-7:1.2.0-alt4 sisyphus+241659.100.1.1 1574755345 installed
<13>Dec 16 10:57:04 rpmi: libGL-7:1.2.0-alt4 sisyphus+241659.100.1.1 1574755345 installed
<13>Dec 16 10:57:04 rpmi: libglvnd-devel-7:1.2.0-alt4 sisyphus+241659.100.1.1 1574755345 installed
<13>Dec 16 10:57:04 rpmi: gcc-c++-common-1.4.24-alt3 sisyphus+243033.100.1.1 1576462403 installed
<13>Dec 16 10:57:05 rpmi: libstdc++9-devel-9.2.1-alt2 sisyphus+240563.200.2.1 1573479396 installed
<13>Dec 16 10:57:06 rpmi: gcc9-c++-9.2.1-alt2 sisyphus+240563.200.2.1 1573479396 installed
<13>Dec 16 10:57:06 rpmi: gcc-c++-9-alt1 sisyphus+239632.300.3.1 1571788297 installed
<13>Dec 16 10:57:06 rpmi: libp11-kit-0.23.15-alt1 sisyphus+226408.100.2.1 1554288204 installed
<13>Dec 16 10:57:06 rpmi: libtasn1-4.15.0-alt1 sisyphus+241940.100.1.1 1574959866 installed
<13>Dec 16 10:57:06 rpmi: rpm-macros-alternatives-0.5.1-alt1 sisyphus+226946.100.1.1 1554830426 installed
<13>Dec 16 10:57:06 rpmi: alternatives-0.5.1-alt1 sisyphus+226946.100.1.1 1554830426 installed
<13>Dec 16 10:57:06 rpmi: ca-certificates-2019.10.28-alt1 sisyphus+239875.300.1.1 1572267834 installed
<13>Dec 16 10:57:06 rpmi: ca-trust-0.1.2-alt1 sisyphus+233348.100.1.1 1561653823 installed
<13>Dec 16 10:57:06 rpmi: p11-kit-trust-0.23.15-alt1 sisyphus+226408.100.2.1 1554288204 installed
<13>Dec 16 10:57:06 rpmi: libcrypto1.1-1.1.1d-alt1.1 sisyphus+237931.100.2.1 1569235729 installed
<13>Dec 16 10:57:07 rpmi: libssl1.1-1.1.1d-alt1.1 sisyphus+237931.100.2.1 1569235729 installed
<13>Dec 16 10:57:07 rpmi: libqt5-network-5.12.5-alt2 sisyphus+241679.100.1.1 1574765435 installed
<13>Dec 16 10:57:07 rpmi: libqt5-eglfsdeviceintegration-5.12.5-alt2 sisyphus+241679.100.1.1 1574765435 installed
<13>Dec 16 10:57:07 rpmi: libqt5-xcbqpa-5.12.5-alt2 sisyphus+241679.100.1.1 1574765435 installed
<13>Dec 16 10:57:07 rpmi: libqt5-eglfskmssupport-5.12.5-alt2 sisyphus+241679.100.1.1 1574765435 installed
<13>Dec 16 10:57:07 rpmi: libqt5-gui-5.12.5-alt2 sisyphus+241679.100.1.1 1574765435 installed
<13>Dec 16 10:57:07 rpmi: libqt5-widgets-5.12.5-alt2 sisyphus+241679.100.1.1 1574765435 installed
<13>Dec 16 10:57:07 rpmi: libqt5-opengl-5.12.5-alt2 sisyphus+241679.100.1.1 1574765435 installed
<13>Dec 16 10:57:07 rpmi: libqt5-printsupport-5.12.5-alt2 sisyphus+241679.100.1.1 1574765435 installed
<13>Dec 16 10:57:08 rpmi: qt5-base-devel-5.12.5-alt2 sisyphus+241679.100.1.1 1574765435 installed
<13>Dec 16 10:57:08 rpmi: libqca-qt5-2.2.0-alt0.2 sisyphus+232355.100.1.1 1560782671 installed
<13>Dec 16 10:57:08 rpmi: libqca-qt5-devel-2.2.0-alt0.2 sisyphus+232355.100.1.1 1560782671 installed
<13>Dec 16 10:57:09 rpmi: doxygen-1:1.8.15-alt1 sisyphus+220984.100.1.2 1549663873 installed
warning: Macro %ubt not found
warning: Macro %ubt not found
warning: Macro %ubt not found
Building target platforms: i586
Building for target i586
Wrote: /usr/src/in/nosrpm/qoauth-qt5-2.0.1-alt2.3.nosrc.rpm
warning: Macro %ubt not found
warning: Macro %ubt not found
warning: Macro %ubt not found
Installing qoauth-qt5-2.0.1-alt2.3.src.rpm
Building target platforms: i586
Building for target i586
Executing(%prep): /bin/sh -e /usr/src/tmp/rpm-tmp.86172
+ umask 022
+ /bin/mkdir -p /usr/src/RPM/BUILD
+ cd /usr/src/RPM/BUILD
+ cd /usr/src/RPM/BUILD
+ rm -rf qoauth-qt5-2.0.1
+ echo 'Source #0 (qoauth-qt5-2.0.1.tar):'
Source #0 (qoauth-qt5-2.0.1.tar):
+ /bin/tar -xf /usr/src/RPM/SOURCES/qoauth-qt5-2.0.1.tar
+ cd qoauth-qt5-2.0.1
+ /bin/chmod -c -Rf u+rwX,go-w .
+ echo 'Patch #1 (alt-pcfile-qt5.patch):'
Patch #1 (alt-pcfile-qt5.patch):
+ /usr/bin/patch -p1
patching file src/pcfile.sh
+ echo 'Patch #2 (alt-linstall-lib.patch):'
Patch #2 (alt-linstall-lib.patch):
+ /usr/bin/patch -p1
patching file src/src.pro
+ sed -i -e 's|/lib|/lib|g' src/pcfile.sh
+ __qmake_qt5 qoauth.pro
+ export 'CPPFLAGS=-pipe -frecord-gcc-switches -Wall -g -O2 -march=i586 -mtune=generic -fPIC -DPIC'
+ CPPFLAGS='-pipe -frecord-gcc-switches -Wall -g -O2 -march=i586 -mtune=generic -fPIC -DPIC'
+ /usr/share/qt5/bin/qmake 'QMAKE_CFLAGS=-pipe -frecord-gcc-switches -Wall -g -O2 -march=i586 -mtune=generic -fPIC -DPIC' 'QMAKE_CXXFLAGS=-pipe -frecord-gcc-switches -Wall -g -O2 -march=i586 -mtune=generic -fPIC -DPIC' qoauth.pro
Info: creating stash file /usr/src/RPM/BUILD/qoauth-qt5-2.0.1/.qmake.stash
+ exit 0
Executing(%build): /bin/sh -e /usr/src/tmp/rpm-tmp.86172
+ umask 022
+ /bin/mkdir -p /usr/src/RPM/BUILD
+ cd /usr/src/RPM/BUILD
+ cd qoauth-qt5-2.0.1
+ make -j8
cd src/ && ( test -e Makefile || /usr/share/qt5/bin/qmake -o Makefile /usr/src/RPM/BUILD/qoauth-qt5-2.0.1/src/src.pro 'QMAKE_CFLAGS=-pipe -frecord-gcc-switches -Wall -g -O2 -march=i586 -mtune=generic -fPIC -DPIC' 'QMAKE_CXXFLAGS=-pipe -frecord-gcc-switches -Wall -g -O2 -march=i586 -mtune=generic -fPIC -DPIC' ) && make -f Makefile 
make[1]: Entering directory '/usr/src/RPM/BUILD/qoauth-qt5-2.0.1/src'
g++ -pipe -frecord-gcc-switches -Wall -g -O2 -march=i586 -mtune=generic -fPIC -DPIC -O2 -Wall -W -dM -E -o moc_predefs.h /usr/lib/qt5/mkspecs/features/data/dummy.cpp
make[1]: Leaving directory '/usr/src/RPM/BUILD/qoauth-qt5-2.0.1/src'
make[1]: Entering directory '/usr/src/RPM/BUILD/qoauth-qt5-2.0.1/src'
/usr/share/qt5/bin/moc -DQOAUTH -DQT_NO_DEBUG -DQT_NETWORK_LIB -DQT_CORE_LIB --include /usr/src/RPM/BUILD/qoauth-qt5-2.0.1/src/moc_predefs.h -I/usr/lib/qt5/mkspecs/linux-g++ -I/usr/src/RPM/BUILD/qoauth-qt5-2.0.1/src -I/usr/src/RPM/BUILD/qoauth-qt5-2.0.1/src -I/usr/src/RPM/BUILD/qoauth-qt5-2.0.1/src -I/usr/include/qt5/Qca-qt5/QtCrypto -I/usr/include/qt5 -I/usr/include/qt5/QtNetwork -I/usr/include/qt5/QtCore -I/usr/include/c++/9 -I/usr/include/c++/9/i586-alt-linux -I/usr/include/c++/9/backward -I/usr/lib/gcc/i586-alt-linux/9/include -I/usr/local/include -I/usr/include interface.h -o moc_interface.cpp
make[1]: Leaving directory '/usr/src/RPM/BUILD/qoauth-qt5-2.0.1/src'
make[1]: Entering directory '/usr/src/RPM/BUILD/qoauth-qt5-2.0.1/src'
g++ -c -pipe -frecord-gcc-switches -Wall -g -O2 -march=i586 -mtune=generic -fPIC -DPIC -O2 -Wall -W -D_REENTRANT -fPIC -DQOAUTH -DQT_NO_DEBUG -DQT_NETWORK_LIB -DQT_CORE_LIB -I. -I. -I. -isystem /usr/include/qt5/Qca-qt5/QtCrypto -isystem /usr/include/qt5 -isystem /usr/include/qt5/QtNetwork -isystem /usr/include/qt5/QtCore -I. -I/usr/lib/qt5/mkspecs/linux-g++ -o ./interface.o interface.cpp
interface.cpp: In member function 'void QOAuth::InterfacePrivate::_q_parseReply(QNetworkReply*)':
interface.cpp:322:9: warning: this statement may fall through [-Wimplicit-fallthrough=]
  322 |         if ( !replyParams.contains( InterfacePrivate::ParamTokenSecret ) ) {
      |         ^~
interface.cpp:326:5: note: here
  326 |     case BadRequest:
      |     ^~~~
interface.cpp: In member function 'QByteArray QOAuth::InterfacePrivate::paramsToString(const ParamMap&, QOAuth::ParsingMode)':
interface.cpp:354:25: warning: this statement may fall through [-Wimplicit-fallthrough=]
  354 |         prependString = "?";
      |                         ^~~
interface.cpp:355:5: note: here
  355 |     case ParseForRequestContent:
      |     ^~~~
make[1]: Leaving directory '/usr/src/RPM/BUILD/qoauth-qt5-2.0.1/src'
make[1]: Entering directory '/usr/src/RPM/BUILD/qoauth-qt5-2.0.1/src'
rm -f libqoauth.so.2.0.0 libqoauth.so libqoauth.so.2 libqoauth.so.2.0
g++ -Wl,-O1 -shared -Wl,-soname,libqoauth.so.2 -o libqoauth.so.2.0.0 ./interface.o  -L/usr/lib -lqca-qt5 /usr/lib/libQt5Network.so /usr/lib/libQt5Core.so -lpthread    
ln -s libqoauth.so.2.0.0 libqoauth.so
ln -s libqoauth.so.2.0.0 libqoauth.so.2
ln -s libqoauth.so.2.0.0 libqoauth.so.2.0
rm -f ../lib/libqoauth.so.2.0.0
mv -f libqoauth.so.2.0.0 ../lib/libqoauth.so.2.0.0
rm -f ../lib/libqoauth.so
rm -f ../lib/libqoauth.so.2
rm -f ../lib/libqoauth.so.2.0
mv -f libqoauth.so ../lib/libqoauth.so
mv -f libqoauth.so.2 ../lib/libqoauth.so.2
mv -f libqoauth.so.2.0 ../lib/libqoauth.so.2.0
make[1]: Leaving directory '/usr/src/RPM/BUILD/qoauth-qt5-2.0.1/src'
cd tests/ && ( test -e Makefile || /usr/share/qt5/bin/qmake -o Makefile /usr/src/RPM/BUILD/qoauth-qt5-2.0.1/tests/tests.pro 'QMAKE_CFLAGS=-pipe -frecord-gcc-switches -Wall -g -O2 -march=i586 -mtune=generic -fPIC -DPIC' 'QMAKE_CXXFLAGS=-pipe -frecord-gcc-switches -Wall -g -O2 -march=i586 -mtune=generic -fPIC -DPIC' ) && make -f Makefile 
cd ft_interface/ && ( test -e Makefile || /usr/share/qt5/bin/qmake -o Makefile /usr/src/RPM/BUILD/qoauth-qt5-2.0.1/tests/ft_interface/ft_interface.pro 'QMAKE_CFLAGS=-pipe -frecord-gcc-switches -Wall -g -O2 -march=i586 -mtune=generic -fPIC -DPIC' 'QMAKE_CXXFLAGS=-pipe -frecord-gcc-switches -Wall -g -O2 -march=i586 -mtune=generic -fPIC -DPIC' ) && make -f Makefile 
cd ut_interface/ && ( test -e Makefile || /usr/share/qt5/bin/qmake -o Makefile /usr/src/RPM/BUILD/qoauth-qt5-2.0.1/tests/ut_interface/ut_interface.pro 'QMAKE_CFLAGS=-pipe -frecord-gcc-switches -Wall -g -O2 -march=i586 -mtune=generic -fPIC -DPIC' 'QMAKE_CXXFLAGS=-pipe -frecord-gcc-switches -Wall -g -O2 -march=i586 -mtune=generic -fPIC -DPIC' ) && make -f Makefile 
make[2]: Entering directory '/usr/src/RPM/BUILD/qoauth-qt5-2.0.1/tests/ut_interface'
g++ -pipe -frecord-gcc-switches -Wall -g -O2 -march=i586 -mtune=generic -fPIC -DPIC -O2 -Wall -W -dM -E -o moc_predefs.h /usr/lib/qt5/mkspecs/features/data/dummy.cpp
make[2]: Leaving directory '/usr/src/RPM/BUILD/qoauth-qt5-2.0.1/tests/ut_interface'
make[2]: Entering directory '/usr/src/RPM/BUILD/qoauth-qt5-2.0.1/tests/ft_interface'
g++ -pipe -frecord-gcc-switches -Wall -g -O2 -march=i586 -mtune=generic -fPIC -DPIC -O2 -Wall -W -dM -E -o moc_predefs.h /usr/lib/qt5/mkspecs/features/data/dummy.cpp
make[2]: Leaving directory '/usr/src/RPM/BUILD/qoauth-qt5-2.0.1/tests/ft_interface'
make[2]: Entering directory '/usr/src/RPM/BUILD/qoauth-qt5-2.0.1/tests/ft_interface'
/usr/share/qt5/bin/moc -DUNIT_TEST -DQT_NO_DEBUG -DQT_TESTLIB_LIB -DQT_NETWORK_LIB -DQT_CORE_LIB -DQT_TESTCASE_BUILDDIR='"/usr/src/RPM/BUILD/qoauth-qt5-2.0.1/tests/ft_interface"' --include /usr/src/RPM/BUILD/qoauth-qt5-2.0.1/tests/ft_interface/moc_predefs.h -I/usr/lib/qt5/mkspecs/linux-g++ -I/usr/src/RPM/BUILD/qoauth-qt5-2.0.1/tests/ft_interface -I/usr/src/RPM/BUILD/qoauth-qt5-2.0.1/include -I/usr/src/RPM/BUILD/qoauth-qt5-2.0.1/tests/ft_interface -I/usr/src/RPM/BUILD/qoauth-qt5-2.0.1/src -I/usr/include/qt5/Qca-qt5/QtCrypto -I/usr/include/qt5 -I/usr/include/qt5/QtTest -I/usr/include/qt5/QtNetwork -I/usr/include/qt5/QtCore -I/usr/include/c++/9 -I/usr/include/c++/9/i586-alt-linux -I/usr/include/c++/9/backward -I/usr/lib/gcc/i586-alt-linux/9/include -I/usr/local/include -I/usr/include ft_interface.h -o moc_ft_interface.cpp
make[2]: Leaving directory '/usr/src/RPM/BUILD/qoauth-qt5-2.0.1/tests/ft_interface'
make[2]: Entering directory '/usr/src/RPM/BUILD/qoauth-qt5-2.0.1/tests/ut_interface'
/usr/share/qt5/bin/moc -DUNIT_TEST -DQT_NO_DEBUG -DQT_TESTLIB_LIB -DQT_NETWORK_LIB -DQT_CORE_LIB -DQT_TESTCASE_BUILDDIR='"/usr/src/RPM/BUILD/qoauth-qt5-2.0.1/tests/ut_interface"' --include /usr/src/RPM/BUILD/qoauth-qt5-2.0.1/tests/ut_interface/moc_predefs.h -I/usr/lib/qt5/mkspecs/linux-g++ -I/usr/src/RPM/BUILD/qoauth-qt5-2.0.1/tests/ut_interface -I/usr/src/RPM/BUILD/qoauth-qt5-2.0.1/include -I/usr/src/RPM/BUILD/qoauth-qt5-2.0.1/tests/ut_interface -I/usr/src/RPM/BUILD/qoauth-qt5-2.0.1/src -I/usr/include/qt5/Qca-qt5/QtCrypto -I/usr/include/qt5 -I/usr/include/qt5/QtTest -I/usr/include/qt5/QtNetwork -I/usr/include/qt5/QtCore -I/usr/include/c++/9 -I/usr/include/c++/9/i586-alt-linux -I/usr/include/c++/9/backward -I/usr/lib/gcc/i586-alt-linux/9/include -I/usr/local/include -I/usr/include ut_interface.h -o moc_ut_interface.cpp
make[2]: Leaving directory '/usr/src/RPM/BUILD/qoauth-qt5-2.0.1/tests/ut_interface'
make[2]: Entering directory '/usr/src/RPM/BUILD/qoauth-qt5-2.0.1/tests/ft_interface'
g++ -c -pipe -frecord-gcc-switches -Wall -g -O2 -march=i586 -mtune=generic -fPIC -DPIC -O2 -Wall -W -D_REENTRANT -fPIC -DUNIT_TEST -DQT_NO_DEBUG -DQT_TESTLIB_LIB -DQT_NETWORK_LIB -DQT_CORE_LIB -DQT_TESTCASE_BUILDDIR='"/usr/src/RPM/BUILD/qoauth-qt5-2.0.1/tests/ft_interface"' -I. -I../../include -I. -I../../src -isystem /usr/include/qt5/Qca-qt5/QtCrypto -isystem /usr/include/qt5 -isystem /usr/include/qt5/QtTest -isystem /usr/include/qt5/QtNetwork -isystem /usr/include/qt5/QtCore -I. -I/usr/lib/qt5/mkspecs/linux-g++ -o moc_ft_interface.o moc_ft_interface.cpp
make[2]: Leaving directory '/usr/src/RPM/BUILD/qoauth-qt5-2.0.1/tests/ft_interface'
make[2]: Entering directory '/usr/src/RPM/BUILD/qoauth-qt5-2.0.1/tests/ut_interface'
g++ -c -pipe -frecord-gcc-switches -Wall -g -O2 -march=i586 -mtune=generic -fPIC -DPIC -O2 -Wall -W -D_REENTRANT -fPIC -DUNIT_TEST -DQT_NO_DEBUG -DQT_TESTLIB_LIB -DQT_NETWORK_LIB -DQT_CORE_LIB -DQT_TESTCASE_BUILDDIR='"/usr/src/RPM/BUILD/qoauth-qt5-2.0.1/tests/ut_interface"' -I. -I../../include -I. -I../../src -isystem /usr/include/qt5/Qca-qt5/QtCrypto -isystem /usr/include/qt5 -isystem /usr/include/qt5/QtTest -isystem /usr/include/qt5/QtNetwork -isystem /usr/include/qt5/QtCore -I. -I/usr/lib/qt5/mkspecs/linux-g++ -o moc_ut_interface.o moc_ut_interface.cpp
make[2]: Leaving directory '/usr/src/RPM/BUILD/qoauth-qt5-2.0.1/tests/ut_interface'
make[2]: Entering directory '/usr/src/RPM/BUILD/qoauth-qt5-2.0.1/tests/ft_interface'
g++ -c -pipe -frecord-gcc-switches -Wall -g -O2 -march=i586 -mtune=generic -fPIC -DPIC -O2 -Wall -W -D_REENTRANT -fPIC -DUNIT_TEST -DQT_NO_DEBUG -DQT_TESTLIB_LIB -DQT_NETWORK_LIB -DQT_CORE_LIB -DQT_TESTCASE_BUILDDIR='"/usr/src/RPM/BUILD/qoauth-qt5-2.0.1/tests/ft_interface"' -I. -I../../include -I. -I../../src -isystem /usr/include/qt5/Qca-qt5/QtCrypto -isystem /usr/include/qt5 -isystem /usr/include/qt5/QtTest -isystem /usr/include/qt5/QtNetwork -isystem /usr/include/qt5/QtCore -I. -I/usr/lib/qt5/mkspecs/linux-g++ -o ft_interface.o ft_interface.cpp
make[2]: Leaving directory '/usr/src/RPM/BUILD/qoauth-qt5-2.0.1/tests/ft_interface'
make[2]: Entering directory '/usr/src/RPM/BUILD/qoauth-qt5-2.0.1/tests/ft_interface'
g++ -Wl,-rpath,../../lib:lib -Wl,-O1 -o ft_interface ft_interface.o moc_ft_interface.o   -L/usr/src/RPM/BUILD/qoauth-qt5-2.0.1/lib -lqoauth -L../../lib -L/usr/lib -lqca-qt5 /usr/lib/libQt5Test.so /usr/lib/libQt5Network.so /usr/lib/libQt5Core.so -lpthread   
make[2]: Leaving directory '/usr/src/RPM/BUILD/qoauth-qt5-2.0.1/tests/ft_interface'
make[2]: Entering directory '/usr/src/RPM/BUILD/qoauth-qt5-2.0.1/tests/ut_interface'
g++ -c -pipe -frecord-gcc-switches -Wall -g -O2 -march=i586 -mtune=generic -fPIC -DPIC -O2 -Wall -W -D_REENTRANT -fPIC -DUNIT_TEST -DQT_NO_DEBUG -DQT_TESTLIB_LIB -DQT_NETWORK_LIB -DQT_CORE_LIB -DQT_TESTCASE_BUILDDIR='"/usr/src/RPM/BUILD/qoauth-qt5-2.0.1/tests/ut_interface"' -I. -I../../include -I. -I../../src -isystem /usr/include/qt5/Qca-qt5/QtCrypto -isystem /usr/include/qt5 -isystem /usr/include/qt5/QtTest -isystem /usr/include/qt5/QtNetwork -isystem /usr/include/qt5/QtCore -I. -I/usr/lib/qt5/mkspecs/linux-g++ -o ut_interface.o ut_interface.cpp
make[2]: Leaving directory '/usr/src/RPM/BUILD/qoauth-qt5-2.0.1/tests/ut_interface'
make[2]: Entering directory '/usr/src/RPM/BUILD/qoauth-qt5-2.0.1/tests/ut_interface'
g++ -Wl,-rpath,../../lib:lib -Wl,-O1 -o ut_interface ut_interface.o moc_ut_interface.o   -L/usr/src/RPM/BUILD/qoauth-qt5-2.0.1/lib -lqoauth -L../../lib -L/usr/lib -lqca-qt5 /usr/lib/libQt5Test.so /usr/lib/libQt5Network.so /usr/lib/libQt5Core.so -lpthread   
make[2]: Leaving directory '/usr/src/RPM/BUILD/qoauth-qt5-2.0.1/tests/ut_interface'
+ exit 0
Executing(%install): /bin/sh -e /usr/src/tmp/rpm-tmp.43583
+ umask 022
+ /bin/mkdir -p /usr/src/RPM/BUILD
+ cd /usr/src/RPM/BUILD
+ /bin/chmod -Rf u+rwX -- /usr/src/tmp/qoauth-qt5-buildroot
+ :
+ /bin/rm -rf -- /usr/src/tmp/qoauth-qt5-buildroot
+ cd qoauth-qt5-2.0.1
+ __installqt5
+ __install_qt5_base
+ make install INSTALL_ROOT=/usr/src/tmp/qoauth-qt5-buildroot
make: Entering directory '/usr/src/RPM/BUILD/qoauth-qt5-2.0.1'
cd src/ && ( test -e Makefile || /usr/share/qt5/bin/qmake -o Makefile /usr/src/RPM/BUILD/qoauth-qt5-2.0.1/src/src.pro 'QMAKE_CFLAGS=-pipe -frecord-gcc-switches -Wall -g -O2 -march=i586 -mtune=generic -fPIC -DPIC' 'QMAKE_CXXFLAGS=-pipe -frecord-gcc-switches -Wall -g -O2 -march=i586 -mtune=generic -fPIC -DPIC' ) && make -f Makefile install
make[1]: Entering directory '/usr/src/RPM/BUILD/qoauth-qt5-2.0.1/src'
/usr/share/qt5/bin/qmake -install qinstall -exe ../lib/libqoauth.so.2.0.0 /usr/src/tmp/qoauth-qt5-buildroot/usr/lib/libqoauth.so.2.0.0
strip --strip-unneeded /usr/src/tmp/qoauth-qt5-buildroot/usr/lib/libqoauth.so.2.0.0
ln -f -s libqoauth.so.2.0.0 /usr/src/tmp/qoauth-qt5-buildroot/usr/lib/libqoauth.so
ln -f -s libqoauth.so.2.0.0 /usr/src/tmp/qoauth-qt5-buildroot/usr/lib/libqoauth.so.2
ln -f -s libqoauth.so.2.0.0 /usr/src/tmp/qoauth-qt5-buildroot/usr/lib/libqoauth.so.2.0
install -m 644 -p ../lib/libqoauth.prl /usr/src/tmp/qoauth-qt5-buildroot/usr/lib/libqoauth.prl
/usr/share/qt5/bin/qmake -install qinstall /usr/src/RPM/BUILD/qoauth-qt5-2.0.1/src/qoauth_global.h /usr/src/tmp/qoauth-qt5-buildroot/usr/include/QtOAuth/qoauth_global.h
/usr/share/qt5/bin/qmake -install qinstall /usr/src/RPM/BUILD/qoauth-qt5-2.0.1/src/qoauth_namespace.h /usr/src/tmp/qoauth-qt5-buildroot/usr/include/QtOAuth/qoauth_namespace.h
/usr/share/qt5/bin/qmake -install qinstall /usr/src/RPM/BUILD/qoauth-qt5-2.0.1/src/interface.h /usr/src/tmp/qoauth-qt5-buildroot/usr/include/QtOAuth/interface.h
/usr/share/qt5/bin/qmake -install qinstall /usr/src/RPM/BUILD/qoauth-qt5-2.0.1/include/QtOAuth /usr/src/tmp/qoauth-qt5-buildroot/usr/include/QtOAuth/QtOAuth
/usr/share/qt5/bin/qmake -install qinstall /usr/src/RPM/BUILD/qoauth-qt5-2.0.1/src/qoauth.pc /usr/src/tmp/qoauth-qt5-buildroot/usr/lib/pkgconfig/qoauth.pc
/usr/share/qt5/bin/qmake -install qinstall /usr/src/RPM/BUILD/qoauth-qt5-2.0.1/oauth.prf /usr/src/tmp/qoauth-qt5-buildroot/usr/lib/qt5/mkspecs/features/oauth.prf
make[1]: Leaving directory '/usr/src/RPM/BUILD/qoauth-qt5-2.0.1/src'
cd tests/ && ( test -e Makefile || /usr/share/qt5/bin/qmake -o Makefile /usr/src/RPM/BUILD/qoauth-qt5-2.0.1/tests/tests.pro 'QMAKE_CFLAGS=-pipe -frecord-gcc-switches -Wall -g -O2 -march=i586 -mtune=generic -fPIC -DPIC' 'QMAKE_CXXFLAGS=-pipe -frecord-gcc-switches -Wall -g -O2 -march=i586 -mtune=generic -fPIC -DPIC' ) && make -f Makefile install
make[1]: Entering directory '/usr/src/RPM/BUILD/qoauth-qt5-2.0.1/tests'
cd ut_interface/ && ( test -e Makefile || /usr/share/qt5/bin/qmake -o Makefile /usr/src/RPM/BUILD/qoauth-qt5-2.0.1/tests/ut_interface/ut_interface.pro 'QMAKE_CFLAGS=-pipe -frecord-gcc-switches -Wall -g -O2 -march=i586 -mtune=generic -fPIC -DPIC' 'QMAKE_CXXFLAGS=-pipe -frecord-gcc-switches -Wall -g -O2 -march=i586 -mtune=generic -fPIC -DPIC' ) && make -f Makefile install
make[2]: Entering directory '/usr/src/RPM/BUILD/qoauth-qt5-2.0.1/tests/ut_interface'
make[2]: Nothing to be done for 'install'.
make[2]: Leaving directory '/usr/src/RPM/BUILD/qoauth-qt5-2.0.1/tests/ut_interface'
cd ft_interface/ && ( test -e Makefile || /usr/share/qt5/bin/qmake -o Makefile /usr/src/RPM/BUILD/qoauth-qt5-2.0.1/tests/ft_interface/ft_interface.pro 'QMAKE_CFLAGS=-pipe -frecord-gcc-switches -Wall -g -O2 -march=i586 -mtune=generic -fPIC -DPIC' 'QMAKE_CXXFLAGS=-pipe -frecord-gcc-switches -Wall -g -O2 -march=i586 -mtune=generic -fPIC -DPIC' ) && make -f Makefile install
make[2]: Entering directory '/usr/src/RPM/BUILD/qoauth-qt5-2.0.1/tests/ft_interface'
make[2]: Nothing to be done for 'install'.
make[2]: Leaving directory '/usr/src/RPM/BUILD/qoauth-qt5-2.0.1/tests/ft_interface'
make[1]: Leaving directory '/usr/src/RPM/BUILD/qoauth-qt5-2.0.1/tests'
make: Leaving directory '/usr/src/RPM/BUILD/qoauth-qt5-2.0.1'
+ __install_qt5_post_user
+ mkdir -p /usr/src/tmp/qoauth-qt5-buildroot//usr/bin
+ ls -1d '/usr/src/tmp/qoauth-qt5-buildroot//usr/share/qt5/bin/*'
+ read f
+ __install_qt5_post_common
+ '[' -d /usr/src/tmp/qoauth-qt5-buildroot//usr/lib ']'
+ pushd /usr/src/tmp/qoauth-qt5-buildroot//usr/lib
~/tmp/qoauth-qt5-buildroot/usr/lib ~/RPM/BUILD/qoauth-qt5-2.0.1
+ ls -1 libqoauth.prl
+ read prl_file
+ sed -i -e '/^QMAKE_PRL_BUILD_DIR/d' libqoauth.prl
++ basename libqoauth.prl .prl
+ '[' -f libqoauth.so ']'
+ sed -i -e '/^QMAKE_PRL_LIBS/d' libqoauth.prl
+ read prl_file
+ popd
~/RPM/BUILD/qoauth-qt5-2.0.1
+ doxygen Doxyfile
warning: Tag `SYMBOL_CACHE_SIZE' at line 300 of file `Doxyfile' has become obsolete.
         To avoid this warning please remove this line from your configuration file or upgrade it using "doxygen -u"
warning: Tag `SHOW_DIRECTORIES' at line 484 of file `Doxyfile' has become obsolete.
         To avoid this warning please remove this line from your configuration file or upgrade it using "doxygen -u"
warning: Tag `HTML_ALIGN_MEMBERS' at line 840 of file `Doxyfile' has become obsolete.
         To avoid this warning please remove this line from your configuration file or upgrade it using "doxygen -u"
warning: Tag `XML_SCHEMA' at line 1177 of file `Doxyfile' has become obsolete.
         To avoid this warning please remove this line from your configuration file or upgrade it using "doxygen -u"
warning: Tag `XML_DTD' at line 1183 of file `Doxyfile' has become obsolete.
         To avoid this warning please remove this line from your configuration file or upgrade it using "doxygen -u"
warning: doxygen no longer ships with the FreeSans font.
You may want to clear or change DOT_FONTNAME.
Otherwise you run the risk that the wrong font is being used for dot generated graphs.
/usr/src/RPM/BUILD/qoauth-qt5-2.0.1/src/interface.h:21: warning: the name `interface.h' supplied as the second argument in the \file statement matches the following input files:
   /usr/src/RPM/BUILD/qoauth-qt5-2.0.1/include/interface.h
   /usr/src/RPM/BUILD/qoauth-qt5-2.0.1/src/interface.h
Please use a more specific name by including a (larger) part of the path!
/usr/src/RPM/BUILD/qoauth-qt5-2.0.1/src/moc_interface.cpp:24: warning: Compound qt_meta_stringdata_QOAuth__Interface_t is not documented.
/usr/src/RPM/BUILD/qoauth-qt5-2.0.1/src/interface.cpp:195: warning: documented symbol `const QByteArray QOAuth::InterfacePrivate::OAuthVersion' was not declared or defined.
/usr/src/RPM/BUILD/qoauth-qt5-2.0.1/src/interface.cpp:198: warning: documented symbol `const QByteArray QOAuth::InterfacePrivate::ParamToken' was not declared or defined.
/usr/src/RPM/BUILD/qoauth-qt5-2.0.1/src/interface.cpp:200: warning: documented symbol `const QByteArray QOAuth::InterfacePrivate::ParamTokenSecret' was not declared or defined.
/usr/src/RPM/BUILD/qoauth-qt5-2.0.1/src/interface.cpp:203: warning: documented symbol `const QByteArray QOAuth::InterfacePrivate::ParamConsumerKey' was not declared or defined.
/usr/src/RPM/BUILD/qoauth-qt5-2.0.1/src/interface.cpp:205: warning: documented symbol `const QByteArray QOAuth::InterfacePrivate::ParamNonce' was not declared or defined.
/usr/src/RPM/BUILD/qoauth-qt5-2.0.1/src/interface.cpp:207: warning: documented symbol `const QByteArray QOAuth::InterfacePrivate::ParamSignature' was not declared or defined.
/usr/src/RPM/BUILD/qoauth-qt5-2.0.1/src/interface.cpp:209: warning: documented symbol `const QByteArray QOAuth::InterfacePrivate::ParamSignatureMethod' was not declared or defined.
/usr/src/RPM/BUILD/qoauth-qt5-2.0.1/src/interface.cpp:211: warning: documented symbol `const QByteArray QOAuth::InterfacePrivate::ParamTimestamp' was not declared or defined.
/usr/src/RPM/BUILD/qoauth-qt5-2.0.1/src/interface.cpp:213: warning: documented symbol `const QByteArray QOAuth::InterfacePrivate::ParamVersion' was not declared or defined.
/usr/src/RPM/BUILD/qoauth-qt5-2.0.1/src/interface.cpp:215: warning: documented symbol `QOAuth::InterfacePrivate::InterfacePrivate' was not declared or defined.
/usr/src/RPM/BUILD/qoauth-qt5-2.0.1/src/interface.cpp:226: warning: documented symbol `void QOAuth::InterfacePrivate::init' was not declared or defined.
/usr/src/RPM/BUILD/qoauth-qt5-2.0.1/src/interface.cpp:238: warning: documented symbol `void QOAuth::InterfacePrivate::setupNetworkAccessManager' was not declared or defined.
/usr/src/RPM/BUILD/qoauth-qt5-2.0.1/src/interface.cpp:252: warning: documented symbol `QByteArray QOAuth::InterfacePrivate::httpMethodToString' was not declared or defined.
/usr/src/RPM/BUILD/qoauth-qt5-2.0.1/src/interface.cpp:273: warning: documented symbol `QByteArray QOAuth::InterfacePrivate::signatureMethodToString' was not declared or defined.
/usr/src/RPM/BUILD/qoauth-qt5-2.0.1/src/interface.cpp:288: warning: documented symbol `QOAuth::ParamMap QOAuth::InterfacePrivate::replyToMap' was not declared or defined.
/usr/src/RPM/BUILD/qoauth-qt5-2.0.1/src/interface.cpp:312: warning: documented symbol `void QOAuth::InterfacePrivate::_q_parseReply' was not declared or defined.
/usr/src/RPM/BUILD/qoauth-qt5-2.0.1/src/interface.cpp:338: warning: documented symbol `void QOAuth::InterfacePrivate::_q_handleSslErrors' was not declared or defined.
/usr/src/RPM/BUILD/qoauth-qt5-2.0.1/src/interface.cpp:346: warning: documented symbol `QByteArray QOAuth::InterfacePrivate::paramsToString' was not declared or defined.
/usr/src/RPM/BUILD/qoauth-qt5-2.0.1/src/interface.cpp:650: warning: documented symbol `void QOAuth::InterfacePrivate::setPrivateKey' was not declared or defined.
/usr/src/RPM/BUILD/qoauth-qt5-2.0.1/src/interface.cpp:681: warning: documented symbol `void QOAuth::InterfacePrivate::readKeyFromLoader' was not declared or defined.
/usr/src/RPM/BUILD/qoauth-qt5-2.0.1/src/interface.cpp:698: warning: no matching class member found for 
  void QOAuth::InterfacePrivate::_q_setPassphrase(int id, const QCA::Event &event)

/usr/src/RPM/BUILD/qoauth-qt5-2.0.1/src/interface.cpp:908: warning: documented symbol `QOAuth::ParamMap QOAuth::InterfacePrivate::sendRequest' was not declared or defined.
/usr/src/RPM/BUILD/qoauth-qt5-2.0.1/src/interface.cpp:978: warning: documented symbol `QByteArray QOAuth::InterfacePrivate::createSignature' was not declared or defined.
/usr/src/RPM/BUILD/qoauth-qt5-2.0.1/src/interface.cpp:1072: warning: documented symbol `QByteArray QOAuth::InterfacePrivate::createPlaintextSignature' was not declared or defined.
/usr/src/RPM/BUILD/qoauth-qt5-2.0.1/src/moc_interface.cpp:96: warning: documented symbol `void QOAuth::Interface::qt_static_metacall' was not declared or defined.
/usr/src/RPM/BUILD/qoauth-qt5-2.0.1/src/moc_interface.cpp:137: warning: documented symbol `QT_INIT_METAOBJECT const QMetaObject QOAuth::Interface::staticMetaObject' was not declared or defined.
/usr/src/RPM/BUILD/qoauth-qt5-2.0.1/src/moc_interface.cpp:147: warning: documented symbol `const QMetaObject * QOAuth::Interface::metaObject' was not declared or defined.
/usr/src/RPM/BUILD/qoauth-qt5-2.0.1/src/moc_interface.cpp:152: warning: documented symbol `void * QOAuth::Interface::qt_metacast' was not declared or defined.
/usr/src/RPM/BUILD/qoauth-qt5-2.0.1/src/moc_interface.cpp:160: warning: documented symbol `int QOAuth::Interface::qt_metacall' was not declared or defined.
/usr/src/RPM/BUILD/qoauth-qt5-2.0.1/src/interface.cpp:92: warning: explicit link request to 'include' could not be resolved
/usr/src/RPM/BUILD/qoauth-qt5-2.0.1/src/interface.cpp:92: warning: Unsupported xml/html tag <QtXml> found
Searching for include files...
Searching for example files...
Searching for files in directory /usr/src/RPM/BUILD/qoauth-qt5-2.0.1/doc/examples
Searching for images...
Searching for dot files...
Searching for msc files...
Searching for dia files...
Searching for files to exclude
Searching INPUT for files to process...
Searching for files in directory /usr/src/RPM/BUILD/qoauth-qt5-2.0.1
Searching for files in directory /usr/src/RPM/BUILD/qoauth-qt5-2.0.1/include
Searching for files in directory /usr/src/RPM/BUILD/qoauth-qt5-2.0.1/src
Reading and parsing tag files
Parsing files
Preprocessing /usr/src/RPM/BUILD/qoauth-qt5-2.0.1/include/interface.h...
Parsing file /usr/src/RPM/BUILD/qoauth-qt5-2.0.1/include/interface.h...
Preprocessing /usr/src/RPM/BUILD/qoauth-qt5-2.0.1/src/interface.cpp...
Parsing file /usr/src/RPM/BUILD/qoauth-qt5-2.0.1/src/interface.cpp...
Preprocessing /usr/src/RPM/BUILD/qoauth-qt5-2.0.1/src/interface.h...
Parsing file /usr/src/RPM/BUILD/qoauth-qt5-2.0.1/src/interface.h...
Preprocessing /usr/src/RPM/BUILD/qoauth-qt5-2.0.1/src/moc_interface.cpp...
Parsing file /usr/src/RPM/BUILD/qoauth-qt5-2.0.1/src/moc_interface.cpp...
Preprocessing /usr/src/RPM/BUILD/qoauth-qt5-2.0.1/src/moc_predefs.h...
Parsing file /usr/src/RPM/BUILD/qoauth-qt5-2.0.1/src/moc_predefs.h...
Preprocessing /usr/src/RPM/BUILD/qoauth-qt5-2.0.1/src/qoauth_global.h...
Parsing file /usr/src/RPM/BUILD/qoauth-qt5-2.0.1/src/qoauth_global.h...
Preprocessing /usr/src/RPM/BUILD/qoauth-qt5-2.0.1/src/qoauth_namespace.h...
Parsing file /usr/src/RPM/BUILD/qoauth-qt5-2.0.1/src/qoauth_namespace.h...
Building group list...
Building directory list...
Building namespace list...
Building file list...
Building class list...
Associating documentation with classes...
Computing nesting relations for classes...
Building example list...
Searching for enumerations...
Searching for documented typedefs...
Searching for members imported via using declarations...
Searching for included using directives...
Searching for documented variables...
Building interface member list...
Building member list...
Searching for friends...
Searching for documented defines...
Computing class inheritance relations...
Computing class usage relations...
Flushing cached template relations that have become invalid...
Computing class relations...
Add enum values to enums...
Searching for member function documentation...
Creating members for template instances...
Building page list...
Search for main page...
Computing page relations...
Determining the scope of groups...
Sorting lists...
Freeing entry tree
Determining which enums are documented
Computing member relations...
Building full member lists recursively...
Adding members to member groups.
Computing member references...
Inheriting documentation...
Generating disk names...
Adding source references...
Adding xrefitems...
Sorting member lists...
Computing dependencies between directories...
Generating citations page...
Counting data structures...
Resolving user defined references...
Finding anchors and sections in the documentation...
Transferring function references...
Combining using relations...
Adding members to index pages...
Generating style sheet...
Generating search indices...
Generating example documentation...
Generating file sources...
Generating code for file interface.h...
Generating code for file src/interface.h...
Generating code for file src/moc_predefs.h...
Generating code for file src/qoauth_global.h...
Generating code for file src/qoauth_namespace.h...
Generating file documentation...
Generating docs for file src/qoauth_global.h...
Generating docs for file src/qoauth_namespace.h...
Generating page documentation...
Generating group documentation...
Generating class documentation...
Generating docs for compound qt_meta_stringdata_QOAuth__Interface_t...
Generating namespace index...
Generating docs for namespace QOAuth
Generating docs for compound QOAuth::Interface...
Generating graph info page...
Generating directory documentation...
Generating index page...
Generating page index...
Generating module index...
Generating namespace index...
Generating namespace member index...
Generating annotated compound index...
Generating alphabetical compound index...
Generating hierarchical class index...
Generating member index...
Generating file index...
Generating file member index...
Generating example index...
finalizing index lists...
writing tag file...
lookup cache used 86/65536 hits=449 misses=86
finished...
+ for file in doc/html/*
+ touch -r Doxyfile doc/html/annotated.html
+ for file in doc/html/*
+ touch -r Doxyfile doc/html/bc_s.png
+ for file in doc/html/*
+ touch -r Doxyfile doc/html/bdwn.png
+ for file in doc/html/*
+ touch -r Doxyfile doc/html/class_q_o_auth_1_1_interface-members.html
+ for file in doc/html/*
+ touch -r Doxyfile doc/html/class_q_o_auth_1_1_interface.html
+ for file in doc/html/*
+ touch -r Doxyfile doc/html/class_q_o_auth_1_1_interface.png
+ for file in doc/html/*
+ touch -r Doxyfile doc/html/classes.html
+ for file in doc/html/*
+ touch -r Doxyfile doc/html/closed.png
+ for file in doc/html/*
+ touch -r Doxyfile doc/html/dir_68267d1309a1af8e8297ef4c3efbcdba.html
+ for file in doc/html/*
+ touch -r Doxyfile doc/html/doc.png
+ for file in doc/html/*
+ touch -r Doxyfile doc/html/doxygen.css
+ for file in doc/html/*
+ touch -r Doxyfile doc/html/doxygen.png
+ for file in doc/html/*
+ touch -r Doxyfile doc/html/files.html
+ for file in doc/html/*
+ touch -r Doxyfile doc/html/folderclosed.png
+ for file in doc/html/*
+ touch -r Doxyfile doc/html/folderopen.png
+ for file in doc/html/*
+ touch -r Doxyfile doc/html/functions.html
+ for file in doc/html/*
+ touch -r Doxyfile doc/html/functions_func.html
+ for file in doc/html/*
+ touch -r Doxyfile doc/html/functions_prop.html
+ for file in doc/html/*
+ touch -r Doxyfile doc/html/hierarchy.html
+ for file in doc/html/*
+ touch -r Doxyfile doc/html/include_2interface_8h_source.html
+ for file in doc/html/*
+ touch -r Doxyfile doc/html/index.html
+ for file in doc/html/*
+ touch -r Doxyfile doc/html/jquery.js
+ for file in doc/html/*
+ touch -r Doxyfile doc/html/menu.js
+ for file in doc/html/*
+ touch -r Doxyfile doc/html/menudata.js
+ for file in doc/html/*
+ touch -r Doxyfile doc/html/moc__predefs_8h_source.html
+ for file in doc/html/*
+ touch -r Doxyfile doc/html/namespace_q_o_auth.html
+ for file in doc/html/*
+ touch -r Doxyfile doc/html/namespacemembers.html
+ for file in doc/html/*
+ touch -r Doxyfile doc/html/namespacemembers_enum.html
+ for file in doc/html/*
+ touch -r Doxyfile doc/html/namespacemembers_eval.html
+ for file in doc/html/*
+ touch -r Doxyfile doc/html/namespacemembers_func.html
+ for file in doc/html/*
+ touch -r Doxyfile doc/html/namespacemembers_type.html
+ for file in doc/html/*
+ touch -r Doxyfile doc/html/namespaces.html
+ for file in doc/html/*
+ touch -r Doxyfile doc/html/nav_f.png
+ for file in doc/html/*
+ touch -r Doxyfile doc/html/nav_g.png
+ for file in doc/html/*
+ touch -r Doxyfile doc/html/nav_h.png
+ for file in doc/html/*
+ touch -r Doxyfile doc/html/open.png
+ for file in doc/html/*
+ touch -r Doxyfile doc/html/qoauth__global_8h.html
+ for file in doc/html/*
+ touch -r Doxyfile doc/html/qoauth__global_8h_source.html
+ for file in doc/html/*
+ touch -r Doxyfile doc/html/qoauth__namespace_8h.html
+ for file in doc/html/*
+ touch -r Doxyfile doc/html/qoauth__namespace_8h_source.html
+ for file in doc/html/*
+ touch -r Doxyfile doc/html/splitbar.png
+ for file in doc/html/*
+ touch -r Doxyfile doc/html/src_2interface_8h_source.html
+ for file in doc/html/*
+ touch -r Doxyfile doc/html/structqt__meta__stringdata___q_o_auth_____interface__t-members.html
+ for file in doc/html/*
+ touch -r Doxyfile doc/html/structqt__meta__stringdata___q_o_auth_____interface__t.html
+ for file in doc/html/*
+ touch -r Doxyfile doc/html/sync_off.png
+ for file in doc/html/*
+ touch -r Doxyfile doc/html/sync_on.png
+ for file in doc/html/*
+ touch -r Doxyfile doc/html/tab_a.png
+ for file in doc/html/*
+ touch -r Doxyfile doc/html/tab_b.png
+ for file in doc/html/*
+ touch -r Doxyfile doc/html/tab_h.png
+ for file in doc/html/*
+ touch -r Doxyfile doc/html/tab_s.png
+ for file in doc/html/*
+ touch -r Doxyfile doc/html/tabs.css
+ make check
make: Entering directory '/usr/src/RPM/BUILD/qoauth-qt5-2.0.1'
cd tests/ && ( test -e Makefile || /usr/share/qt5/bin/qmake -o Makefile /usr/src/RPM/BUILD/qoauth-qt5-2.0.1/tests/tests.pro 'QMAKE_CFLAGS=-pipe -frecord-gcc-switches -Wall -g -O2 -march=i586 -mtune=generic -fPIC -DPIC' 'QMAKE_CXXFLAGS=-pipe -frecord-gcc-switches -Wall -g -O2 -march=i586 -mtune=generic -fPIC -DPIC' ) && make -f Makefile
make[1]: Entering directory '/usr/src/RPM/BUILD/qoauth-qt5-2.0.1/tests'
cd ut_interface/ && ( test -e Makefile || /usr/share/qt5/bin/qmake -o Makefile /usr/src/RPM/BUILD/qoauth-qt5-2.0.1/tests/ut_interface/ut_interface.pro 'QMAKE_CFLAGS=-pipe -frecord-gcc-switches -Wall -g -O2 -march=i586 -mtune=generic -fPIC -DPIC' 'QMAKE_CXXFLAGS=-pipe -frecord-gcc-switches -Wall -g -O2 -march=i586 -mtune=generic -fPIC -DPIC' ) && make -f Makefile 
make[2]: Entering directory '/usr/src/RPM/BUILD/qoauth-qt5-2.0.1/tests/ut_interface'
make[2]: Nothing to be done for 'first'.
make[2]: Leaving directory '/usr/src/RPM/BUILD/qoauth-qt5-2.0.1/tests/ut_interface'
cd ft_interface/ && ( test -e Makefile || /usr/share/qt5/bin/qmake -o Makefile /usr/src/RPM/BUILD/qoauth-qt5-2.0.1/tests/ft_interface/ft_interface.pro 'QMAKE_CFLAGS=-pipe -frecord-gcc-switches -Wall -g -O2 -march=i586 -mtune=generic -fPIC -DPIC' 'QMAKE_CXXFLAGS=-pipe -frecord-gcc-switches -Wall -g -O2 -march=i586 -mtune=generic -fPIC -DPIC' ) && make -f Makefile 
make[2]: Entering directory '/usr/src/RPM/BUILD/qoauth-qt5-2.0.1/tests/ft_interface'
make[2]: Nothing to be done for 'first'.
make[2]: Leaving directory '/usr/src/RPM/BUILD/qoauth-qt5-2.0.1/tests/ft_interface'
make[1]: Leaving directory '/usr/src/RPM/BUILD/qoauth-qt5-2.0.1/tests'
( cd tests/ut_interface && ./ut_interface ) && ( cd tests/ft_interface && ./ft_interface )
********* Start testing of QOAuth::Ut_Interface *********
Config: Using QtTest library 5.12.5, Qt 5.12.5 (i386-little_endian-ilp32 shared (dynamic) release build; by GCC 9.2.1 20190827 (ALT Sisyphus 9.2.1-alt2))
PASS   : QOAuth::Ut_Interface::initTestCase()
PASS   : QOAuth::Ut_Interface::constructor()
PASS   : QOAuth::Ut_Interface::consumerKey()
PASS   : QOAuth::Ut_Interface::setConsumerKey()
PASS   : QOAuth::Ut_Interface::consumerSecret()
PASS   : QOAuth::Ut_Interface::setConsumerSecret()
PASS   : QOAuth::Ut_Interface::requestTimeout()
PASS   : QOAuth::Ut_Interface::setRequestTimeout()
PASS   : QOAuth::Ut_Interface::error()
QWARN  : QOAuth::Ut_Interface::requestToken(key empty) createSignature - consumer key is empty, make sure that you set itwith QOAuth::Interface::setConsumerKey()
PASS   : QOAuth::Ut_Interface::requestToken(key empty)
QWARN  : QOAuth::Ut_Interface::requestToken(secret empty) createSignature - consumer secret is empty, make sure that you set itwith QOAuth::Interface::setConsumerSecret()
PASS   : QOAuth::Ut_Interface::requestToken(secret empty)
QWARN  : QOAuth::Ut_Interface::requestToken(httpMethod) sendRequest - requestToken() and accessToken() accept only GET and POST methods
PASS   : QOAuth::Ut_Interface::requestToken(httpMethod)
QWARN  : QOAuth::Ut_Interface::accessToken(key empty) createSignature - consumer key is empty, make sure that you set itwith QOAuth::Interface::setConsumerKey()
PASS   : QOAuth::Ut_Interface::accessToken(key empty)
QWARN  : QOAuth::Ut_Interface::accessToken(secret empty) createSignature - consumer secret is empty, make sure that you set itwith QOAuth::Interface::setConsumerSecret()
PASS   : QOAuth::Ut_Interface::accessToken(secret empty)
QWARN  : QOAuth::Ut_Interface::accessToken(httpMethod) sendRequest - requestToken() and accessToken() accept only GET and POST methods
PASS   : QOAuth::Ut_Interface::accessToken(httpMethod)
QWARN  : QOAuth::Ut_Interface::createParametersString(key empty) createSignature - consumer key is empty, make sure that you set itwith QOAuth::Interface::setConsumerKey()
PASS   : QOAuth::Ut_Interface::createParametersString(key empty)
QWARN  : QOAuth::Ut_Interface::createParametersString(secret empty) createSignature - consumer secret is empty, make sure that you set itwith QOAuth::Interface::setConsumerSecret()
PASS   : QOAuth::Ut_Interface::createParametersString(secret empty)
PASS   : QOAuth::Ut_Interface::inlineParameters(empty)
PASS   : QOAuth::Ut_Interface::inlineParameters(easy)
PASS   : QOAuth::Ut_Interface::inlineParameters(tricky)
PASS   : QOAuth::Ut_Interface::inlineParameters(wrong mode)
QFATAL : QOAuth::Ut_Interface::setRSAPrivateKey(clean) RSA is not supported!
FAIL!  : QOAuth::Ut_Interface::setRSAPrivateKey(clean) Received a fatal error.
   Loc: [Unknown file(0)]
Totals: 21 passed, 1 failed, 0 skipped, 0 blacklisted, 11ms
********* Finished testing of QOAuth::Ut_Interface *********
/bin/sh: line 1: 36945 Aborted                 ./ut_interface
make: *** [Makefile:278: check] Error 134
make: Leaving directory '/usr/src/RPM/BUILD/qoauth-qt5-2.0.1'
+ :
+ /usr/lib/rpm/brp-alt
Cleaning files in /usr/src/tmp/qoauth-qt5-buildroot (auto)
mode of './usr/lib/libqoauth.so.2.0.0' changed from 0755 (rwxr-xr-x) to 0644 (rw-r--r--)
Verifying and fixing files in /usr/src/tmp/qoauth-qt5-buildroot (binconfig,pkgconfig,libtool,desktop)
/usr/lib/pkgconfig/qoauth.pc: Libs: '-L${libdir} -lqoauth' --> '-lqoauth'
Checking contents of files in /usr/src/tmp/qoauth-qt5-buildroot/ (default)
Compressing files in /usr/src/tmp/qoauth-qt5-buildroot (auto)
Adjusting library links in /usr/src/tmp/qoauth-qt5-buildroot
./usr/lib:
	libqoauth.so.2 -> libqoauth.so.2.0.0
Verifying ELF objects in /usr/src/tmp/qoauth-qt5-buildroot (arch=normal,fhs=normal,lfs=relaxed,lint=relaxed,rpath=normal,stack=normal,textrel=normal,unresolved=normal)
Hardlinking identical .pyc and .pyo files
Processing files: libqoauth2-2.0.1-alt2.3
Finding Provides (using /usr/lib/rpm/find-provides)
Executing: /bin/sh -e /usr/src/tmp/rpm-tmp.34gQoR
find-provides: running scripts (alternatives,debuginfo,lib,pam,perl,pkgconfig,python,shell)
lib.prov: /usr/src/tmp/qoauth-qt5-buildroot/usr/lib/libqoauth.so.2: 80 symbols, 17 bpp
Finding Requires (using /usr/lib/rpm/find-requires)
Executing: /bin/sh -e /usr/src/tmp/rpm-tmp.5D6swQ
find-requires: running scripts (cpp,debuginfo,files,lib,pam,perl,pkgconfig,pkgconfiglib,python,rpmlib,shebang,shell,static,symlinks)
Provides: libqoauth.so.2 = set:kdp5pNN6rUX0U5SOcehuAiiZgIeVjhoGmCdgZEzpAUOIgxVPtm0CR5y1fd4fcLCHJ4nOJF2cZnS626TWKsjQvp0Jjp8bLOFBvMUx5ZbASbRgYwb8KcvBpXaiGbLE3GQWIkyiClPkeAnlFEyZz0f4JkIFkZyj8A18kMQ74o0
Requires: qca-qt5-ossl, libQt5Core.so.5 >= set:qjnGdXe06tqQIGT5GHnKnS6POE27b7PSQ6AecL37HkmuHhojQ8vKOZo5dw96r2XSqOkJNw8F8GZIIcJtvxrIrkwmSGRloEmX6nLZFFOR2btgeX0nRccXd71YhXZb4ZBkCsUfSPhLHbB0OFC9efh5xi1lZLWyk1D0w78rbBj9V94Fh2hPkIPrW4HoKUSQfVGQpuWFgphv731AZ8yNZq05qwkK0wzQAB1j2usXiOYx4, libQt5Core.so.5(Qt_5), libQt5Core.so.5(Qt_5.12), libQt5Network.so.5 >= set:oksp7YZ30qT5qetpY0yRBaQ1IkfkUvd3, libQt5Network.so.5(Qt_5), libc.so.6(GLIBC_2.0), libc.so.6(GLIBC_2.1.3), libc.so.6(GLIBC_2.4), libgcc_s.so.1(GCC_3.0), libqca-qt5.so.2 >= set:pjFZn0CT4ZnAzukaRjUGP1i7ZH8ZAHasfZyJFMfrV23TANWDwrZDp3f6QXamizXiBQIN8Gi1n3kTq239C3Zf08jkNvpZ9mxo6KlgC1BFeuXZ5jNZy28YH8tQ0, libstdc++.so.6(CXXABI_1.3), libstdc++.so.6(CXXABI_1.3.9), libstdc++.so.6(GLIBCXX_3.4), rtld(GNU_HASH)
Requires(rpmlib): rpmlib(SetVersions)
Finding debuginfo files (using /usr/lib/rpm/find-debuginfo-files)
Executing: /bin/sh -e /usr/src/tmp/rpm-tmp.7herTS
Processing files: qoauth-qt5-devel-2.0.1-alt2.3
Executing(%doc): /bin/sh -e /usr/src/tmp/rpm-tmp.16133
+ umask 022
+ /bin/mkdir -p /usr/src/RPM/BUILD
+ cd /usr/src/RPM/BUILD
+ cd qoauth-qt5-2.0.1
+ DOCDIR=/usr/src/tmp/qoauth-qt5-buildroot/usr/share/doc/qoauth-qt5-devel-2.0.1
+ export DOCDIR
+ rm -rf /usr/src/tmp/qoauth-qt5-buildroot/usr/share/doc/qoauth-qt5-devel-2.0.1
+ /bin/mkdir -p /usr/src/tmp/qoauth-qt5-buildroot/usr/share/doc/qoauth-qt5-devel-2.0.1
+ cp -prL doc/html doc/examples /usr/src/tmp/qoauth-qt5-buildroot/usr/share/doc/qoauth-qt5-devel-2.0.1
+ chmod -R go-w /usr/src/tmp/qoauth-qt5-buildroot/usr/share/doc/qoauth-qt5-devel-2.0.1
+ chmod -R a+rX /usr/src/tmp/qoauth-qt5-buildroot/usr/share/doc/qoauth-qt5-devel-2.0.1
+ exit 0
warning: File listed twice: /usr/lib/libqoauth.so
Finding Provides (using /usr/lib/rpm/find-provides)
Executing: /bin/sh -e /usr/src/tmp/rpm-tmp.0fgAjP
find-provides: running scripts (alternatives,debuginfo,lib,pam,perl,pkgconfig,python,shell)
Finding Requires (using /usr/lib/rpm/find-requires)
Executing: /bin/sh -e /usr/src/tmp/rpm-tmp.zRQCpQ
find-requires: running scripts (cpp,debuginfo,files,lib,pam,perl,pkgconfig,pkgconfiglib,python,rpmlib,shebang,shell,static,symlinks)
In file included from /usr/include/qt5/QtCore/qatomic.h:46,
                 from /usr/include/qt5/QtCore/qrefcount.h:43,
                 from /usr/include/qt5/QtCore/qbytearray.h:44,
                 from /usr/include/qt5/QtCore/qstring.h:49,
                 from /usr/include/qt5/QtCore/qobject.h:47,
                 from /usr/include/qt5/QtCore/QObject:1,
                 from /usr/src/tmp/qoauth-qt5-buildroot/usr/include/QtOAuth/interface.h:31:
/usr/include/qt5/QtCore/qbasicatomic.h:61:4: error: #error "Qt requires C++11 support"
   61 | #  error "Qt requires C++11 support"
      |    ^~~~~
In file included from /usr/include/qt5/QtCore/qstring.h:49,
                 from /usr/include/qt5/QtCore/qobject.h:47,
                 from /usr/include/qt5/QtCore/QObject:1,
                 from /usr/src/tmp/qoauth-qt5-buildroot/usr/include/QtOAuth/interface.h:31:
/usr/include/qt5/QtCore/qbytearray.h:52:10: fatal error: string: No such file or directory
   52 | #include <string>
      |          ^~~~~~~~
compilation terminated.
cpp.req: /usr/src/tmp/qoauth-qt5-buildroot/usr/include/QtOAuth/interface.h: cpp failed, trying c++ mode
In file included from /usr/include/qt5/QtCore/qnamespace.h:43,
                 from /usr/include/qt5/QtCore/qobjectdefs.h:48,
                 from /usr/include/qt5/QtCore/qobject.h:46,
                 from /usr/include/qt5/QtCore/QObject:1,
                 from /usr/src/tmp/qoauth-qt5-buildroot/usr/include/QtOAuth/interface.h:31:
/usr/include/qt5/QtCore/qglobal.h:1187:4: error: #error "You must build your code with position independent code if Qt was built with -reduce-relocations. " "Compile your code with -fPIC (-fPIE is not enough)."
 1187 | #  error "You must build your code with position independent code if Qt was built with -reduce-relocations. "\
      |    ^~~~~
cpp.req: WARNING: /usr/src/tmp/qoauth-qt5-buildroot/usr/include/QtOAuth/interface.h: cpp failed
In file included from /usr/include/qt5/QtCore/qatomic.h:46,
                 from /usr/include/qt5/QtCore/qrefcount.h:43,
                 from /usr/include/qt5/QtCore/qlist.h:45,
                 from /usr/include/qt5/QtCore/qmap.h:44,
                 from /usr/include/qt5/QtCore/QMultiMap:1,
                 from /usr/src/tmp/qoauth-qt5-buildroot/usr/include/QtOAuth/qoauth_namespace.h:31:
/usr/include/qt5/QtCore/qbasicatomic.h:61:4: error: #error "Qt requires C++11 support"
   61 | #  error "Qt requires C++11 support"
      |    ^~~~~
In file included from /usr/include/qt5/QtCore/qstring.h:49,
                 from /usr/include/qt5/QtCore/qhashfunctions.h:44,
                 from /usr/include/qt5/QtCore/qlist.h:47,
                 from /usr/include/qt5/QtCore/qmap.h:44,
                 from /usr/include/qt5/QtCore/QMultiMap:1,
                 from /usr/src/tmp/qoauth-qt5-buildroot/usr/include/QtOAuth/qoauth_namespace.h:31:
/usr/include/qt5/QtCore/qbytearray.h:52:10: fatal error: string: No such file or directory
   52 | #include <string>
      |          ^~~~~~~~
compilation terminated.
cpp.req: /usr/src/tmp/qoauth-qt5-buildroot/usr/include/QtOAuth/qoauth_namespace.h: cpp failed, trying c++ mode
In file included from /usr/include/qt5/QtCore/qiterator.h:43,
                 from /usr/include/qt5/QtCore/qmap.h:43,
                 from /usr/include/qt5/QtCore/QMultiMap:1,
                 from /usr/src/tmp/qoauth-qt5-buildroot/usr/include/QtOAuth/qoauth_namespace.h:31:
/usr/include/qt5/QtCore/qglobal.h:1187:4: error: #error "You must build your code with position independent code if Qt was built with -reduce-relocations. " "Compile your code with -fPIC (-fPIE is not enough)."
 1187 | #  error "You must build your code with position independent code if Qt was built with -reduce-relocations. "\
      |    ^~~~~
cpp.req: WARNING: /usr/src/tmp/qoauth-qt5-buildroot/usr/include/QtOAuth/qoauth_namespace.h: cpp failed
Provides: pkgconfig(qoauth) = 2.0.0
Requires: qt5-base-devel, /usr/lib/libqoauth.so.2.0.0, /usr/lib/pkgconfig, pkgconfig(Qt5Core), pkgconfig(Qt5Network), pkgconfig(qca2-qt5)
Conflicts: qoauth-devel
Finding debuginfo files (using /usr/lib/rpm/find-debuginfo-files)
Executing: /bin/sh -e /usr/src/tmp/rpm-tmp.z7APLP
Adding to qoauth-qt5-devel a strict dependency on libqoauth2
Removing 1 extra deps from qoauth-qt5-devel due to dependency on libqoauth2
Wrote: /usr/src/RPM/RPMS/i586/libqoauth2-2.0.1-alt2.3.i586.rpm
Wrote: /usr/src/RPM/RPMS/i586/qoauth-qt5-devel-2.0.1-alt2.3.i586.rpm
28.84user 3.15system 0:43.67elapsed 73%CPU (0avgtext+0avgdata 243240maxresident)k
0inputs+0outputs (0major+692714minor)pagefaults 0swaps
/.out/libqoauth2-2.0.1-alt2.3.i586.rpm: The use of such a license name is ambiguous: GPL
/.out/qoauth-qt5-devel-2.0.1-alt2.3.i586.rpm: The use of such a license name is ambiguous: GPL
42.77user 9.24system 1:09.47elapsed 74%CPU (0avgtext+0avgdata 243240maxresident)k
856inputs+0outputs (0major+1073001minor)pagefaults 0swaps
--- libqoauth2-2.0.1-alt2.3.i586.rpm.repo	2019-06-23 22:09:14.000000000 +0000
+++ libqoauth2-2.0.1-alt2.3.i586.rpm.hasher	2019-12-16 10:58:01.227091660 +0000
@@ -20,3 +20,3 @@
 Requires: rpmlib(PayloadIsLzma)  
-Provides: libqoauth.so.2 = set:kdp5pNN6rUX0U5SOcehuAiiZgIeVjhoGmCdgZEzpAUOIgxVPtm0CR5y1fd4fcLCHJ4nOJF2cZnS626TWKsjQvp0Jjp8bLOFBvMUx5ZbASbRMw9ua54nCLOIt59RBnQ1lqtmah9PGpa7OHGkkNZxw7ymaSkGvp2xc0x2CZg2c
+Provides: libqoauth.so.2 = set:kdp5pNN6rUX0U5SOcehuAiiZgIeVjhoGmCdgZEzpAUOIgxVPtm0CR5y1fd4fcLCHJ4nOJF2cZnS626TWKsjQvp0Jjp8bLOFBvMUx5ZbASbRgYwb8KcvBpXaiGbLE3GQWIkyiClPkeAnlFEyZz0f4JkIFkZyj8A18kMQ74o0
 Provides: libqoauth2 = 2.0.1-alt2.3:sisyphus+233034.100.1.1