<86>Nov 22 11:06:55 userdel[11542]: delete user 'rooter'
<86>Nov 22 11:06:55 userdel[11542]: removed group 'rooter' owned by 'rooter'
<86>Nov 22 11:06:55 userdel[11542]: removed shadow group 'rooter' owned by 'rooter'
<86>Nov 22 11:06:55 groupadd[11558]: group added to /etc/group: name=rooter, GID=573
<86>Nov 22 11:06:55 groupadd[11558]: group added to /etc/gshadow: name=rooter
<86>Nov 22 11:06:55 groupadd[11558]: new group: name=rooter, GID=573
<86>Nov 22 11:06:55 useradd[11573]: new user: name=rooter, UID=573, GID=573, home=/root, shell=/bin/bash
<86>Nov 22 11:06:55 userdel[11601]: delete user 'builder'
<86>Nov 22 11:06:55 userdel[11601]: removed group 'builder' owned by 'builder'
<86>Nov 22 11:06:55 groupadd[11620]: group added to /etc/group: name=builder, GID=574
<86>Nov 22 11:06:55 groupadd[11620]: group added to /etc/gshadow: name=builder
<86>Nov 22 11:06:56 groupadd[11620]: new group: name=builder, GID=574
<86>Nov 22 11:06:56 useradd[11629]: new user: name=builder, UID=574, GID=574, home=/usr/src, shell=/bin/bash
<13>Nov 22 11:07:01 rpmi: libxkbcommon-0.9.1-alt1 sisyphus+239553.100.1.1 1571659627 installed
<13>Nov 22 11:07:01 rpmi: libglvnd-7:1.2.0-alt2 sisyphus+239998.100.1.1 1572427234 installed
<13>Nov 22 11:07:01 rpmi: libexpat-2.2.4-alt1 1503305345 installed
<13>Nov 22 11:07:01 rpmi: qt5-base-common-5.12.5-alt1 sisyphus+238768.340.19.1 1571501152 installed
<13>Nov 22 11:07:01 rpmi: libmtdev-1.1.5-alt1 sisyphus+220715.100.1.1 1549364509 installed
<13>Nov 22 11:07:01 rpmi: udev-rules-1:243-alt4 sisyphus+240263.100.1.1 1573004022 installed
<13>Nov 22 11:07:01 rpmi: libpng16-1.6.37-alt1 sisyphus+236677.100.2.1 1566917998 installed
<13>Nov 22 11:07:01 rpmi: libICE-1.0.9-alt1 1409902721 installed
<13>Nov 22 11:07:01 rpmi: libwayland-server-1.17.0-alt1 sisyphus+225894.100.1.1 1553872805 installed
<13>Nov 22 11:07:01 rpmi: libSM-1.2.3-alt1 sisyphus+226734.100.2.1 1554586158 installed
<13>Nov 22 11:07:01 rpmi: rpm-macros-qt5-5.12.5-alt1 sisyphus+238768.340.19.1 1571500911 installed
<13>Nov 22 11:07:01 rpmi: libOpenGL-7:1.2.0-alt2 sisyphus+239998.100.1.1 1572427234 installed
<13>Nov 22 11:07:01 rpmi: libGLES-7:1.2.0-alt2 sisyphus+239998.100.1.1 1572427234 installed
<13>Nov 22 11:07:01 rpmi: xxd-4:8.1.2120-alt1 sisyphus+238838.100.1.1 1570455542 installed
<13>Nov 22 11:07:01 rpmi: python-base-2.7.17-alt3 sisyphus+240580.60.5.1 1573516905 installed
<13>Nov 22 11:07:01 rpmi: python-modules-curses-2.7.17-alt3 sisyphus+240580.200.5.1 1573517321 installed
<13>Nov 22 11:07:01 rpmi: libsqlite3-3.30.1-alt2 sisyphus+239645.100.1.1 1571835345 installed
<13>Nov 22 11:07:01 rpmi: libts-1.0-alt1.qa1 1366249315 installed
<13>Nov 22 11:07:01 rpmi: libproxy-0.4.15-alt3 sisyphus+227885.100.1.2 1555818599 installed
<13>Nov 22 11:07:01 rpmi: libpcre2-10.33-alt1.1 sisyphus+227856.100.1.2 1555786378 installed
<13>Nov 22 11:07:01 rpmi: libverto-0.3.0-alt1_7 sisyphus+225932.100.1.1 1553994919 installed
<13>Nov 22 11:07:01 rpmi: libkeyutils-1.6-alt2 sisyphus+226520.100.2.1 1554512089 installed
<13>Nov 22 11:07:01 rpmi: libjpeg-2:2.0.2-alt1 sisyphus+226996.100.1.1 1554902907 installed
<13>Nov 22 11:07:01 rpmi: libwacom-data-1.1-alt1 sisyphus+238155.300.2.1 1569408114 installed
<13>Nov 22 11:07:02 rpmi: libicu65-1:6.5.1-alt1 sisyphus+238768.100.16.1 1571427455 installed
<13>Nov 22 11:07:03 rpmi: libqt5-core-5.12.5-alt1 sisyphus+238768.340.19.1 1571501152 installed
<13>Nov 22 11:07:03 rpmi: libqt5-concurrent-5.12.5-alt1 sisyphus+238768.340.19.1 1571501152 installed
<13>Nov 22 11:07:03 rpmi: libqt5-sql-5.12.5-alt1 sisyphus+238768.340.19.1 1571501152 installed
<13>Nov 22 11:07:03 rpmi: libqt5-test-5.12.5-alt1 sisyphus+238768.340.19.1 1571501152 installed
<13>Nov 22 11:07:03 rpmi: libqt5-xml-5.12.5-alt1 sisyphus+238768.340.19.1 1571501152 installed
<13>Nov 22 11:07:03 rpmi: libgudev-1:233-alt1 sisyphus+235422.100.1.1 1564855273 installed
<13>Nov 22 11:07:03 rpmi: libwacom-1.1-alt1 sisyphus+238155.300.2.1 1569408208 installed
<13>Nov 22 11:07:03 rpmi: libgraphite2-1.3.13-alt2 sisyphus+226799.100.1.1 1554648241 installed
<13>Nov 22 11:07:03 rpmi: libharfbuzz-2.6.4-alt1 sisyphus+240033.100.1.1 1572506773 installed
<13>Nov 22 11:07:03 rpmi: libfreetype-2.10.1-alt1 sisyphus+237471.100.1.1 1568276356 installed
<13>Nov 22 11:07:03 rpmi: fontconfig-2.13.1-alt1 sisyphus+226691.100.2.2 1554598726 installed
Updating fonts cache: <29>Nov 22 11:07:04 fontconfig: Updating fonts cache: succeeded
[ DONE ]
<13>Nov 22 11:07:04 rpmi: libgdbm-1.8.3-alt10 1454943334 installed
<13>Nov 22 11:07:04 rpmi: libevdev-1.8.0-alt1 sisyphus+236608.100.1.1 1566815743 installed
<13>Nov 22 11:07:04 rpmi: libinput-1.14.3-alt1 sisyphus+239829.100.1.1 1572245315 installed
<13>Nov 22 11:07:04 rpmi: libcom_err-1.44.6-alt1 sisyphus+224154.100.1.1 1552091678 installed
<13>Nov 22 11:07:04 rpmi: liblz4-1:1.9.2-alt1 sisyphus+238585.100.2.2 1570066927 installed
<13>Nov 22 11:07:04 rpmi: libgpg-error-1.36-alt1 sisyphus+225621.300.1.1 1553521082 installed
<13>Nov 22 11:07:04 rpmi: libgcrypt20-1.8.5-alt3 sisyphus+239622.100.1.1 1571746654 installed
<13>Nov 22 11:07:04 rpmi: libsystemd-1:243-alt4 sisyphus+240263.100.1.1 1573004056 installed
<13>Nov 22 11:07:04 rpmi: libdbus-1.12.16-alt2 sisyphus+240566.100.2.1 1573547696 installed
<13>Nov 22 11:07:04 rpmi: libavahi-0.7-alt1 sisyphus+237493.100.1.1 1568299481 installed
<13>Nov 22 11:07:04 rpmi: libcups-2.2.12-alt3 sisyphus+240570.100.1.1 1573481639 installed
<13>Nov 22 11:07:04 rpmi: libqt5-dbus-5.12.5-alt1 sisyphus+238768.340.19.1 1571501152 installed
<13>Nov 22 11:07:04 rpmi: xorg-proto-devel-2019.1-alt1 sisyphus+232786.100.1.1 1561106722 installed
<13>Nov 22 11:07:04 rpmi: libxshmfence-1.3-alt1 sisyphus+223149.1000.2.1 1551268571 installed
<13>Nov 22 11:07:04 rpmi: libX11-locales-3:1.6.9-alt1 sisyphus+239210.100.1.1 1571056781 installed
<13>Nov 22 11:07:04 rpmi: libXdmcp-1.1.3-alt1 sisyphus+225206.600.1.2 1552949353 installed
<13>Nov 22 11:07:04 rpmi: libXau-1.0.9-alt1 sisyphus+223149.200.2.1 1551268152 installed
<13>Nov 22 11:07:04 rpmi: libxcb-1.13.1-alt1 sisyphus+226527.100.2.2 1554593801 installed
<13>Nov 22 11:07:04 rpmi: libX11-3:1.6.9-alt1 sisyphus+239210.100.1.1 1571056801 installed
<13>Nov 22 11:07:04 rpmi: libXext-1.3.4-alt1 sisyphus+225206.700.1.2 1552949429 installed
<13>Nov 22 11:07:04 rpmi: libXxf86vm-1.1.4-alt2 1527672187 installed
<13>Nov 22 11:07:04 rpmi: libXdamage-1.1.5-alt1 sisyphus+225206.500.1.2 1552949286 installed
<13>Nov 22 11:07:04 rpmi: libXfixes-5.0.3-alt1 sisyphus+226736.100.2.2 1554614841 installed
<13>Nov 22 11:07:04 rpmi: libXrender-0.9.8-alt1 1371312112 installed
<13>Nov 22 11:07:07 rpmi: libxcb-devel-1.13.1-alt1 sisyphus+226527.100.2.2 1554593801 installed
<13>Nov 22 11:07:07 rpmi: libX11-devel-3:1.6.9-alt1 sisyphus+239210.100.1.1 1571056801 installed
<13>Nov 22 11:07:07 rpmi: libxcbutil-icccm-0.4.1-alt2 sisyphus+229000.100.1.1 1557152221 installed
<13>Nov 22 11:07:07 rpmi: libxcbutil-1:0.4.0-alt1 1413392888 installed
<13>Nov 22 11:07:07 rpmi: libxcbutil-image-0.4.0-alt1 1446204182 installed
<13>Nov 22 11:07:07 rpmi: libxcbutil-keysyms-0.4.0-alt1 1446204124 installed
<13>Nov 22 11:07:07 rpmi: libxcb-render-util-0.3.9-alt3 sisyphus+222674.100.1.1 1550989886 installed
<13>Nov 22 11:07:07 rpmi: libxkbcommon-x11-0.9.1-alt1 sisyphus+239553.100.1.1 1571659627 installed
<13>Nov 22 11:07:07 rpmi: libwayland-client-1.17.0-alt1 sisyphus+225894.100.1.1 1553872805 installed
<13>Nov 22 11:07:07 rpmi: libpciaccess-1:0.16-alt1 sisyphus+234814.100.1.1 1563438291 installed
<13>Nov 22 11:07:07 rpmi: libdrm-1:2.4.100-alt1 sisyphus+240099.100.1.1 1572599774 installed
<13>Nov 22 11:07:07 rpmi: libGLX-mesa-4:19.2.4-alt1 sisyphus+240833.100.1.1 1573805612 installed
<13>Nov 22 11:07:07 rpmi: libgbm-4:19.2.4-alt1 sisyphus+240833.100.1.1 1573805612 installed
<13>Nov 22 11:07:07 rpmi: libEGL-mesa-4:19.2.4-alt1 sisyphus+240833.100.1.1 1573805612 installed
<13>Nov 22 11:07:07 rpmi: libEGL-7:1.2.0-alt2 sisyphus+239998.100.1.1 1572427234 installed
<13>Nov 22 11:07:07 rpmi: libGLX-7:1.2.0-alt2 sisyphus+239998.100.1.1 1572427234 installed
<13>Nov 22 11:07:07 rpmi: libGL-7:1.2.0-alt2 sisyphus+239998.100.1.1 1572427234 installed
<13>Nov 22 11:07:07 rpmi: libglvnd-devel-7:1.2.0-alt2 sisyphus+239998.100.1.1 1572427234 installed
<13>Nov 22 11:07:07 rpmi: libEGL-devel-4:19.2.4-alt1 sisyphus+240833.100.1.1 1573805612 installed
<13>Nov 22 11:07:07 rpmi: libGL-devel-4:19.2.4-alt1 sisyphus+240833.100.1.1 1573805612 installed
<13>Nov 22 11:07:07 rpmi: gcc-c++-common-1.4.24-alt2 sisyphus+240563.100.1.1 1573475389 installed
<13>Nov 22 11:07:07 rpmi: libstdc++9-devel-9.2.1-alt2 sisyphus+240563.200.2.1 1573479396 installed
<13>Nov 22 11:07:09 rpmi: gcc9-c++-9.2.1-alt2 sisyphus+240563.200.2.1 1573479396 installed
<13>Nov 22 11:07:09 rpmi: gcc-c++-9-alt1 sisyphus+239632.300.3.1 1571788297 installed
<13>Nov 22 11:07:09 rpmi: libp11-kit-0.23.15-alt1 sisyphus+226408.100.2.1 1554288204 installed
<13>Nov 22 11:07:09 rpmi: libtasn1-4.14-alt1 sisyphus+235791.100.1.1 1565282372 installed
<13>Nov 22 11:07:09 rpmi: rpm-macros-alternatives-0.5.1-alt1 sisyphus+226946.100.1.1 1554830426 installed
<13>Nov 22 11:07:09 rpmi: alternatives-0.5.1-alt1 sisyphus+226946.100.1.1 1554830426 installed
<13>Nov 22 11:07:09 rpmi: ca-certificates-2019.10.28-alt1 sisyphus+239875.300.1.1 1572267834 installed
<13>Nov 22 11:07:09 rpmi: ca-trust-0.1.2-alt1 sisyphus+233348.100.1.1 1561653823 installed
<13>Nov 22 11:07:09 rpmi: p11-kit-trust-0.23.15-alt1 sisyphus+226408.100.2.1 1554288204 installed
<13>Nov 22 11:07:09 rpmi: libcrypto1.1-1.1.1d-alt1.1 sisyphus+237931.100.2.1 1569235729 installed
<13>Nov 22 11:07:09 rpmi: libssl1.1-1.1.1d-alt1.1 sisyphus+237931.100.2.1 1569235729 installed
<13>Nov 22 11:07:09 rpmi: libqt5-network-5.12.5-alt1 sisyphus+238768.340.19.1 1571501152 installed
<13>Nov 22 11:07:09 rpmi: libqt5-xcbqpa-5.12.5-alt1 sisyphus+238768.340.19.1 1571501152 installed
<13>Nov 22 11:07:09 rpmi: libqt5-eglfskmssupport-5.12.5-alt1 sisyphus+238768.340.19.1 1571501152 installed
<13>Nov 22 11:07:09 rpmi: libqt5-eglfsdeviceintegration-5.12.5-alt1 sisyphus+238768.340.19.1 1571501152 installed
<13>Nov 22 11:07:10 rpmi: libqt5-gui-5.12.5-alt1 sisyphus+238768.340.19.1 1571501152 installed
<13>Nov 22 11:07:10 rpmi: libqt5-widgets-5.12.5-alt1 sisyphus+238768.340.19.1 1571501152 installed
<13>Nov 22 11:07:10 rpmi: libqt5-opengl-5.12.5-alt1 sisyphus+238768.340.19.1 1571501152 installed
<13>Nov 22 11:07:10 rpmi: libqt5-printsupport-5.12.5-alt1 sisyphus+238768.340.19.1 1571501152 installed
<86>Nov 22 11:07:10 groupadd[24660]: group added to /etc/group: name=_keytab, GID=499
<86>Nov 22 11:07:10 groupadd[24660]: group added to /etc/gshadow: name=_keytab
<86>Nov 22 11:07:10 groupadd[24660]: new group: name=_keytab, GID=499
<13>Nov 22 11:07:10 rpmi: libkrb5-1.16.3-alt1 sisyphus+223678.100.1.1 1551746516 installed
<13>Nov 22 11:07:10 rpmi: libtirpc-1.0.3-alt1 1532008017 installed
<13>Nov 22 11:07:10 rpmi: libnsl2-1.1.0-alt1_1 1511548749 installed
<13>Nov 22 11:07:10 rpmi: python-modules-compiler-2.7.17-alt3 sisyphus+240580.200.5.1 1573517321 installed
<13>Nov 22 11:07:10 rpmi: python-modules-email-2.7.17-alt3 sisyphus+240580.200.5.1 1573517321 installed
<13>Nov 22 11:07:10 rpmi: python-modules-unittest-2.7.17-alt3 sisyphus+240580.200.5.1 1573517321 installed
<13>Nov 22 11:07:10 rpmi: python-modules-nis-2.7.17-alt3 sisyphus+240580.200.5.1 1573517321 installed
<13>Nov 22 11:07:10 rpmi: python-modules-encodings-2.7.17-alt3 sisyphus+240580.200.5.1 1573517321 installed
<13>Nov 22 11:07:11 rpmi: python-modules-2.7.17-alt3 sisyphus+240580.200.5.1 1573517321 installed
<13>Nov 22 11:07:11 rpmi: python-modules-xml-2.7.17-alt3 sisyphus+240580.200.5.1 1573517321 installed
<13>Nov 22 11:07:11 rpmi: python-modules-hotshot-2.7.17-alt3 sisyphus+240580.200.5.1 1573517321 installed
<13>Nov 22 11:07:11 rpmi: python-modules-bsddb-2.7.17-alt3 sisyphus+240580.200.5.1 1573517321 installed
<13>Nov 22 11:07:11 rpmi: python-modules-ctypes-2.7.17-alt3 sisyphus+240580.200.5.1 1573517321 installed
<13>Nov 22 11:07:11 rpmi: python-modules-multiprocessing-2.7.17-alt3 sisyphus+240580.200.5.1 1573517321 installed
<13>Nov 22 11:07:11 rpmi: python-modules-logging-2.7.17-alt3 sisyphus+240580.200.5.1 1573517321 installed
<13>Nov 22 11:07:11 rpmi: python-2.7.17-alt3 sisyphus+240580.200.5.1 1573517321 installed
<13>Nov 22 11:07:11 rpmi: python-modules-distutils-2.7.17-alt3 sisyphus+240580.200.5.1 1573517321 installed
<13>Nov 22 11:07:11 rpmi: python-modules-json-2.7.17-alt3 sisyphus+240580.200.5.1 1573517321 installed
<13>Nov 22 11:07:12 rpmi: qt5-base-devel-5.12.5-alt1 sisyphus+238768.340.19.1 1571501152 installed
warning: Macro %Kbuild not found
warning: Macro %Kinstall not found
<13>Nov 22 11:07:17 rpmi: libidn2-2.3.0-alt1 sisyphus+240846.100.1.2 1573870475 installed
<13>Nov 22 11:07:17 rpmi: rpm-macros-kde-common-devel-14.12.1-alt1 1422279175 installed
<13>Nov 22 11:07:17 rpmi: strace-5.3-alt1 sisyphus+234377.340.6.1 1569421183 installed
<13>Nov 22 11:07:17 rpmi: ed-1:0.2-alt10 1449768440 installed
<13>Nov 22 11:07:17 rpmi: rpm-utils-0.10.3-alt1 sisyphus+234377.400.6.1 1569421271 installed
<13>Nov 22 11:07:17 rpmi: rpm-macros-cmake-3.15.4-alt1 sisyphus+239520.100.1.1 1571611961 installed
<13>Nov 22 11:07:17 rpmi: cmake-modules-3.15.4-alt1 sisyphus+239520.100.1.1 1571611942 installed
<13>Nov 22 11:07:17 rpmi: libuv-1.33.1-alt1 sisyphus+239990.100.1.1 1572378437 installed
<13>Nov 22 11:07:17 rpmi: librhash-1.3.5-alt2 1505156279 installed
<13>Nov 22 11:07:17 rpmi: libjsoncpp19-1.8.4-alt4 sisyphus+232904.100.1.1 1561247386 installed
<13>Nov 22 11:07:17 rpmi: publicsuffix-list-dafsa-20191108-alt1 sisyphus+240482.100.1.2 1573431390 installed
<13>Nov 22 11:07:17 rpmi: libpsl-0.21.0-alt2 sisyphus+237083.100.1.1 1567531657 installed
<13>Nov 22 11:07:17 rpmi: libnghttp2-1.39.2-alt1 sisyphus+236978.100.1.1 1567325198 installed
<86>Nov 22 11:07:17 groupadd[30187]: group added to /etc/group: name=sasl, GID=498
<86>Nov 22 11:07:17 groupadd[30187]: group added to /etc/gshadow: name=sasl
<86>Nov 22 11:07:17 groupadd[30187]: new group: name=sasl, GID=498
<13>Nov 22 11:07:17 rpmi: libsasl2-3-2.1.27-alt2 sisyphus+228101.100.1.1 1556139863 installed
<13>Nov 22 11:07:17 rpmi: libldap-2.4.48-alt3 sisyphus+238816.100.1.1 1570449022 installed
<13>Nov 22 11:07:17 rpmi: libbrotlicommon-1.0.7-alt1 sisyphus+226738.100.2.1 1554554568 installed
<13>Nov 22 11:07:17 rpmi: libbrotlidec-1.0.7-alt1 sisyphus+226738.100.2.1 1554554568 installed
<13>Nov 22 11:07:17 rpmi: libcurl-7.67.0-alt1 sisyphus+240544.100.1.1 1573453411 installed
<13>Nov 22 11:07:17 rpmi: libnettle7-3.5.1-alt1 sisyphus+235265.40.6.1 1566223065 installed
<13>Nov 22 11:07:17 rpmi: libarchive13-3.4.0-alt1 sisyphus+235265.640.9.1 1566482857 installed
<13>Nov 22 11:07:18 rpmi: cmake-3.15.4-alt1 sisyphus+239520.100.1.1 1571611961 installed
<13>Nov 22 11:07:18 rpmi: kde-common-devel-14.12.1-alt1 1422279175 installed
Building target platforms: i586
Building for target i586
Wrote: /usr/src/in/nosrpm/qimageblitz5-5.0.0-alt0.2.nosrc.rpm
Installing qimageblitz5-5.0.0-alt0.2.src.rpm
Building target platforms: i586
Building for target i586
Executing(%prep): /bin/sh -e /usr/src/tmp/rpm-tmp.63433
+ umask 022
+ /bin/mkdir -p /usr/src/RPM/BUILD
+ cd /usr/src/RPM/BUILD
+ cd /usr/src/RPM/BUILD
+ rm -rf qimageblitz-5.0.0
+ echo 'Source #0 (qimageblitz-5.0.0.tar):'
Source #0 (qimageblitz-5.0.0.tar):
+ /bin/tar -xf /usr/src/RPM/SOURCES/qimageblitz-5.0.0.tar
+ cd qimageblitz-5.0.0
+ /bin/chmod -c -Rf u+rwX,go-w .
+ sed -i '/add_subdirectory.*test/d' CMakeLists.txt
+ sed -i 's| -ansi ||' CMakeLists.txt
+ sed -i '/^Requires:[[:space:]]*QtGui$/s|QtGui|Qt5Gui|' blitz/qimageblitz.pc.cmake
+ exit 0
Executing(%build): /bin/sh -e /usr/src/tmp/rpm-tmp.6718
+ umask 022
+ /bin/mkdir -p /usr/src/RPM/BUILD
+ cd /usr/src/RPM/BUILD
+ cd qimageblitz-5.0.0
+ __kde_build -DQT4_BUILD=OFF
+ mkdir -p BUILD-i586-alt-linux
+ __kde4_cmake -DINCLUDE_INSTALL_DIR=/usr/include -DSOUND_INSTALL_DIR=/usr/share/sounds -DAUTOSTART_INSTALL_DIR=/etc/xdg/autostart -DXDG_DIRECTORY_INSTALL_DIR=/usr/share/desktop-directories -DXDG_APPS_INSTALL_DIR=/usr/share/applications -DQT4_BUILD=OFF
+ export PATH=/usr/lib/kde4/bin:/usr/src/bin:/bin:/usr/bin:/usr/X11R6/bin:/usr/games
+ PATH=/usr/lib/kde4/bin:/usr/src/bin:/bin:/usr/bin:/usr/X11R6/bin:/usr/games
+ pushd BUILD-i586-alt-linux
~/RPM/BUILD/qimageblitz-5.0.0/BUILD-i586-alt-linux ~/RPM/BUILD/qimageblitz-5.0.0
+ cmake .. -DCMAKE_SKIP_RPATH:BOOL=yes -DCMAKE_BUILD_TYPE=Release '-DCMAKE_C_FLAGS:STRING=-pipe -frecord-gcc-switches -Wall -g -O2 -march=i586 -mtune=generic' '-DCMAKE_CXX_FLAGS:STRING=-pipe -frecord-gcc-switches -Wall -g -O2 -march=i586 -mtune=generic' '-DCMAKE_EXE_LINKER_FLAGS:STRING=-L/usr/lib/kde4link -L/usr/lib/kde4/devel' '-DCMAKE_MODULE_LINKER_FLAGS:STRING=-L/usr/lib/kde4link -L/usr/lib/kde4/devel' '-DCMAKE_SHARED_LINKER_FLAGS:STRING=-L/usr/lib/kde4link -L/usr/lib/kde4/devel' '-DCMAKE_LIBRARY_PATH:LIST=/usr/lib/kde4/devel;/usr/lib/kde4link;/usr/lib;/lib' -DLIB_DESTINATION=lib -DLIB_SUFFIX= -DCMAKE_INSTALL_PREFIX=/usr -DBIN_INSTALL_DIR=/usr/bin -DSBIN_INSTALL_DIR=/usr/sbin -DICON_INSTALL_DIR=/usr/share/icons -DXDG_APPS_INSTALL_DIR=/usr/share/applications/kde4 -DXDG_DIRECTORY_INSTALL_DIR=/usr/share/desktop-directories -DLIB_INSTALL_DIR=/usr/lib -DLIBEXEC_INSTALL_DIR=/usr/lib/kde4/libexec -DINCLUDE_INSTALL_DIR=/usr/include/kde4 -DKDE4_INCLUDE_INSTALL_DIR=/usr/include/kde4 -DSYSCONF_INSTALL_DIR=/etc -DDATA_INSTALL_DIR=/usr/share/kde4/apps -DCONFIG_INSTALL_DIR=/usr/share/kde4/config -DKCFG_INSTALL_DIR=/usr/share/kde4/config.kcfg -DHTML_INSTALL_DIR=/usr/share/kde4/doc/HTML -DAPPLNK_INSTALL_DIR=/usr/share/applnk -DLOCALE_INSTALL_DIR=/usr/share/kde4/locale -DSERVICES_INSTALL_DIR=/usr/share/kde4/services -DSERVICETYPES_INSTALL_DIR=/usr/share/kde4/servicetypes -DKCONF_UPDATE_INSTALL_DIR=/usr/share/kde4/apps/kconf_update -DXDG_MIME_INSTALL_DIR=/usr/share/mime/packages -DAUTOSTART_INSTALL_DIR=/usr/share/kde4/autostart -DSOUND_INSTALL_DIR=/usr/share/kde4/sounds -DTEMPLATES_INSTALL_DIR=/usr/share/kde4/templates -DWALLPAPER_INSTALL_DIR=/usr/share/wallpapers -DDBUS_INTERFACES_INSTALL_DIR=/usr/share/dbus-1/interfaces -DDBUS_SERVICES_INSTALL_DIR=/usr/share/dbus-1/services -DDBUS_SYSTEM_SERVICES_INSTALL_DIR=/usr/share/dbus-1/system-services -DMAN_INSTALL_DIR=/usr/share/man -DINFO_INSTALL_DIR=/usr/share/info -DINSTALL_PYTHON_FILES_IN_PYTHON_PREFIX:BOOL=yes -DINCLUDE_INSTALL_DIR=/usr/include -DSOUND_INSTALL_DIR=/usr/share/sounds -DAUTOSTART_INSTALL_DIR=/etc/xdg/autostart -DXDG_DIRECTORY_INSTALL_DIR=/usr/share/desktop-directories -DXDG_APPS_INSTALL_DIR=/usr/share/applications -DQT4_BUILD=OFF
-- The C compiler identification is GNU 9.2.1
-- The CXX compiler identification is GNU 9.2.1
-- Check for working C compiler: /usr/bin/cc
-- Check for working C compiler: /usr/bin/cc -- works
-- Detecting C compiler ABI info
-- Detecting C compiler ABI info - done
-- Detecting C compile features
-- Detecting C compile features - done
-- Check for working CXX compiler: /usr/bin/c++
-- Check for working CXX compiler: /usr/bin/c++ -- works
-- Detecting CXX compiler ABI info
-- Detecting CXX compiler ABI info - done
-- Detecting CXX compile features
-- Detecting CXX compile features - done
-- Building with Qt5 support
-- Looking for stdint.h
-- Looking for stdint.h - found
-- Performing Test HAVE_MMX
-- Performing Test HAVE_MMX - Success
-- Performing Test HAVE_SSE
-- Performing Test HAVE_SSE - Success
-- Performing Test HAVE_SSE2
-- Performing Test HAVE_SSE2 - Success
-- Performing Test HAVE_3DNOW
-- Performing Test HAVE_3DNOW - Success
-- Performing Test HAVE_ALTIVEC
-- Performing Test HAVE_ALTIVEC - Failed
-- Configuring done
-- Generating done
CMake Warning:
  Manually-specified variables were not used by the project:

    APPLNK_INSTALL_DIR
    AUTOSTART_INSTALL_DIR
    CMAKE_EXE_LINKER_FLAGS
    CMAKE_LIBRARY_PATH
    CMAKE_MODULE_LINKER_FLAGS
    CONFIG_INSTALL_DIR
    DATA_INSTALL_DIR
    DBUS_INTERFACES_INSTALL_DIR
    DBUS_SERVICES_INSTALL_DIR
    DBUS_SYSTEM_SERVICES_INSTALL_DIR
    HTML_INSTALL_DIR
    ICON_INSTALL_DIR
    INFO_INSTALL_DIR
    INSTALL_PYTHON_FILES_IN_PYTHON_PREFIX
    KCFG_INSTALL_DIR
    KCONF_UPDATE_INSTALL_DIR
    KDE4_INCLUDE_INSTALL_DIR
    LIBEXEC_INSTALL_DIR
    LIB_DESTINATION
    LOCALE_INSTALL_DIR
    MAN_INSTALL_DIR
    SBIN_INSTALL_DIR
    SERVICES_INSTALL_DIR
    SERVICETYPES_INSTALL_DIR
    SOUND_INSTALL_DIR
    SYSCONF_INSTALL_DIR
    TEMPLATES_INSTALL_DIR
    WALLPAPER_INSTALL_DIR
    XDG_APPS_INSTALL_DIR
    XDG_MIME_INSTALL_DIR


-- Build files have been written to: /usr/src/RPM/BUILD/qimageblitz-5.0.0/BUILD-i586-alt-linux
+ popd
~/RPM/BUILD/qimageblitz-5.0.0
+ __kde4_make
+ pushd BUILD-i586-alt-linux
~/RPM/BUILD/qimageblitz-5.0.0/BUILD-i586-alt-linux ~/RPM/BUILD/qimageblitz-5.0.0
+ make -j8
make[2]: Entering directory '/usr/src/RPM/BUILD/qimageblitz-5.0.0/BUILD-i586-alt-linux'
Scanning dependencies of target qimageblitz_autogen
make[2]: Leaving directory '/usr/src/RPM/BUILD/qimageblitz-5.0.0/BUILD-i586-alt-linux'
make[2]: Entering directory '/usr/src/RPM/BUILD/qimageblitz-5.0.0/BUILD-i586-alt-linux'
[  8%] Automatic MOC for target qimageblitz
make[2]: Leaving directory '/usr/src/RPM/BUILD/qimageblitz-5.0.0/BUILD-i586-alt-linux'
make[1]: Entering directory '/usr/src/RPM/BUILD/qimageblitz-5.0.0/BUILD-i586-alt-linux'
[  8%] Built target qimageblitz_autogen
make[1]: Leaving directory '/usr/src/RPM/BUILD/qimageblitz-5.0.0/BUILD-i586-alt-linux'
make[2]: Entering directory '/usr/src/RPM/BUILD/qimageblitz-5.0.0/BUILD-i586-alt-linux'
[ 16%] Generating asm_scale.o
make[2]: Leaving directory '/usr/src/RPM/BUILD/qimageblitz-5.0.0/BUILD-i586-alt-linux'
make[2]: Entering directory '/usr/src/RPM/BUILD/qimageblitz-5.0.0/BUILD-i586-alt-linux'
Scanning dependencies of target qimageblitz
make[2]: Leaving directory '/usr/src/RPM/BUILD/qimageblitz-5.0.0/BUILD-i586-alt-linux'
make[2]: Entering directory '/usr/src/RPM/BUILD/qimageblitz-5.0.0/BUILD-i586-alt-linux'
[ 25%] Building CXX object blitz/CMakeFiles/qimageblitz.dir/qimageblitz_autogen/mocs_compilation.cpp.o
make[2]: Leaving directory '/usr/src/RPM/BUILD/qimageblitz-5.0.0/BUILD-i586-alt-linux'
make[2]: Entering directory '/usr/src/RPM/BUILD/qimageblitz-5.0.0/BUILD-i586-alt-linux'
[ 75%] Building CXX object blitz/CMakeFiles/qimageblitz.dir/blitzcpu.cpp.o
make[2]: Leaving directory '/usr/src/RPM/BUILD/qimageblitz-5.0.0/BUILD-i586-alt-linux'
make[2]: Entering directory '/usr/src/RPM/BUILD/qimageblitz-5.0.0/BUILD-i586-alt-linux'
[ 83%] Building CXX object blitz/CMakeFiles/qimageblitz.dir/scale.cpp.o
/usr/src/RPM/BUILD/qimageblitz-5.0.0/blitz/scale.cpp:99:2: warning: #warning Using MMX smoothscaling [-Wcpp]
   99 | #warning Using MMX smoothscaling
      |  ^~~~~~~
cc1plus: warning: unrecognized command line option '-Wno-long-long-Wundef'
make[2]: Leaving directory '/usr/src/RPM/BUILD/qimageblitz-5.0.0/BUILD-i586-alt-linux'
make[2]: Entering directory '/usr/src/RPM/BUILD/qimageblitz-5.0.0/BUILD-i586-alt-linux'
[ 58%] Building CXX object blitz/CMakeFiles/qimageblitz.dir/scalefilter.cpp.o
make[2]: Leaving directory '/usr/src/RPM/BUILD/qimageblitz-5.0.0/BUILD-i586-alt-linux'
make[2]: Entering directory '/usr/src/RPM/BUILD/qimageblitz-5.0.0/BUILD-i586-alt-linux'
[ 41%] Building CXX object blitz/CMakeFiles/qimageblitz.dir/histogram.cpp.o
/usr/src/RPM/BUILD/qimageblitz-5.0.0/blitz/histogram.cpp: In static member function 'static QImage Blitz::oilPaint(QImage&, float, Blitz::EffectQuality)':
/usr/src/RPM/BUILD/qimageblitz-5.0.0/blitz/histogram.cpp:355:18: warning: variable 'src' set but not used [-Wunused-but-set-variable]
  355 |     QRgb *dest, *src, *s, **scanblock;
      |                  ^~~
At global scope:
cc1plus: warning: unrecognized command line option '-Wno-long-long-Wundef'
make[2]: Leaving directory '/usr/src/RPM/BUILD/qimageblitz-5.0.0/BUILD-i586-alt-linux'
make[2]: Entering directory '/usr/src/RPM/BUILD/qimageblitz-5.0.0/BUILD-i586-alt-linux'
[ 50%] Building CXX object blitz/CMakeFiles/qimageblitz.dir/convolve.cpp.o
/usr/src/RPM/BUILD/qimageblitz-5.0.0/blitz/convolve.cpp:144:2: warning: #warning Using MMX floating point convolve [-Wcpp]
  144 | #warning Using MMX floating point convolve
      |  ^~~~~~~
/usr/src/RPM/BUILD/qimageblitz-5.0.0/blitz/convolve.cpp:465:2: warning: #warning Using MMX integer convolve [-Wcpp]
  465 | #warning Using MMX integer convolve
      |  ^~~~~~~
/usr/src/RPM/BUILD/qimageblitz-5.0.0/blitz/convolve.cpp:974:2: warning: #warning Using MMX gaussian blur [-Wcpp]
  974 | #warning Using MMX gaussian blur
      |  ^~~~~~~
/usr/src/RPM/BUILD/qimageblitz-5.0.0/blitz/convolve.cpp: In static member function 'static QImage Blitz::convolve(QImage&, int, float*)':
/usr/src/RPM/BUILD/qimageblitz-5.0.0/blitz/convolve.cpp:101:10: warning: variable 'overflow' set but not used [-Wunused-but-set-variable]
  101 |     bool overflow = false;
      |          ^~~~~~~~
At global scope:
cc1plus: warning: unrecognized command line option '-Wno-long-long-Wundef'
make[2]: Leaving directory '/usr/src/RPM/BUILD/qimageblitz-5.0.0/BUILD-i586-alt-linux'
make[2]: Entering directory '/usr/src/RPM/BUILD/qimageblitz-5.0.0/BUILD-i586-alt-linux'
[ 91%] Building CXX object blitz/CMakeFiles/qimageblitz.dir/gradient.cpp.o
make[2]: Leaving directory '/usr/src/RPM/BUILD/qimageblitz-5.0.0/BUILD-i586-alt-linux'
make[2]: Entering directory '/usr/src/RPM/BUILD/qimageblitz-5.0.0/BUILD-i586-alt-linux'
[ 66%] Building CXX object blitz/CMakeFiles/qimageblitz.dir/colors.cpp.o
/usr/src/RPM/BUILD/qimageblitz-5.0.0/blitz/colors.cpp:78:2: warning: #warning Using MMX grayscale [-Wcpp]
   78 | #warning Using MMX grayscale
      |  ^~~~~~~
/usr/src/RPM/BUILD/qimageblitz-5.0.0/blitz/colors.cpp:234:2: warning: #warning Using MMX invert [-Wcpp]
  234 | #warning Using MMX invert
      |  ^~~~~~~
/usr/src/RPM/BUILD/qimageblitz-5.0.0/blitz/colors.cpp:395:2: warning: #warning Using MMX intensity [-Wcpp]
  395 | #warning Using MMX intensity
      |  ^~~~~~~
cc1plus: warning: unrecognized command line option '-Wno-long-long-Wundef'
make[2]: Leaving directory '/usr/src/RPM/BUILD/qimageblitz-5.0.0/BUILD-i586-alt-linux'
make[2]: Entering directory '/usr/src/RPM/BUILD/qimageblitz-5.0.0/BUILD-i586-alt-linux'
[ 33%] Building CXX object blitz/CMakeFiles/qimageblitz.dir/blitz.cpp.o
/usr/src/RPM/BUILD/qimageblitz-5.0.0/blitz/blitz.cpp:428:2: warning: #warning Using MMX sobel edge [-Wcpp]
  428 | #warning Using MMX sobel edge
      |  ^~~~~~~
cc1plus: warning: unrecognized command line option '-Wno-long-long-Wundef'
make[2]: Leaving directory '/usr/src/RPM/BUILD/qimageblitz-5.0.0/BUILD-i586-alt-linux'
make[2]: Entering directory '/usr/src/RPM/BUILD/qimageblitz-5.0.0/BUILD-i586-alt-linux'
[100%] Linking CXX shared library libqimageblitz.so
make[2]: Leaving directory '/usr/src/RPM/BUILD/qimageblitz-5.0.0/BUILD-i586-alt-linux'
make[1]: Entering directory '/usr/src/RPM/BUILD/qimageblitz-5.0.0/BUILD-i586-alt-linux'
[100%] Built target qimageblitz
make[1]: Leaving directory '/usr/src/RPM/BUILD/qimageblitz-5.0.0/BUILD-i586-alt-linux'
+ popd
~/RPM/BUILD/qimageblitz-5.0.0
+ exit 0
Executing(%install): /bin/sh -e /usr/src/tmp/rpm-tmp.26427
+ umask 022
+ /bin/mkdir -p /usr/src/RPM/BUILD
+ cd /usr/src/RPM/BUILD
+ /bin/chmod -Rf u+rwX -- /usr/src/tmp/qimageblitz5-buildroot
+ :
+ /bin/rm -rf -- /usr/src/tmp/qimageblitz5-buildroot
+ cd qimageblitz-5.0.0
+ __kde_install
+ make -C BUILD-i586-alt-linux DESTDIR=/usr/src/tmp/qimageblitz5-buildroot install
make: Entering directory '/usr/src/RPM/BUILD/qimageblitz-5.0.0/BUILD-i586-alt-linux'
make[1]: Entering directory '/usr/src/RPM/BUILD/qimageblitz-5.0.0/BUILD-i586-alt-linux'
make[2]: Entering directory '/usr/src/RPM/BUILD/qimageblitz-5.0.0/BUILD-i586-alt-linux'
make[2]: Leaving directory '/usr/src/RPM/BUILD/qimageblitz-5.0.0/BUILD-i586-alt-linux'
make[2]: Entering directory '/usr/src/RPM/BUILD/qimageblitz-5.0.0/BUILD-i586-alt-linux'
[  8%] Automatic MOC for target qimageblitz
make[2]: Leaving directory '/usr/src/RPM/BUILD/qimageblitz-5.0.0/BUILD-i586-alt-linux'
[  8%] Built target qimageblitz_autogen
make[2]: Entering directory '/usr/src/RPM/BUILD/qimageblitz-5.0.0/BUILD-i586-alt-linux'
make[2]: Leaving directory '/usr/src/RPM/BUILD/qimageblitz-5.0.0/BUILD-i586-alt-linux'
[100%] Built target qimageblitz
make[1]: Leaving directory '/usr/src/RPM/BUILD/qimageblitz-5.0.0/BUILD-i586-alt-linux'
Install the project...
-- Install configuration: "Release"
-- Installing: /usr/src/tmp/qimageblitz5-buildroot/usr/lib/libqimageblitz.so.5.0.0
-- Installing: /usr/src/tmp/qimageblitz5-buildroot/usr/lib/libqimageblitz.so.5
-- Installing: /usr/src/tmp/qimageblitz5-buildroot/usr/lib/libqimageblitz.so
-- Installing: /usr/src/tmp/qimageblitz5-buildroot/usr/include/qimageblitz/qimageblitz.h
-- Installing: /usr/src/tmp/qimageblitz5-buildroot/usr/include/qimageblitz/qimageblitz_export.h
-- Installing: /usr/src/tmp/qimageblitz5-buildroot/usr/include/qimageblitz/blitzcpu.h
-- Installing: /usr/src/tmp/qimageblitz5-buildroot/usr/lib/pkgconfig/qimageblitz.pc
make: Leaving directory '/usr/src/RPM/BUILD/qimageblitz-5.0.0/BUILD-i586-alt-linux'
+ /usr/lib/rpm/brp-alt
Cleaning files in /usr/src/tmp/qimageblitz5-buildroot (auto)
mode of './usr/lib/libqimageblitz.so.5.0.0' changed from 0755 (rwxr-xr-x) to 0644 (rw-r--r--)
Verifying and fixing files in /usr/src/tmp/qimageblitz5-buildroot (binconfig,pkgconfig,libtool,desktop)
/usr/lib/pkgconfig/qimageblitz.pc: Cflags: '-I${includedir}' --> ''
/usr/lib/pkgconfig/qimageblitz.pc: Libs: '-L${libdir} -lqimageblitz' --> '-lqimageblitz'
Checking contents of files in /usr/src/tmp/qimageblitz5-buildroot/ (default)
Compressing files in /usr/src/tmp/qimageblitz5-buildroot (auto)
Adjusting library links in /usr/src/tmp/qimageblitz5-buildroot
./usr/lib:
	libqimageblitz.so.5 -> libqimageblitz.so.5.0.0
Verifying ELF objects in /usr/src/tmp/qimageblitz5-buildroot (arch=normal,fhs=normal,lfs=relaxed,lint=relaxed,rpath=normal,stack=normal,textrel=normal,unresolved=normal)
Hardlinking identical .pyc and .pyo files
Processing files: libqimageblitz5-5.0.0-alt0.2
warning: File listed twice: /usr/lib/libqimageblitz.so.5
Finding Provides (using /usr/lib/rpm/find-provides)
Executing: /bin/sh -e /usr/src/tmp/rpm-tmp.kVKzZU
find-provides: running scripts (alternatives,debuginfo,lib,pam,perl,pkgconfig,python,shell)
lib.prov: /usr/src/tmp/qimageblitz5-buildroot/usr/lib/libqimageblitz.so.5: 53 symbols, 16 bpp
Finding Requires (using /usr/lib/rpm/find-requires)
Executing: /bin/sh -e /usr/src/tmp/rpm-tmp.SsAxAU
find-requires: running scripts (cpp,debuginfo,files,lib,pam,perl,pkgconfig,pkgconfiglib,python,rpmlib,shebang,shell,static,symlinks)
Provides: libqimageblitz.so.5 = set:jdHbDXcZGEIj7C4Fni8vWevYl23F09FjLNATgwCaATLMCKpUZ9ot9KH4gdFP5QT2Uqb2l2pHDKQLhKrmKGcclpywifDfQJGmaTbZL3fb9s
Requires: libQt5Core.so.5 >= set:qneZHXCYfG8Kzsghv51BMwTr0, libQt5Core.so.5(Qt_5), libQt5Core.so.5(Qt_5.12), libQt5Gui.so.5 >= set:ql2pCpyVFYB6HY5UbbGzLBpj12shh5KEfSxWpsQEjtwU2SYD55Ng7dH6n0vewXWnQXh2ZLNgn5Byj2MWzMYKcGdXAoOvXZ2dRyuQl1, libQt5Gui.so.5(Qt_5), libc.so.6(GLIBC_2.0), libc.so.6(GLIBC_2.1.3), libc.so.6(GLIBC_2.11), libc.so.6(GLIBC_2.4), libm.so.6(GLIBC_2.0), libm.so.6(GLIBC_2.1), libm.so.6(GLIBC_2.27), libm.so.6(GLIBC_2.29), libstdc++.so.6(CXXABI_1.3.9), libstdc++.so.6(GLIBCXX_3.4), rtld(GNU_HASH)
Requires(rpmlib): rpmlib(SetVersions)
Finding debuginfo files (using /usr/lib/rpm/find-debuginfo-files)
Executing: /bin/sh -e /usr/src/tmp/rpm-tmp.HJR8uS
Creating libqimageblitz5-debuginfo package
Processing files: qimageblitz5-devel-5.0.0-alt0.2
Executing(%doc): /bin/sh -e /usr/src/tmp/rpm-tmp.82236
+ umask 022
+ /bin/mkdir -p /usr/src/RPM/BUILD
+ cd /usr/src/RPM/BUILD
+ cd qimageblitz-5.0.0
+ DOCDIR=/usr/src/tmp/qimageblitz5-buildroot/usr/share/doc/qimageblitz5-devel-5.0.0
+ export DOCDIR
+ rm -rf /usr/src/tmp/qimageblitz5-buildroot/usr/share/doc/qimageblitz5-devel-5.0.0
+ /bin/mkdir -p /usr/src/tmp/qimageblitz5-buildroot/usr/share/doc/qimageblitz5-devel-5.0.0
+ cp -prL README.BLITZ README.PORTING /usr/src/tmp/qimageblitz5-buildroot/usr/share/doc/qimageblitz5-devel-5.0.0
+ chmod -R go-w /usr/src/tmp/qimageblitz5-buildroot/usr/share/doc/qimageblitz5-devel-5.0.0
+ chmod -R a+rX /usr/src/tmp/qimageblitz5-buildroot/usr/share/doc/qimageblitz5-devel-5.0.0
+ exit 0
Finding Provides (using /usr/lib/rpm/find-provides)
Executing: /bin/sh -e /usr/src/tmp/rpm-tmp.vGwKrW
find-provides: running scripts (alternatives,debuginfo,lib,pam,perl,pkgconfig,python,shell)
Finding Requires (using /usr/lib/rpm/find-requires)
Executing: /bin/sh -e /usr/src/tmp/rpm-tmp.uwOqzS
find-requires: running scripts (cpp,debuginfo,files,lib,pam,perl,pkgconfig,pkgconfiglib,python,rpmlib,shebang,shell,static,symlinks)
In file included from /usr/include/qt5/QtCore/qatomic.h:46,
                 from /usr/include/qt5/QtCore/qrefcount.h:43,
                 from /usr/include/qt5/QtCore/qlist.h:45,
                 from /usr/include/qt5/QtCore/qstringlist.h:41,
                 from /usr/include/qt5/QtGui/qcolor.h:46,
                 from /usr/include/qt5/QtGui/qimage.h:44,
                 from /usr/include/qt5/QtGui/QImage:1,
                 from /usr/src/tmp/qimageblitz5-buildroot/usr/include/qimageblitz/qimageblitz.h:36:
/usr/include/qt5/QtCore/qbasicatomic.h:61:4: error: #error "Qt requires C++11 support"
   61 | #  error "Qt requires C++11 support"
      |    ^~~~~
In file included from /usr/include/qt5/QtCore/qstring.h:49,
                 from /usr/include/qt5/QtCore/qhashfunctions.h:44,
                 from /usr/include/qt5/QtCore/qlist.h:47,
                 from /usr/include/qt5/QtCore/qstringlist.h:41,
                 from /usr/include/qt5/QtGui/qcolor.h:46,
                 from /usr/include/qt5/QtGui/qimage.h:44,
                 from /usr/include/qt5/QtGui/QImage:1,
                 from /usr/src/tmp/qimageblitz5-buildroot/usr/include/qimageblitz/qimageblitz.h:36:
/usr/include/qt5/QtCore/qbytearray.h:52:10: fatal error: string: No such file or directory
   52 | #include <string>
      |          ^~~~~~~~
compilation terminated.
cpp.req: /usr/src/tmp/qimageblitz5-buildroot/usr/include/qimageblitz/qimageblitz.h: cpp failed, trying c++ mode
In file included from /usr/include/qt5/QtGui/qtguiglobal.h:43,
                 from /usr/include/qt5/QtGui/qimage.h:43,
                 from /usr/include/qt5/QtGui/QImage:1,
                 from /usr/src/tmp/qimageblitz5-buildroot/usr/include/qimageblitz/qimageblitz.h:36:
/usr/include/qt5/QtCore/qglobal.h:1187:4: error: #error "You must build your code with position independent code if Qt was built with -reduce-relocations. " "Compile your code with -fPIC (-fPIE is not enough)."
 1187 | #  error "You must build your code with position independent code if Qt was built with -reduce-relocations. "\
      |    ^~~~~
cpp.req: WARNING: /usr/src/tmp/qimageblitz5-buildroot/usr/include/qimageblitz/qimageblitz.h: cpp failed
Provides: pkgconfig(qimageblitz) = 5.0.0
Requires: /usr/lib/libqimageblitz.so.5, /usr/lib/pkgconfig, pkgconfig(Qt5Gui), qt5-base-devel
Conflicts: libqimageblitz-devel
Finding debuginfo files (using /usr/lib/rpm/find-debuginfo-files)
Executing: /bin/sh -e /usr/src/tmp/rpm-tmp.XBjwqV
Processing files: libqimageblitz5-debuginfo-5.0.0-alt0.2
Finding Provides (using /usr/lib/rpm/find-provides)
Executing: /bin/sh -e /usr/src/tmp/rpm-tmp.lk5qAT
find-provides: running scripts (debuginfo)
Finding Requires (using /usr/lib/rpm/find-requires)
Executing: /bin/sh -e /usr/src/tmp/rpm-tmp.bvmRaV
find-requires: running scripts (debuginfo)
Provides: debug(libqimageblitz.so.5)
Requires: libqimageblitz5 = 5.0.0-alt0.2, debug(libQt5Core.so.5), debug(libQt5Gui.so.5), debug(libc.so.6), debug(libm.so.6), debug(libstdc++.so.6)
Adding to libqimageblitz5-debuginfo a strict dependency on libqimageblitz5
Adding to qimageblitz5-devel a strict dependency on libqimageblitz5
Removing 1 extra deps from qimageblitz5-devel due to dependency on libqimageblitz5
Wrote: /usr/src/RPM/RPMS/i586/libqimageblitz5-5.0.0-alt0.2.i586.rpm
Wrote: /usr/src/RPM/RPMS/i586/qimageblitz5-devel-5.0.0-alt0.2.i586.rpm
Wrote: /usr/src/RPM/RPMS/i586/libqimageblitz5-debuginfo-5.0.0-alt0.2.i586.rpm
36.24user 4.49system 0:25.86elapsed 157%CPU (0avgtext+0avgdata 127664maxresident)k
0inputs+0outputs (0major+723850minor)pagefaults 0swaps
57.04user 13.07system 0:58.06elapsed 120%CPU (0avgtext+0avgdata 127664maxresident)k
0inputs+0outputs (0major+1237403minor)pagefaults 0swaps
--- libqimageblitz5-5.0.0-alt0.2.i586.rpm.repo	2019-10-22 09:17:23.000000000 +0000
+++ libqimageblitz5-5.0.0-alt0.2.i586.rpm.hasher	2019-11-22 11:07:50.119659233 +0000
@@ -15,2 +15,3 @@
 Requires: libm.so.6(GLIBC_2.27)  
+Requires: libm.so.6(GLIBC_2.29)  
 Requires: libstdc++.so.6(CXXABI_1.3.9)