<86>Nov 11 12:22:41 userdel[20814]: delete user 'rooter'
<86>Nov 11 12:22:41 userdel[20814]: removed group 'rooter' owned by 'rooter'
<86>Nov 11 12:22:41 userdel[20814]: removed shadow group 'rooter' owned by 'rooter'
<86>Nov 11 12:22:42 groupadd[20824]: group added to /etc/group: name=rooter, GID=549
<86>Nov 11 12:22:42 groupadd[20824]: group added to /etc/gshadow: name=rooter
<86>Nov 11 12:22:42 groupadd[20824]: new group: name=rooter, GID=549
<86>Nov 11 12:22:42 useradd[20831]: new user: name=rooter, UID=549, GID=549, home=/root, shell=/bin/bash
<86>Nov 11 12:22:42 userdel[20848]: delete user 'builder'
<86>Nov 11 12:22:42 userdel[20848]: removed group 'builder' owned by 'builder'
<86>Nov 11 12:22:42 userdel[20848]: removed shadow group 'builder' owned by 'builder'
<86>Nov 11 12:22:42 groupadd[20856]: group added to /etc/group: name=builder, GID=550
<86>Nov 11 12:22:42 groupadd[20856]: group added to /etc/gshadow: name=builder
<86>Nov 11 12:22:42 groupadd[20856]: new group: name=builder, GID=550
<86>Nov 11 12:22:42 useradd[20866]: new user: name=builder, UID=550, GID=550, home=/usr/src, shell=/bin/bash
<13>Nov 11 12:22:49 rpmi: libidn2-2.2.0-alt1 sisyphus+229970.100.1.1 1558625600 installed
<13>Nov 11 12:22:49 rpmi: libruby-2.5.5-alt4.1 sisyphus+237310.40.2.1 1568211319 installed
<13>Nov 11 12:22:49 rpmi: rpm-macros-ruby-1:1.0.0-alt8 sisyphus+231621.60.57.1 1567243111 installed
<13>Nov 11 12:22:49 rpmi: libexpat-2.2.4-alt1 1503305345 installed
<13>Nov 11 12:22:49 rpmi: publicsuffix-list-dafsa-20191108-alt1 sisyphus+240482.100.1.2 1573431390 installed
<13>Nov 11 12:22:49 rpmi: libpsl-0.21.0-alt2 sisyphus+237083.100.1.1 1567531657 installed
<13>Nov 11 12:22:49 rpmi: libnghttp2-1.39.2-alt1 sisyphus+236978.100.1.1 1567325198 installed
<13>Nov 11 12:22:49 rpmi: libbrotlicommon-1.0.7-alt1 sisyphus+226738.100.2.1 1554554568 installed
<13>Nov 11 12:22:49 rpmi: libbrotlidec-1.0.7-alt1 sisyphus+226738.100.2.1 1554554568 installed
<13>Nov 11 12:22:49 rpmi: rsync-3.1.3-alt1 1518721086 installed
<13>Nov 11 12:22:49 rpmi: libverto-0.3.0-alt1_7 sisyphus+225932.100.1.1 1553994919 installed
<13>Nov 11 12:22:49 rpmi: libkeyutils-1.6-alt2 sisyphus+226520.100.2.1 1554512089 installed
<13>Nov 11 12:22:49 rpmi: libcom_err-1.44.6-alt1 sisyphus+224154.100.1.1 1552091678 installed
<13>Nov 11 12:22:49 rpmi: libedit3-3.1.20190324-alt1 sisyphus+236523.100.1.1 1566578247 installed
<13>Nov 11 12:22:49 rpmi: less-530-alt1 sisyphus+226367.200.2.2 1554151813 installed
<13>Nov 11 12:22:49 rpmi: diffstat-1.62-alt1 sisyphus+221902.1600.4.1 1550595368 installed
<13>Nov 11 12:22:49 rpmi: chrpath-0.16-alt1 1453066316 installed
<13>Nov 11 12:22:49 rpmi: libp11-kit-0.23.15-alt1 sisyphus+226408.100.2.1 1554288204 installed
<13>Nov 11 12:22:49 rpmi: libtasn1-4.14-alt1 sisyphus+235791.100.1.1 1565282372 installed
<13>Nov 11 12:22:49 rpmi: libgdbm-1.8.3-alt10 1454943334 installed
<13>Nov 11 12:22:49 rpmi: libyaml2-0.2.2-alt1 sisyphus+229134.100.1.1 1557342721 installed
<13>Nov 11 12:22:49 rpmi: rpm-macros-alternatives-0.5.1-alt1 sisyphus+226946.100.1.1 1554830426 installed
<13>Nov 11 12:22:49 rpmi: alternatives-0.5.1-alt1 sisyphus+226946.100.1.1 1554830426 installed
<13>Nov 11 12:22:49 rpmi: ca-certificates-2019.10.28-alt1 sisyphus+239875.300.1.1 1572267834 installed
<13>Nov 11 12:22:49 rpmi: ca-trust-0.1.2-alt1 sisyphus+233348.100.1.1 1561653823 installed
<13>Nov 11 12:22:49 rpmi: p11-kit-trust-0.23.15-alt1 sisyphus+226408.100.2.1 1554288204 installed
<13>Nov 11 12:22:50 rpmi: libcrypto1.1-1.1.1d-alt1.1 sisyphus+237931.100.2.1 1569235729 installed
<13>Nov 11 12:22:50 rpmi: libssl1.1-1.1.1d-alt1.1 sisyphus+237931.100.2.1 1569235729 installed
<86>Nov 11 12:22:50 groupadd[29421]: group added to /etc/group: name=_keytab, GID=499
<86>Nov 11 12:22:50 groupadd[29421]: group added to /etc/gshadow: name=_keytab
<86>Nov 11 12:22:50 groupadd[29421]: new group: name=_keytab, GID=499
<13>Nov 11 12:22:50 rpmi: libkrb5-1.16.3-alt1 sisyphus+223678.100.1.1 1551746516 installed
<86>Nov 11 12:22:50 groupadd[29860]: group added to /etc/group: name=sasl, GID=498
<86>Nov 11 12:22:50 groupadd[29860]: group added to /etc/gshadow: name=sasl
<86>Nov 11 12:22:50 groupadd[29860]: new group: name=sasl, GID=498
<13>Nov 11 12:22:50 rpmi: libsasl2-3-2.1.27-alt2 sisyphus+228101.100.1.1 1556139863 installed
<13>Nov 11 12:22:50 rpmi: libldap-2.4.48-alt3 sisyphus+238816.100.1.1 1570449022 installed
<13>Nov 11 12:22:50 rpmi: libcurl-7.66.0-alt1 sisyphus+237384.100.1.1 1568183544 installed
<13>Nov 11 12:22:50 rpmi: openssl-1.1.1d-alt1.1 sisyphus+237931.100.2.1 1569235729 installed
<13>Nov 11 12:22:50 rpmi: ruby-rubygems-update-3.0.4-alt1 sisyphus+231621.240.57.1 1567243682 installed
<13>Nov 11 12:22:50 rpmi: gem-did-you-mean-1.3.0-alt2.1 sisyphus+237310.1100.2.1 1568211939 installed
<13>Nov 11 12:22:50 rpmi: ruby-minitest-5.11.3-alt1 sisyphus+219345.3500.8.1 1547631954 installed
<13>Nov 11 12:22:50 rpmi: ruby-net-telnet-0.2.0-alt1 sisyphus+219345.2700.8.1 1547631566 installed
<13>Nov 11 12:22:50 rpmi: gem-power-assert-1.1.4-alt1 sisyphus+226411.3200.6.1 1554380195 installed
<13>Nov 11 12:22:50 rpmi: ruby-test-unit-1:3.3.1-alt1 sisyphus+226411.5300.6.1 1554381151 installed
<13>Nov 11 12:22:50 rpmi: ruby-xmlrpc-0.3.0-alt1 sisyphus+219345.3300.8.1 1547631818 installed
<13>Nov 11 12:22:50 rpmi: gem-2.5.5-alt4.1 sisyphus+237310.40.2.1 1568211289 installed
<13>Nov 11 12:22:50 rpmi: ri-6.1.1-alt3 sisyphus+220149.7500.44.1 1552167568 installed
<13>Nov 11 12:22:50 rpmi: rdoc-6.1.1-alt3 sisyphus+220149.7500.44.1 1552167568 installed
<13>Nov 11 12:22:50 rpmi: ruby-rdoc-6.1.1-alt3 sisyphus+220149.7500.44.1 1552167568 installed
<13>Nov 11 12:22:50 rpmi: erb-2.5.5-alt4.1 sisyphus+237310.40.2.1 1568211289 installed
<13>Nov 11 12:22:50 rpmi: irb-2.5.5-alt4.1 sisyphus+237310.40.2.1 1568211289 installed
<13>Nov 11 12:22:50 rpmi: rake-12.3.3-alt1 sisyphus+238087.3100.11.1 1569616589 installed
<13>Nov 11 12:22:50 rpmi: ruby-rake-12.3.3-alt1 sisyphus+238087.3100.11.1 1569616589 installed
<13>Nov 11 12:22:51 rpmi: ruby-stdlibs-2.5.5-alt4.1 sisyphus+237310.40.2.1 1568211319 installed
<13>Nov 11 12:22:51 rpmi: bundle-2.0.2-alt2 sisyphus+237310.400.2.1 1568211679 installed
<13>Nov 11 12:22:51 rpmi: ruby-2.5.5-alt4.1 sisyphus+237310.40.2.1 1568211319 installed
<13>Nov 11 12:22:53 rpmi: ruby-bundler-2.0.2-alt2 sisyphus+237310.400.2.1 1568211679 installed
<13>Nov 11 12:22:53 rpmi: ruby-coderay-1.1.2-alt1.1 sisyphus.209945.5500 1537064013 installed
<13>Nov 11 12:22:53 rpmi: ruby-method_source-0.9.0-alt1 sisyphus.209945.31420 1537073074 installed
<13>Nov 11 12:22:53 rpmi: ruby-pry-0.12.2-alt3.1 sisyphus+237310.3600.2.1 1568214271 installed
<13>Nov 11 12:22:53 rpmi: gem-setup-5.999.3-alt9 sisyphus+237309.100.1.1 1568042127 installed
<13>Nov 11 12:22:53 rpmi: openssh-common-7.9p1-alt1 sisyphus+233206.100.1.1 1561507843 installed
<86>Nov 11 12:22:53 groupadd[2668]: group added to /etc/group: name=sshagent, GID=497
<86>Nov 11 12:22:53 groupadd[2668]: group added to /etc/gshadow: name=sshagent
<86>Nov 11 12:22:53 groupadd[2668]: new group: name=sshagent, GID=497
<13>Nov 11 12:22:54 rpmi: openssh-clients-7.9p1-alt1 sisyphus+233206.100.1.1 1561507843 installed
<13>Nov 11 12:22:56 rpmi: git-core-2.21.0-alt1 sisyphus+225342.100.2.1 1553908937 installed
<13>Nov 11 12:22:56 rpmi: ruby-tool-setup-3.4.1-alt15 sisyphus+224756.300.2.1 1552290808 installed
<13>Nov 11 12:22:56 rpmi: libruby-devel-2.5.5-alt4.1 sisyphus+237310.40.2.1 1568211319 installed
<13>Nov 11 12:22:56 rpmi: rpm-build-ruby-1:1.0.0-alt8 sisyphus+231621.60.57.1 1567243111 installed
Building target platforms: i586
Building for target i586
Wrote: /usr/src/in/nosrpm/ruby-posix_mq-2.4.1-alt2.nosrc.rpm
Installing ruby-posix_mq-2.4.1-alt2.src.rpm
Building target platforms: i586
Building for target i586
Executing(%prep): /bin/sh -e /usr/src/tmp/rpm-tmp.98102
+ umask 022
+ /bin/mkdir -p /usr/src/RPM/BUILD
+ cd /usr/src/RPM/BUILD
+ cd /usr/src/RPM/BUILD
+ rm -rf ruby-posix_mq-2.4.1
+ echo 'Source #0 (ruby-posix_mq-2.4.1.tar):'
Source #0 (ruby-posix_mq-2.4.1.tar):
+ /bin/tar -xf /usr/src/RPM/SOURCES/ruby-posix_mq-2.4.1.tar
+ cd ruby-posix_mq-2.4.1
+ /bin/chmod -c -Rf u+rwX,go-w .
+ exit 0
Executing(%build): /bin/sh -e /usr/src/tmp/rpm-tmp.62970
+ umask 022
+ /bin/mkdir -p /usr/src/RPM/BUILD
+ cd /usr/src/RPM/BUILD
+ cd ruby-posix_mq-2.4.1
+ /usr/bin/setup.rb build --prefixes=gem,ruby,rails-engine --gem-version-replace=
GIT_VERSION = 2.4.1
/bin/sh: pandoc: command not found
make: *** [GNUmakefile:27: posix-mq-rb.1.html] Error 127
gem 'posix_mq' at /usr/src/RPM/BUILD/ruby-posix_mq-2.4.1
(ruby 2.5.5 i586-linux)
WARN [LoadError]: cannot load such file -- Rakefile

- - PRECONFIG - - - - - - - - - - - - - - - - - - - - - - - - - - - - 

SetupConfig was saved. Edit to customize configuration.

- - COMPILE - - - - - - - - - - - - - - - - - - - - - - - - - - - - - 

checking for sys/select.h... yes
checking for signal.h... yes
checking for mqueue.h... yes
checking for pthread.h... yes
checking for rb_str_set_len()... yes
checking for rb_thread_blocking_region()... no
checking for rb_thread_call_without_gvl()... yes
checking for -lm... yes
checking for -lrt... yes
checking for -lpthread... yes
checking for __mq_oshandle()... no
checking for mq_timedsend()... yes
checking for mq_timedreceive()... yes
creating Makefile
checking for sys/select.h... yes
checking for signal.h... yes
checking for mqueue.h... yes
checking for pthread.h... yes
checking for rb_str_set_len()... yes
checking for rb_thread_blocking_region()... no
checking for rb_thread_call_without_gvl()... yes
checking for -lm... yes
checking for -lrt... yes
checking for -lpthread... yes
checking for __mq_oshandle()... no
checking for mq_timedsend()... yes
checking for mq_timedreceive()... yes
creating Makefile
[/usr/src/RPM/BUILD/ruby-posix_mq-2.4.1/ext/posix_mq/.]$ make make
make: Entering directory '/usr/src/RPM/BUILD/ruby-posix_mq-2.4.1/ext/posix_mq'
compiling posix_mq.c
linking shared-object posix_mq_ext.so
make: Leaving directory '/usr/src/RPM/BUILD/ruby-posix_mq-2.4.1/ext/posix_mq'
make: Entering directory '/usr/src/RPM/BUILD/ruby-posix_mq-2.4.1/ext/posix_mq'
/bin/install -c -m 0755 posix_mq_ext.so /usr/src/RPM/BUILD/ruby-posix_mq-2.4.1/.so.posix_mq/usr/lib/ruby/site_ruby/2.5.5/i586-linux
make: Leaving directory '/usr/src/RPM/BUILD/ruby-posix_mq-2.4.1/ext/posix_mq'
[/usr/src/RPM/BUILD/ruby-posix_mq-2.4.1/./ext/posix_mq]$ make make
make: Entering directory '/usr/src/RPM/BUILD/ruby-posix_mq-2.4.1/ext/posix_mq'
make: Nothing to be done for 'all'.
make: Leaving directory '/usr/src/RPM/BUILD/ruby-posix_mq-2.4.1/ext/posix_mq'
make: Entering directory '/usr/src/RPM/BUILD/ruby-posix_mq-2.4.1/ext/posix_mq'
/bin/install -c -m 0755 posix_mq_ext.so /usr/src/RPM/BUILD/ruby-posix_mq-2.4.1/.so.posix_mq/usr/lib/ruby/site_ruby/2.5.5/i586-linux
make: Leaving directory '/usr/src/RPM/BUILD/ruby-posix_mq-2.4.1/ext/posix_mq'

- - DOCUMENT- - - - - - - - - - - - - - - - - - - - - - - - - - - - - 


+ exit 0
Executing(%install): /bin/sh -e /usr/src/tmp/rpm-tmp.32792
+ umask 022
+ /bin/mkdir -p /usr/src/RPM/BUILD
+ cd /usr/src/RPM/BUILD
+ /bin/chmod -Rf u+rwX -- /usr/src/tmp/ruby-posix_mq-buildroot
+ :
+ /bin/rm -rf -- /usr/src/tmp/ruby-posix_mq-buildroot
+ cd ruby-posix_mq-2.4.1
+ /usr/bin/setup.rb install --install_prefix=/usr/src/tmp/ruby-posix_mq-buildroot
/bin/sh: pandoc: command not found
make: *** [GNUmakefile:27: posix-mq-rb.1.html] Error 127
gem 'posix_mq' at /usr/src/RPM/BUILD/ruby-posix_mq-2.4.1
(ruby 2.5.5 i586-linux)
WARN [LoadError]: cannot load such file -- Rakefile

- - INSTALL - - - - - - - - - - - - - - - - - - - - - - - - - - - - - 

* {exe} ->
  % posix_mq < bin
    posix-mq-rb => [/usr/src/tmp/ruby-posix_mq-buildroot]/usr/lib/ruby/gems/2.5.0/gems/posix_mq-2.4.1/bin/posix-mq-rb
  % posix_mq
    /usr/lib/ruby/gems/2.5.0/gems/posix_mq-2.4.1/bin/posix-mq-rb -> [/usr/src/tmp/ruby-posix_mq-buildroot]/usr/bin/posix-mq-rb
* {dl} ->
  % posix_mq < .so.posix_mq/usr/lib/ruby/site_ruby/2.5.5/i586-linux
    posix_mq_ext.so => [/usr/src/tmp/ruby-posix_mq-buildroot]/usr/lib/ruby/gems/2.5.0/extensions/x86-linux/2.5.0/posix_mq-2.4.1/posix_mq_ext.so
    gem.build_complete => [/usr/src/tmp/ruby-posix_mq-buildroot]/usr/lib/ruby/gems/2.5.0/extensions/x86-linux/2.5.0/posix_mq-2.4.1/gem.build_complete
    /usr/lib/ruby/gems/2.5.0/extensions/x86-linux/2.5.0/posix_mq-2.4.1 -> [/usr/src/tmp/ruby-posix_mq-buildroot]/usr/lib/ruby/gems/2.5.0/gems/posix_mq-2.4.1/i586-linux
* {lib} ->
  % posix_mq < lib
    posix_mq.rb => [/usr/src/tmp/ruby-posix_mq-buildroot]/usr/lib/ruby/gems/2.5.0/gems/posix_mq-2.4.1/lib/posix_mq.rb
* {man} ->
  % posix_mq < Documentation
* {ri} ->
  % posix_mq < .ri.posix_mq
    cache.ri => [/usr/src/tmp/ruby-posix_mq-buildroot]/usr/lib/ruby/gems/2.5.0/doc/posix_mq-2.4.1/ri/cache.ri
    POSIX_MQ/notify-i.ri => [/usr/src/tmp/ruby-posix_mq-buildroot]/usr/lib/ruby/gems/2.5.0/doc/posix_mq-2.4.1/ri/POSIX_MQ/notify-i.ri
    POSIX_MQ/dup-i.ri => [/usr/src/tmp/ruby-posix_mq-buildroot]/usr/lib/ruby/gems/2.5.0/doc/posix_mq-2.4.1/ri/POSIX_MQ/dup-i.ri
    POSIX_MQ/clone-i.ri => [/usr/src/tmp/ruby-posix_mq-buildroot]/usr/lib/ruby/gems/2.5.0/doc/posix_mq-2.4.1/ri/POSIX_MQ/clone-i.ri
    POSIX_MQ/open-c.ri => [/usr/src/tmp/ruby-posix_mq-buildroot]/usr/lib/ruby/gems/2.5.0/doc/posix_mq-2.4.1/ri/POSIX_MQ/open-c.ri
    POSIX_MQ/cdesc-POSIX_MQ.ri => [/usr/src/tmp/ruby-posix_mq-buildroot]/usr/lib/ruby/gems/2.5.0/doc/posix_mq-2.4.1/ri/POSIX_MQ/cdesc-POSIX_MQ.ri
* {inc} ->
  % posix_mq < ext
    /usr/include -> [/usr/src/tmp/ruby-posix_mq-buildroot]/usr/lib/ruby/gems/2.5.0/gems/posix_mq-2.4.1/ext
* {app} ->
* {log} ->
* {state} ->
* {test} ->
  % posix_mq < test
    test_posix_mq.rb => [/usr/src/tmp/ruby-posix_mq-buildroot]/usr/lib/ruby/gems/2.5.0/gems/posix_mq-2.4.1/test/test_posix_mq.rb
* {sup} ->
* {conf} ->
* {data} ->
  % posix_mq < .
    .document => [/usr/src/tmp/ruby-posix_mq-buildroot]/usr/lib/ruby/gems/2.5.0/gems/posix_mq-2.4.1/.document
    .gitignore => [/usr/src/tmp/ruby-posix_mq-buildroot]/usr/lib/ruby/gems/2.5.0/gems/posix_mq-2.4.1/.gitignore
    .olddoc.yml => [/usr/src/tmp/ruby-posix_mq-buildroot]/usr/lib/ruby/gems/2.5.0/gems/posix_mq-2.4.1/.olddoc.yml
    COPYING => [/usr/src/tmp/ruby-posix_mq-buildroot]/usr/lib/ruby/gems/2.5.0/gems/posix_mq-2.4.1/COPYING
    COPYING-GPL2 => [/usr/src/tmp/ruby-posix_mq-buildroot]/usr/lib/ruby/gems/2.5.0/gems/posix_mq-2.4.1/COPYING-GPL2
    GIT-VERSION-FILE => [/usr/src/tmp/ruby-posix_mq-buildroot]/usr/lib/ruby/gems/2.5.0/gems/posix_mq-2.4.1/GIT-VERSION-FILE
    GIT-VERSION-GEN => [/usr/src/tmp/ruby-posix_mq-buildroot]/usr/lib/ruby/gems/2.5.0/gems/posix_mq-2.4.1/GIT-VERSION-GEN
    GNUmakefile => [/usr/src/tmp/ruby-posix_mq-buildroot]/usr/lib/ruby/gems/2.5.0/gems/posix_mq-2.4.1/GNUmakefile
    LICENSE => [/usr/src/tmp/ruby-posix_mq-buildroot]/usr/lib/ruby/gems/2.5.0/gems/posix_mq-2.4.1/LICENSE
    README => [/usr/src/tmp/ruby-posix_mq-buildroot]/usr/lib/ruby/gems/2.5.0/gems/posix_mq-2.4.1/README
    archive/.gitignore => [/usr/src/tmp/ruby-posix_mq-buildroot]/usr/lib/ruby/gems/2.5.0/gems/posix_mq-2.4.1/archive/.gitignore
    archive/slrnpull.conf => [/usr/src/tmp/ruby-posix_mq-buildroot]/usr/lib/ruby/gems/2.5.0/gems/posix_mq-2.4.1/archive/slrnpull.conf
    pkg.mk => [/usr/src/tmp/ruby-posix_mq-buildroot]/usr/lib/ruby/gems/2.5.0/gems/posix_mq-2.4.1/pkg.mk
    posix_mq.gemspec => [/usr/src/tmp/ruby-posix_mq-buildroot]/usr/lib/ruby/gems/2.5.0/gems/posix_mq-2.4.1/posix_mq.gemspec
    setup.rb => [/usr/src/tmp/ruby-posix_mq-buildroot]/usr/lib/ruby/gems/2.5.0/gems/posix_mq-2.4.1/setup.rb
* {.gemspec} ->
  %posix_mq
    /usr/src/tmp/gem.20191111-6092-r83b05 => [/usr/src/tmp/ruby-posix_mq-buildroot]/usr/lib/ruby/gems/2.5.0/specifications/posix_mq-2.4.1.gemspec
* {gemfile} ->

+ /usr/lib/rpm/brp-alt
Cleaning files in /usr/src/tmp/ruby-posix_mq-buildroot (auto)
removed './usr/lib/ruby/gems/2.5.0/gems/posix_mq-2.4.1/archive/.gitignore'
removed './usr/lib/ruby/gems/2.5.0/gems/posix_mq-2.4.1/.gitignore'
mode of './usr/lib/ruby/gems/2.5.0/extensions/x86-linux/2.5.0/posix_mq-2.4.1/posix_mq_ext.so' changed from 0755 (rwxr-xr-x) to 0644 (rw-r--r--)
Verifying and fixing files in /usr/src/tmp/ruby-posix_mq-buildroot (binconfig,pkgconfig,libtool,desktop)
Checking contents of files in /usr/src/tmp/ruby-posix_mq-buildroot/ (default)
Compressing files in /usr/src/tmp/ruby-posix_mq-buildroot (auto)
Adjusting library links in /usr/src/tmp/ruby-posix_mq-buildroot
./usr/lib:
./usr/lib/ruby/gems/2.5.0/gems/posix_mq-2.4.1/lib:
/usr/lib/rpm/debugedit: ./usr/lib/ruby/gems/2.5.0/extensions/x86-linux/2.5.0/posix_mq-2.4.1/posix_mq_ext.so: DWARF version 20347 unhandled
Verifying ELF objects in /usr/src/tmp/ruby-posix_mq-buildroot (arch=normal,fhs=normal,lfs=relaxed,lint=relaxed,rpath=normal,stack=normal,textrel=normal,unresolved=normal)
Hardlinking identical .pyc and .pyo files
Executing(%check): /bin/sh -e /usr/src/tmp/rpm-tmp.43968
+ umask 022
+ /bin/mkdir -p /usr/src/RPM/BUILD
+ cd /usr/src/RPM/BUILD
+ cd ruby-posix_mq-2.4.1
+ /usr/bin/setup.rb test
/bin/sh: pandoc: command not found
make: *** [GNUmakefile:27: posix-mq-rb.1.html] Error 127
gem 'posix_mq' at /usr/src/RPM/BUILD/ruby-posix_mq-2.4.1
(ruby 2.5.5 i586-linux)
WARN [LoadError]: cannot load such file -- Rakefile

+ exit 0
Processing files: ruby-posix_mq-2.4.1-alt2
Executing(%doc): /bin/sh -e /usr/src/tmp/rpm-tmp.52779
+ umask 022
+ /bin/mkdir -p /usr/src/RPM/BUILD
+ cd /usr/src/RPM/BUILD
+ cd ruby-posix_mq-2.4.1
+ DOCDIR=/usr/src/tmp/ruby-posix_mq-buildroot/usr/share/doc/ruby-posix_mq-2.4.1
+ export DOCDIR
+ rm -rf /usr/src/tmp/ruby-posix_mq-buildroot/usr/share/doc/ruby-posix_mq-2.4.1
+ /bin/mkdir -p /usr/src/tmp/ruby-posix_mq-buildroot/usr/share/doc/ruby-posix_mq-2.4.1
+ cp -prL README /usr/src/tmp/ruby-posix_mq-buildroot/usr/share/doc/ruby-posix_mq-2.4.1
+ chmod -R go-w /usr/src/tmp/ruby-posix_mq-buildroot/usr/share/doc/ruby-posix_mq-2.4.1
+ chmod -R a+rX /usr/src/tmp/ruby-posix_mq-buildroot/usr/share/doc/ruby-posix_mq-2.4.1
+ exit 0
Finding Provides (using /usr/lib/rpm/find-provides)
Executing: /bin/sh -e /usr/src/tmp/rpm-tmp.0qtHkx
find-provides: absolute symbolic link /usr/src/tmp/ruby-posix_mq-buildroot/usr/lib/ruby/gems/2.5.0/gems/posix_mq-2.4.1/ext -> /usr/include is not going to provide anything
find-provides: absolute symbolic link /usr/src/tmp/ruby-posix_mq-buildroot/usr/lib/ruby/gems/2.5.0/gems/posix_mq-2.4.1/i586-linux -> /usr/lib/ruby/gems/2.5.0/extensions/x86-linux/2.5.0/posix_mq-2.4.1 is not going to provide anything
find-provides: running scripts (alternatives,debuginfo,lib,pam,perl,pkgconfig,python,ruby,shell)
Detecting ruby provides for ruby-posix_mq...
--- '/usr/src/RPM/BUILD/ruby-posix_mq-2.4.1/SetupConfig'
Ruby project file is '/usr/src/RPM/BUILD/ruby-posix_mq-2.4.1/SetupConfig'
setup.rb provides --install_prefix=/usr/src/tmp/ruby-posix_mq-buildroot --package=ruby-posix_mq -q
/bin/sh: pandoc: command not found
make: *** [GNUmakefile:27: posix-mq-rb.1.html] Error 127
gem 'posix_mq' at /usr/src/RPM/BUILD/ruby-posix_mq-2.4.1
(ruby 2.5.5 i586-linux)
WARN [LoadError]: cannot load such file -- Rakefile
* provs ->
  - [posix_mq]
    [lib]:
      gem(posix_mq) = 2.4.1
      ruby-gem(posix_mq) = 2.4.1
      rubygem(posix_mq) = 2.4.1
Finding Requires (using /usr/lib/rpm/find-requires)
Executing: /bin/sh -e /usr/src/tmp/rpm-tmp.6HYUfu
find-requires: running scripts (cpp,debuginfo,files,lib,pam,perl,pkgconfig,pkgconfiglib,python,rpmlib,ruby,shebang,shell,static,symlinks)
Detecting ruby requires for ruby-posix_mq...
Ruby project file is '/usr/src/RPM/BUILD/ruby-posix_mq-2.4.1/SetupConfig'
setup.rb requires --install_prefix=/usr/src/tmp/ruby-posix_mq-buildroot --package=ruby-posix_mq -q
/bin/sh: pandoc: command not found
make: *** [GNUmakefile:27: posix-mq-rb.1.html] Error 127
gem 'posix_mq' at /usr/src/RPM/BUILD/ruby-posix_mq-2.4.1
(ruby 2.5.5 i586-linux)
WARN [LoadError]: cannot load such file -- Rakefile
* reqs ->
  - [posix_mq]
    [lib]:
      ruby(2.5.0)
      ruby >= 0
      rubygems >= 0
shebang.req.files: executable script /usr/src/tmp/ruby-posix_mq-buildroot/usr/lib/ruby/gems/2.5.0/gems/posix_mq-2.4.1/GIT-VERSION-GEN is not executable
find-requires: FINDPACKAGE-COMMANDS: git ruby
Provides: gem(posix_mq) = 2.4.1, ruby-gem(posix_mq) = 2.4.1, rubygem(posix_mq) = 2.4.1
Requires: /usr/bin/env, /usr/include, git-core, libc.so.6(GLIBC_2.0), libc.so.6(GLIBC_2.1.3), libc.so.6(GLIBC_2.17), libc.so.6(GLIBC_2.4), libm.so.6(GLIBC_2.0), libpthread.so.0(GLIBC_2.0), libpthread.so.0(GLIBC_2.1), librt.so.1(GLIBC_2.3.4), librt.so.1(GLIBC_2.7), libruby.so.2.5 >= set:oi8jSf3NAXEdZ8u86b91VngUvxkrhqyJP5JisPqZaX9AFcMr2981LBwZ08p6AlAFogzXJJgyqOVUXXaKG95CZA2C4WqEfZllZBc2jz4JMYpE6Z45qQ43Mx1cLAxK067Q6TP8RSrZDxTO8av51ZlkOpTDKXp20, rtld(GNU_HASH), ruby >= 0, ruby(2.5.0), rubygems >= 0
Requires(rpmlib): rpmlib(SetVersions)
Finding debuginfo files (using /usr/lib/rpm/find-debuginfo-files)
Executing: /bin/sh -e /usr/src/tmp/rpm-tmp.o5kaMv
/usr/lib/rpm/debugedit: ./usr/lib/debug/usr/lib/ruby/gems/2.5.0/extensions/x86-linux/2.5.0/posix_mq-2.4.1/posix_mq_ext.so.debug: DWARF version 20347 unhandled
Creating ruby-posix_mq-debuginfo package
Processing files: posix-mq-rb-2.4.1-alt2
Finding Provides (using /usr/lib/rpm/find-provides)
Executing: /bin/sh -e /usr/src/tmp/rpm-tmp.6k0GAv
find-provides: absolute symbolic link /usr/src/tmp/ruby-posix_mq-buildroot/usr/bin/posix-mq-rb -> /usr/lib/ruby/gems/2.5.0/gems/posix_mq-2.4.1/bin/posix-mq-rb is not going to provide anything
find-provides: running scripts (alternatives,debuginfo,lib,pam,perl,pkgconfig,python,ruby,shell)
Finding Requires (using /usr/lib/rpm/find-requires)
Executing: /bin/sh -e /usr/src/tmp/rpm-tmp.44Qetx
find-requires: running scripts (cpp,debuginfo,files,lib,pam,perl,pkgconfig,pkgconfiglib,python,rpmlib,ruby,shebang,shell,static,symlinks)
Detecting ruby requires for posix-mq-rb...
Ruby project file is '/usr/src/RPM/BUILD/ruby-posix_mq-2.4.1/SetupConfig'
setup.rb requires --install_prefix=/usr/src/tmp/ruby-posix_mq-buildroot --package=posix-mq-rb -q
/bin/sh: pandoc: command not found
make: *** [GNUmakefile:27: posix-mq-rb.1.html] Error 127
gem 'posix_mq' at /usr/src/RPM/BUILD/ruby-posix_mq-2.4.1
(ruby 2.5.5 i586-linux)
WARN [LoadError]: cannot load such file -- Rakefile
* reqs ->
  - [posix_mq]
    [bin]:
      /usr/bin/env
      gem(posix_mq) = 2.4.1
Requires: /usr/bin/env, /usr/lib/ruby/gems/2.5.0/gems/posix_mq-2.4.1/bin/posix-mq-rb, gem(posix_mq) = 2.4.1
Processing files: gem-posix-mq-doc-2.4.1-alt2
Finding Provides (using /usr/lib/rpm/find-provides)
Executing: /bin/sh -e /usr/src/tmp/rpm-tmp.I3Ve3x
find-provides: running scripts (alternatives,debuginfo,lib,pam,perl,pkgconfig,python,ruby,shell)
Detecting ruby provides for gem-posix-mq-doc...
--- '/usr/src/RPM/BUILD/ruby-posix_mq-2.4.1/SetupConfig'
Ruby project file is '/usr/src/RPM/BUILD/ruby-posix_mq-2.4.1/SetupConfig'
setup.rb provides --install_prefix=/usr/src/tmp/ruby-posix_mq-buildroot --package=gem-posix-mq-doc -q
/bin/sh: pandoc: command not found
make: *** [GNUmakefile:27: posix-mq-rb.1.html] Error 127
gem 'posix_mq' at /usr/src/RPM/BUILD/ruby-posix_mq-2.4.1
(ruby 2.5.5 i586-linux)
WARN [LoadError]: cannot load such file -- Rakefile
* provs ->
  - [posix_mq]
Finding Requires (using /usr/lib/rpm/find-requires)
Executing: /bin/sh -e /usr/src/tmp/rpm-tmp.ysafdw
find-requires: running scripts (cpp,debuginfo,files,lib,pam,perl,pkgconfig,pkgconfiglib,python,rpmlib,ruby,shebang,shell,static,symlinks)
Detecting ruby requires for gem-posix-mq-doc...
Ruby project file is '/usr/src/RPM/BUILD/ruby-posix_mq-2.4.1/SetupConfig'
setup.rb requires --install_prefix=/usr/src/tmp/ruby-posix_mq-buildroot --package=gem-posix-mq-doc -q
/bin/sh: pandoc: command not found
make: *** [GNUmakefile:27: posix-mq-rb.1.html] Error 127
gem 'posix_mq' at /usr/src/RPM/BUILD/ruby-posix_mq-2.4.1
(ruby 2.5.5 i586-linux)
WARN [LoadError]: cannot load such file -- Rakefile
* reqs ->
  - [posix_mq]
    [doc]:
      gem(posix_mq) = 2.4.1
Provides: ruby-posix-mq-doc
Requires: gem(posix_mq) = 2.4.1
Obsoletes: ruby-posix-mq-doc
Processing files: ruby-posix_mq-debuginfo-2.4.1-alt2
Finding Provides (using /usr/lib/rpm/find-provides)
Executing: /bin/sh -e /usr/src/tmp/rpm-tmp.ixCoIt
find-provides: running scripts (debuginfo)
Finding Requires (using /usr/lib/rpm/find-requires)
Executing: /bin/sh -e /usr/src/tmp/rpm-tmp.Klq23t
find-requires: running scripts (debuginfo)
Requires: ruby-posix_mq = 2.4.1-alt2, debug(libc.so.6), debug(libm.so.6), debug(libpthread.so.0), debug(librt.so.1), debug(libruby.so.2.5)
Adding to ruby-posix_mq-debuginfo a strict dependency on ruby-posix_mq
Adding to posix-mq-rb a strict dependency on ruby-posix_mq
Adding to gem-posix-mq-doc a strict dependency on ruby-posix_mq
Removing 2 extra deps from posix-mq-rb due to dependency on ruby-posix_mq
Removing 1 extra deps from gem-posix-mq-doc due to dependency on ruby-posix_mq
Removing 1 extra deps from posix-mq-rb due to repentancy on ruby-posix_mq
Wrote: /usr/src/RPM/RPMS/i586/ruby-posix_mq-2.4.1-alt2.i586.rpm
Wrote: /usr/src/RPM/RPMS/noarch/posix-mq-rb-2.4.1-alt2.noarch.rpm
Wrote: /usr/src/RPM/RPMS/noarch/gem-posix-mq-doc-2.4.1-alt2.noarch.rpm
Wrote: /usr/src/RPM/RPMS/i586/ruby-posix_mq-debuginfo-2.4.1-alt2.i586.rpm
24.36user 3.71system 0:40.64elapsed 69%CPU (0avgtext+0avgdata 33588maxresident)k
0inputs+0outputs (0major+589116minor)pagefaults 0swaps
41.00user 10.72system 1:18.27elapsed 66%CPU (0avgtext+0avgdata 110564maxresident)k
0inputs+0outputs (0major+984556minor)pagefaults 0swaps
--- gem-posix-mq-doc-2.4.1-alt2.noarch.rpm.repo	2019-04-27 14:13:20.000000000 +0000
+++ gem-posix-mq-doc-2.4.1-alt2.noarch.rpm.hasher	2019-11-11 12:23:56.144072842 +0000
@@ -3,32 +3,8 @@
 /usr/lib/ruby/gems/2.5.0/doc/posix_mq-2.4.1/ri/POSIX_MQ	40755	
-/usr/lib/ruby/gems/2.5.0/doc/posix_mq-2.4.1/ri/POSIX_MQ/%3c%3c-i.ri	100644	
-/usr/lib/ruby/gems/2.5.0/doc/posix_mq-2.4.1/ri/POSIX_MQ/attr%3d-i.ri	100644	
-/usr/lib/ruby/gems/2.5.0/doc/posix_mq-2.4.1/ri/POSIX_MQ/attr-i.ri	100644	
-/usr/lib/ruby/gems/2.5.0/doc/posix_mq-2.4.1/ri/POSIX_MQ/autoclose%3d-i.ri	100644	
-/usr/lib/ruby/gems/2.5.0/doc/posix_mq-2.4.1/ri/POSIX_MQ/autoclose%3f-i.ri	100644	
 /usr/lib/ruby/gems/2.5.0/doc/posix_mq-2.4.1/ri/POSIX_MQ/cdesc-POSIX_MQ.ri	100644	
 /usr/lib/ruby/gems/2.5.0/doc/posix_mq-2.4.1/ri/POSIX_MQ/clone-i.ri	100644	
-/usr/lib/ruby/gems/2.5.0/doc/posix_mq-2.4.1/ri/POSIX_MQ/close-i.ri	100644	
-/usr/lib/ruby/gems/2.5.0/doc/posix_mq-2.4.1/ri/POSIX_MQ/closed%3f-i.ri	100644	
 /usr/lib/ruby/gems/2.5.0/doc/posix_mq-2.4.1/ri/POSIX_MQ/dup-i.ri	100644	
-/usr/lib/ruby/gems/2.5.0/doc/posix_mq-2.4.1/ri/POSIX_MQ/for_fd-c.ri	100644	
-/usr/lib/ruby/gems/2.5.0/doc/posix_mq-2.4.1/ri/POSIX_MQ/name-i.ri	100644	
-/usr/lib/ruby/gems/2.5.0/doc/posix_mq-2.4.1/ri/POSIX_MQ/new-c.ri	100644	
-/usr/lib/ruby/gems/2.5.0/doc/posix_mq-2.4.1/ri/POSIX_MQ/nonblock%3d-i.ri	100644	
-/usr/lib/ruby/gems/2.5.0/doc/posix_mq-2.4.1/ri/POSIX_MQ/nonblock%3f-i.ri	100644	
-/usr/lib/ruby/gems/2.5.0/doc/posix_mq-2.4.1/ri/POSIX_MQ/notify%3d-i.ri	100644	
 /usr/lib/ruby/gems/2.5.0/doc/posix_mq-2.4.1/ri/POSIX_MQ/notify-i.ri	100644	
 /usr/lib/ruby/gems/2.5.0/doc/posix_mq-2.4.1/ri/POSIX_MQ/open-c.ri	100644	
-/usr/lib/ruby/gems/2.5.0/doc/posix_mq-2.4.1/ri/POSIX_MQ/receive-i.ri	100644	
-/usr/lib/ruby/gems/2.5.0/doc/posix_mq-2.4.1/ri/POSIX_MQ/send-i.ri	100644	
-/usr/lib/ruby/gems/2.5.0/doc/posix_mq-2.4.1/ri/POSIX_MQ/shift-i.ri	100644	
-/usr/lib/ruby/gems/2.5.0/doc/posix_mq-2.4.1/ri/POSIX_MQ/to_io-i.ri	100644	
-/usr/lib/ruby/gems/2.5.0/doc/posix_mq-2.4.1/ri/POSIX_MQ/tryreceive-i.ri	100644	
-/usr/lib/ruby/gems/2.5.0/doc/posix_mq-2.4.1/ri/POSIX_MQ/trysend-i.ri	100644	
-/usr/lib/ruby/gems/2.5.0/doc/posix_mq-2.4.1/ri/POSIX_MQ/tryshift-i.ri	100644	
-/usr/lib/ruby/gems/2.5.0/doc/posix_mq-2.4.1/ri/POSIX_MQ/unlink-c.ri	100644	
-/usr/lib/ruby/gems/2.5.0/doc/posix_mq-2.4.1/ri/POSIX_MQ/unlink-i.ri	100644	
 /usr/lib/ruby/gems/2.5.0/doc/posix_mq-2.4.1/ri/cache.ri	100644	
-/usr/lib/ruby/gems/2.5.0/doc/posix_mq-2.4.1/ri/page-LICENSE.ri	100644	
-/usr/lib/ruby/gems/2.5.0/doc/posix_mq-2.4.1/ri/page-README.ri	100644	
 Requires: ruby-posix_mq = 2.4.1-alt2:sisyphus+226987.5600.11.1
--- ruby-posix_mq-2.4.1-alt2.i586.rpm.repo	2019-04-27 14:21:12.000000000 +0000
+++ ruby-posix_mq-2.4.1-alt2.i586.rpm.hasher	2019-11-11 12:23:56.223070333 +0000
@@ -17,6 +17,11 @@
 /usr/lib/ruby/gems/2.5.0/gems/posix_mq-2.4.1/bin/posix-mq-rb	100755	
+/usr/lib/ruby/gems/2.5.0/gems/posix_mq-2.4.1/ext	120777	/usr/include
+/usr/lib/ruby/gems/2.5.0/gems/posix_mq-2.4.1/i586-linux	120777	/usr/lib/ruby/gems/2.5.0/extensions/x86-linux/2.5.0/posix_mq-2.4.1
 /usr/lib/ruby/gems/2.5.0/gems/posix_mq-2.4.1/lib	40755	
-/usr/lib/ruby/gems/2.5.0/gems/posix_mq-2.4.1/lib/posix_mq.rb	100644	
+/usr/lib/ruby/gems/2.5.0/gems/posix_mq-2.4.1/lib/posix_mq.rb	100755	
 /usr/lib/ruby/gems/2.5.0/gems/posix_mq-2.4.1/pkg.mk	100644	
 /usr/lib/ruby/gems/2.5.0/gems/posix_mq-2.4.1/posix_mq.gemspec	100644	
+/usr/lib/ruby/gems/2.5.0/gems/posix_mq-2.4.1/setup.rb	100644	
+/usr/lib/ruby/gems/2.5.0/gems/posix_mq-2.4.1/test	40755	
+/usr/lib/ruby/gems/2.5.0/gems/posix_mq-2.4.1/test/test_posix_mq.rb	100755	
 /usr/lib/ruby/gems/2.5.0/specifications/posix_mq-2.4.1.gemspec	100644	
@@ -25,2 +30,3 @@
 Requires: /usr/bin/env  
+Requires: /usr/include  
 Requires: git-core  
@@ -28,2 +34,3 @@
 Requires: libc.so.6(GLIBC_2.1.3)  
+Requires: libc.so.6(GLIBC_2.17)  
 Requires: libc.so.6(GLIBC_2.4)  
@@ -32,3 +39,2 @@
 Requires: libpthread.so.0(GLIBC_2.1)  
-Requires: librt.so.1(GLIBC_2.2)  
 Requires: librt.so.1(GLIBC_2.3.4)