<86>Nov 11 09:08:02 userdel[32408]: delete user 'rooter'
<86>Nov 11 09:08:02 groupadd[32417]: group added to /etc/group: name=rooter, GID=555
<86>Nov 11 09:08:02 groupadd[32417]: group added to /etc/gshadow: name=rooter
<86>Nov 11 09:08:02 groupadd[32417]: new group: name=rooter, GID=555
<86>Nov 11 09:08:02 useradd[32427]: new user: name=rooter, UID=555, GID=555, home=/root, shell=/bin/bash
<86>Nov 11 09:08:02 userdel[32444]: delete user 'builder'
<86>Nov 11 09:08:02 userdel[32444]: removed group 'builder' owned by 'builder'
<86>Nov 11 09:08:02 userdel[32444]: removed shadow group 'builder' owned by 'builder'
<86>Nov 11 09:08:02 groupadd[32464]: group added to /etc/group: name=builder, GID=556
<86>Nov 11 09:08:02 groupadd[32464]: group added to /etc/gshadow: name=builder
<86>Nov 11 09:08:02 groupadd[32464]: new group: name=builder, GID=556
<86>Nov 11 09:08:02 useradd[32481]: new user: name=builder, UID=556, GID=556, home=/usr/src, shell=/bin/bash
warning: user igor does not exist - using root
warning: group igor does not exist - using root
warning: user igor does not exist - using root
warning: group igor does not exist - using root
warning: user igor does not exist - using root
warning: group igor does not exist - using root
<13>Nov 11 09:08:10 rpmi: perl-HTTP-Date-6.02-alt1 1348645274 installed
<13>Nov 11 09:08:10 rpmi: perl-libnet-1:3.11-alt1 1511423541 installed
<13>Nov 11 09:08:10 rpmi: perl-Locale-Maketext-Simple-0.21-alt3 1321333616 installed
<13>Nov 11 09:08:10 rpmi: perl-Params-Check-0.38-alt1 1374748239 installed
<13>Nov 11 09:08:10 rpmi: perl-Perl-OSType-1.010-alt1 1467551766 installed
<13>Nov 11 09:08:10 rpmi: perl-LWP-MediaTypes-6.04-alt1 sisyphus+225468.100.1.1 1553186684 installed
<13>Nov 11 09:08:10 rpmi: perl-Term-Cap-1.17-alt1 1445018869 installed
<13>Nov 11 09:08:10 rpmi: perl-Term-ANSIColor-4.06-alt1 1479407083 installed
<13>Nov 11 09:08:10 rpmi: perl-Compress-Raw-Zlib-2.089-alt1 sisyphus+240408.100.1.1 1573131051 installed
<13>Nov 11 09:08:10 rpmi: libidn2-2.2.0-alt1 sisyphus+229970.100.1.1 1558625600 installed
<13>Nov 11 09:08:10 rpmi: perl-Data-Dump-1.23-alt1 1444601978 installed
<13>Nov 11 09:08:10 rpmi: perl-File-Listing-6.04-alt1 1329758996 installed
<13>Nov 11 09:08:10 rpmi: perl-File-Remove-1.58-alt1 sisyphus.214292.100 1539030600 installed
<13>Nov 11 09:08:10 rpmi: perl-Devel-Symdump-2.18-alt1 1487063672 installed
<13>Nov 11 09:08:10 rpmi: perl-local-lib-2.000024-alt1 1507829790 installed
<13>Nov 11 09:08:10 rpmi: perl-Net-Ping-2.72-alt1 sisyphus+225869.100.1.1 1553857608 installed
<13>Nov 11 09:08:10 rpmi: perl-Try-Tiny-0.30-alt1 1514318058 installed
<13>Nov 11 09:08:10 rpmi: perl-IO-Socket-IP-0.39-alt1 1494508514 installed
<13>Nov 11 09:08:10 rpmi: perl-HTML-Tagset-3.20-alt2 1317725093 installed
<13>Nov 11 09:08:10 rpmi: perl-HTTP-Tiny-0.076-alt1 1533738728 installed
<13>Nov 11 09:08:10 rpmi: perl-Test-Reporter-1.62-alt1_10 1531849134 installed
<13>Nov 11 09:08:10 rpmi: perl-Probe-Perl-0.03-alt1 1376309664 installed
<13>Nov 11 09:08:10 rpmi: perl-Math-Complex-1.59-alt1 1334229876 installed
<13>Nov 11 09:08:10 rpmi: perl-Math-BigInt-1.999818-alt1 sisyphus+239855.100.1.1 1572265618 installed
<13>Nov 11 09:08:10 rpmi: perl-Math-BigInt-FastCalc-0.5009-alt1 sisyphus+239145.100.2.1 1570982773 installed
<13>Nov 11 09:08:10 rpmi: perl-Module-Load-0.34-alt1 sisyphus+221450.100.1.2 1550125259 installed
<13>Nov 11 09:08:10 rpmi: perl-File-Which-1.23-alt1 sisyphus.218871.100 1546337313 installed
<13>Nov 11 09:08:10 rpmi: perl-File-HomeDir-1.004-alt1 1525450444 installed
<13>Nov 11 09:08:10 rpmi: perl-Config-Tiny-2.24-alt1 sisyphus+232575.100.1.1 1560926629 installed
<13>Nov 11 09:08:10 rpmi: perl-Capture-Tiny-0.48-alt1 1524680703 installed
<13>Nov 11 09:08:10 rpmi: perl-Digest-SHA-6.02-alt1.1 sisyphus+219907.1500.1.1 1548343935 installed
<13>Nov 11 09:08:10 rpmi: perl-Pod-Escapes-1.07-alt1 1418767892 installed
<13>Nov 11 09:08:10 rpmi: perl-IO-String-1.08-alt2 1321677915 installed
<13>Nov 11 09:08:10 rpmi: perl-Filter-1.59-alt1.1 sisyphus+219907.400.1.1 1548343389 installed
<13>Nov 11 09:08:10 rpmi: perl-Encode-3.01-alt1 sisyphus+224923.100.1.1 1552474122 installed
<13>Nov 11 09:08:10 rpmi: perl-URI-1.76-alt1 sisyphus+220243.100.1.1 1548863244 installed
<13>Nov 11 09:08:10 rpmi: perl-Module-Metadata-1.000037-alt1 sisyphus+237422.100.1.1 1568202732 installed
<13>Nov 11 09:08:10 rpmi: perl-Pod-Simple-3.40-alt1 sisyphus+239861.100.1.1 1572267919 installed
<13>Nov 11 09:08:10 rpmi: perl-Pod-Usage-1.69-alt1 1464274721 installed
<13>Nov 11 09:08:10 rpmi: perl-podlators-4.12-alt1 sisyphus+231574.100.1.1 1559749961 installed
<13>Nov 11 09:08:10 rpmi: perl-Module-CoreList-5.20191020-alt1 sisyphus+239857.100.1.1 1572266272 installed
<13>Nov 11 09:08:10 rpmi: perl-JSON-PP-1:4.04-alt1 sisyphus+234044.100.1.1 1562497374 installed
<13>Nov 11 09:08:10 rpmi: perl-Module-Load-Conditional-0.68-alt1 1469804041 installed
<13>Nov 11 09:08:10 rpmi: perl-Pod-Parser-1.63-alt1 1447282032 installed
<13>Nov 11 09:08:10 rpmi: perl-Pod-Coverage-0.23-alt2 1507677806 installed
<13>Nov 11 09:08:10 rpmi: perl-HTML-Parser-3.72-alt1.2 sisyphus+219907.600.1.1 1548343581 installed
<13>Nov 11 09:08:10 rpmi: perl-WWW-RobotRules-6.02-alt1 1329756211 installed
<13>Nov 11 09:08:10 rpmi: perl-CPAN-Meta-YAML-0.018-alt1 1450184987 installed
<13>Nov 11 09:08:10 rpmi: perl-Parse-CPAN-Meta-2.150010-alt3 sisyphus+236868.100.1.1 1567107580 installed
<13>Nov 11 09:08:10 rpmi: perl-CPAN-Meta-2.150010-alt3 sisyphus+236868.100.1.1 1567107580 installed
<13>Nov 11 09:08:10 rpmi: perl-IO-HTML-1.001-alt1 1404821752 installed
<13>Nov 11 09:08:10 rpmi: perl-Encode-Locale-1.05-alt1 1444608613 installed
<13>Nov 11 09:08:10 rpmi: perl-Term-ReadLine-Gnu-1.35-alt1.1 sisyphus+219907.1400.1.1 1548343889 installed
<13>Nov 11 09:08:10 rpmi: perl-YAML-Tiny-1.73-alt1 1520430664 installed
<13>Nov 11 09:08:10 rpmi: perl-Compress-Raw-Bzip2-2.089-alt1 sisyphus+240407.100.1.1 1573129585 installed
<13>Nov 11 09:08:10 rpmi: perl-IO-Compress-2.089-alt1 sisyphus+240416.100.1.1 1573134826 installed
<13>Nov 11 09:08:10 rpmi: perl-HTTP-Message-6.18-alt1 1528288416 installed
<13>Nov 11 09:08:10 rpmi: perl-HTTP-Cookies-6.05-alt1 sisyphus+239848.100.1.1 1572262163 installed
<13>Nov 11 09:08:10 rpmi: perl-HTTP-Negotiate-6.01-alt1 1329760563 installed
<13>Nov 11 09:08:10 rpmi: perl-IO-Zlib-1.10-alt3 1348624976 installed
<13>Nov 11 09:08:10 rpmi: perl-Archive-Tar-2.32-alt1 sisyphus.213407.100 1537475513 installed
<13>Nov 11 09:08:10 rpmi: perl-Net-HTTP-6.19-alt1 sisyphus+229756.100.1.1 1558454558 installed
<13>Nov 11 09:08:10 rpmi: perl-libwww-6.41-alt1 sisyphus+240084.100.1.1 1572552324 installed
<13>Nov 11 09:08:10 rpmi: libgdbm-1.8.3-alt10 1454943334 installed
<13>Nov 11 09:08:10 rpmi: libgdbm-devel-1.8.3-alt10 1454943334 installed
<13>Nov 11 09:08:10 rpmi: libdb4.7-devel-4.7.25-alt9 1490438479 installed
<13>Nov 11 09:08:10 rpmi: perl-devel-1:5.28.2-alt1 sisyphus+230063.100.1.1 1558785441 installed
<13>Nov 11 09:08:10 rpmi: perl-IPC-Cmd-1.04-alt1 sisyphus+234736.100.1.1 1563377607 installed
<13>Nov 11 09:08:10 rpmi: perl-ExtUtils-CBuilder-0.280231-alt1 sisyphus+226315.100.1.1 1554058643 installed
<13>Nov 11 09:08:10 rpmi: perl-CPAN-Reporter-1.2018-alt2_3 sisyphus+224929.100.1.1 1552476358 installed
<13>Nov 11 09:08:10 rpmi: perl-CPAN-2.27-alt1 sisyphus+234041.100.1.1 1562496481 installed
<13>Nov 11 09:08:10 rpmi: perl-inc-latest-0.500-alt2 1447197123 installed
<13>Nov 11 09:08:10 rpmi: perl-Module-Build-0.4229-alt1 sisyphus+227589.100.1.1 1555691844 installed
<13>Nov 11 09:08:10 rpmi: perl-Module-ScanDeps-1.27-alt1 sisyphus+219751.100.1.2 1548129440 installed
<13>Nov 11 09:08:10 rpmi: publicsuffix-list-dafsa-20191108-alt1 sisyphus+240482.100.1.2 1573431390 installed
<13>Nov 11 09:08:10 rpmi: libpsl-0.21.0-alt2 sisyphus+237083.100.1.1 1567531657 installed
<13>Nov 11 09:08:10 rpmi: libnghttp2-1.39.2-alt1 sisyphus+236978.100.1.1 1567325198 installed
<13>Nov 11 09:08:10 rpmi: libverto-0.3.0-alt1_7 sisyphus+225932.100.1.1 1553994919 installed
<13>Nov 11 09:08:10 rpmi: libkeyutils-1.6-alt2 sisyphus+226520.100.2.1 1554512089 installed
<13>Nov 11 09:08:10 rpmi: libcom_err-1.44.6-alt1 sisyphus+224154.100.1.1 1552091678 installed
<13>Nov 11 09:08:10 rpmi: libbrotlicommon-1.0.7-alt1 sisyphus+226738.100.2.1 1554554568 installed
<13>Nov 11 09:08:10 rpmi: libbrotlidec-1.0.7-alt1 sisyphus+226738.100.2.1 1554554568 installed
<13>Nov 11 09:08:10 rpmi: libp11-kit-0.23.15-alt1 sisyphus+226408.100.2.1 1554288204 installed
<13>Nov 11 09:08:10 rpmi: libtasn1-4.14-alt1 sisyphus+235791.100.1.1 1565282372 installed
<13>Nov 11 09:08:10 rpmi: bc-1:1.07.1-alt1 sisyphus+221902.700.4.1 1550587857 installed
<13>Nov 11 09:08:10 rpmi: rpm-macros-alternatives-0.5.1-alt1 sisyphus+226946.100.1.1 1554830426 installed
<13>Nov 11 09:08:10 rpmi: alternatives-0.5.1-alt1 sisyphus+226946.100.1.1 1554830426 installed
<13>Nov 11 09:08:10 rpmi: ca-certificates-2019.10.28-alt1 sisyphus+239875.300.1.1 1572267834 installed
<13>Nov 11 09:08:10 rpmi: ca-trust-0.1.2-alt1 sisyphus+233348.100.1.1 1561653823 installed
<13>Nov 11 09:08:11 rpmi: p11-kit-trust-0.23.15-alt1 sisyphus+226408.100.2.1 1554288204 installed
<13>Nov 11 09:08:11 rpmi: libcrypto1.1-1.1.1d-alt1.1 sisyphus+237931.100.2.1 1569235729 installed
<13>Nov 11 09:08:11 rpmi: libssl1.1-1.1.1d-alt1.1 sisyphus+237931.100.2.1 1569235729 installed
<86>Nov 11 09:08:11 groupadd[52311]: group added to /etc/group: name=_keytab, GID=499
<86>Nov 11 09:08:11 groupadd[52311]: group added to /etc/gshadow: name=_keytab
<86>Nov 11 09:08:11 groupadd[52311]: new group: name=_keytab, GID=499
<13>Nov 11 09:08:11 rpmi: libkrb5-1.16.3-alt1 sisyphus+223678.100.1.1 1551746516 installed
<86>Nov 11 09:08:11 groupadd[52561]: group added to /etc/group: name=sasl, GID=498
<86>Nov 11 09:08:11 groupadd[52561]: group added to /etc/gshadow: name=sasl
<86>Nov 11 09:08:11 groupadd[52561]: new group: name=sasl, GID=498
<13>Nov 11 09:08:11 rpmi: libsasl2-3-2.1.27-alt2 sisyphus+228101.100.1.1 1556139863 installed
<13>Nov 11 09:08:11 rpmi: libldap-2.4.48-alt3 sisyphus+238816.100.1.1 1570449022 installed
<13>Nov 11 09:08:11 rpmi: libcurl-7.66.0-alt1 sisyphus+237384.100.1.1 1568183544 installed
<13>Nov 11 09:08:11 rpmi: libcurl-devel-7.66.0-alt1 sisyphus+237384.100.1.1 1568183544 installed
<13>Nov 11 09:08:11 rpmi: perl-Module-Install-1.19-alt1 1513762305 installed
<13>Nov 11 09:08:11 rpmi: perl-Test-Pod-1.52-alt1 1524163463 installed
<13>Nov 11 09:08:11 rpmi: perl-Test-Pod-Coverage-1.10-alt1 1406300388 installed
Building target platforms: i586
Building for target i586
Wrote: /usr/src/in/nosrpm/perl-WWW-Curl-4.17-alt3.2.nosrc.rpm
Installing perl-WWW-Curl-4.17-alt3.2.src.rpm
Building target platforms: i586
Building for target i586
Executing(%prep): /bin/sh -e /usr/src/tmp/rpm-tmp.63294
+ umask 022
+ /bin/mkdir -p /usr/src/RPM/BUILD
+ cd /usr/src/RPM/BUILD
+ cd /usr/src/RPM/BUILD
+ rm -rf WWW-Curl-4.17
+ echo 'Source #0 (WWW-Curl-4.17.tar.gz):'
Source #0 (WWW-Curl-4.17.tar.gz):
+ /bin/gzip -dc /usr/src/RPM/SOURCES/WWW-Curl-4.17.tar.gz
+ /bin/tar -xf -
+ cd WWW-Curl-4.17
+ /bin/chmod -c -Rf u+rwX,go-w .
+ echo 'Patch #0 (WWW-Curl-4.17-Skip-preprocessor-symbol-only-CURL_STRICTER.patch):'
Patch #0 (WWW-Curl-4.17-Skip-preprocessor-symbol-only-CURL_STRICTER.patch):
+ /usr/bin/patch -p1
patching file Makefile.PL
+ rm -rf inc
+ sed -i -e '/^inc\//d' MANIFEST
+ rm t/19multi.t
+ exit 0
Executing(%build): /bin/sh -e /usr/src/tmp/rpm-tmp.24240
+ umask 022
+ /bin/mkdir -p /usr/src/RPM/BUILD
+ cd /usr/src/RPM/BUILD
+ cd WWW-Curl-4.17
+ perl_vendor_build
+ export PERL_EXTUTILS_AUTOINSTALL=--skip
+ PERL_EXTUTILS_AUTOINSTALL=--skip
+ export XSUBPP_STATIC_XS=1
+ XSUBPP_STATIC_XS=1
+ _perl_vendor_fixin
+ find . -type f -print0
+ xargs -r0 /usr/bin/subst -p '1s,^#![[:space:]]*\([^[:space:]]*/\)\?perl\([^/[:alpha:][:space:]][^/[:space:]]*\)\?\([[:space:]]\|$\),#!/usr/bin/perl\3,'
+ /bin/grep -qs -Ew '((dist|module)_name|Build_PL|Module::Build)' Build.PL
+ _perl_vendor_MM_build
+ : looking for PREREQ dependencies
+ /usr/bin/perl Makefile.PL PRINT_PREREQ=1
+ tee .perl.req
include /usr/src/RPM/BUILD/WWW-Curl-4.17/inc/Module/Install.pm
include inc/Module/Install/Metadata.pm
include inc/Module/Install/Base.pm
include inc/Module/Install/External.pm
include inc/Module/Install/Can.pm
Locating bin:curl-config... found at /usr/bin/curl-config.
The version is libcurl 7.66.0-DEV
Found curl.h in /usr/include/curl/curl.h
Building curlopt-constants.c for your libcurl version
Building Easy.pm constants for your libcurl version
Building Share.pm constants for your libcurl version
include inc/Module/Install/MakeMaker.pm
include inc/Module/Install/Makefile.pm
perl(perl)>=5.006001 
+ : writing Makefile
+ /usr/bin/perl Makefile.PL PREFIX=/usr INSTALLDIRS=vendor
include /usr/src/RPM/BUILD/WWW-Curl-4.17/inc/Module/Install.pm
include inc/Module/Install/Metadata.pm
include inc/Module/Install/Base.pm
include inc/Module/Install/External.pm
include inc/Module/Install/Can.pm
Locating bin:curl-config... found at /usr/bin/curl-config.
The version is libcurl 7.66.0-DEV
Found curl.h in /usr/include/curl/curl.h
Building curlopt-constants.c for your libcurl version
Building Easy.pm constants for your libcurl version
Building Share.pm constants for your libcurl version
include inc/Module/Install/MakeMaker.pm
include inc/Module/Install/Makefile.pm
Checking if your kit is complete...
Warning: the following files are missing in your kit:
	t/19multi.t
Please inform the author.
Generating a Unix-style Makefile
Writing Makefile for WWW::Curl
Writing META.yml
+ : running make
+ make -j8 'OPTIMIZE=-pipe -frecord-gcc-switches -Wall -g -O2 -march=i586 -mtune=generic' 'CP=/bin/cp -p'
make: Entering directory '/usr/src/RPM/BUILD/WWW-Curl-4.17'
Running Mkbootstrap for Curl ()
chmod 644 "Curl.bs"
make: Leaving directory '/usr/src/RPM/BUILD/WWW-Curl-4.17'
make: Entering directory '/usr/src/RPM/BUILD/WWW-Curl-4.17'
cp lib/WWW/Curl/Easy.pm blib/lib/WWW/Curl/Easy.pm
cp lib/WWW/Curl/Share.pm blib/lib/WWW/Curl/Share.pm
cp lib/WWW/Curl.pm blib/lib/WWW/Curl.pm
cp lib/WWW/Curl/Form.pm blib/lib/WWW/Curl/Form.pm
cp lib/WWW/Curl/Multi.pm blib/lib/WWW/Curl/Multi.pm
make: Leaving directory '/usr/src/RPM/BUILD/WWW-Curl-4.17'
make: Entering directory '/usr/src/RPM/BUILD/WWW-Curl-4.17'
"/usr/bin/perl" "-Iinc" -MExtUtils::Command::MM -e 'cp_nonempty' -- Curl.bs blib/arch/auto/WWW/Curl/Curl.bs 644
make: Leaving directory '/usr/src/RPM/BUILD/WWW-Curl-4.17'
make: Entering directory '/usr/src/RPM/BUILD/WWW-Curl-4.17'
"/usr/bin/perl" "-Iinc" "/usr/share/perl5/ExtUtils/xsubpp"  -typemap '/usr/share/perl5/ExtUtils/typemap' -typemap '/usr/src/RPM/BUILD/WWW-Curl-4.17/typemap'  Curl.xs > Curl.xsc
mv Curl.xsc Curl.c
make: Leaving directory '/usr/src/RPM/BUILD/WWW-Curl-4.17'
make: Entering directory '/usr/src/RPM/BUILD/WWW-Curl-4.17'
gcc -c  -I/usr/include -D_REENTRANT -D_GNU_SOURCE -fwrapv -fno-strict-aliasing -pipe -fstack-protector-strong -I/usr/local/include -D_LARGEFILE_SOURCE -D_FILE_OFFSET_BITS=64 -pipe -frecord-gcc-switches -Wall -g -O2 -march=i586 -mtune=generic   -DVERSION=\"4.17\" -DXS_VERSION=\"4.17\" -fPIC "-I/usr/lib/perl5/CORE"   Curl.c
Curl.xs:76:12: error: expected '{' before 'void'
   76 |     struct void *curlm;
      |            ^~~~
Curl.xs:76:12: error: two or more data types in declaration specifiers
In file included from Curl.xs:14:
Curl.xs: In function 'perl_curl_multi_new':
/usr/lib/perl5/CORE/handy.h:2279:25: warning: division by zero [-Wdiv-by-zero]
 2279 |             MEM_SIZE_MAX/sizeof(t)) > MEM_SIZE_MAX/sizeof(t))
      |                         ^
/usr/lib/perl5/CORE/perl.h:3402:62: note: in definition of macro 'EXPECT'
 3402 | #  define EXPECT(expr,val)                  __builtin_expect(expr,val)
      |                                                              ^~~~
/usr/lib/perl5/CORE/perl.h:3407:52: note: in expansion of macro 'cBOOL'
 3407 | #define UNLIKELY(cond)                      EXPECT(cBOOL(cond),FALSE)
      |                                                    ^~~~~
/usr/lib/perl5/CORE/handy.h:2282:9: note: in expansion of macro 'UNLIKELY'
 2282 |  (void)(UNLIKELY(_MEM_WRAP_WILL_WRAP(n,t)) \
      |         ^~~~~~~~
/usr/lib/perl5/CORE/handy.h:2282:18: note: in expansion of macro '_MEM_WRAP_WILL_WRAP'
 2282 |  (void)(UNLIKELY(_MEM_WRAP_WILL_WRAP(n,t)) \
      |                  ^~~~~~~~~~~~~~~~~~~
/usr/lib/perl5/CORE/handy.h:2294:30: note: in expansion of macro 'MEM_WRAP_CHECK'
 2294 | #define MEM_WRAP_CHECK_(n,t) MEM_WRAP_CHECK(n,t),
      |                              ^~~~~~~~~~~~~~
/usr/lib/perl5/CORE/handy.h:2377:28: note: in expansion of macro 'MEM_WRAP_CHECK_'
 2377 | #define Newxz(v,n,t) (v = (MEM_WRAP_CHECK_(n,t) (t*)MEM_LOG_ALLOC(n,t,safecalloc((n),sizeof(t)))))
      |                            ^~~~~~~~~~~~~~~
/usr/lib/perl5/CORE/handy.h:2383:23: note: in expansion of macro 'Newxz'
 2383 | #define Newz(x,v,n,t) Newxz(v,n,t)
      |                       ^~~~~
Curl.xs:236:5: note: in expansion of macro 'Newz'
  236 |     Newz(1, self, 1, perl_curl_multi);
      |     ^~~~
/usr/lib/perl5/CORE/handy.h:2279:51: warning: division by zero [-Wdiv-by-zero]
 2279 |             MEM_SIZE_MAX/sizeof(t)) > MEM_SIZE_MAX/sizeof(t))
      |                                                   ^
/usr/lib/perl5/CORE/perl.h:3402:62: note: in definition of macro 'EXPECT'
 3402 | #  define EXPECT(expr,val)                  __builtin_expect(expr,val)
      |                                                              ^~~~
/usr/lib/perl5/CORE/perl.h:3407:52: note: in expansion of macro 'cBOOL'
 3407 | #define UNLIKELY(cond)                      EXPECT(cBOOL(cond),FALSE)
      |                                                    ^~~~~
/usr/lib/perl5/CORE/handy.h:2282:9: note: in expansion of macro 'UNLIKELY'
 2282 |  (void)(UNLIKELY(_MEM_WRAP_WILL_WRAP(n,t)) \
      |         ^~~~~~~~
/usr/lib/perl5/CORE/handy.h:2282:18: note: in expansion of macro '_MEM_WRAP_WILL_WRAP'
 2282 |  (void)(UNLIKELY(_MEM_WRAP_WILL_WRAP(n,t)) \
      |                  ^~~~~~~~~~~~~~~~~~~
/usr/lib/perl5/CORE/handy.h:2294:30: note: in expansion of macro 'MEM_WRAP_CHECK'
 2294 | #define MEM_WRAP_CHECK_(n,t) MEM_WRAP_CHECK(n,t),
      |                              ^~~~~~~~~~~~~~
/usr/lib/perl5/CORE/handy.h:2377:28: note: in expansion of macro 'MEM_WRAP_CHECK_'
 2377 | #define Newxz(v,n,t) (v = (MEM_WRAP_CHECK_(n,t) (t*)MEM_LOG_ALLOC(n,t,safecalloc((n),sizeof(t)))))
      |                            ^~~~~~~~~~~~~~~
/usr/lib/perl5/CORE/handy.h:2383:23: note: in expansion of macro 'Newxz'
 2383 | #define Newz(x,v,n,t) Newxz(v,n,t)
      |                       ^~~~~
Curl.xs:236:5: note: in expansion of macro 'Newz'
  236 |     Newz(1, self, 1, perl_curl_multi);
      |     ^~~~
Curl.xs: In function 'fwrite_wrapper2':
Curl.xs:363:13: warning: unused variable 'sv' [-Wunused-variable]
  363 |         SV *sv;
      |             ^~
In file included from Curl.xs:574:
curlopt-constants.c: In function 'constant':
curlopt-constants.c:19:58: warning: 'return' with no value, in function returning non-void [-Wreturn-type]
   19 |             if (strEQ(name, "DID_MEMORY_FUNC_TYPEDEFS")) return CURL_DID_MEMORY_FUNC_TYPEDEFS;
      |                                                          ^~~~~~
curlopt-constants.c:2:1: note: declared here
    2 | constant(const char *name)
      | ^~~~~~~~
curlopt-constants.c:1705:40: warning: 'return' with no value, in function returning non-void [-Wreturn-type]
 1705 |             if (strEQ(name, "CURL_H")) return CURLINC_CURL_H;
      |                                        ^~~~~~
curlopt-constants.c:2:1: note: declared here
    2 | constant(const char *name)
      | ^~~~~~~~
In file included from Curl.xs:15:
Curl.c: In function 'XS_WWW__Curl__Easy_init':
/usr/lib/perl5/CORE/XSUB.h:185:20: warning: unused variable 'ix' [-Wunused-variable]
  185 | #define dXSI32 I32 ix = XSANY.any_i32
      |                    ^~
/usr/lib/perl5/CORE/XSUB.h:185:20: note: in definition of macro 'dXSI32'
  185 | #define dXSI32 I32 ix = XSANY.any_i32
      |                    ^~
Curl.c: In function 'XS_WWW__Curl__Easy_internal_setopt':
Curl.c:1122:6: warning: unused variable 'value' [-Wunused-variable]
 1122 |  int value = (int)SvIV(ST(2))
      |      ^~~~~
Curl.c:1120:6: warning: unused variable 'option' [-Wunused-variable]
 1120 |  int option = (int)SvIV(ST(1))
      |      ^~~~~~
Curl.c:1119:18: warning: variable 'self' set but not used [-Wunused-but-set-variable]
 1119 |  WWW__Curl__Easy self;
      |                  ^~~~
Curl.c: In function 'XS_WWW__Curl__Easy_cleanup':
Curl.c:1296:18: warning: variable 'self' set but not used [-Wunused-but-set-variable]
 1296 |  WWW__Curl__Easy self;
      |                  ^~~~
Curl.c: In function 'XS_WWW__Curl__Easy_strerror':
Curl.c:1352:18: warning: variable 'self' set but not used [-Wunused-but-set-variable]
 1352 |  WWW__Curl__Easy self;
      |                  ^~~~
Curl.c: In function 'XS_WWW__Curl__Multi_add_handle':
Curl.c:1571:18: warning: variable 'curl' set but not used [-Wunused-but-set-variable]
 1571 |  WWW__Curl__Easy curl;
      |                  ^~~~
Curl.c:1570:19: warning: variable 'curlm' set but not used [-Wunused-but-set-variable]
 1570 |  WWW__Curl__Multi curlm;
      |                   ^~~~~
Curl.c: In function 'XS_WWW__Curl__Multi_remove_handle':
Curl.c:1610:18: warning: variable 'curl' set but not used [-Wunused-but-set-variable]
 1610 |  WWW__Curl__Easy curl;
      |                  ^~~~
Curl.c:1609:19: warning: variable 'curlm' set but not used [-Wunused-but-set-variable]
 1609 |  WWW__Curl__Multi curlm;
      |                   ^~~~~
Curl.xs: In function 'XS_WWW__Curl__Multi_info_read':
Curl.xs:1091:45: error: 'perl_curl_multi' {aka 'struct <anonymous>'} has no member named 'curlm'
 1091 |      while ((msg = curl_multi_info_read(self->curlm, &queue))) {
      |                                             ^~
Curl.xs:1101:32: error: 'perl_curl_multi' {aka 'struct <anonymous>'} has no member named 'curlm'
 1101 |   curl_multi_remove_handle(self->curlm, easy);
      |                                ^~
Curl.xs: In function 'XS_WWW__Curl__Multi_fdset':
Curl.xs:1128:30: error: 'perl_curl_multi' {aka 'struct <anonymous>'} has no member named 'curlm'
 1128 |         curl_multi_fdset(self->curlm, &fdread, &fdwrite, &fdexcep, &maxfd);
      |                              ^~
Curl.c:1712:7: warning: unused variable 'RETVAL' [-Wunused-variable]
 1712 |  SV * RETVAL;
      |       ^~~~~~
Curl.c: In function 'XS_WWW__Curl__Multi_perform':
Curl.xs:1150:13: warning: unused variable 'remaining' [-Wunused-variable]
 1150 |         int remaining;
      |             ^~~~~~~~~
Curl.c:1762:19: warning: variable 'self' set but not used [-Wunused-but-set-variable]
 1762 |  WWW__Curl__Multi self;
      |                   ^~~~
Curl.c: In function 'XS_WWW__Curl__Multi_strerror':
Curl.c:1847:19: warning: variable 'self' set but not used [-Wunused-but-set-variable]
 1847 |  WWW__Curl__Multi self;
      |                   ^~~~
Curl.c: In function 'XS_WWW__Curl__Share_strerror':
Curl.c:2014:19: warning: variable 'self' set but not used [-Wunused-but-set-variable]
 2014 |  WWW__Curl__Share self;
      |                   ^~~~
make: *** [Makefile:348: Curl.o] Error 1
make: Leaving directory '/usr/src/RPM/BUILD/WWW-Curl-4.17'
error: Bad exit status from /usr/src/tmp/rpm-tmp.24240 (%build)


RPM build errors:
    Bad exit status from /usr/src/tmp/rpm-tmp.24240 (%build)
Command exited with non-zero status 1
1.65user 0.16system 0:01.76elapsed 102%CPU (0avgtext+0avgdata 65004maxresident)k
0inputs+0outputs (0major+69259minor)pagefaults 0swaps
hsh-rebuild: rebuild of `perl-WWW-Curl-4.17-alt3.2.src.rpm' failed.
Command exited with non-zero status 1
6.83user 2.30system 0:15.20elapsed 60%CPU (0avgtext+0avgdata 112692maxresident)k
4728inputs+0outputs (0major+373770minor)pagefaults 0swaps