<86>Sep 18 10:29:09 userdel[99803]: delete user 'rooter'
<86>Sep 18 10:29:09 userdel[99803]: removed group 'rooter' owned by 'rooter'
<86>Sep 18 10:29:09 groupadd[99808]: group added to /etc/group: name=rooter, GID=615
<86>Sep 18 10:29:09 groupadd[99808]: group added to /etc/gshadow: name=rooter
<86>Sep 18 10:29:09 groupadd[99808]: new group: name=rooter, GID=615
<86>Sep 18 10:29:09 useradd[99814]: new user: name=rooter, UID=615, GID=615, home=/root, shell=/bin/bash
<86>Sep 18 10:29:09 userdel[99821]: delete user 'builder'
<86>Sep 18 10:29:09 userdel[99821]: removed group 'builder' owned by 'builder'
<86>Sep 18 10:29:09 userdel[99821]: removed shadow group 'builder' owned by 'builder'
<86>Sep 18 10:29:09 groupadd[99826]: group added to /etc/group: name=builder, GID=616
<86>Sep 18 10:29:09 groupadd[99826]: group added to /etc/gshadow: name=builder
<86>Sep 18 10:29:09 groupadd[99826]: new group: name=builder, GID=616
<86>Sep 18 10:29:09 useradd[99830]: new user: name=builder, UID=616, GID=616, home=/usr/src, shell=/bin/bash
warning: user mike does not exist - using root
warning: group mike does not exist - using root
warning: user mike does not exist - using root
warning: group mike does not exist - using root
warning: user mike does not exist - using root
warning: group mike does not exist - using root
<13>Sep 18 10:29:11 rpmi: libmtsupport-0.0.1-alt3.qa4 1447389566 installed
<13>Sep 18 10:29:11 rpmi: libfacet-0.0.1-alt3.qa4 1447389611 installed
<13>Sep 18 10:29:11 rpmi: libbtree-0.0.1-alt3.qa4 1447389657 installed
<13>Sep 18 10:29:11 rpmi: gcc-c++-common-1.4.23-alt1 sisyphus+221902.2500.4.1 1550596716 installed
<13>Sep 18 10:29:12 rpmi: libstdc++8-devel-8.3.1-alt5 sisyphus+235477.100.1.1 1565022025 installed
<13>Sep 18 10:29:13 rpmi: gcc8-c++-8.3.1-alt5 sisyphus+235477.100.1.1 1565022025 installed
<13>Sep 18 10:29:13 rpmi: gcc-c++-8-alt2 sisyphus+235723.100.1.1 1565191484 installed
<13>Sep 18 10:29:13 rpmi: libstdc++-devel-8-alt2 sisyphus+235723.100.1.1 1565191484 installed
<13>Sep 18 10:29:13 rpmi: libbtree-devel-0.0.1-alt3.qa4 1447389657 installed
<13>Sep 18 10:29:13 rpmi: libfacet-devel-0.0.1-alt3.qa4 1447389611 installed
<13>Sep 18 10:29:13 rpmi: libmtsupport-devel-0.0.1-alt3.qa4 1447389566 installed
Building target platforms: i586
Building for target i586
Wrote: /usr/src/in/nosrpm/libmtquery-0.0.1-alt3.1.qa4.nosrc.rpm
Installing libmtquery-0.0.1-alt3.1.qa4.src.rpm
Building target platforms: i586
Building for target i586
Executing(%prep): /bin/sh -e /usr/src/tmp/rpm-tmp.63571
+ umask 022
+ /bin/mkdir -p /usr/src/RPM/BUILD
+ cd /usr/src/RPM/BUILD
+ cd /usr/src/RPM/BUILD
+ rm -rf libmtquery-0.0.1alpha3
+ echo 'Source #0 (libmtquery-0.0.1alpha3.tar.bz2):'
Source #0 (libmtquery-0.0.1alpha3.tar.bz2):
+ /bin/bzip2 -dc /usr/src/RPM/SOURCES/libmtquery-0.0.1alpha3.tar.bz2
+ /bin/tar -xf -
+ cd libmtquery-0.0.1alpha3
+ /bin/chmod -c -Rf u+rwX,go-w .
+ echo 'Patch #0 (libmtquery-0.0.1-alt-DSO.patch):'
Patch #0 (libmtquery-0.0.1-alt-DSO.patch):
+ /usr/bin/patch -p2
patching file testsuite/Makefile
+ exit 0
Executing(%build): /bin/sh -e /usr/src/tmp/rpm-tmp.63571
+ umask 022
+ /bin/mkdir -p /usr/src/RPM/BUILD
+ cd /usr/src/RPM/BUILD
+ cd libmtquery-0.0.1alpha3
+ make -j8 DEBUG_LDFLAGS=
make[1]: Entering directory '/usr/src/RPM/BUILD/libmtquery-0.0.1alpha3/src'
Making dependences for config.cc
make[1]: Leaving directory '/usr/src/RPM/BUILD/libmtquery-0.0.1alpha3/src'
make[1]: Entering directory '/usr/src/RPM/BUILD/libmtquery-0.0.1alpha3/src'
Making dependences for file_map.cc
make[1]: Leaving directory '/usr/src/RPM/BUILD/libmtquery-0.0.1alpha3/src'
make[1]: Entering directory '/usr/src/RPM/BUILD/libmtquery-0.0.1alpha3/src'
Making dependences for linguas.cc
make[1]: Leaving directory '/usr/src/RPM/BUILD/libmtquery-0.0.1alpha3/src'
make[1]: Entering directory '/usr/src/RPM/BUILD/libmtquery-0.0.1alpha3/src'
Making dependences for article.cc
make[1]: Leaving directory '/usr/src/RPM/BUILD/libmtquery-0.0.1alpha3/src'
make[1]: Entering directory '/usr/src/RPM/BUILD/libmtquery-0.0.1alpha3/src'
Making dependences for lgk.cc
make[1]: Leaving directory '/usr/src/RPM/BUILD/libmtquery-0.0.1alpha3/src'
make[1]: Entering directory '/usr/src/RPM/BUILD/libmtquery-0.0.1alpha3/src'
Making dependences for translation.cc
make[1]: Leaving directory '/usr/src/RPM/BUILD/libmtquery-0.0.1alpha3/src'
make[1]: Entering directory '/usr/src/RPM/BUILD/libmtquery-0.0.1alpha3/src'
Making dependences for siktable.cc
make[1]: Leaving directory '/usr/src/RPM/BUILD/libmtquery-0.0.1alpha3/src'
make[1]: Entering directory '/usr/src/RPM/BUILD/libmtquery-0.0.1alpha3/src'
Making dependences for dict_path.cc
make[1]: Leaving directory '/usr/src/RPM/BUILD/libmtquery-0.0.1alpha3/src'
make[1]: Entering directory '/usr/src/RPM/BUILD/libmtquery-0.0.1alpha3/src'
Making dependences for lang_info.cc
make[1]: Leaving directory '/usr/src/RPM/BUILD/libmtquery-0.0.1alpha3/src'
make[1]: Entering directory '/usr/src/RPM/BUILD/libmtquery-0.0.1alpha3/src'
Making dependences for lemm.cc
make[1]: Leaving directory '/usr/src/RPM/BUILD/libmtquery-0.0.1alpha3/src'
make[1]: Entering directory '/usr/src/RPM/BUILD/libmtquery-0.0.1alpha3/src'
g++ -g -O2 -Wall -W -Wold-style-cast -fno-common -pedantic -DNDEBUG -I../../libmtsupport/include/mt/support -I../../libbtree/include/btree -I../../libfacet/include/facet -I/usr/include/btree -I/usr/include/facet -I/usr/include/mt/support -I../include/mt/query  -pipe -frecord-gcc-switches -Wall -g -O2 -march=i586 -mtune=generic   -c  -fpic lgk.cc -o lgk.so
make[1]: Leaving directory '/usr/src/RPM/BUILD/libmtquery-0.0.1alpha3/src'
make[1]: Entering directory '/usr/src/RPM/BUILD/libmtquery-0.0.1alpha3/src'
g++ -g -O2 -Wall -W -Wold-style-cast -fno-common -pedantic -DNDEBUG -I../../libmtsupport/include/mt/support -I../../libbtree/include/btree -I../../libfacet/include/facet -I/usr/include/btree -I/usr/include/facet -I/usr/include/mt/support -I../include/mt/query  -pipe -frecord-gcc-switches -Wall -g -O2 -march=i586 -mtune=generic   -c  -fpic siktable.cc -o siktable.so
make[1]: Leaving directory '/usr/src/RPM/BUILD/libmtquery-0.0.1alpha3/src'
make[1]: Entering directory '/usr/src/RPM/BUILD/libmtquery-0.0.1alpha3/src'
g++ -g -O2 -Wall -W -Wold-style-cast -fno-common -pedantic -DNDEBUG -I../../libmtsupport/include/mt/support -I../../libbtree/include/btree -I../../libfacet/include/facet -I/usr/include/btree -I/usr/include/facet -I/usr/include/mt/support -I../include/mt/query  -pipe -frecord-gcc-switches -Wall -g -O2 -march=i586 -mtune=generic   -c  -fpic linguas.cc -o linguas.so
make[1]: Leaving directory '/usr/src/RPM/BUILD/libmtquery-0.0.1alpha3/src'
make[1]: Entering directory '/usr/src/RPM/BUILD/libmtquery-0.0.1alpha3/src'
g++ -g -O2 -Wall -W -Wold-style-cast -fno-common -pedantic -DNDEBUG -I../../libmtsupport/include/mt/support -I../../libbtree/include/btree -I../../libfacet/include/facet -I/usr/include/btree -I/usr/include/facet -I/usr/include/mt/support -I../include/mt/query  -pipe -frecord-gcc-switches -Wall -g -O2 -march=i586 -mtune=generic   -c -o lgk.o lgk.cc
make[1]: Leaving directory '/usr/src/RPM/BUILD/libmtquery-0.0.1alpha3/src'
make[1]: Entering directory '/usr/src/RPM/BUILD/libmtquery-0.0.1alpha3/src'
g++ -g -O2 -Wall -W -Wold-style-cast -fno-common -pedantic -DNDEBUG -I../../libmtsupport/include/mt/support -I../../libbtree/include/btree -I../../libfacet/include/facet -I/usr/include/btree -I/usr/include/facet -I/usr/include/mt/support -I../include/mt/query  -pipe -frecord-gcc-switches -Wall -g -O2 -march=i586 -mtune=generic   -c  -fpic article.cc -o article.so
In file included from /usr/include/btree/bmap.hh:13,
                 from ../include/mt/query/article.hh:16,
                 from article.cc:11:
/usr/include/btree/btraits.hh:40:9: warning: type qualifiers ignored on function return type [-Wignored-qualifiers]
  static const mem_pos data(const i16_t& val)
         ^~~~~
make[1]: Leaving directory '/usr/src/RPM/BUILD/libmtquery-0.0.1alpha3/src'
make[1]: Entering directory '/usr/src/RPM/BUILD/libmtquery-0.0.1alpha3/src'
g++ -g -O2 -Wall -W -Wold-style-cast -fno-common -pedantic -DNDEBUG -I../../libmtsupport/include/mt/support -I../../libbtree/include/btree -I../../libfacet/include/facet -I/usr/include/btree -I/usr/include/facet -I/usr/include/mt/support -I../include/mt/query  -pipe -frecord-gcc-switches -Wall -g -O2 -march=i586 -mtune=generic   -c  -fpic file_map.cc -o file_map.so
make[1]: Leaving directory '/usr/src/RPM/BUILD/libmtquery-0.0.1alpha3/src'
make[1]: Entering directory '/usr/src/RPM/BUILD/libmtquery-0.0.1alpha3/src'
g++ -g -O2 -Wall -W -Wold-style-cast -fno-common -pedantic -DNDEBUG -I../../libmtsupport/include/mt/support -I../../libbtree/include/btree -I../../libfacet/include/facet -I/usr/include/btree -I/usr/include/facet -I/usr/include/mt/support -I../include/mt/query  -pipe -frecord-gcc-switches -Wall -g -O2 -march=i586 -mtune=generic   -c  -fpic dict_path.cc -o dict_path.so
make[1]: Leaving directory '/usr/src/RPM/BUILD/libmtquery-0.0.1alpha3/src'
make[1]: Entering directory '/usr/src/RPM/BUILD/libmtquery-0.0.1alpha3/src'
g++ -g -O2 -Wall -W -Wold-style-cast -fno-common -pedantic -DNDEBUG -I../../libmtsupport/include/mt/support -I../../libbtree/include/btree -I../../libfacet/include/facet -I/usr/include/btree -I/usr/include/facet -I/usr/include/mt/support -I../include/mt/query  -pipe -frecord-gcc-switches -Wall -g -O2 -march=i586 -mtune=generic   -c  -fpic config.cc -o config.so
make[1]: Leaving directory '/usr/src/RPM/BUILD/libmtquery-0.0.1alpha3/src'
make[1]: Entering directory '/usr/src/RPM/BUILD/libmtquery-0.0.1alpha3/src'
g++ -g -O2 -Wall -W -Wold-style-cast -fno-common -pedantic -DNDEBUG -I../../libmtsupport/include/mt/support -I../../libbtree/include/btree -I../../libfacet/include/facet -I/usr/include/btree -I/usr/include/facet -I/usr/include/mt/support -I../include/mt/query  -pipe -frecord-gcc-switches -Wall -g -O2 -march=i586 -mtune=generic   -c -o siktable.o siktable.cc
make[1]: Leaving directory '/usr/src/RPM/BUILD/libmtquery-0.0.1alpha3/src'
make[1]: Entering directory '/usr/src/RPM/BUILD/libmtquery-0.0.1alpha3/src'
g++ -g -O2 -Wall -W -Wold-style-cast -fno-common -pedantic -DNDEBUG -I../../libmtsupport/include/mt/support -I../../libbtree/include/btree -I../../libfacet/include/facet -I/usr/include/btree -I/usr/include/facet -I/usr/include/mt/support -I../include/mt/query  -pipe -frecord-gcc-switches -Wall -g -O2 -march=i586 -mtune=generic   -c  -fpic lang_info.cc -o lang_info.so
make[1]: Leaving directory '/usr/src/RPM/BUILD/libmtquery-0.0.1alpha3/src'
make[1]: Entering directory '/usr/src/RPM/BUILD/libmtquery-0.0.1alpha3/src'
g++ -g -O2 -Wall -W -Wold-style-cast -fno-common -pedantic -DNDEBUG -I../../libmtsupport/include/mt/support -I../../libbtree/include/btree -I../../libfacet/include/facet -I/usr/include/btree -I/usr/include/facet -I/usr/include/mt/support -I../include/mt/query  -pipe -frecord-gcc-switches -Wall -g -O2 -march=i586 -mtune=generic   -c -o article.o article.cc
In file included from /usr/include/btree/bmap.hh:13,
                 from ../include/mt/query/article.hh:16,
                 from article.cc:11:
/usr/include/btree/btraits.hh:40:9: warning: type qualifiers ignored on function return type [-Wignored-qualifiers]
  static const mem_pos data(const i16_t& val)
         ^~~~~
make[1]: Leaving directory '/usr/src/RPM/BUILD/libmtquery-0.0.1alpha3/src'
make[1]: Entering directory '/usr/src/RPM/BUILD/libmtquery-0.0.1alpha3/src'
g++ -g -O2 -Wall -W -Wold-style-cast -fno-common -pedantic -DNDEBUG -I../../libmtsupport/include/mt/support -I../../libbtree/include/btree -I../../libfacet/include/facet -I/usr/include/btree -I/usr/include/facet -I/usr/include/mt/support -I../include/mt/query  -pipe -frecord-gcc-switches -Wall -g -O2 -march=i586 -mtune=generic   -c -o lang_info.o lang_info.cc
make[1]: Leaving directory '/usr/src/RPM/BUILD/libmtquery-0.0.1alpha3/src'
make[1]: Entering directory '/usr/src/RPM/BUILD/libmtquery-0.0.1alpha3/src'
g++ -g -O2 -Wall -W -Wold-style-cast -fno-common -pedantic -DNDEBUG -I../../libmtsupport/include/mt/support -I../../libbtree/include/btree -I../../libfacet/include/facet -I/usr/include/btree -I/usr/include/facet -I/usr/include/mt/support -I../include/mt/query  -pipe -frecord-gcc-switches -Wall -g -O2 -march=i586 -mtune=generic   -c -o dict_path.o dict_path.cc
make[1]: Leaving directory '/usr/src/RPM/BUILD/libmtquery-0.0.1alpha3/src'
make[1]: Entering directory '/usr/src/RPM/BUILD/libmtquery-0.0.1alpha3/src'
g++ -g -O2 -Wall -W -Wold-style-cast -fno-common -pedantic -DNDEBUG -I../../libmtsupport/include/mt/support -I../../libbtree/include/btree -I../../libfacet/include/facet -I/usr/include/btree -I/usr/include/facet -I/usr/include/mt/support -I../include/mt/query  -pipe -frecord-gcc-switches -Wall -g -O2 -march=i586 -mtune=generic   -c -o linguas.o linguas.cc
make[1]: Leaving directory '/usr/src/RPM/BUILD/libmtquery-0.0.1alpha3/src'
make[1]: Entering directory '/usr/src/RPM/BUILD/libmtquery-0.0.1alpha3/src'
g++ -g -O2 -Wall -W -Wold-style-cast -fno-common -pedantic -DNDEBUG -I../../libmtsupport/include/mt/support -I../../libbtree/include/btree -I../../libfacet/include/facet -I/usr/include/btree -I/usr/include/facet -I/usr/include/mt/support -I../include/mt/query  -pipe -frecord-gcc-switches -Wall -g -O2 -march=i586 -mtune=generic   -c  -fpic lemm.cc -o lemm.so
In file included from /usr/include/btree/bmap.hh:13,
                 from lemm.cc:9:
/usr/include/btree/btraits.hh:40:9: warning: type qualifiers ignored on function return type [-Wignored-qualifiers]
  static const mem_pos data(const i16_t& val)
         ^~~~~
make[1]: Leaving directory '/usr/src/RPM/BUILD/libmtquery-0.0.1alpha3/src'
make[1]: Entering directory '/usr/src/RPM/BUILD/libmtquery-0.0.1alpha3/src'
g++ -g -O2 -Wall -W -Wold-style-cast -fno-common -pedantic -DNDEBUG -I../../libmtsupport/include/mt/support -I../../libbtree/include/btree -I../../libfacet/include/facet -I/usr/include/btree -I/usr/include/facet -I/usr/include/mt/support -I../include/mt/query  -pipe -frecord-gcc-switches -Wall -g -O2 -march=i586 -mtune=generic   -c -o file_map.o file_map.cc
make[1]: Leaving directory '/usr/src/RPM/BUILD/libmtquery-0.0.1alpha3/src'
make[1]: Entering directory '/usr/src/RPM/BUILD/libmtquery-0.0.1alpha3/src'
g++ -g -O2 -Wall -W -Wold-style-cast -fno-common -pedantic -DNDEBUG -I../../libmtsupport/include/mt/support -I../../libbtree/include/btree -I../../libfacet/include/facet -I/usr/include/btree -I/usr/include/facet -I/usr/include/mt/support -I../include/mt/query  -pipe -frecord-gcc-switches -Wall -g -O2 -march=i586 -mtune=generic   -c -o config.o config.cc
make[1]: Leaving directory '/usr/src/RPM/BUILD/libmtquery-0.0.1alpha3/src'
make[1]: Entering directory '/usr/src/RPM/BUILD/libmtquery-0.0.1alpha3/src'
g++ -g -O2 -Wall -W -Wold-style-cast -fno-common -pedantic -DNDEBUG -I../../libmtsupport/include/mt/support -I../../libbtree/include/btree -I../../libfacet/include/facet -I/usr/include/btree -I/usr/include/facet -I/usr/include/mt/support -I../include/mt/query  -pipe -frecord-gcc-switches -Wall -g -O2 -march=i586 -mtune=generic   -c -o lemm.o lemm.cc
In file included from /usr/include/btree/bmap.hh:13,
                 from lemm.cc:9:
/usr/include/btree/btraits.hh:40:9: warning: type qualifiers ignored on function return type [-Wignored-qualifiers]
  static const mem_pos data(const i16_t& val)
         ^~~~~
make[1]: Leaving directory '/usr/src/RPM/BUILD/libmtquery-0.0.1alpha3/src'
make[1]: Entering directory '/usr/src/RPM/BUILD/libmtquery-0.0.1alpha3/src'
g++ -g -O2 -Wall -W -Wold-style-cast -fno-common -pedantic -DNDEBUG -I../../libmtsupport/include/mt/support -I../../libbtree/include/btree -I../../libfacet/include/facet -I/usr/include/btree -I/usr/include/facet -I/usr/include/mt/support -I../include/mt/query  -pipe -frecord-gcc-switches -Wall -g -O2 -march=i586 -mtune=generic   -c  -fpic translation.cc -o translation.so
In file included from /usr/include/btree/bmap.hh:13,
                 from ../include/mt/query/article.hh:16,
                 from ../include/mt/query/translation.hh:17,
                 from translation.cc:16:
/usr/include/btree/btraits.hh:40:9: warning: type qualifiers ignored on function return type [-Wignored-qualifiers]
  static const mem_pos data(const i16_t& val)
         ^~~~~
make[1]: Leaving directory '/usr/src/RPM/BUILD/libmtquery-0.0.1alpha3/src'
make[1]: Entering directory '/usr/src/RPM/BUILD/libmtquery-0.0.1alpha3/src'
g++   -g -O2 -Wall -W -Wold-style-cast -fno-common -pedantic -DNDEBUG  -shared -Wl,-soname,libmtquery.so.0 lgk.so siktable.so lang_info.so lemm.so translation.so dict_path.so article.so file_map.so linguas.so config.so -lmtsupport -lbtree -lfacet -o libmtquery.so
ln -sf libmtquery.so libmtquery.so.0
make[1]: Leaving directory '/usr/src/RPM/BUILD/libmtquery-0.0.1alpha3/src'
make[1]: Entering directory '/usr/src/RPM/BUILD/libmtquery-0.0.1alpha3/src'
g++ -g -O2 -Wall -W -Wold-style-cast -fno-common -pedantic -DNDEBUG -I../../libmtsupport/include/mt/support -I../../libbtree/include/btree -I../../libfacet/include/facet -I/usr/include/btree -I/usr/include/facet -I/usr/include/mt/support -I../include/mt/query  -pipe -frecord-gcc-switches -Wall -g -O2 -march=i586 -mtune=generic   -c -o translation.o translation.cc
In file included from /usr/include/btree/bmap.hh:13,
                 from ../include/mt/query/article.hh:16,
                 from ../include/mt/query/translation.hh:17,
                 from translation.cc:16:
/usr/include/btree/btraits.hh:40:9: warning: type qualifiers ignored on function return type [-Wignored-qualifiers]
  static const mem_pos data(const i16_t& val)
         ^~~~~
make[1]: Leaving directory '/usr/src/RPM/BUILD/libmtquery-0.0.1alpha3/src'
make[1]: Entering directory '/usr/src/RPM/BUILD/libmtquery-0.0.1alpha3/src'
ar rv libmtquery.a lgk.o siktable.o lang_info.o lemm.o translation.o dict_path.o article.o file_map.o linguas.o config.o
ar: creating libmtquery.a
a - lgk.o
a - siktable.o
a - lang_info.o
a - lemm.o
a - translation.o
a - dict_path.o
a - article.o
a - file_map.o
a - linguas.o
a - config.o
ranlib libmtquery.a
make[1]: Leaving directory '/usr/src/RPM/BUILD/libmtquery-0.0.1alpha3/src'
make[1]: Entering directory '/usr/src/RPM/BUILD/libmtquery-0.0.1alpha3/testsuite'
g++ -g -O2 -Wall -W -Wold-style-cast -fno-common -pedantic -DNDEBUG -I../../libmtsupport/include/mt/support -I../../libbtree/include/btree -I../../libfacet/include/facet -I../include/mt/query -I/usr/include/btree -I/usr/include/mt/support -I/usr/include/facet  -Wl,-rpath,/usr/src/RPM/BUILD/libmtquery-0.0.1alpha3/testsuite/../src/ -L../src/  test6.cc  -lmtquery -lbtree -o test6
make[1]: Leaving directory '/usr/src/RPM/BUILD/libmtquery-0.0.1alpha3/testsuite'
make[1]: Entering directory '/usr/src/RPM/BUILD/libmtquery-0.0.1alpha3/testsuite'
g++ -g -O2 -Wall -W -Wold-style-cast -fno-common -pedantic -DNDEBUG -I../../libmtsupport/include/mt/support -I../../libbtree/include/btree -I../../libfacet/include/facet -I../include/mt/query -I/usr/include/btree -I/usr/include/mt/support -I/usr/include/facet  -Wl,-rpath,/usr/src/RPM/BUILD/libmtquery-0.0.1alpha3/testsuite/../src/ -L../src/  test2.cc  -lmtquery -lbtree -o test2
make[1]: Leaving directory '/usr/src/RPM/BUILD/libmtquery-0.0.1alpha3/testsuite'
make[1]: Entering directory '/usr/src/RPM/BUILD/libmtquery-0.0.1alpha3/testsuite'
g++ -g -O2 -Wall -W -Wold-style-cast -fno-common -pedantic -DNDEBUG -I../../libmtsupport/include/mt/support -I../../libbtree/include/btree -I../../libfacet/include/facet -I../include/mt/query -I/usr/include/btree -I/usr/include/mt/support -I/usr/include/facet  -Wl,-rpath,/usr/src/RPM/BUILD/libmtquery-0.0.1alpha3/testsuite/../src/ -L../src/  test5.cc  -lmtquery -lbtree -o test5
In file included from /usr/include/btree/bmap.hh:13,
                 from ../include/mt/query/article.hh:16,
                 from test5.cc:11:
/usr/include/btree/btraits.hh:40:9: warning: type qualifiers ignored on function return type [-Wignored-qualifiers]
  static const mem_pos data(const i16_t& val)
         ^~~~~
make[1]: Leaving directory '/usr/src/RPM/BUILD/libmtquery-0.0.1alpha3/testsuite'
make[1]: Entering directory '/usr/src/RPM/BUILD/libmtquery-0.0.1alpha3/testsuite'
g++ -g -O2 -Wall -W -Wold-style-cast -fno-common -pedantic -DNDEBUG -I../../libmtsupport/include/mt/support -I../../libbtree/include/btree -I../../libfacet/include/facet -I../include/mt/query -I/usr/include/btree -I/usr/include/mt/support -I/usr/include/facet  -Wl,-rpath,/usr/src/RPM/BUILD/libmtquery-0.0.1alpha3/testsuite/../src/ -L../src/  test3.cc  -lmtquery -lbtree -o test3
make[1]: Leaving directory '/usr/src/RPM/BUILD/libmtquery-0.0.1alpha3/testsuite'
make[1]: Entering directory '/usr/src/RPM/BUILD/libmtquery-0.0.1alpha3/testsuite'
g++ -g -O2 -Wall -W -Wold-style-cast -fno-common -pedantic -DNDEBUG -I../../libmtsupport/include/mt/support -I../../libbtree/include/btree -I../../libfacet/include/facet -I../include/mt/query -I/usr/include/btree -I/usr/include/mt/support -I/usr/include/facet  -Wl,-rpath,/usr/src/RPM/BUILD/libmtquery-0.0.1alpha3/testsuite/../src/ -L../src/  test1.cc  -lmtquery -lbtree -o test1
make[1]: Leaving directory '/usr/src/RPM/BUILD/libmtquery-0.0.1alpha3/testsuite'
make[1]: Entering directory '/usr/src/RPM/BUILD/libmtquery-0.0.1alpha3/testsuite'
g++ -g -O2 -Wall -W -Wold-style-cast -fno-common -pedantic -DNDEBUG -I../../libmtsupport/include/mt/support -I../../libbtree/include/btree -I../../libfacet/include/facet -I../include/mt/query -I/usr/include/btree -I/usr/include/mt/support -I/usr/include/facet  -Wl,-rpath,/usr/src/RPM/BUILD/libmtquery-0.0.1alpha3/testsuite/../src/ -L../src/  test4.cc  -lmtquery -lbtree -o test4
In file included from /usr/include/btree/bmap.hh:13,
                 from ../include/mt/query/article.hh:16,
                 from ../include/mt/query/translation.hh:17,
                 from test4.cc:19:
/usr/include/btree/btraits.hh:40:9: warning: type qualifiers ignored on function return type [-Wignored-qualifiers]
  static const mem_pos data(const i16_t& val)
         ^~~~~
make[1]: Leaving directory '/usr/src/RPM/BUILD/libmtquery-0.0.1alpha3/testsuite'
+ exit 0
Executing(%install): /bin/sh -e /usr/src/tmp/rpm-tmp.87192
+ umask 022
+ /bin/mkdir -p /usr/src/RPM/BUILD
+ cd /usr/src/RPM/BUILD
+ /bin/chmod -Rf u+rwX -- /usr/src/tmp/libmtquery-buildroot
+ :
+ /bin/rm -rf -- /usr/src/tmp/libmtquery-buildroot
+ cd libmtquery-0.0.1alpha3
+ /usr/bin/make 'INSTALL=/bin/install -p' prefix=/usr/src/tmp/libmtquery-buildroot/usr exec_prefix=/usr/src/tmp/libmtquery-buildroot/usr bindir=/usr/src/tmp/libmtquery-buildroot/usr/bin sbindir=/usr/src/tmp/libmtquery-buildroot/usr/sbin sysconfdir=/usr/src/tmp/libmtquery-buildroot/etc datadir=/usr/src/tmp/libmtquery-buildroot/usr/share includedir=/usr/src/tmp/libmtquery-buildroot/usr/include libdir=/usr/src/tmp/libmtquery-buildroot/usr/lib libexecdir=/usr/src/tmp/libmtquery-buildroot/usr/lib localstatedir=/usr/src/tmp/libmtquery-buildroot/var/lib sharedstatedir=/usr/src/tmp/libmtquery-buildroot/var/lib mandir=/usr/src/tmp/libmtquery-buildroot/usr/share/man infodir=/usr/src/tmp/libmtquery-buildroot/usr/share/info install
make: Entering directory '/usr/src/RPM/BUILD/libmtquery-0.0.1alpha3'
make[1]: Entering directory '/usr/src/RPM/BUILD/libmtquery-0.0.1alpha3/src'
make[1]: Nothing to be done for 'all'.
make[1]: Leaving directory '/usr/src/RPM/BUILD/libmtquery-0.0.1alpha3/src'
make[1]: Entering directory '/usr/src/RPM/BUILD/libmtquery-0.0.1alpha3/testsuite'
make[1]: Nothing to be done for 'all'.
make[1]: Leaving directory '/usr/src/RPM/BUILD/libmtquery-0.0.1alpha3/testsuite'
make[1]: Entering directory '/usr/src/RPM/BUILD/libmtquery-0.0.1alpha3/src'
/bin/install -p -d -m755 /usr/src/tmp/libmtquery-buildroot/usr/include/mt/query
/bin/install -p -pD -m755 libmtquery.so /usr/src/tmp/libmtquery-buildroot/usr/lib/libmtquery.so.0.0.1alpha3
/bin/install -p -pD -m644 libmtquery.a /usr/src/tmp/libmtquery-buildroot/usr/lib/libmtquery.a
make[1]: Leaving directory '/usr/src/RPM/BUILD/libmtquery-0.0.1alpha3/src'
make[1]: Entering directory '/usr/src/RPM/BUILD/libmtquery-0.0.1alpha3/testsuite'
make[1]: Nothing to be done for 'install'.
make[1]: Leaving directory '/usr/src/RPM/BUILD/libmtquery-0.0.1alpha3/testsuite'
make: Leaving directory '/usr/src/RPM/BUILD/libmtquery-0.0.1alpha3'
+ /usr/lib/rpm/brp-alt
Cleaning files in /usr/src/tmp/libmtquery-buildroot (auto)
mode of './usr/lib/libmtquery.so.0.0.1alpha3' changed from 0755 (rwxr-xr-x) to 0644 (rw-r--r--)
Verifying and fixing files in /usr/src/tmp/libmtquery-buildroot (binconfig,pkgconfig,libtool,desktop)
Checking contents of files in /usr/src/tmp/libmtquery-buildroot/ (default)
Compressing files in /usr/src/tmp/libmtquery-buildroot (auto)
Adjusting library links in /usr/src/tmp/libmtquery-buildroot
./usr/lib:
	libmtquery.so.0 -> libmtquery.so.0.0.1alpha3
Verifying ELF objects in /usr/src/tmp/libmtquery-buildroot (arch=normal,fhs=normal,lfs=relaxed,lint=relaxed,rpath=normal,stack=normal,textrel=normal,unresolved=normal)
Hardlinking identical .pyc and .pyo files
Processing files: libmtquery-0.0.1-alt3.1.qa4
Executing(%doc): /bin/sh -e /usr/src/tmp/rpm-tmp.70020
+ umask 022
+ /bin/mkdir -p /usr/src/RPM/BUILD
+ cd /usr/src/RPM/BUILD
+ cd libmtquery-0.0.1alpha3
+ DOCDIR=/usr/src/tmp/libmtquery-buildroot/usr/share/doc/libmtquery-0.0.1
+ export DOCDIR
+ rm -rf /usr/src/tmp/libmtquery-buildroot/usr/share/doc/libmtquery-0.0.1
+ /bin/mkdir -p /usr/src/tmp/libmtquery-buildroot/usr/share/doc/libmtquery-0.0.1
+ cp -prL ChangeLog /usr/src/tmp/libmtquery-buildroot/usr/share/doc/libmtquery-0.0.1
+ chmod -R go-w /usr/src/tmp/libmtquery-buildroot/usr/share/doc/libmtquery-0.0.1
+ chmod -R a+rX /usr/src/tmp/libmtquery-buildroot/usr/share/doc/libmtquery-0.0.1
+ exit 0
Finding Provides (using /usr/lib/rpm/find-provides)
Executing: /bin/sh -e /usr/src/tmp/rpm-tmp.cr6RyU
find-provides: running scripts (debuginfo,lib,pam,perl,pkgconfig,python,shell)
lib.prov: /usr/src/tmp/libmtquery-buildroot/usr/lib/libmtquery.so.0: 142 symbols, 18 bpp
Finding Requires (using /usr/lib/rpm/find-requires)
Executing: /bin/sh -e /usr/src/tmp/rpm-tmp.bLnb4W
find-requires: running scripts (cpp,debuginfo,files,lib,pam,perl,pkgconfig,pkgconfiglib,python,rpmlib,shebang,shell,static,symlinks)
Provides: libmtquery.so.0 = set:ldIqEN9XTg5P1Tnt9n063KHW7wpx9zAtuTMZ7dgxadNZwy5yIOaIiLK53nb2hnux6QNLKAnX20n3EVMrR8bOBueD5TtTPWtBPhsaX3wExQOrTlMMP7GRjOU7wKjhpBgwV3viZIHWsIPsByRCiQOy7w2egwlfOv9keZ4hOV0cM084bJWVp9j9p1ux3sAm0MjBaFMNSGZ9zJvdWkMNgxk4qJEKCjssUwISjNUREgAcpaLwd6iVfvyJSjKLZmt99NnyvZLmk6E3I1EGwXc5tfco3YZci004gPeEzVh5SLem6
Requires: libbtree.so.0 >= set:ienm6EG4Wkfjh1bah8Ip9sgmDhmqA6, libc.so.6(GLIBC_2.0), libc.so.6(GLIBC_2.1.3), libc.so.6(GLIBC_2.4), libfacet.so.0 >= set:jgPrZ04C46FDVAOEz0, libgcc_s.so.1(GCC_3.0), libmtsupport.so.0 >= set:genomPnV1, libstdc++.so.6(CXXABI_1.3), libstdc++.so.6(CXXABI_1.3.9), libstdc++.so.6(GLIBCXX_3.4), libstdc++.so.6(GLIBCXX_3.4.11), libstdc++.so.6(GLIBCXX_3.4.20), libstdc++.so.6(GLIBCXX_3.4.21), rtld(GNU_HASH), rtld(GNU_UNIQUE)
Requires(rpmlib): rpmlib(SetVersions)
Finding debuginfo files (using /usr/lib/rpm/find-debuginfo-files)
Executing: /bin/sh -e /usr/src/tmp/rpm-tmp.QNtjq8
Creating libmtquery-debuginfo package
Processing files: libmtquery-devel-0.0.1-alt3.1.qa4
Finding Provides (using /usr/lib/rpm/find-provides)
Executing: /bin/sh -e /usr/src/tmp/rpm-tmp.GUYICB
find-provides: running scripts (debuginfo,lib,pam,perl,pkgconfig,python,shell)
Finding Requires (using /usr/lib/rpm/find-requires)
Executing: /bin/sh -e /usr/src/tmp/rpm-tmp.bnDgpo
find-requires: running scripts (cpp,debuginfo,files,lib,pam,perl,pkgconfig,pkgconfiglib,python,rpmlib,shebang,shell,static,symlinks)
/usr/src/tmp/libmtquery-buildroot/usr/include/mt/query/lemm.hh:12:10: fatal error: vector: No such file or directory
 #include <vector>
          ^~~~~~~~
compilation terminated.
cpp.req: /usr/src/tmp/libmtquery-buildroot/usr/include/mt/query/lemm.hh: cpp failed, trying c++ mode
In file included from /usr/src/tmp/libmtquery-buildroot/usr/include/mt/query/lemm.hh:14:
/usr/src/tmp/libmtquery-buildroot/usr/include/mt/query/lang_info.hh:16:10: fatal error: identification.hh: No such file or directory
 #include "identification.hh"
          ^~~~~~~~~~~~~~~~~~~
compilation terminated.
cpp.req: WARNING: /usr/src/tmp/libmtquery-buildroot/usr/include/mt/query/lemm.hh: cpp failed
/usr/src/tmp/libmtquery-buildroot/usr/include/mt/query/config.hh:12:10: fatal error: string: No such file or directory
 #include <string>
          ^~~~~~~~
compilation terminated.
cpp.req: /usr/src/tmp/libmtquery-buildroot/usr/include/mt/query/config.hh: cpp failed, trying c++ mode
In file included from /usr/src/tmp/libmtquery-buildroot/usr/include/mt/query/article.hh:15:
/usr/src/tmp/libmtquery-buildroot/usr/include/mt/query/lang_info.hh:16:10: fatal error: identification.hh: No such file or directory
 #include "identification.hh"
          ^~~~~~~~~~~~~~~~~~~
compilation terminated.
cpp.req: WARNING: /usr/src/tmp/libmtquery-buildroot/usr/include/mt/query/article.hh: cpp failed
In file included from /usr/src/tmp/libmtquery-buildroot/usr/include/mt/query/linguas.hh:7:
/usr/src/tmp/libmtquery-buildroot/usr/include/mt/query/lang_info.hh:16:10: fatal error: identification.hh: No such file or directory
 #include "identification.hh"
          ^~~~~~~~~~~~~~~~~~~
compilation terminated.
cpp.req: WARNING: /usr/src/tmp/libmtquery-buildroot/usr/include/mt/query/linguas.hh: cpp failed
/usr/src/tmp/libmtquery-buildroot/usr/include/mt/query/siktable.hh:16:10: fatal error: bdata.hh: No such file or directory
 #include "bdata.hh"
          ^~~~~~~~~~
compilation terminated.
cpp.req: WARNING: /usr/src/tmp/libmtquery-buildroot/usr/include/mt/query/siktable.hh: cpp failed
In file included from /usr/src/tmp/libmtquery-buildroot/usr/include/mt/query/dict_path.hh:12:
/usr/src/tmp/libmtquery-buildroot/usr/include/mt/query/lang_info.hh:16:10: fatal error: identification.hh: No such file or directory
 #include "identification.hh"
          ^~~~~~~~~~~~~~~~~~~
compilation terminated.
cpp.req: WARNING: /usr/src/tmp/libmtquery-buildroot/usr/include/mt/query/dict_path.hh: cpp failed
/usr/src/tmp/libmtquery-buildroot/usr/include/mt/query/lang_info.hh:16:10: fatal error: identification.hh: No such file or directory
 #include "identification.hh"
          ^~~~~~~~~~~~~~~~~~~
compilation terminated.
cpp.req: WARNING: /usr/src/tmp/libmtquery-buildroot/usr/include/mt/query/lang_info.hh: cpp failed
/usr/src/tmp/libmtquery-buildroot/usr/include/mt/query/singleton.hh:14:10: fatal error: shared_ptr.hh: No such file or directory
 #include "shared_ptr.hh"
          ^~~~~~~~~~~~~~~
compilation terminated.
cpp.req: WARNING: /usr/src/tmp/libmtquery-buildroot/usr/include/mt/query/singleton.hh: cpp failed
In file included from /usr/src/tmp/libmtquery-buildroot/usr/include/mt/query/lemm.hh:14,
                 from /usr/src/tmp/libmtquery-buildroot/usr/include/mt/query/translation.hh:15:
/usr/src/tmp/libmtquery-buildroot/usr/include/mt/query/lang_info.hh:16:10: fatal error: identification.hh: No such file or directory
 #include "identification.hh"
          ^~~~~~~~~~~~~~~~~~~
compilation terminated.
cpp.req: WARNING: /usr/src/tmp/libmtquery-buildroot/usr/include/mt/query/translation.hh: cpp failed
Requires: libmtquery = 0.0.1-alt3.1.qa4, /usr/lib/libmtquery.so.0
Finding debuginfo files (using /usr/lib/rpm/find-debuginfo-files)
Executing: /bin/sh -e /usr/src/tmp/rpm-tmp.E7lQbu
Processing files: libmtquery-devel-static-0.0.1-alt3.1.qa4
Finding Provides (using /usr/lib/rpm/find-provides)
Executing: /bin/sh -e /usr/src/tmp/rpm-tmp.bRRjEJ
find-provides: running scripts (debuginfo,lib,pam,perl,pkgconfig,python,shell)
Finding Requires (using /usr/lib/rpm/find-requires)
Executing: /bin/sh -e /usr/src/tmp/rpm-tmp.HUVFKg
find-requires: running scripts (cpp,debuginfo,files,lib,pam,perl,pkgconfig,pkgconfiglib,python,rpmlib,shebang,shell,static,symlinks)
Requires: libmtquery-devel = 0.0.1-alt3.1.qa4, glibc-devel-static
Finding debuginfo files (using /usr/lib/rpm/find-debuginfo-files)
Executing: /bin/sh -e /usr/src/tmp/rpm-tmp.c89si8
Processing files: libmtquery-debuginfo-0.0.1-alt3.1.qa4
Finding Provides (using /usr/lib/rpm/find-provides)
Executing: /bin/sh -e /usr/src/tmp/rpm-tmp.KDaZui
find-provides: running scripts (debuginfo)
Finding Requires (using /usr/lib/rpm/find-requires)
Executing: /bin/sh -e /usr/src/tmp/rpm-tmp.uoaYnC
find-requires: running scripts (debuginfo)
Provides: debug(libmtquery.so.0)
Requires: libmtquery = 0.0.1-alt3.1.qa4, debug(libbtree.so.0), debug(libc.so.6), debug(libfacet.so.0), debug(libgcc_s.so.1), debug(libmtsupport.so.0), debug(libstdc++.so.6)
Removing 1 extra deps from libmtquery-devel due to dependency on libmtquery
Wrote: /usr/src/RPM/RPMS/i586/libmtquery-0.0.1-alt3.1.qa4.i586.rpm
Wrote: /usr/src/RPM/RPMS/i586/libmtquery-devel-0.0.1-alt3.1.qa4.i586.rpm
Wrote: /usr/src/RPM/RPMS/i586/libmtquery-devel-static-0.0.1-alt3.1.qa4.i586.rpm
Wrote: /usr/src/RPM/RPMS/i586/libmtquery-debuginfo-0.0.1-alt3.1.qa4.i586.rpm
31.65user 2.84system 0:26.13elapsed 131%CPU (0avgtext+0avgdata 126716maxresident)k
0inputs+0outputs (0major+1010054minor)pagefaults 0swaps
36.84user 5.36system 0:35.47elapsed 118%CPU (0avgtext+0avgdata 126716maxresident)k
120inputs+0outputs (0major+1337124minor)pagefaults 0swaps
--- libmtquery-0.0.1-alt3.1.qa4.i586.rpm.repo	2015-11-13 04:42:12.000000000 +0000
+++ libmtquery-0.0.1-alt3.1.qa4.i586.rpm.hasher	2019-09-18 10:29:42.523759561 +0000
@@ -13,2 +13,3 @@
 Requires: libstdc++.so.6(CXXABI_1.3)  
+Requires: libstdc++.so.6(CXXABI_1.3.9)  
 Requires: libstdc++.so.6(GLIBCXX_3.4)  
@@ -20,3 +21,3 @@
 Requires: rpmlib(PayloadIsLzma)  
-Provides: libmtquery.so.0 = set:ld0fQ6aNbLqAUQBs1ocoPQZ4ZwQktScpAIPXPmfr7sITbwsSAkjryIOaIiLKSs4yQ2nEEzvt9LS5kwxF5e3ebYmdOysFDPpstdkWumLHsud2Z0OZqp0T3YMBmuXK2XyoBIwfkHTRoZjSg5Bl21CfY9ZaiimRVoT3nrahbbu0SDb8w0HuAZyxOF7HcM03wZLms83h9p1ux3sAma6ZtxbasXEie2X33NJlXPNSL6tG9fbRRD2F8QqhtdDwCB9buda49jCOboz1TryJSjKLZmt97dsubNLZDba3b5jrubB8wbD76OUmFYo1oKDtgKMYcIvt0
+Provides: libmtquery.so.0 = set:ldIqEN9XTg5P1Tnt9n063KHW7wpx9zAtuTMZ7dgxadNZwy5yIOaIiLK53nb2hnux6QNLKAnX20n3EVMrR8bOBueD5TtTPWtBPhsaX3wExQOrTlMMP7GRjOU7wKjhpBgwV3viZIHWsIPsByRCiQOy7w2egwlfOv9keZ4hOV0cM084bJWVp9j9p1ux3sAm0MjBaFMNSGZ9zJvdWkMNgxk4qJEKCjssUwISjNUREgAcpaLwd6iVfvyJSjKLZmt99NnyvZLmk6E3I1EGwXc5tfco3YZci004gPeEzVh5SLem6
 Provides: libmtquery = 0.0.1-alt3.1.qa4