<86>Sep 18 10:45:25 userdel[23935]: delete user 'rooter'
<86>Sep 18 10:45:25 userdel[23935]: removed group 'rooter' owned by 'rooter'
<86>Sep 18 10:45:25 userdel[23935]: removed shadow group 'rooter' owned by 'rooter'
<86>Sep 18 10:45:25 groupadd[23943]: group added to /etc/group: name=rooter, GID=573
<86>Sep 18 10:45:25 groupadd[23943]: group added to /etc/gshadow: name=rooter
<86>Sep 18 10:45:25 groupadd[23943]: new group: name=rooter, GID=573
<86>Sep 18 10:45:25 useradd[23950]: new user: name=rooter, UID=573, GID=573, home=/root, shell=/bin/bash
<86>Sep 18 10:45:25 userdel[23957]: delete user 'builder'
<86>Sep 18 10:45:25 userdel[23957]: removed group 'builder' owned by 'builder'
<86>Sep 18 10:45:25 userdel[23957]: removed shadow group 'builder' owned by 'builder'
<86>Sep 18 10:45:25 groupadd[23962]: group added to /etc/group: name=builder, GID=574
<86>Sep 18 10:45:25 groupadd[23962]: group added to /etc/gshadow: name=builder
<86>Sep 18 10:45:25 groupadd[23962]: new group: name=builder, GID=574
<86>Sep 18 10:45:25 useradd[23966]: new user: name=builder, UID=574, GID=574, home=/usr/src, shell=/bin/bash
warning: Macro %K4build not found
warning: Macro %K4install not found
warning: Macro %_K4libdir not found
warning: Macro %_K4includedir not found
warning: Macro %_K4link not found
<13>Sep 18 10:45:32 rpmi: xorg-proto-devel-2019.1-alt1 sisyphus+232786.100.1.1 1561106722 installed
<13>Sep 18 10:45:32 rpmi: libjpeg-2:2.0.2-alt1 sisyphus+226996.100.1.1 1554902907 installed
<13>Sep 18 10:45:32 rpmi: libICE-1.0.9-alt1 1409902721 installed
<13>Sep 18 10:45:32 rpmi: libpng16-1.6.37-alt1 sisyphus+236677.100.2.1 1566917998 installed
<13>Sep 18 10:45:32 rpmi: libexpat-2.2.4-alt1 1503305345 installed
<13>Sep 18 10:45:32 rpmi: libSM-1.2.3-alt1 sisyphus+226734.100.2.1 1554586158 installed
<13>Sep 18 10:45:32 rpmi: libglvnd-7:1.1.1-alt1 sisyphus+224993.100.4.1 1552634542 installed
<13>Sep 18 10:45:32 rpmi: xml-utils-1:2.9.9.0.52.f824-alt1 sisyphus+229881.200.3.1 1558978749 installed
<13>Sep 18 10:45:32 rpmi: shared-mime-info-1.12-alt1 sisyphus+219597.100.2.2 1548057005 installed
<13>Sep 18 10:45:32 rpmi: libogg-1.3.3-alt1 sisyphus+221902.4000.4.1 1550598661 installed
<13>Sep 18 10:45:32 rpmi: libICE-devel-1.0.9-alt1 1409902721 installed
<13>Sep 18 10:45:32 rpmi: libSM-devel-1.2.3-alt1 sisyphus+226734.100.2.1 1554586158 installed
<86>Sep 18 10:45:32 groupadd[2364]: group added to /etc/group: name=utempter, GID=499
<86>Sep 18 10:45:32 groupadd[2364]: group added to /etc/gshadow: name=utempter
<86>Sep 18 10:45:32 groupadd[2364]: new group: name=utempter, GID=499
<13>Sep 18 10:45:32 rpmi: libutempter-1.1.6-alt2 1299636220 installed
<13>Sep 18 10:45:32 rpmi: libgif-4.1.6-alt3 1299634261 installed
<13>Sep 18 10:45:32 rpmi: libsqlite3-3.29.0-alt1 sisyphus+237138.100.1.1 1567626477 installed
<13>Sep 18 10:45:33 rpmi: libwebp7-1.0.3-alt1 sisyphus+234493.100.1.1 1563090160 installed
<13>Sep 18 10:45:33 rpmi: libXdmcp-1.1.3-alt1 sisyphus+225206.600.1.2 1552949353 installed
<13>Sep 18 10:45:33 rpmi: libXau-1.0.9-alt1 sisyphus+223149.200.2.1 1551268152 installed
<13>Sep 18 10:45:33 rpmi: libxcb-1.13.1-alt1 sisyphus+226527.100.2.2 1554593801 installed
<13>Sep 18 10:45:33 rpmi: libwayland-server-1.17.0-alt1 sisyphus+225894.100.1.1 1553872805 installed
<13>Sep 18 10:45:33 rpmi: zlib-devel-1.2.11-alt1 sisyphus+221902.6000.4.1 1550601058 installed
<13>Sep 18 10:45:33 rpmi: ilmbase12-common-2.2.0-alt1.1 1434452921 installed
<13>Sep 18 10:45:33 rpmi: libiex12-2.2.0-alt1.1 1434452921 installed
<13>Sep 18 10:45:33 rpmi: libhalf12-2.2.0-alt1.1 1434452921 installed
<13>Sep 18 10:45:34 rpmi: libicu64-1:6.4.2-alt1 sisyphus+227580.100.1.2 1555784329 installed
<13>Sep 18 10:45:34 rpmi: libgraphite2-1.3.13-alt2 sisyphus+226799.100.1.1 1554648241 installed
<13>Sep 18 10:45:34 rpmi: libharfbuzz-2.6.1-alt1 sisyphus+236500.100.1.1 1566557851 installed
<13>Sep 18 10:45:34 rpmi: libfreetype-2.10.1-alt1 sisyphus+237471.100.1.1 1568276356 installed
<13>Sep 18 10:45:34 rpmi: fontconfig-2.13.1-alt1 sisyphus+226691.100.2.2 1554598726 installed
Updating fonts cache: <29>Sep 18 10:45:35 fontconfig: Updating fonts cache: succeeded
[ DONE ]
<13>Sep 18 10:45:35 rpmi: libidn2-2.2.0-alt1 sisyphus+229970.100.1.1 1558625600 installed
<13>Sep 18 10:45:35 rpmi: qt4-common-4.8.7-alt19 sisyphus+236928.100.1.1 1567173933 installed
<13>Sep 18 10:45:35 rpmi: libqt4-core-4.8.7-alt19 sisyphus+236928.100.1.1 1567173933 installed
<13>Sep 18 10:45:35 rpmi: libqt4-sql-4.8.7-alt19 sisyphus+236928.100.1.1 1567173933 installed
<13>Sep 18 10:45:35 rpmi: libqt4-xml-4.8.7-alt19 sisyphus+236928.100.1.1 1567173933 installed
<13>Sep 18 10:45:35 rpmi: icon-theme-hicolor-0.17-alt1 1505715846 installed
<13>Sep 18 10:45:36 rpmi: menu-icons-default-0.2.0.20-alt1 1479213521 installed
<13>Sep 18 10:45:36 rpmi: altlinux-freedesktop-menu-icon-theme-default-0.0.26-alt1 1366231495 installed
<13>Sep 18 10:45:36 rpmi: libqt4-sql-sqlite-4.8.7-alt19 sisyphus+236928.100.1.1 1567173933 installed
<13>Sep 18 10:45:36 rpmi: automoc-0.9.88-alt1.qa1 1366273811 installed
<13>Sep 18 10:45:36 rpmi: libqt4-test-4.8.7-alt19 sisyphus+236928.100.1.1 1567173933 installed
<13>Sep 18 10:45:36 rpmi: libqt4-clucene-4.8.7-alt19 sisyphus+236928.100.1.1 1567173933 installed
<13>Sep 18 10:45:36 rpmi: rpm-macros-qt4-4.8.7-alt19 sisyphus+236928.100.1.1 1567173782 installed
<13>Sep 18 10:45:36 rpmi: libharfbuzz-icu-2.6.1-alt1 sisyphus+236500.100.1.1 1566557851 installed
<13>Sep 18 10:45:36 rpmi: libgraphite2-devel-1.3.13-alt2 sisyphus+226799.100.1.1 1554648241 installed
<13>Sep 18 10:45:36 rpmi: icu-utils-1:6.4.2-alt1 sisyphus+227580.100.1.2 1555784329 installed
<13>Sep 18 10:45:36 rpmi: libicu-devel-1:6.4.2-alt1 sisyphus+227580.100.1.2 1555784329 installed
<13>Sep 18 10:45:36 rpmi: libilmthread12-2.2.0-alt1.1 1434452921 installed
<13>Sep 18 10:45:36 rpmi: libpng-devel-1.6.37-alt1 sisyphus+236677.100.2.1 1566917998 installed
<13>Sep 18 10:45:39 rpmi: libxcb-devel-1.13.1-alt1 sisyphus+226527.100.2.2 1554593801 installed
<13>Sep 18 10:45:39 rpmi: libXau-devel-1.0.9-alt1 sisyphus+223149.200.2.1 1551268152 installed
<13>Sep 18 10:45:39 rpmi: libXdmcp-devel-1.1.3-alt1 sisyphus+225206.600.1.2 1552949353 installed
<13>Sep 18 10:45:39 rpmi: libgif-devel-4.1.6-alt3 1299634261 installed
<13>Sep 18 10:45:39 rpmi: libutempter-devel-1.1.6-alt2 1299636220 installed
<13>Sep 18 10:45:39 rpmi: libflac8-1.3.2-alt2 sisyphus+220898.4400.11.1 1551973321 installed
<13>Sep 18 10:45:39 rpmi: libvorbis-1.3.6-alt2 sisyphus+220072.200.2.2 1548744475 installed
<13>Sep 18 10:45:39 rpmi: rpm-build-gir-0.7.3-alt2 sisyphus+234037.40.2.1 1562495133 installed
<13>Sep 18 10:45:39 rpmi: libOpenGL-7:1.1.1-alt1 sisyphus+224993.100.4.1 1552634542 installed
<13>Sep 18 10:45:39 rpmi: libGLES-7:1.1.1-alt1 sisyphus+224993.100.4.1 1552634542 installed
<13>Sep 18 10:45:39 rpmi: libjasper-2.0.16-alt1 sisyphus+231386.100.1.1 1559568070 installed
<13>Sep 18 10:45:39 rpmi: libhunspell-1.7.0-alt1 sisyphus+226731.100.2.1 1554585904 installed
<13>Sep 18 10:45:39 rpmi: libenchant-1.6.0-alt3.qa1 1460409853 installed
<13>Sep 18 10:45:39 rpmi: openexr22-common-2.2.0-alt3 sisyphus+221267.100.1.2 1549944972 installed
<13>Sep 18 10:45:39 rpmi: libilmimf22-2.2.0-alt3 sisyphus+221267.100.1.2 1549944972 installed
<13>Sep 18 10:45:39 rpmi: su-0.60-alt35 1484567251 installed
<13>Sep 18 10:45:39 rpmi: url_handler-0.3.1-alt1 1290564262 installed
<13>Sep 18 10:45:39 rpmi: desktop-file-utils-0.23-alt2 sisyphus+226879.100.1.1 1554744356 installed
<13>Sep 18 10:45:39 rpmi: sgml-common-0.6.3-alt15 1423664786 installed
<13>Sep 18 10:45:39 rpmi: docbook-dtds-4.5-alt1 1223476557 installed
<13>Sep 18 10:45:39 rpmi: docbook-style-xsl-1.79.1-alt4 sisyphus+232871.100.1.1 1561238010 installed
<13>Sep 18 10:45:39 rpmi: shared-desktop-ontologies-1:0.11.0-alt1 1378390330 installed
<13>Sep 18 10:45:39 rpmi: shared-desktop-ontologies-devel-1:0.11.0-alt1 1378390330 installed
<13>Sep 18 10:45:39 rpmi: libpcre16-8.43-alt1 sisyphus+222771.100.1.1 1551029673 installed
<13>Sep 18 10:45:39 rpmi: pcretest-8.43-alt1 sisyphus+222771.100.1.1 1551029673 installed
<13>Sep 18 10:45:39 rpmi: libpcre-devel-8.43-alt1 sisyphus+222771.100.1.1 1551029673 installed
<13>Sep 18 10:45:40 rpmi: libalsa-1:1.1.9-alt2 sisyphus+229323.100.1.1 1557826759 installed
<13>Sep 18 10:45:40 rpmi: libltdl7-2.4.6-alt1 sisyphus+226971.100.2.1 1554906368 installed
<13>Sep 18 10:45:40 rpmi: libunixODBC2-2.3.7-alt1 sisyphus+228027.100.1.1 1556027338 installed
<13>Sep 18 10:45:40 rpmi: libunixODBC-devel-compat-2.3.7-alt1 sisyphus+228027.100.1.1 1556027338 installed
<13>Sep 18 10:45:40 rpmi: libunixODBC-devel-2.3.7-alt1 sisyphus+228027.100.1.1 1556027338 installed
<13>Sep 18 10:45:40 rpmi: libgsm-1.0.17-alt1 1523356165 installed
<13>Sep 18 10:45:40 rpmi: libsndfile-1.0.28-alt2 sisyphus.212728.100 1536333068 installed
<13>Sep 18 10:45:40 rpmi: libasyncns-0.8-alt2.qa1 1365949820 installed
<13>Sep 18 10:45:40 rpmi: libjbig-2.1-alt1 1401380926 installed
<13>Sep 18 10:45:40 rpmi: libtiff5-4.0.10.0.93.91480d3d-alt1 sisyphus+231496.100.1.1 1559668979 installed
<13>Sep 18 10:45:40 rpmi: liblcms2-2.9-alt1 1516411892 installed
<13>Sep 18 10:45:40 rpmi: libmng-2.0.3-alt2 sisyphus+222619.100.1.1 1550943853 installed
<13>Sep 18 10:45:40 rpmi: liblz4-1:1.9.1-alt1 sisyphus+228057.100.1.1 1556059318 installed
<13>Sep 18 10:45:40 rpmi: libgpg-error-1.36-alt1 sisyphus+225621.300.1.1 1553521082 installed
<13>Sep 18 10:45:40 rpmi: libgcrypt20-1.8.5-alt1 sisyphus+236872.100.1.1 1567111980 installed
<13>Sep 18 10:45:40 rpmi: libsystemd-1:243-alt1 sisyphus+237134.300.3.1 1567642540 installed
<13>Sep 18 10:45:40 rpmi: libdbus-1.12.12-alt2 sisyphus+221234.100.1.2 1549918047 installed
<13>Sep 18 10:45:40 rpmi: libqt4-dbus-4.8.7-alt19 sisyphus+236928.100.1.1 1567173933 installed
<13>Sep 18 10:45:40 rpmi: libqt4-script-4.8.7-alt19 sisyphus+236928.100.1.1 1567173933 installed
<13>Sep 18 10:45:40 rpmi: libstrigi-0.7.8-alt8 sisyphus+235858.3600.15.1 1565633713 installed
<13>Sep 18 10:45:40 rpmi: libxslt-1.1.33-alt2 sisyphus+237506.100.1.1 1568316630 installed
<13>Sep 18 10:45:40 rpmi: libstrigi-devel-0.7.8-alt8 sisyphus+235858.3600.15.1 1565633713 installed
<13>Sep 18 10:45:40 rpmi: libdbus-devel-1.12.12-alt2 sisyphus+221234.100.1.2 1549918047 installed
<13>Sep 18 10:45:40 rpmi: libpulseaudio-13.0-alt1 sisyphus+237619.100.1.1 1568646721 installed
<13>Sep 18 10:45:40 rpmi: libxshmfence-1.3-alt1 sisyphus+223149.1000.2.1 1551268571 installed
<13>Sep 18 10:45:41 rpmi: libX11-locales-3:1.6.8-alt1 sisyphus+232786.200.1.1 1561106874 installed
<13>Sep 18 10:45:41 rpmi: libX11-3:1.6.8-alt1 sisyphus+232786.200.1.1 1561106876 installed
<13>Sep 18 10:45:41 rpmi: libXext-1.3.4-alt1 sisyphus+225206.700.1.2 1552949429 installed
<13>Sep 18 10:45:41 rpmi: libX11-devel-3:1.6.8-alt1 sisyphus+232786.200.1.1 1561106876 installed
<13>Sep 18 10:45:41 rpmi: libXrender-0.9.8-alt1 1371312112 installed
<13>Sep 18 10:45:41 rpmi: libXfixes-5.0.3-alt1 sisyphus+226736.100.2.2 1554614841 installed
<13>Sep 18 10:45:41 rpmi: libXfixes-devel-5.0.3-alt1 sisyphus+226736.100.2.2 1554614841 installed
<13>Sep 18 10:45:41 rpmi: libXrender-devel-0.9.8-alt1 1371312112 installed
<13>Sep 18 10:45:41 rpmi: libXext-devel-1.3.4-alt1 sisyphus+225206.700.1.2 1552949429 installed
<13>Sep 18 10:45:41 rpmi: libXcursor-1.2.0-alt1 sisyphus+225206.400.1.2 1552949218 installed
<13>Sep 18 10:45:41 rpmi: libXt-1.1.4-alt1 1369984722 installed
<13>Sep 18 10:45:41 rpmi: libXrandr-1.5.2-alt1 sisyphus+225206.1300.1.2 1552949710 installed
<13>Sep 18 10:45:41 rpmi: libXxf86vm-1.1.4-alt2 1527672187 installed
<13>Sep 18 10:45:41 rpmi: libXi-1.7.10-alt1 sisyphus+232786.300.1.1 1561106978 installed
<13>Sep 18 10:45:41 rpmi: libXi-devel-1.7.10-alt1 sisyphus+232786.300.1.1 1561106978 installed
<13>Sep 18 10:45:41 rpmi: libXinerama-1.1.4-alt1 sisyphus+223149.300.2.1 1551268216 installed
<13>Sep 18 10:45:41 rpmi: libqt4-gui-4.8.7-alt19 sisyphus+236928.100.1.1 1567173933 installed
<13>Sep 18 10:45:42 rpmi: libqt4-designer-4.8.7-alt19 sisyphus+236928.100.1.1 1567173933 installed
<13>Sep 18 10:45:42 rpmi: libphonon-4.8.3-alt1 1418134069 installed
<13>Sep 18 10:45:42 rpmi: libqt4-uitools-4.8.7-alt19 sisyphus+236928.100.1.1 1567173933 installed
<13>Sep 18 10:45:42 rpmi: libqt4-svg-4.8.7-alt19 sisyphus+236928.100.1.1 1567173933 installed
<13>Sep 18 10:45:42 rpmi: libXtst-1.2.2-alt1 1369984893 installed
<13>Sep 18 10:45:42 rpmi: libXtst-devel-1.2.2-alt1 1369984893 installed
<13>Sep 18 10:45:42 rpmi: libXScrnSaver-1.2.3-alt1 sisyphus+223149.500.2.1 1551268358 installed
<13>Sep 18 10:45:42 rpmi: libXdamage-1.1.5-alt1 sisyphus+225206.500.1.2 1552949286 installed
<13>Sep 18 10:45:42 rpmi: libXdamage-devel-1.1.5-alt1 sisyphus+225206.500.1.2 1552949286 installed
<13>Sep 18 10:45:42 rpmi: libXScrnSaver-devel-1.2.3-alt1 sisyphus+223149.500.2.1 1551268358 installed
<13>Sep 18 10:45:42 rpmi: libphononexperimental-4.8.3-alt1 1418134069 installed
<13>Sep 18 10:45:42 rpmi: libqt4-scripttools-4.8.7-alt19 sisyphus+236928.100.1.1 1567173933 installed
<13>Sep 18 10:45:42 rpmi: libqt4-multimedia-4.8.7-alt19 sisyphus+236928.100.1.1 1567173933 installed
<13>Sep 18 10:45:42 rpmi: libdbusmenu-qt2-0.9.3-alt0.2 1463760662 installed
<13>Sep 18 10:45:42 rpmi: libXinerama-devel-1.1.4-alt1 sisyphus+223149.300.2.1 1551268216 installed
<13>Sep 18 10:45:42 rpmi: libXxf86vm-devel-1.1.4-alt2 1527672187 installed
<13>Sep 18 10:45:42 rpmi: libXrandr-devel-1.5.2-alt1 sisyphus+225206.1300.1.2 1552949710 installed
<13>Sep 18 10:45:42 rpmi: libXpm-3.5.12-alt1 sisyphus+223149.400.2.1 1551268289 installed
<13>Sep 18 10:45:42 rpmi: libXpm-devel-3.5.12-alt1 sisyphus+223149.400.2.1 1551268289 installed
<13>Sep 18 10:45:42 rpmi: libXt-devel-1.1.4-alt1 1369984722 installed
<13>Sep 18 10:45:42 rpmi: libXmu-1.1.3-alt1 sisyphus+225206.1200.1.2 1552949641 installed
<13>Sep 18 10:45:42 rpmi: xset-1.2.4-alt1 sisyphus.213358.100 1537438594 installed
<13>Sep 18 10:45:42 rpmi: libXcursor-devel-1.2.0-alt1 sisyphus+225206.400.1.2 1552949218 installed
<13>Sep 18 10:45:42 rpmi: libXft-2.3.3-alt1 sisyphus+225206.1000.3.2 1552987708 installed
<13>Sep 18 10:45:42 rpmi: libXv-1.0.11-alt1 1527685499 installed
<13>Sep 18 10:45:42 rpmi: libXv-devel-1.0.11-alt1 1527685499 installed
<13>Sep 18 10:45:42 rpmi: libXcomposite-0.4.5-alt1 sisyphus+225206.300.1.2 1552949137 installed
<13>Sep 18 10:45:42 rpmi: libXcomposite-devel-0.4.5-alt1 sisyphus+225206.300.1.2 1552949137 installed
<13>Sep 18 10:45:42 rpmi: libxkbfile-1.1.0-alt1 sisyphus+225206.1100.1.2 1552949569 installed
<13>Sep 18 10:45:42 rpmi: libxkbfile-devel-1.1.0-alt1 sisyphus+225206.1100.1.2 1552949569 installed
<13>Sep 18 10:45:42 rpmi: xprop-1.2.4-alt1 sisyphus+225764.100.1.1 1553680703 installed
<13>Sep 18 10:45:42 rpmi: xdg-utils-1.1.3-alt6 sisyphus+233067.100.1.1 1561332512 installed
<13>Sep 18 10:45:42 rpmi: libwayland-client-1.17.0-alt1 sisyphus+225894.100.1.1 1553872805 installed
<13>Sep 18 10:45:42 rpmi: libpciaccess-1:0.16-alt1 sisyphus+234814.100.1.1 1563438291 installed
<13>Sep 18 10:45:42 rpmi: libdrm-1:2.4.99-alt1 sisyphus+234110.100.1.1 1562593653 installed
<13>Sep 18 10:45:42 rpmi: libGLX-mesa-4:19.1.6-alt1 sisyphus+237115.100.1.1 1567602891 installed
<13>Sep 18 10:45:42 rpmi: libGLX-7:1.1.1-alt1 sisyphus+224993.100.4.1 1552634542 installed
<13>Sep 18 10:45:42 rpmi: libGL-7:1.1.1-alt1 sisyphus+224993.100.4.1 1552634542 installed
<13>Sep 18 10:45:42 rpmi: libqt4-opengl-4.8.7-alt19 sisyphus+236928.100.1.1 1567173933 installed
<13>Sep 18 10:45:42 rpmi: libGLU-4:9.0.0-alt1 1347643784 installed
<13>Sep 18 10:45:42 rpmi: libgbm-4:19.1.6-alt1 sisyphus+237115.100.1.1 1567602891 installed
<13>Sep 18 10:45:42 rpmi: libEGL-mesa-4:19.1.6-alt1 sisyphus+237115.100.1.1 1567602891 installed
<13>Sep 18 10:45:42 rpmi: libEGL-7:1.1.1-alt1 sisyphus+224993.100.4.1 1552634542 installed
<13>Sep 18 10:45:42 rpmi: libglvnd-devel-7:1.1.1-alt1 sisyphus+224993.100.4.1 1552634542 installed
<13>Sep 18 10:45:42 rpmi: libEGL-devel-4:19.1.6-alt1 sisyphus+237115.100.1.1 1567602891 installed
<13>Sep 18 10:45:42 rpmi: libGL-devel-4:19.1.6-alt1 sisyphus+237115.100.1.1 1567602891 installed
<13>Sep 18 10:45:42 rpmi: libGLU-devel-4:9.0.0-alt1 1347643784 installed
<13>Sep 18 10:45:42 rpmi: rpm-macros-kde-common-devel-14.12.1-alt1 1422279175 installed
<13>Sep 18 10:45:42 rpmi: strace-5.2-alt1 sisyphus+234303.100.1.1 1562937959 installed
<13>Sep 18 10:45:42 rpmi: kde-common-15.12.1-alt1 1453450783 installed
<13>Sep 18 10:45:43 rpmi: gsettings-desktop-schemas-data-3.32.0-alt1 sisyphus+225059.300.3.2 1552843929 installed
<13>Sep 18 10:45:43 rpmi: libgio-2.60.7-alt1 sisyphus+237086.100.1.1 1567540868 installed
<13>Sep 18 10:45:43 rpmi: gsettings-desktop-schemas-3.32.0-alt1 sisyphus+225059.300.3.2 1552843980 installed
<13>Sep 18 10:45:43 rpmi: libpolkit-0.116-alt1 sisyphus+228976.400.4.1 1557128967 installed
<13>Sep 18 10:45:43 rpmi: libpolkit-qt-core-1-0.112.0-alt1 1407931994 installed
<13>Sep 18 10:45:43 rpmi: gcc-c++-common-1.4.23-alt1 sisyphus+221902.2500.4.1 1550596716 installed
<13>Sep 18 10:45:43 rpmi: libstdc++8-devel-8.3.1-alt5 sisyphus+235477.100.1.1 1565022025 installed
<13>Sep 18 10:45:44 rpmi: gcc8-c++-8.3.1-alt5 sisyphus+235477.100.1.1 1565022025 installed
<13>Sep 18 10:45:44 rpmi: libgdbm-1.8.3-alt10 1454943334 installed
<13>Sep 18 10:45:44 rpmi: ed-1:0.2-alt10 1449768440 installed
<13>Sep 18 10:45:44 rpmi: rpm-utils-0.10.2-alt1 sisyphus+232744.200.2.1 1561066431 installed
<13>Sep 18 10:45:44 rpmi: kde-common-devel-14.12.1-alt1 1422279175 installed
<13>Sep 18 10:45:44 rpmi: rpm-macros-cmake-3.13.4-alt3 sisyphus+229386.100.1.1 1557907647 installed
<13>Sep 18 10:45:45 rpmi: cmake-modules-3.13.4-alt3 sisyphus+229386.100.1.1 1557907621 installed
<13>Sep 18 10:45:45 rpmi: libuv-1.28.0-alt1 sisyphus+231674.100.1.1 1559848899 installed
<13>Sep 18 10:45:45 rpmi: librhash-1.3.5-alt2 1505156279 installed
<13>Sep 18 10:45:45 rpmi: libjsoncpp19-1.8.4-alt4 sisyphus+232904.100.1.1 1561247386 installed
<13>Sep 18 10:45:45 rpmi: publicsuffix-list-dafsa-20190823-alt1 sisyphus+236630.100.1.1 1566830156 installed
<13>Sep 18 10:45:45 rpmi: libpsl-0.21.0-alt2 sisyphus+237083.100.1.1 1567531657 installed
<13>Sep 18 10:45:45 rpmi: libnghttp2-1.39.2-alt1 sisyphus+236978.100.1.1 1567325198 installed
<13>Sep 18 10:45:45 rpmi: libverto-0.3.0-alt1_7 sisyphus+225932.100.1.1 1553994919 installed
<13>Sep 18 10:45:45 rpmi: libkeyutils-1.6-alt2 sisyphus+226520.100.2.1 1554512089 installed
<13>Sep 18 10:45:45 rpmi: libcom_err-1.44.6-alt1 sisyphus+224154.100.1.1 1552091678 installed
<13>Sep 18 10:45:45 rpmi: libbrotlicommon-1.0.7-alt1 sisyphus+226738.100.2.1 1554554568 installed
<13>Sep 18 10:45:45 rpmi: libbrotlidec-1.0.7-alt1 sisyphus+226738.100.2.1 1554554568 installed
<13>Sep 18 10:45:45 rpmi: libnettle7-3.5.1-alt1 sisyphus+235265.40.6.1 1566223065 installed
<13>Sep 18 10:45:45 rpmi: libarchive13-3.4.0-alt1 sisyphus+235265.640.9.1 1566482857 installed
<13>Sep 18 10:45:45 rpmi: libp11-kit-0.23.15-alt1 sisyphus+226408.100.2.1 1554288204 installed
<13>Sep 18 10:45:45 rpmi: libtasn1-4.14-alt1 sisyphus+235791.100.1.1 1565282372 installed
<13>Sep 18 10:45:45 rpmi: bzlib-devel-1:1.0.6-alt6 sisyphus+224341.100.1.1 1552254552 installed
<13>Sep 18 10:45:45 rpmi: altlinux-mime-defaults-0.435-alt1 sisyphus+233225.100.1.1 1561540568 installed
<13>Sep 18 10:45:45 rpmi: wm-common-freedesktop-1.3-alt1 1303402115 installed
<13>Sep 18 10:45:45 rpmi: altlinux-freedesktop-menu-common-0.67-alt1 sisyphus+232521.100.1.2 1560890506 installed
<13>Sep 18 10:45:45 rpmi: rpm-macros-alternatives-0.5.1-alt1 sisyphus+226946.100.1.1 1554830426 installed
<13>Sep 18 10:45:45 rpmi: alternatives-0.5.1-alt1 sisyphus+226946.100.1.1 1554830426 installed
<13>Sep 18 10:45:45 rpmi: ca-certificates-2019.09.10-alt1 sisyphus+237323.300.1.1 1568103476 installed
<13>Sep 18 10:45:45 rpmi: ca-trust-0.1.2-alt1 sisyphus+233348.100.1.1 1561653823 installed
<13>Sep 18 10:45:45 rpmi: p11-kit-trust-0.23.15-alt1 sisyphus+226408.100.2.1 1554288204 installed
<13>Sep 18 10:45:45 rpmi: libcrypto1.1-1.1.1b-alt2 sisyphus+227249.100.2.1 1555667822 installed
<13>Sep 18 10:45:45 rpmi: libssl1.1-1.1.1b-alt2 sisyphus+227249.100.2.1 1555667822 installed
<13>Sep 18 10:45:45 rpmi: libqt4-network-4.8.7-alt19 sisyphus+236928.100.1.1 1567173933 installed
<86>Sep 18 10:45:45 groupadd[14021]: group added to /etc/group: name=_keytab, GID=498
<86>Sep 18 10:45:45 groupadd[14021]: group added to /etc/gshadow: name=_keytab
<86>Sep 18 10:45:45 groupadd[14021]: new group: name=_keytab, GID=498
<13>Sep 18 10:45:45 rpmi: libkrb5-1.16.3-alt1 sisyphus+223678.100.1.1 1551746516 installed
<13>Sep 18 10:45:45 rpmi: libpython3-3.7.4-alt1 sisyphus+236519.100.1.1 1566575438 installed
<13>Sep 18 10:45:45 rpmi: python3-3.7.4-alt1 sisyphus+236519.100.1.1 1566575438 installed
<13>Sep 18 10:45:46 rpmi: python3-base-3.7.4-alt1 sisyphus+236519.100.1.1 1566575438 installed
<13>Sep 18 10:45:47 rpmi: libqt4-qt3support-4.8.7-alt19 sisyphus+236928.100.1.1 1567173933 installed
<13>Sep 18 10:45:47 rpmi: glib2-devel-2.60.7-alt1 sisyphus+237086.100.1.1 1567540868 installed
<13>Sep 18 10:45:47 rpmi: libharfbuzz-devel-2.6.1-alt1 sisyphus+236500.100.1.1 1566557851 installed
<13>Sep 18 10:45:47 rpmi: libfreetype-devel-2.10.1-alt1 sisyphus+237471.100.1.1 1568276356 installed
<13>Sep 18 10:45:47 rpmi: fontconfig-devel-2.13.1-alt1 sisyphus+226691.100.2.2 1554598726 installed
<13>Sep 18 10:45:47 rpmi: libXft-devel-2.3.3-alt1 sisyphus+225206.1000.3.2 1552987708 installed
<86>Sep 18 10:45:47 groupadd[17367]: group added to /etc/group: name=sasl, GID=497
<86>Sep 18 10:45:47 groupadd[17367]: group added to /etc/gshadow: name=sasl
<86>Sep 18 10:45:47 groupadd[17367]: new group: name=sasl, GID=497
<13>Sep 18 10:45:47 rpmi: libsasl2-3-2.1.27-alt2 sisyphus+228101.100.1.1 1556139863 installed
<13>Sep 18 10:45:47 rpmi: libldap-2.4.48-alt1 sisyphus+236705.100.1.1 1566947839 installed
<13>Sep 18 10:45:47 rpmi: libcurl-7.66.0-alt1 sisyphus+237384.100.1.1 1568183544 installed
<13>Sep 18 10:45:48 rpmi: cmake-3.13.4-alt3 sisyphus+229386.100.1.1 1557907647 installed
<13>Sep 18 10:45:48 rpmi: libqt4-xmlpatterns-4.8.7-alt19 sisyphus+236928.100.1.1 1567173933 installed
<13>Sep 18 10:45:48 rpmi: libqt4-declarative-4.8.7-alt19 sisyphus+236928.100.1.1 1567173933 installed
<13>Sep 18 10:45:49 rpmi: libqt4-webkit-1:2.3.4-alt7 sisyphus+233170.100.1.1 1561476979 installed
<13>Sep 18 10:45:49 rpmi: libqt4-help-4.8.7-alt19 sisyphus+236928.100.1.1 1567173933 installed
<13>Sep 18 10:45:49 rpmi: libattica0.4-0.4.2-alt1 1375339023 installed
<13>Sep 18 10:45:49 rpmi: libssl-devel-1.1.1b-alt2 sisyphus+227249.100.2.1 1555667822 installed
<13>Sep 18 10:45:49 rpmi: phonon-devel-4.8.3-alt1 1418134069 installed
<13>Sep 18 10:45:49 rpmi: libqt4-webkit-devel-1:2.3.4-alt7 sisyphus+233170.100.1.1 1561476979 installed
<13>Sep 18 10:45:50 rpmi: libqt4-devel-4.8.7-alt19 sisyphus+236928.100.1.1 1567173933 installed
<13>Sep 18 10:45:50 rpmi: libqca2-2.2.0-alt1.1 sisyphus+232230.100.1.1 1560638445 installed
<13>Sep 18 10:45:50 rpmi: altlinux-freedesktop-menu-shallow-menu-0.67-alt1 sisyphus+232521.100.1.2 1560890506 installed
<13>Sep 18 10:45:50 rpmi: altlinux-freedesktop-menu-generic-0.67-alt1 sisyphus+232521.100.1.2 1560890506 installed
<13>Sep 18 10:45:50 rpmi: altlinux-freedesktop-menu-kde4-0.67-alt1 sisyphus+232521.100.1.2 1560890506 installed
<13>Sep 18 10:45:52 rpmi: kde4libs-4.14.38-alt5 sisyphus+235762.100.1.1 1565257280 installed
<13>Sep 18 10:45:52 rpmi: kde4libs-devel-4.14.38-alt5 sisyphus+235762.100.1.1 1565257280 installed
<13>Sep 18 10:45:52 rpmi: gcc-c++-8-alt2 sisyphus+235723.100.1.1 1565191484 installed
Building target platforms: i586
Building for target i586
Wrote: /usr/src/in/nosrpm/libkomparediff2-4.14.2-alt1.nosrc.rpm
Installing libkomparediff2-4.14.2-alt1.src.rpm
Building target platforms: i586
Building for target i586
Executing(%prep): /bin/sh -e /usr/src/tmp/rpm-tmp.33556
+ umask 022
+ /bin/mkdir -p /usr/src/RPM/BUILD
+ cd /usr/src/RPM/BUILD
+ cd /usr/src/RPM/BUILD
+ rm -rf libkomparediff2-4.14.2
+ echo 'Source #0 (libkomparediff2-4.14.2.tar):'
Source #0 (libkomparediff2-4.14.2.tar):
+ /bin/tar -xf /usr/src/RPM/SOURCES/libkomparediff2-4.14.2.tar
+ cd libkomparediff2-4.14.2
+ /bin/chmod -c -Rf u+rwX,go-w .
+ exit 0
Executing(%build): /bin/sh -e /usr/src/tmp/rpm-tmp.33556
+ umask 022
+ /bin/mkdir -p /usr/src/RPM/BUILD
+ cd /usr/src/RPM/BUILD
+ cd libkomparediff2-4.14.2
+ __kde4_build -DKDE4_BUILD_TESTS:BOOL=OFF
+ mkdir -p BUILD-i586-alt-linux
+ __kde4_cmake -DKDE4_BUILD_TESTS:BOOL=OFF
+ export PATH=/usr/lib/kde4/bin:/usr/src/bin:/bin:/usr/bin:/usr/X11R6/bin:/usr/games
+ PATH=/usr/lib/kde4/bin:/usr/src/bin:/bin:/usr/bin:/usr/X11R6/bin:/usr/games
+ pushd BUILD-i586-alt-linux
~/RPM/BUILD/libkomparediff2-4.14.2/BUILD-i586-alt-linux ~/RPM/BUILD/libkomparediff2-4.14.2
+ cmake .. -DCMAKE_SKIP_RPATH:BOOL=yes -DCMAKE_BUILD_TYPE=Release '-DCMAKE_C_FLAGS:STRING=-pipe -frecord-gcc-switches -Wall -g -O2 -march=i586 -mtune=generic' '-DCMAKE_CXX_FLAGS:STRING=-pipe -frecord-gcc-switches -Wall -g -O2 -march=i586 -mtune=generic' '-DCMAKE_EXE_LINKER_FLAGS:STRING=-L/usr/lib/kde4link -L/usr/lib/kde4/devel' '-DCMAKE_MODULE_LINKER_FLAGS:STRING=-L/usr/lib/kde4link -L/usr/lib/kde4/devel' '-DCMAKE_SHARED_LINKER_FLAGS:STRING=-L/usr/lib/kde4link -L/usr/lib/kde4/devel' '-DCMAKE_LIBRARY_PATH:LIST=/usr/lib/kde4/devel;/usr/lib/kde4link;/usr/lib;/lib' -DLIB_DESTINATION=lib -DLIB_SUFFIX= -DCMAKE_INSTALL_PREFIX=/usr -DBIN_INSTALL_DIR=/usr/bin -DSBIN_INSTALL_DIR=/usr/sbin -DICON_INSTALL_DIR=/usr/share/icons -DXDG_APPS_INSTALL_DIR=/usr/share/applications/kde4 -DXDG_DIRECTORY_INSTALL_DIR=/usr/share/desktop-directories -DLIB_INSTALL_DIR=/usr/lib -DLIBEXEC_INSTALL_DIR=/usr/lib/kde4/libexec -DINCLUDE_INSTALL_DIR=/usr/include/kde4 -DKDE4_INCLUDE_INSTALL_DIR=/usr/include/kde4 -DSYSCONF_INSTALL_DIR=/etc -DDATA_INSTALL_DIR=/usr/share/kde4/apps -DCONFIG_INSTALL_DIR=/usr/share/kde4/config -DKCFG_INSTALL_DIR=/usr/share/kde4/config.kcfg -DHTML_INSTALL_DIR=/usr/share/kde4/doc/HTML -DAPPLNK_INSTALL_DIR=/usr/share/applnk -DLOCALE_INSTALL_DIR=/usr/share/kde4/locale -DSERVICES_INSTALL_DIR=/usr/share/kde4/services -DSERVICETYPES_INSTALL_DIR=/usr/share/kde4/servicetypes -DKCONF_UPDATE_INSTALL_DIR=/usr/share/kde4/apps/kconf_update -DXDG_MIME_INSTALL_DIR=/usr/share/mime/packages -DAUTOSTART_INSTALL_DIR=/usr/share/kde4/autostart -DSOUND_INSTALL_DIR=/usr/share/kde4/sounds -DTEMPLATES_INSTALL_DIR=/usr/share/kde4/templates -DWALLPAPER_INSTALL_DIR=/usr/share/wallpapers -DDBUS_INTERFACES_INSTALL_DIR=/usr/share/dbus-1/interfaces -DDBUS_SERVICES_INSTALL_DIR=/usr/share/dbus-1/services -DDBUS_SYSTEM_SERVICES_INSTALL_DIR=/usr/share/dbus-1/system-services -DMAN_INSTALL_DIR=/usr/share/man -DINFO_INSTALL_DIR=/usr/share/info -DINSTALL_PYTHON_FILES_IN_PYTHON_PREFIX:BOOL=yes -DKDE4_BUILD_TESTS:BOOL=OFF
-- The C compiler identification is GNU 8.3.1
-- The CXX compiler identification is GNU 8.3.1
-- Check for working C compiler: /usr/bin/cc
-- Check for working C compiler: /usr/bin/cc -- works
-- Detecting C compiler ABI info
-- Detecting C compiler ABI info - done
-- Detecting C compile features
-- Detecting C compile features - done
-- Check for working CXX compiler: /usr/bin/c++
-- Check for working CXX compiler: /usr/bin/c++ -- works
-- Detecting CXX compiler ABI info
-- Detecting CXX compiler ABI info - done
-- Detecting CXX compile features
-- Detecting CXX compile features - done
-- Looking for Q_WS_X11
-- Looking for Q_WS_X11 - found
-- Looking for Q_WS_WIN
-- Looking for Q_WS_WIN - not found
-- Looking for Q_WS_QWS
-- Looking for Q_WS_QWS - not found
-- Looking for Q_WS_MAC
-- Looking for Q_WS_MAC - not found
-- Found Qt-Version 4.8.7 (using /usr/bin/qmake-qt4)
-- Looking for XOpenDisplay in /usr/lib/libX11.so;/usr/lib/libXext.so;/usr/lib/libXft.so;/usr/lib/libXau.so;/usr/lib/libXdmcp.so;/usr/lib/libXpm.so
-- Looking for XOpenDisplay in /usr/lib/libX11.so;/usr/lib/libXext.so;/usr/lib/libXft.so;/usr/lib/libXau.so;/usr/lib/libXdmcp.so;/usr/lib/libXpm.so - found
-- Looking for gethostbyname
-- Looking for gethostbyname - found
-- Looking for connect
-- Looking for connect - found
-- Looking for remove
-- Looking for remove - found
-- Looking for shmat
-- Looking for shmat - found
-- Looking for IceConnectionNumber in ICE
-- Looking for IceConnectionNumber in ICE - found
-- Found X11: /usr/lib/libX11.so
-- Looking for pthread.h
-- Looking for pthread.h - found
-- Looking for pthread_create
-- Looking for pthread_create - not found
-- Looking for pthread_create in pthreads
-- Looking for pthread_create in pthreads - not found
-- Looking for pthread_create in pthread
-- Looking for pthread_create in pthread - found
-- Found Threads: TRUE  
-- Found OpenSSL: /usr/lib/libcrypto.so (found version "1.1.1b")  
-- Looking for _POSIX_TIMERS
-- Looking for _POSIX_TIMERS - found
-- Found Automoc4: /usr/bin/automoc4  
-- Found Perl: /usr/bin/perl (found version "5.28.2") 
-- Found Phonon: /usr/include/kde4 (Required is at least version "4.3.80") 
-- Performing Test _OFFT_IS_64BIT
-- Performing Test _OFFT_IS_64BIT - Failed
-- Performing Test HAVE_FPIE_SUPPORT
-- Performing Test HAVE_FPIE_SUPPORT - Success
-- Performing Test __KDE_HAVE_W_OVERLOADED_VIRTUAL
-- Performing Test __KDE_HAVE_W_OVERLOADED_VIRTUAL - Success
-- Performing Test __KDE_HAVE_GCC_VISIBILITY
-- Performing Test __KDE_HAVE_GCC_VISIBILITY - Success
-- Found KDE 4.12 include dir: /usr/include/kde4
-- Found KDE 4.12 library dir: /usr/lib/kde4/devel
-- Found the KDE4 kconfig_compiler4 preprocessor: /usr/lib/kde4/bin/kconfig_compiler4
-- Found automoc4: /usr/bin/automoc4
CMake Warning (dev) at /usr/lib/automoc4/Automoc4Config.cmake:179 (get_directory_property):
  Policy CMP0059 is not set: Do not treat DEFINITIONS as a built-in directory
  property.  Run "cmake --help-policy CMP0059" for policy details.  Use the
  cmake_policy command to set the policy and suppress this warning.
Call Stack (most recent call first):
  /usr/lib/automoc4/Automoc4Config.cmake:243 (_add_automoc4_target)
  /usr/share/kde4/apps/cmake/modules/KDE4Macros.cmake:1081 (_automoc4_kde4_pre_target_handling)
  CMakeLists.txt:27 (kde4_add_library)
This warning is for project developers.  Use -Wno-dev to suppress it.

CMake Warning (dev) at /usr/lib/automoc4/Automoc4Config.cmake:179 (get_directory_property):
  Policy CMP0059 is not set: Do not treat DEFINITIONS as a built-in directory
  property.  Run "cmake --help-policy CMP0059" for policy details.  Use the
  cmake_policy command to set the policy and suppress this warning.
Call Stack (most recent call first):
  /usr/lib/automoc4/Automoc4Config.cmake:243 (_add_automoc4_target)
  /usr/share/kde4/apps/cmake/modules/KDE4Macros.cmake:1029 (_automoc4_kde4_pre_target_handling)
  /usr/share/kde4/apps/cmake/modules/KDE4Macros.cmake:888 (kde4_add_executable)
  tests/CMakeLists.txt:21 (kde4_add_unit_test)
This warning is for project developers.  Use -Wno-dev to suppress it.

CMake Warning (dev) at /usr/lib/automoc4/Automoc4Config.cmake:179 (get_directory_property):
  Policy CMP0059 is not set: Do not treat DEFINITIONS as a built-in directory
  property.  Run "cmake --help-policy CMP0059" for policy details.  Use the
  cmake_policy command to set the policy and suppress this warning.
Call Stack (most recent call first):
  /usr/lib/automoc4/Automoc4Config.cmake:243 (_add_automoc4_target)
  /usr/share/kde4/apps/cmake/modules/KDE4Macros.cmake:1029 (_automoc4_kde4_pre_target_handling)
  /usr/share/kde4/apps/cmake/modules/KDE4Macros.cmake:888 (kde4_add_executable)
  tests/CMakeLists.txt:35 (kde4_add_unit_test)
This warning is for project developers.  Use -Wno-dev to suppress it.

-- Configuring done
CMake Warning (dev) in CMakeLists.txt:
  Policy CMP0022 is not set: INTERFACE_LINK_LIBRARIES defines the link
  interface.  Run "cmake --help-policy CMP0022" for policy details.  Use the
  cmake_policy command to set the policy and suppress this warning.

  Target "komparediff2" has an INTERFACE_LINK_LIBRARIES property which
  differs from its LINK_INTERFACE_LIBRARIES properties.

  INTERFACE_LINK_LIBRARIES:

    KDE4__kdecore;KDE4__kdeui;KDE4__kio

  LINK_INTERFACE_LIBRARIES:

    

This warning is for project developers.  Use -Wno-dev to suppress it.

-- Generating done
CMake Warning:
  Manually-specified variables were not used by the project:

    APPLNK_INSTALL_DIR
    INSTALL_PYTHON_FILES_IN_PYTHON_PREFIX
    LIB_DESTINATION


-- Build files have been written to: /usr/src/RPM/BUILD/libkomparediff2-4.14.2/BUILD-i586-alt-linux
+ popd
~/RPM/BUILD/libkomparediff2-4.14.2
+ __kde4_make
+ pushd BUILD-i586-alt-linux
~/RPM/BUILD/libkomparediff2-4.14.2/BUILD-i586-alt-linux ~/RPM/BUILD/libkomparediff2-4.14.2
+ make -j8
make[2]: Entering directory '/usr/src/RPM/BUILD/libkomparediff2-4.14.2/BUILD-i586-alt-linux'
Scanning dependencies of target komparediff2_automoc
make[2]: Leaving directory '/usr/src/RPM/BUILD/libkomparediff2-4.14.2/BUILD-i586-alt-linux'
make[2]: Entering directory '/usr/src/RPM/BUILD/libkomparediff2-4.14.2/BUILD-i586-alt-linux'
Generating kompareprocess.moc
Generating settingsbase.moc
Generating diffsettings.moc
Generating komparemodellist.moc
Generating moc_diffmodel.cpp
Generating moc_difference.cpp
make[2]: Leaving directory '/usr/src/RPM/BUILD/libkomparediff2-4.14.2/BUILD-i586-alt-linux'
make[1]: Entering directory '/usr/src/RPM/BUILD/libkomparediff2-4.14.2/BUILD-i586-alt-linux'
[  0%] Built target komparediff2_automoc
make[1]: Leaving directory '/usr/src/RPM/BUILD/libkomparediff2-4.14.2/BUILD-i586-alt-linux'
make[2]: Entering directory '/usr/src/RPM/BUILD/libkomparediff2-4.14.2/BUILD-i586-alt-linux'
Scanning dependencies of target komparediff2
make[2]: Leaving directory '/usr/src/RPM/BUILD/libkomparediff2-4.14.2/BUILD-i586-alt-linux'
make[2]: Entering directory '/usr/src/RPM/BUILD/libkomparediff2-4.14.2/BUILD-i586-alt-linux'
[ 12%] Building CXX object CMakeFiles/komparediff2.dir/diffmodellist.cpp.o
make[2]: Leaving directory '/usr/src/RPM/BUILD/libkomparediff2-4.14.2/BUILD-i586-alt-linux'
make[2]: Entering directory '/usr/src/RPM/BUILD/libkomparediff2-4.14.2/BUILD-i586-alt-linux'
[  6%] Building CXX object CMakeFiles/komparediff2.dir/komparediff2_automoc.cpp.o
make[2]: Leaving directory '/usr/src/RPM/BUILD/libkomparediff2-4.14.2/BUILD-i586-alt-linux'
make[2]: Entering directory '/usr/src/RPM/BUILD/libkomparediff2-4.14.2/BUILD-i586-alt-linux'
[ 37%] Building CXX object CMakeFiles/komparediff2.dir/difference.cpp.o
make[2]: Leaving directory '/usr/src/RPM/BUILD/libkomparediff2-4.14.2/BUILD-i586-alt-linux'
make[2]: Entering directory '/usr/src/RPM/BUILD/libkomparediff2-4.14.2/BUILD-i586-alt-linux'
[ 18%] Building CXX object CMakeFiles/komparediff2.dir/kompareprocess.cpp.o
make[2]: Leaving directory '/usr/src/RPM/BUILD/libkomparediff2-4.14.2/BUILD-i586-alt-linux'
make[2]: Entering directory '/usr/src/RPM/BUILD/libkomparediff2-4.14.2/BUILD-i586-alt-linux'
[ 43%] Building CXX object CMakeFiles/komparediff2.dir/diffhunk.cpp.o
make[2]: Leaving directory '/usr/src/RPM/BUILD/libkomparediff2-4.14.2/BUILD-i586-alt-linux'
make[2]: Entering directory '/usr/src/RPM/BUILD/libkomparediff2-4.14.2/BUILD-i586-alt-linux'
[ 56%] Building CXX object CMakeFiles/komparediff2.dir/settingsbase.cpp.o
make[2]: Leaving directory '/usr/src/RPM/BUILD/libkomparediff2-4.14.2/BUILD-i586-alt-linux'
make[2]: Entering directory '/usr/src/RPM/BUILD/libkomparediff2-4.14.2/BUILD-i586-alt-linux'
[ 50%] Building CXX object CMakeFiles/komparediff2.dir/diffsettings.cpp.o
make[2]: Leaving directory '/usr/src/RPM/BUILD/libkomparediff2-4.14.2/BUILD-i586-alt-linux'
make[2]: Entering directory '/usr/src/RPM/BUILD/libkomparediff2-4.14.2/BUILD-i586-alt-linux'
[ 62%] Building CXX object CMakeFiles/komparediff2.dir/parser.cpp.o
make[2]: Leaving directory '/usr/src/RPM/BUILD/libkomparediff2-4.14.2/BUILD-i586-alt-linux'
make[2]: Entering directory '/usr/src/RPM/BUILD/libkomparediff2-4.14.2/BUILD-i586-alt-linux'
[ 31%] Building CXX object CMakeFiles/komparediff2.dir/diffmodel.cpp.o
make[2]: Leaving directory '/usr/src/RPM/BUILD/libkomparediff2-4.14.2/BUILD-i586-alt-linux'
make[2]: Entering directory '/usr/src/RPM/BUILD/libkomparediff2-4.14.2/BUILD-i586-alt-linux'
[ 81%] Building CXX object CMakeFiles/komparediff2.dir/diffparser.cpp.o
make[2]: Leaving directory '/usr/src/RPM/BUILD/libkomparediff2-4.14.2/BUILD-i586-alt-linux'
make[2]: Entering directory '/usr/src/RPM/BUILD/libkomparediff2-4.14.2/BUILD-i586-alt-linux'
[ 68%] Building CXX object CMakeFiles/komparediff2.dir/parserbase.cpp.o
make[2]: Leaving directory '/usr/src/RPM/BUILD/libkomparediff2-4.14.2/BUILD-i586-alt-linux'
make[2]: Entering directory '/usr/src/RPM/BUILD/libkomparediff2-4.14.2/BUILD-i586-alt-linux'
[ 87%] Building CXX object CMakeFiles/komparediff2.dir/perforceparser.cpp.o
make[2]: Leaving directory '/usr/src/RPM/BUILD/libkomparediff2-4.14.2/BUILD-i586-alt-linux'
make[2]: Entering directory '/usr/src/RPM/BUILD/libkomparediff2-4.14.2/BUILD-i586-alt-linux'
[ 25%] Building CXX object CMakeFiles/komparediff2.dir/komparemodellist.cpp.o
make[2]: Leaving directory '/usr/src/RPM/BUILD/libkomparediff2-4.14.2/BUILD-i586-alt-linux'
make[2]: Entering directory '/usr/src/RPM/BUILD/libkomparediff2-4.14.2/BUILD-i586-alt-linux'
[ 75%] Building CXX object CMakeFiles/komparediff2.dir/cvsdiffparser.cpp.o
make[2]: Leaving directory '/usr/src/RPM/BUILD/libkomparediff2-4.14.2/BUILD-i586-alt-linux'
make[2]: Entering directory '/usr/src/RPM/BUILD/libkomparediff2-4.14.2/BUILD-i586-alt-linux'
[ 93%] Building CXX object CMakeFiles/komparediff2.dir/stringlistpair.cpp.o
make[2]: Leaving directory '/usr/src/RPM/BUILD/libkomparediff2-4.14.2/BUILD-i586-alt-linux'
make[2]: Entering directory '/usr/src/RPM/BUILD/libkomparediff2-4.14.2/BUILD-i586-alt-linux'
[100%] Linking CXX shared library lib/libkomparediff2.so
make[2]: Leaving directory '/usr/src/RPM/BUILD/libkomparediff2-4.14.2/BUILD-i586-alt-linux'
make[1]: Entering directory '/usr/src/RPM/BUILD/libkomparediff2-4.14.2/BUILD-i586-alt-linux'
[100%] Built target komparediff2
make[1]: Leaving directory '/usr/src/RPM/BUILD/libkomparediff2-4.14.2/BUILD-i586-alt-linux'
+ popd
~/RPM/BUILD/libkomparediff2-4.14.2
+ exit 0
Executing(%install): /bin/sh -e /usr/src/tmp/rpm-tmp.77362
+ umask 022
+ /bin/mkdir -p /usr/src/RPM/BUILD
+ cd /usr/src/RPM/BUILD
+ /bin/chmod -Rf u+rwX -- /usr/src/tmp/libkomparediff2-buildroot
+ :
+ /bin/rm -rf -- /usr/src/tmp/libkomparediff2-buildroot
+ cd libkomparediff2-4.14.2
+ __kde_install
+ make -C BUILD-i586-alt-linux DESTDIR=/usr/src/tmp/libkomparediff2-buildroot install
make: Entering directory '/usr/src/RPM/BUILD/libkomparediff2-4.14.2/BUILD-i586-alt-linux'
make[1]: Entering directory '/usr/src/RPM/BUILD/libkomparediff2-4.14.2/BUILD-i586-alt-linux'
make[2]: Entering directory '/usr/src/RPM/BUILD/libkomparediff2-4.14.2/BUILD-i586-alt-linux'
make[2]: Leaving directory '/usr/src/RPM/BUILD/libkomparediff2-4.14.2/BUILD-i586-alt-linux'
make[2]: Entering directory '/usr/src/RPM/BUILD/libkomparediff2-4.14.2/BUILD-i586-alt-linux'
make[2]: Leaving directory '/usr/src/RPM/BUILD/libkomparediff2-4.14.2/BUILD-i586-alt-linux'
[  0%] Built target komparediff2_automoc
make[2]: Entering directory '/usr/src/RPM/BUILD/libkomparediff2-4.14.2/BUILD-i586-alt-linux'
make[2]: Leaving directory '/usr/src/RPM/BUILD/libkomparediff2-4.14.2/BUILD-i586-alt-linux'
[100%] Built target komparediff2
make[1]: Leaving directory '/usr/src/RPM/BUILD/libkomparediff2-4.14.2/BUILD-i586-alt-linux'
Install the project...
-- Install configuration: "Release"
-- Installing: /usr/src/tmp/libkomparediff2-buildroot/usr/lib/libkomparediff2.so.4.14.38
-- Installing: /usr/src/tmp/libkomparediff2-buildroot/usr/lib/libkomparediff2.so.4
-- Installing: /usr/src/tmp/libkomparediff2-buildroot/usr/lib/libkomparediff2.so
-- Installing: /usr/src/tmp/libkomparediff2-buildroot/usr/include/kde4/libkomparediff2/diff2export.h
-- Installing: /usr/src/tmp/libkomparediff2-buildroot/usr/include/kde4/libkomparediff2/settingsbase.h
-- Installing: /usr/src/tmp/libkomparediff2-buildroot/usr/include/kde4/libkomparediff2/diffsettings.h
-- Installing: /usr/src/tmp/libkomparediff2-buildroot/usr/include/kde4/libkomparediff2/komparemodellist.h
-- Installing: /usr/src/tmp/libkomparediff2-buildroot/usr/include/kde4/libkomparediff2/difference.h
-- Installing: /usr/src/tmp/libkomparediff2-buildroot/usr/include/kde4/libkomparediff2/diffmodel.h
-- Installing: /usr/src/tmp/libkomparediff2-buildroot/usr/include/kde4/libkomparediff2/diffmodellist.h
-- Installing: /usr/src/tmp/libkomparediff2-buildroot/usr/include/kde4/libkomparediff2/marker.h
-- Installing: /usr/src/tmp/libkomparediff2-buildroot/usr/include/kde4/libkomparediff2/kompare.h
-- Installing: /usr/src/tmp/libkomparediff2-buildroot/usr/include/kde4/libkomparediff2/diffhunk.h
-- Installing: /usr/src/tmp/libkomparediff2-buildroot/usr/lib/cmake/libkomparediff2/LibKompareDiff2Config.cmake
-- Installing: /usr/src/tmp/libkomparediff2-buildroot/usr/lib/cmake/libkomparediff2/LibKompareDiff2Targets.cmake
-- Installing: /usr/src/tmp/libkomparediff2-buildroot/usr/lib/cmake/libkomparediff2/LibKompareDiff2Targets-release.cmake
make: Leaving directory '/usr/src/RPM/BUILD/libkomparediff2-4.14.2/BUILD-i586-alt-linux'
+ mkdir -p /usr/src/tmp/libkomparediff2-buildroot//usr/lib/kde4/devel
+ pushd /usr/src/tmp/libkomparediff2-buildroot//usr/lib
~/tmp/libkomparediff2-buildroot/usr/lib ~/RPM/BUILD/libkomparediff2-4.14.2
+ for l in lib*.so
+ '[' -L libkomparediff2.so ']'
++ readlink libkomparediff2.so
+ f=libkomparediff2.so.4
++ relative /usr/src/tmp/libkomparediff2-buildroot//usr/lib/libkomparediff2.so.4 /usr/src/tmp/libkomparediff2-buildroot//usr/lib/kde4/devel/libkomparediff2.so.4
+ ln -sf ../../libkomparediff2.so.4 /usr/src/tmp/libkomparediff2-buildroot//usr/lib/kde4/devel/libkomparediff2.so
+ rm -f libkomparediff2.so
+ popd
~/RPM/BUILD/libkomparediff2-4.14.2
+ '[' -d /usr/src/tmp/libkomparediff2-buildroot//usr/lib/kconf_update_bin ']'
+ '[' -d /usr/src/tmp/libkomparediff2-buildroot//usr/share/kde4/share ']'
+ '[' -d /usr/src/tmp/libkomparediff2-buildroot//usr/share/kde4/bin ']'
+ '[' -d /usr/src/tmp/libkomparediff2-buildroot//etc/xdg/menus ']'
+ '[' -d /usr/src/tmp/libkomparediff2-buildroot//usr/share/kde4/apps/cmake/modules/ ']'
+ /usr/lib/rpm/brp-alt
Cleaning files in /usr/src/tmp/libkomparediff2-buildroot (auto)
mode of './usr/lib/libkomparediff2.so.4.14.38' changed from 0755 (rwxr-xr-x) to 0644 (rw-r--r--)
Verifying and fixing files in /usr/src/tmp/libkomparediff2-buildroot (binconfig,pkgconfig,libtool,desktop)
Checking contents of files in /usr/src/tmp/libkomparediff2-buildroot/ (default)
Compressing files in /usr/src/tmp/libkomparediff2-buildroot (auto)
Adjusting library links in /usr/src/tmp/libkomparediff2-buildroot
./usr/lib:
	libkomparediff2.so.4 -> libkomparediff2.so.4.14.38
Verifying ELF objects in /usr/src/tmp/libkomparediff2-buildroot (arch=normal,fhs=normal,lfs=relaxed,lint=relaxed,rpath=normal,stack=normal,textrel=normal,unresolved=normal)
Hardlinking identical .pyc and .pyo files
Executing(%check): /bin/sh -e /usr/src/tmp/rpm-tmp.97509
+ umask 022
+ /bin/mkdir -p /usr/src/RPM/BUILD
+ cd /usr/src/RPM/BUILD
+ cd libkomparediff2-4.14.2
+ exit 0
Processing files: libkomparediff2-4.14.2-alt1
Finding Provides (using /usr/lib/rpm/find-provides)
Executing: /bin/sh -e /usr/src/tmp/rpm-tmp.YG2tDp
find-provides: running scripts (alternatives,debuginfo,gir,lib,pam,perl,pkgconfig,python,shell,typelib)
lib.prov: /usr/src/tmp/libkomparediff2-buildroot/usr/lib/libkomparediff2.so.4: 181 symbols, 18 bpp
Finding Requires (using /usr/lib/rpm/find-requires)
Executing: /bin/sh -e /usr/src/tmp/rpm-tmp.mByV6H
find-requires: running scripts (cpp,debuginfo,files,gir-js,gir-python,gir,lib,pam,perl,pkgconfig,pkgconfiglib,python,rpmlib,shebang,shell,static,symlinks,typelib)
Provides: libkomparediff2.so.4 = set:ldIgO3bMqYfAqaoEK0fahD3O7dEU4XJuwZIN9N6PbrW8aTbNQEt0ae6DHUZlydTVaIZFFklZctI1ucZjAbVAvXvioveNtqWZr3fq7BDrqraYCiKXLXegZzW2W9kcFlLoURPTxJBNySJBADM1USPciBnHjUubLdZybcyQcaHr3e7GDtOJOSGPkLukk218gqtZCrrF6zgoeHY4tDZLsDysmaW9u2ehlcS0Ohp7vBCkbxAV58pV2xH6zEG4WxYzlvMyxsJBnzAZFFgYtHKvEqXbVCk8XaV0l2epZ0MQ7qX2sbAaAs1guJ5XFfpzncQLJvygywowVOIYw7cfSJjfIpJ9COwZiZzxZzyoJyJNo06ria1VhY67
Requires: diffutils, libQtCore.so.4 >= set:phiB1kfwqxC89hA76dZx78dvn3ete0gD0mIBGjZAhwOGzktN02QjGXkos7XsvxaL1ju6oZ01MG6sI9tBE9R7lZqUtdRiI8yHZ2ocEbQZ72UjAzQVZ9YlrR3pbUOksmytzGMPwKMsJTOZGmgxOS6Ygv6FZBq7CEoaREQQn9Zl0kMen928LI8dqPuZ0akhEPw3RMfg65fE8a4THAYsD0HoC3wpz7K09EEBfzO35VgvRqZpPtZ648LVHL1V4gptlMT8j3jqYMU9lzkwsjmaZzkxY8RvnbH56ZbFjsvHuHdRnxg2Q9n7GJm2Lt7y6JKN1uLwCmhEwsfHXmXkl4Ve3z8nbFf0MQpZkddZdqJ0fLnytwsnWax5t9ZuES02KDZH12b66yGJD1oSq, libQtGui.so.4 >= set:roLUiDwz9OLyYJX6qRzH0, libc.so.6(GLIBC_2.0), libc.so.6(GLIBC_2.1.3), libc.so.6(GLIBC_2.4), libkdecore.so.5 >= set:qkCWdebCX3C0L2DblsEyPN7uExizAxB9WwtwvaAanSCUSaIRKd03IJYPaaFToUWDruinua90OAnsRgQLZyahTcVTWwlgptkN0U5ZDmml6R4b9FCV3m6wgfhyBjFbQRqbPHWrvO65vmMP0xChie64LOg0, libkdeui.so.5 >= set:qnXeb4FmrNZnGoOr12AfxVkI2, libkio.so.5 >= set:pm6DwtgeOuGLKpPwraE1, libstdc++.so.6(CXXABI_1.3), libstdc++.so.6(CXXABI_1.3.9), libstdc++.so.6(GLIBCXX_3.4), rtld(GNU_HASH)
Requires(rpmlib): rpmlib(SetVersions)
Conflicts: kde4sdk-kompare < 4.12
Finding debuginfo files (using /usr/lib/rpm/find-debuginfo-files)
Executing: /bin/sh -e /usr/src/tmp/rpm-tmp.pGI2xC
Creating libkomparediff2-debuginfo package
Processing files: libkomparediff2-devel-4.14.2-alt1
Finding Provides (using /usr/lib/rpm/find-provides)
Executing: /bin/sh -e /usr/src/tmp/rpm-tmp.GlAs7z
find-provides: running scripts (alternatives,debuginfo,gir,lib,pam,perl,pkgconfig,python,shell,typelib)
Finding Requires (using /usr/lib/rpm/find-requires)
Executing: /bin/sh -e /usr/src/tmp/rpm-tmp.78dTAk
find-requires: running scripts (cpp,debuginfo,files,gir-js,gir-python,gir,lib,pam,perl,pkgconfig,pkgconfiglib,python,rpmlib,shebang,shell,static,symlinks,typelib)
/usr/src/tmp/libkomparediff2-buildroot/usr/include/kde4/libkomparediff2/marker.h:24:10: fatal error: QList: No such file or directory
 #include <QList>
          ^~~~~~~
compilation terminated.
cpp.req: /usr/src/tmp/libkomparediff2-buildroot/usr/include/kde4/libkomparediff2/marker.h: cpp failed, trying c++ mode
/usr/src/tmp/libkomparediff2-buildroot/usr/include/kde4/libkomparediff2/marker.h:24:10: fatal error: QList: No such file or directory
 #include <QList>
          ^~~~~~~
compilation terminated.
cpp.req: WARNING: /usr/src/tmp/libkomparediff2-buildroot/usr/include/kde4/libkomparediff2/marker.h: cpp failed
In file included from /usr/src/tmp/libkomparediff2-buildroot/usr/include/kde4/libkomparediff2/kompare.h:21:
/usr/include/kde4/kurl.h:27:10: fatal error: QtCore/QVariant: No such file or directory
 #include <QtCore/QVariant>
          ^~~~~~~~~~~~~~~~~
compilation terminated.
cpp.req: /usr/src/tmp/libkomparediff2-buildroot/usr/include/kde4/libkomparediff2/kompare.h: cpp failed, trying c++ mode
In file included from /usr/include/kde4/kdecore_export.h:24,
                 from /usr/include/kde4/kurl.h:25,
                 from /usr/src/tmp/libkomparediff2-buildroot/usr/include/kde4/libkomparediff2/kompare.h:21:
/usr/include/kde4/kdemacros.h:162:11: fatal error: QtCore/qglobal.h: No such file or directory
 # include <QtCore/qglobal.h>
           ^~~~~~~~~~~~~~~~~~
compilation terminated.
cpp.req: WARNING: /usr/src/tmp/libkomparediff2-buildroot/usr/include/kde4/libkomparediff2/kompare.h: cpp failed
In file included from /usr/src/tmp/libkomparediff2-buildroot/usr/include/kde4/libkomparediff2/diffhunk.h:21:
/usr/src/tmp/libkomparediff2-buildroot/usr/include/kde4/libkomparediff2/difference.h:21:10: fatal error: qvector.h: No such file or directory
 #include <qvector.h>
          ^~~~~~~~~~~
compilation terminated.
cpp.req: /usr/src/tmp/libkomparediff2-buildroot/usr/include/kde4/libkomparediff2/diffhunk.h: cpp failed, trying c++ mode
In file included from /usr/src/tmp/libkomparediff2-buildroot/usr/include/kde4/libkomparediff2/diffhunk.h:21:
/usr/src/tmp/libkomparediff2-buildroot/usr/include/kde4/libkomparediff2/difference.h:21:10: fatal error: qvector.h: No such file or directory
 #include <qvector.h>
          ^~~~~~~~~~~
compilation terminated.
cpp.req: WARNING: /usr/src/tmp/libkomparediff2-buildroot/usr/include/kde4/libkomparediff2/diffhunk.h: cpp failed
/usr/src/tmp/libkomparediff2-buildroot/usr/include/kde4/libkomparediff2/diffmodel.h:21:10: fatal error: QtCore/QObject: No such file or directory
 #include <QtCore/QObject>
          ^~~~~~~~~~~~~~~~
compilation terminated.
cpp.req: /usr/src/tmp/libkomparediff2-buildroot/usr/include/kde4/libkomparediff2/diffmodel.h: cpp failed, trying c++ mode
/usr/src/tmp/libkomparediff2-buildroot/usr/include/kde4/libkomparediff2/diffmodel.h:21:10: fatal error: QtCore/QObject: No such file or directory
 #include <QtCore/QObject>
          ^~~~~~~~~~~~~~~~
compilation terminated.
cpp.req: WARNING: /usr/src/tmp/libkomparediff2-buildroot/usr/include/kde4/libkomparediff2/diffmodel.h: cpp failed
/usr/src/tmp/libkomparediff2-buildroot/usr/include/kde4/libkomparediff2/difference.h:21:10: fatal error: qvector.h: No such file or directory
 #include <qvector.h>
          ^~~~~~~~~~~
compilation terminated.
cpp.req: /usr/src/tmp/libkomparediff2-buildroot/usr/include/kde4/libkomparediff2/difference.h: cpp failed, trying c++ mode
/usr/src/tmp/libkomparediff2-buildroot/usr/include/kde4/libkomparediff2/difference.h:21:10: fatal error: qvector.h: No such file or directory
 #include <qvector.h>
          ^~~~~~~~~~~
compilation terminated.
cpp.req: WARNING: /usr/src/tmp/libkomparediff2-buildroot/usr/include/kde4/libkomparediff2/difference.h: cpp failed
/usr/src/tmp/libkomparediff2-buildroot/usr/include/kde4/libkomparediff2/diffsettings.h:21:10: fatal error: QtCore/QStringList: No such file or directory
 #include <QtCore/QStringList>
          ^~~~~~~~~~~~~~~~~~~~
compilation terminated.
cpp.req: /usr/src/tmp/libkomparediff2-buildroot/usr/include/kde4/libkomparediff2/diffsettings.h: cpp failed, trying c++ mode
/usr/src/tmp/libkomparediff2-buildroot/usr/include/kde4/libkomparediff2/diffsettings.h:21:10: fatal error: QtCore/QStringList: No such file or directory
 #include <QtCore/QStringList>
          ^~~~~~~~~~~~~~~~~~~~
compilation terminated.
cpp.req: WARNING: /usr/src/tmp/libkomparediff2-buildroot/usr/include/kde4/libkomparediff2/diffsettings.h: cpp failed
/usr/src/tmp/libkomparediff2-buildroot/usr/include/kde4/libkomparediff2/settingsbase.h:21:10: fatal error: QtCore/QObject: No such file or directory
 #include <QtCore/QObject>
          ^~~~~~~~~~~~~~~~
compilation terminated.
cpp.req: /usr/src/tmp/libkomparediff2-buildroot/usr/include/kde4/libkomparediff2/settingsbase.h: cpp failed, trying c++ mode
/usr/src/tmp/libkomparediff2-buildroot/usr/include/kde4/libkomparediff2/settingsbase.h:21:10: fatal error: QtCore/QObject: No such file or directory
 #include <QtCore/QObject>
          ^~~~~~~~~~~~~~~~
compilation terminated.
cpp.req: WARNING: /usr/src/tmp/libkomparediff2-buildroot/usr/include/kde4/libkomparediff2/settingsbase.h: cpp failed
/usr/src/tmp/libkomparediff2-buildroot/usr/include/kde4/libkomparediff2/diffmodellist.h:21:10: fatal error: QtCore/QList: No such file or directory
 #include <QtCore/QList> // include for the base class
          ^~~~~~~~~~~~~~
compilation terminated.
cpp.req: /usr/src/tmp/libkomparediff2-buildroot/usr/include/kde4/libkomparediff2/diffmodellist.h: cpp failed, trying c++ mode
/usr/src/tmp/libkomparediff2-buildroot/usr/include/kde4/libkomparediff2/diffmodellist.h:21:10: fatal error: QtCore/QList: No such file or directory
 #include <QtCore/QList> // include for the base class
          ^~~~~~~~~~~~~~
compilation terminated.
cpp.req: WARNING: /usr/src/tmp/libkomparediff2-buildroot/usr/include/kde4/libkomparediff2/diffmodellist.h: cpp failed
/usr/src/tmp/libkomparediff2-buildroot/usr/include/kde4/libkomparediff2/komparemodellist.h:23:10: fatal error: QtCore/QObject: No such file or directory
 #include <QtCore/QObject>
          ^~~~~~~~~~~~~~~~
compilation terminated.
cpp.req: /usr/src/tmp/libkomparediff2-buildroot/usr/include/kde4/libkomparediff2/komparemodellist.h: cpp failed, trying c++ mode
/usr/src/tmp/libkomparediff2-buildroot/usr/include/kde4/libkomparediff2/komparemodellist.h:23:10: fatal error: QtCore/QObject: No such file or directory
 #include <QtCore/QObject>
          ^~~~~~~~~~~~~~~~
compilation terminated.
cpp.req: WARNING: /usr/src/tmp/libkomparediff2-buildroot/usr/include/kde4/libkomparediff2/komparemodellist.h: cpp failed
Requires: /usr/lib/libkomparediff2.so.4, kde4libs-devel
Conflicts: kde4sdk-kompare < 4.12
Finding debuginfo files (using /usr/lib/rpm/find-debuginfo-files)
Executing: /bin/sh -e /usr/src/tmp/rpm-tmp.qXgN5M
Processing files: libkomparediff2-debuginfo-4.14.2-alt1
Finding Provides (using /usr/lib/rpm/find-provides)
Executing: /bin/sh -e /usr/src/tmp/rpm-tmp.aVhqdO
find-provides: running scripts (debuginfo)
Finding Requires (using /usr/lib/rpm/find-requires)
Executing: /bin/sh -e /usr/src/tmp/rpm-tmp.gjf1M4
find-requires: running scripts (debuginfo)
Provides: debug(libkomparediff2.so.4)
Requires: libkomparediff2 = 4.14.2-alt1, debug(libQtCore.so.4), debug(libQtGui.so.4), debug(libc.so.6), debug(libkdecore.so.5), debug(libkdeui.so.5), debug(libkio.so.5), debug(libstdc++.so.6)
Adding to libkomparediff2-devel a strict dependency on libkomparediff2
Removing 1 extra deps from libkomparediff2-devel due to dependency on libkomparediff2
Wrote: /usr/src/RPM/RPMS/i586/libkomparediff2-4.14.2-alt1.i586.rpm
Wrote: /usr/src/RPM/RPMS/i586/libkomparediff2-devel-4.14.2-alt1.i586.rpm
Wrote: /usr/src/RPM/RPMS/i586/libkomparediff2-debuginfo-4.14.2-alt1.i586.rpm
45.39user 7.71system 0:38.72elapsed 137%CPU (0avgtext+0avgdata 114472maxresident)k
0inputs+0outputs (0major+1053482minor)pagefaults 0swaps
73.79user 19.20system 1:20.71elapsed 115%CPU (0avgtext+0avgdata 114472maxresident)k
36112inputs+0outputs (0major+1946755minor)pagefaults 0swaps
--- libkomparediff2-4.14.2-alt1.i586.rpm.repo	2014-10-16 09:04:11.000000000 +0000
+++ libkomparediff2-4.14.2-alt1.i586.rpm.hasher	2019-09-18 10:46:42.537391432 +0000
@@ -1,3 +1,3 @@
-/usr/lib/libkomparediff2.so.4	120777	libkomparediff2.so.4.14.2
-/usr/lib/libkomparediff2.so.4.14.2	100644	
+/usr/lib/libkomparediff2.so.4	120777	libkomparediff2.so.4.14.38
+/usr/lib/libkomparediff2.so.4.14.38	100644	
 Requires: diffutils  
@@ -8,2 +8,3 @@
 Requires: libc.so.6(GLIBC_2.1.3)  
+Requires: libc.so.6(GLIBC_2.4)  
 Requires: libkdecore.so.5 >= set:qkCWdebCX3C0L2DblsEyPN7uExizAxB9WwtwvaAanSCUSaIRKd03IJYPaaFToUWDruinua90OAnsRgQLZyahTcVTWwlgptkN0U5ZDmml6R4b9FCV3m6wgfhyBjFbQRqbPHWrvO65vmMP0xChie64LOg0
@@ -12,2 +13,3 @@
 Requires: libstdc++.so.6(CXXABI_1.3)  
+Requires: libstdc++.so.6(CXXABI_1.3.9)  
 Requires: libstdc++.so.6(GLIBCXX_3.4)  
--- libkomparediff2-debuginfo-4.14.2-alt1.i586.rpm.repo	2014-10-16 09:04:11.000000000 +0000
+++ libkomparediff2-debuginfo-4.14.2-alt1.i586.rpm.hasher	2019-09-18 10:46:42.568390431 +0000
@@ -1,3 +1,3 @@
-/usr/lib/debug/usr/lib/libkomparediff2.so.4.14.2.debug	100644	
-/usr/lib/debug/usr/lib/libkomparediff2.so.4.debug	120777	libkomparediff2.so.4.14.2.debug
+/usr/lib/debug/usr/lib/libkomparediff2.so.4.14.38.debug	100644	
+/usr/lib/debug/usr/lib/libkomparediff2.so.4.debug	120777	libkomparediff2.so.4.14.38.debug
 /usr/src/debug/libkomparediff2-4.14.2	40755