<86>Sep  3 09:13:30 userdel[72202]: delete user 'rooter'
<86>Sep  3 09:13:30 groupadd[72221]: group added to /etc/group: name=rooter, GID=687
<86>Sep  3 09:13:30 groupadd[72221]: group added to /etc/gshadow: name=rooter
<86>Sep  3 09:13:30 groupadd[72221]: new group: name=rooter, GID=687
<86>Sep  3 09:13:30 useradd[72229]: new user: name=rooter, UID=687, GID=687, home=/root, shell=/bin/bash
<86>Sep  3 09:13:30 userdel[72243]: delete user 'builder'
<86>Sep  3 09:13:30 userdel[72243]: removed group 'builder' owned by 'builder'
<86>Sep  3 09:13:30 userdel[72243]: removed shadow group 'builder' owned by 'builder'
<86>Sep  3 09:13:30 groupadd[72258]: group added to /etc/group: name=builder, GID=688
<86>Sep  3 09:13:30 groupadd[72258]: group added to /etc/gshadow: name=builder
<86>Sep  3 09:13:30 groupadd[72258]: new group: name=builder, GID=688
<86>Sep  3 09:13:30 useradd[72265]: new user: name=builder, UID=688, GID=688, home=/usr/src, shell=/bin/bash
warning: user igor does not exist - using root
warning: group igor does not exist - using root
warning: user igor does not exist - using root
warning: group igor does not exist - using root
warning: user igor does not exist - using root
warning: group igor does not exist - using root
<13>Sep  3 09:13:32 rpmi: rpm-macros-kde-common-devel-14.12.1-alt1 1422279175 installed
<13>Sep  3 09:13:32 rpmi: rpm-macros-generic-compat-0.04-alt1 1527350580 installed
<13>Sep  3 09:13:32 rpmi: rpm-macros-fedora-compat-0.156-alt1 sisyphus+221696.100.1.1 1550345568 installed
<13>Sep  3 09:13:34 rpmi: libexpat-2.2.4-alt1 1503305345 installed
<13>Sep  3 09:13:34 rpmi: libuv-1.28.0-alt1 sisyphus+231674.100.1.1 1559848899 installed
<13>Sep  3 09:13:34 rpmi: libjsoncpp19-1.8.4-alt4 sisyphus+232904.100.1.1 1561247386 installed
<13>Sep  3 09:13:34 rpmi: libidn2-2.2.0-alt1 sisyphus+229970.100.1.1 1558625600 installed
<13>Sep  3 09:13:34 rpmi: libsqlite3-3.28.0-alt1 sisyphus+231334.100.1.1 1559488430 installed
<13>Sep  3 09:13:34 rpmi: shared-mime-info-1.12-alt1 sisyphus+219597.100.2.2 1548057005 installed
<13>Sep  3 09:13:34 rpmi: gsettings-desktop-schemas-data-3.32.0-alt1 sisyphus+225059.300.3.2 1552843929 installed
<13>Sep  3 09:13:34 rpmi: libgio-2.60.6-alt1 sisyphus+235075.100.1.1 1563971204 installed
<13>Sep  3 09:13:34 rpmi: gsettings-desktop-schemas-3.32.0-alt1 sisyphus+225059.300.3.2 1552843980 installed
<13>Sep  3 09:13:34 rpmi: libgdbm-1.8.3-alt10 1454943334 installed
<13>Sep  3 09:13:34 rpmi: xml-utils-1:2.9.9.0.52.f824-alt1 sisyphus+229881.200.3.1 1558978749 installed
<13>Sep  3 09:13:34 rpmi: rpm-build-gir-0.7.3-alt2 sisyphus+234037.40.2.1 1562495133 installed
<13>Sep  3 09:13:34 rpmi: gcc-c++-common-1.4.23-alt1 sisyphus+221902.2500.4.1 1550596716 installed
<13>Sep  3 09:13:35 rpmi: libstdc++8-devel-8.3.1-alt5 sisyphus+235477.100.1.1 1565022025 installed
<13>Sep  3 09:13:36 rpmi: gcc8-c++-8.3.1-alt5 sisyphus+235477.100.1.1 1565022025 installed
<13>Sep  3 09:13:36 rpmi: rpm-macros-cmake-3.13.4-alt3 sisyphus+229386.100.1.1 1557907647 installed
<13>Sep  3 09:13:36 rpmi: cmake-modules-3.13.4-alt3 sisyphus+229386.100.1.1 1557907621 installed
<13>Sep  3 09:13:36 rpmi: librhash-1.3.5-alt2 1505156279 installed
<13>Sep  3 09:13:36 rpmi: publicsuffix-list-dafsa-20190823-alt1 sisyphus+236630.100.1.1 1566830156 installed
<13>Sep  3 09:13:36 rpmi: libpsl-0.21.0-alt1 sisyphus+227314.100.1.2 1555618423 installed
<13>Sep  3 09:13:36 rpmi: libnghttp2-1.39.2-alt1 sisyphus+236978.100.1.1 1567325198 installed
<13>Sep  3 09:13:36 rpmi: libverto-0.3.0-alt1_7 sisyphus+225932.100.1.1 1553994919 installed
<13>Sep  3 09:13:36 rpmi: libkeyutils-1.6-alt2 sisyphus+226520.100.2.1 1554512089 installed
<13>Sep  3 09:13:36 rpmi: libcom_err-1.44.6-alt1 sisyphus+224154.100.1.1 1552091678 installed
<13>Sep  3 09:13:36 rpmi: libbrotlicommon-1.0.7-alt1 sisyphus+226738.100.2.1 1554554568 installed
<13>Sep  3 09:13:36 rpmi: libbrotlidec-1.0.7-alt1 sisyphus+226738.100.2.1 1554554568 installed
<13>Sep  3 09:13:36 rpmi: libnettle7-3.5.1-alt1 sisyphus+235265.40.6.1 1566223065 installed
<13>Sep  3 09:13:36 rpmi: libarchive13-3.4.0-alt1 sisyphus+235265.640.9.1 1566482857 installed
<13>Sep  3 09:13:36 rpmi: libp11-kit-0.23.15-alt1 sisyphus+226408.100.2.1 1554288204 installed
<13>Sep  3 09:13:36 rpmi: libtasn1-4.14-alt1 sisyphus+235791.100.1.1 1565282372 installed
<13>Sep  3 09:13:36 rpmi: rpm-macros-alternatives-0.5.1-alt1 sisyphus+226946.100.1.1 1554830426 installed
<13>Sep  3 09:13:36 rpmi: alternatives-0.5.1-alt1 sisyphus+226946.100.1.1 1554830426 installed
<13>Sep  3 09:13:36 rpmi: ca-certificates-2019.07.11-alt1 sisyphus+234280.200.1.1 1562839906 installed
<13>Sep  3 09:13:36 rpmi: ca-trust-0.1.2-alt1 sisyphus+233348.100.1.1 1561653823 installed
<13>Sep  3 09:13:36 rpmi: p11-kit-trust-0.23.15-alt1 sisyphus+226408.100.2.1 1554288204 installed
<13>Sep  3 09:13:36 rpmi: libcrypto1.1-1.1.1b-alt2 sisyphus+227249.100.2.1 1555667822 installed
<13>Sep  3 09:13:36 rpmi: libssl1.1-1.1.1b-alt2 sisyphus+227249.100.2.1 1555667822 installed
<13>Sep  3 09:13:36 rpmi: libpython3-3.7.4-alt1 sisyphus+236519.100.1.1 1566575438 installed
<13>Sep  3 09:13:36 rpmi: python3-3.7.4-alt1 sisyphus+236519.100.1.1 1566575438 installed
<13>Sep  3 09:13:37 rpmi: python3-base-3.7.4-alt1 sisyphus+236519.100.1.1 1566575438 installed
<86>Sep  3 09:13:37 groupadd[90170]: group added to /etc/group: name=_keytab, GID=499
<86>Sep  3 09:13:37 groupadd[90170]: group added to /etc/gshadow: name=_keytab
<86>Sep  3 09:13:37 groupadd[90170]: new group: name=_keytab, GID=499
<13>Sep  3 09:13:37 rpmi: libkrb5-1.16.3-alt1 sisyphus+223678.100.1.1 1551746516 installed
<86>Sep  3 09:13:37 groupadd[90219]: group added to /etc/group: name=sasl, GID=498
<86>Sep  3 09:13:37 groupadd[90219]: group added to /etc/gshadow: name=sasl
<86>Sep  3 09:13:37 groupadd[90219]: new group: name=sasl, GID=498
<13>Sep  3 09:13:37 rpmi: libsasl2-3-2.1.27-alt2 sisyphus+228101.100.1.1 1556139863 installed
<13>Sep  3 09:13:37 rpmi: libldap-2.4.48-alt1 sisyphus+236705.100.1.1 1566947839 installed
<13>Sep  3 09:13:37 rpmi: libcurl-7.65.3-alt1 sisyphus+235033.100.1.1 1563886227 installed
<13>Sep  3 09:13:38 rpmi: cmake-3.13.4-alt3 sisyphus+229386.100.1.1 1557907647 installed
<13>Sep  3 09:13:38 rpmi: glib2-devel-2.60.6-alt1 sisyphus+235075.100.1.1 1563971204 installed
<13>Sep  3 09:13:38 rpmi: libgio-devel-2.60.6-alt1 sisyphus+235075.100.1.1 1563971204 installed
<13>Sep  3 09:13:38 rpmi: ctest-3.13.4-alt3 sisyphus+229386.100.1.1 1557907647 installed
<13>Sep  3 09:13:38 rpmi: gcc-c++-8-alt2 sisyphus+235723.100.1.1 1565191484 installed
<13>Sep  3 09:13:38 rpmi: libsqlite3-devel-3.28.0-alt1 sisyphus+231334.100.1.1 1559488430 installed
<13>Sep  3 09:13:39 rpmi: doxygen-1:1.8.15-alt1 sisyphus+220984.100.1.2 1549663873 installed
Building target platforms: i586
Building for target i586
Wrote: /usr/src/in/nosrpm/libUnihan-0.5.3-alt5_19.nosrc.rpm
Installing libUnihan-0.5.3-alt5_19.src.rpm
Building target platforms: i586
Building for target i586
Executing(%prep): /bin/sh -e /usr/src/tmp/rpm-tmp.95810
+ umask 022
+ /bin/mkdir -p /usr/src/RPM/BUILD
+ cd /usr/src/RPM/BUILD
+ cd /usr/src/RPM/BUILD
+ rm -rf libUnihan-0.5.3-Source
+ echo 'Source #0 (libUnihan-0.5.3-Source.tar.gz):'
Source #0 (libUnihan-0.5.3-Source.tar.gz):
+ /bin/gzip -dc /usr/src/RPM/SOURCES/libUnihan-0.5.3-Source.tar.gz
+ /bin/tar -xf -
+ cd libUnihan-0.5.3-Source
+ /bin/chmod -c -Rf u+rwX,go-w .
+ sed -i -e 's|${docdir}/${DB_PRJ_NAME}|/usr/share/doc/libUnihan|' -e 's|${docdir}/${PROJECT_NAME}-${PRJ_VER}|/usr/share/doc/libUnihan|' CMakeLists.txt
+ exit 0
Executing(%build): /bin/sh -e /usr/src/tmp/rpm-tmp.95810
+ umask 022
+ /bin/mkdir -p /usr/src/RPM/BUILD
+ cd /usr/src/RPM/BUILD
+ cd libUnihan-0.5.3-Source
+ CFLAGS='-pipe -frecord-gcc-switches -Wall -g -O2 -march=i586 -mtune=generic -fPIC -DPIC'
+ export CFLAGS
+ CXXFLAGS='-pipe -frecord-gcc-switches -Wall -g -O2 -march=i586 -mtune=generic -fPIC -DPIC'
+ export CXXFLAGS
+ FFLAGS='-pipe -frecord-gcc-switches -Wall -g -O2 -march=i586 -mtune=generic -fPIC -DPIC'
+ export FFLAGS
+ cmake -DCMAKE_VERBOSE_MAKEFILE=ON -DCMAKE_INSTALL_PREFIX:PATH=/usr -DCMAKE_INSTALL_LIBDIR:PATH=/usr/lib -DINCLUDE_INSTALL_DIR:PATH=/usr/include -DLIB_INSTALL_DIR:PATH=/usr/lib -DSYSCONF_INSTALL_DIR:PATH=/etc -DSHARE_INSTALL_PREFIX:PATH=/usr/share -DBUILD_SHARED_LIBS:BOOL=ON .
CMake Deprecation Warning at CMakeLists.txt:4 (cmake_policy):
  The OLD behavior for policy CMP0005 will be removed from a future version
  of CMake.

  The cmake-policies(7) manual explains that the OLD behaviors of all
  policies are deprecated and that a policy should be set to OLD only under
  specific short-term circumstances.  Projects should be ported to the NEW
  behavior and not rely on setting a policy to OLD.


-- The C compiler identification is GNU 8.3.1
-- The CXX compiler identification is GNU 8.3.1
-- Check for working C compiler: /usr/bin/cc
-- Check for working C compiler: /usr/bin/cc -- works
-- Detecting C compiler ABI info
-- Detecting C compiler ABI info - done
-- Detecting C compile features
-- Detecting C compile features - done
-- Check for working CXX compiler: /usr/bin/c++
-- Check for working CXX compiler: /usr/bin/c++ -- works
-- Detecting CXX compiler ABI info
-- Detecting CXX compiler ABI info - done
-- Detecting CXX compile features
-- Detecting CXX compile features - done
warning: bogus date in %changelog: Tue Oct 06 2008 Ding-Yi Chen <dchen at redhat dot com> - 0.5.2-0
-- Looking for g_string_chunk_clear
-- Looking for g_string_chunk_clear - not found
-- Looking for sqlite3_open_v2
-- Looking for sqlite3_open_v2 - not found
CMake Warning (dev) at test/CMakeLists.txt:5 (LINK_DIRECTORIES):
  This command specifies the relative path

    ../lib

  as a link directory.

  Policy CMP0015 is not set: link_directories() treats paths relative to the
  source dir.  Run "cmake --help-policy CMP0015" for policy details.  Use the
  cmake_policy command to set the policy and suppress this warning.
This warning is for project developers.  Use -Wno-dev to suppress it.

-- Found PkgConfig: /usr/bin/pkg-config (found version "0.29.2") 
-- Checking for module 'glib-2.0'
--   Found glib-2.0, version 2.60.6
Package libpcre was not found in the pkg-config search path.
Perhaps you should add the directory containing `libpcre.pc'
to the PKG_CONFIG_PATH environment variable
Package 'libpcre', required by 'glib-2.0', not found
Package libpcre was not found in the pkg-config search path.
Perhaps you should add the directory containing `libpcre.pc'
to the PKG_CONFIG_PATH environment variable
Package 'libpcre', required by 'glib-2.0', not found
Package libpcre was not found in the pkg-config search path.
Perhaps you should add the directory containing `libpcre.pc'
to the PKG_CONFIG_PATH environment variable
Package 'libpcre', required by 'glib-2.0', not found
Package libpcre was not found in the pkg-config search path.
Perhaps you should add the directory containing `libpcre.pc'
to the PKG_CONFIG_PATH environment variable
Package 'libpcre', required by 'glib-2.0', not found
-- Checking for module 'sqlite3'
--   Found sqlite3, version 3.28.0
-- Found Doxygen: /usr/bin/doxygen (found version "1.8.15") found components:  doxygen missing components:  dot
-- Configuring done
CMake Warning (dev) in test/CMakeLists.txt:
  Policy CMP0081 is not set: Relative paths not allowed in LINK_DIRECTORIES
  target property.  Run "cmake --help-policy CMP0081" for policy details.
  Use the cmake_policy command to set the policy and suppress this warning.

  Found relative path while evaluating link directories of "check_phonetic":

    "../lib"

This warning is for project developers.  Use -Wno-dev to suppress it.

CMake Warning (dev) in test/CMakeLists.txt:
  Policy CMP0081 is not set: Relative paths not allowed in LINK_DIRECTORIES
  target property.  Run "cmake --help-policy CMP0081" for policy details.
  Use the cmake_policy command to set the policy and suppress this warning.

  Found relative path while evaluating link directories of
  "check_unihan_functions":

    "../lib"

This warning is for project developers.  Use -Wno-dev to suppress it.

CMake Warning (dev) in test/CMakeLists.txt:
  Policy CMP0081 is not set: Relative paths not allowed in LINK_DIRECTORIES
  target property.  Run "cmake --help-policy CMP0081" for policy details.
  Use the cmake_policy command to set the policy and suppress this warning.

  Found relative path while evaluating link directories of "check_toneMark":

    "../lib"

This warning is for project developers.  Use -Wno-dev to suppress it.

CMake Warning (dev) in test/CMakeLists.txt:
  Policy CMP0081 is not set: Relative paths not allowed in LINK_DIRECTORIES
  target property.  Run "cmake --help-policy CMP0081" for policy details.
  Use the cmake_policy command to set the policy and suppress this warning.

  Found relative path while evaluating link directories of
  "unihan_field_validation":

    "../lib"

This warning is for project developers.  Use -Wno-dev to suppress it.

-- Generating done
CMake Warning:
  Manually-specified variables were not used by the project:

    CMAKE_INSTALL_LIBDIR
    INCLUDE_INSTALL_DIR
    SHARE_INSTALL_PREFIX
    SYSCONF_INSTALL_DIR


-- Build files have been written to: /usr/src/RPM/BUILD/libUnihan-0.5.3-Source
+ cmake .
CMake Deprecation Warning at CMakeLists.txt:4 (cmake_policy):
  The OLD behavior for policy CMP0005 will be removed from a future version
  of CMake.

  The cmake-policies(7) manual explains that the OLD behaviors of all
  policies are deprecated and that a policy should be set to OLD only under
  specific short-term circumstances.  Projects should be ported to the NEW
  behavior and not rely on setting a policy to OLD.


warning: bogus date in %changelog: Tue Oct 06 2008 Ding-Yi Chen <dchen at redhat dot com> - 0.5.2-0
CMake Warning (dev) at test/CMakeLists.txt:5 (LINK_DIRECTORIES):
  This command specifies the relative path

    ../lib

  as a link directory.

  Policy CMP0015 is not set: link_directories() treats paths relative to the
  source dir.  Run "cmake --help-policy CMP0015" for policy details.  Use the
  cmake_policy command to set the policy and suppress this warning.
This warning is for project developers.  Use -Wno-dev to suppress it.

-- Configuring done
CMake Warning (dev) in test/CMakeLists.txt:
  Policy CMP0081 is not set: Relative paths not allowed in LINK_DIRECTORIES
  target property.  Run "cmake --help-policy CMP0081" for policy details.
  Use the cmake_policy command to set the policy and suppress this warning.

  Found relative path while evaluating link directories of "check_phonetic":

    "../lib"

This warning is for project developers.  Use -Wno-dev to suppress it.

CMake Warning (dev) in test/CMakeLists.txt:
  Policy CMP0081 is not set: Relative paths not allowed in LINK_DIRECTORIES
  target property.  Run "cmake --help-policy CMP0081" for policy details.
  Use the cmake_policy command to set the policy and suppress this warning.

  Found relative path while evaluating link directories of
  "check_unihan_functions":

    "../lib"

This warning is for project developers.  Use -Wno-dev to suppress it.

CMake Warning (dev) in test/CMakeLists.txt:
  Policy CMP0081 is not set: Relative paths not allowed in LINK_DIRECTORIES
  target property.  Run "cmake --help-policy CMP0081" for policy details.
  Use the cmake_policy command to set the policy and suppress this warning.

  Found relative path while evaluating link directories of "check_toneMark":

    "../lib"

This warning is for project developers.  Use -Wno-dev to suppress it.

CMake Warning (dev) in test/CMakeLists.txt:
  Policy CMP0081 is not set: Relative paths not allowed in LINK_DIRECTORIES
  target property.  Run "cmake --help-policy CMP0081" for policy details.
  Use the cmake_policy command to set the policy and suppress this warning.

  Found relative path while evaluating link directories of
  "unihan_field_validation":

    "../lib"

This warning is for project developers.  Use -Wno-dev to suppress it.

-- Generating done
-- Build files have been written to: /usr/src/RPM/BUILD/libUnihan-0.5.3-Source
+ make VERBOSE=1 'C_DEFINES=-pipe -frecord-gcc-switches -Wall -g -O2 -march=i586 -mtune=generic -fPIC -DPIC' -j8
make: Entering directory '/usr/src/RPM/BUILD/libUnihan-0.5.3-Source'
/usr/bin/cmake -S/usr/src/RPM/BUILD/libUnihan-0.5.3-Source -B/usr/src/RPM/BUILD/libUnihan-0.5.3-Source --check-build-system CMakeFiles/Makefile.cmake 0
make: Leaving directory '/usr/src/RPM/BUILD/libUnihan-0.5.3-Source'
make: Entering directory '/usr/src/RPM/BUILD/libUnihan-0.5.3-Source'
/usr/bin/cmake -E cmake_progress_start /usr/src/RPM/BUILD/libUnihan-0.5.3-Source/CMakeFiles /usr/src/RPM/BUILD/libUnihan-0.5.3-Source/CMakeFiles/progress.marks
make: Leaving directory '/usr/src/RPM/BUILD/libUnihan-0.5.3-Source'
make -f CMakeFiles/Makefile2 all
make -f bin/CMakeFiles/Unihan.dir/build.make bin/CMakeFiles/Unihan.dir/depend
make[2]: Entering directory '/usr/src/RPM/BUILD/libUnihan-0.5.3-Source'
cd /usr/src/RPM/BUILD/libUnihan-0.5.3-Source && /usr/bin/cmake -E cmake_depends "Unix Makefiles" /usr/src/RPM/BUILD/libUnihan-0.5.3-Source /usr/src/RPM/BUILD/libUnihan-0.5.3-Source/src /usr/src/RPM/BUILD/libUnihan-0.5.3-Source /usr/src/RPM/BUILD/libUnihan-0.5.3-Source/bin /usr/src/RPM/BUILD/libUnihan-0.5.3-Source/bin/CMakeFiles/Unihan.dir/DependInfo.cmake --color=
Dependee "/usr/src/RPM/BUILD/libUnihan-0.5.3-Source/bin/CMakeFiles/Unihan.dir/DependInfo.cmake" is newer than depender "/usr/src/RPM/BUILD/libUnihan-0.5.3-Source/bin/CMakeFiles/Unihan.dir/depend.internal".
Dependee "/usr/src/RPM/BUILD/libUnihan-0.5.3-Source/bin/CMakeFiles/CMakeDirectoryInformation.cmake" is newer than depender "/usr/src/RPM/BUILD/libUnihan-0.5.3-Source/bin/CMakeFiles/Unihan.dir/depend.internal".
Scanning dependencies of target Unihan
make[2]: Leaving directory '/usr/src/RPM/BUILD/libUnihan-0.5.3-Source'
make -f bin/CMakeFiles/Unihan.dir/build.make bin/CMakeFiles/Unihan.dir/build
make[2]: Entering directory '/usr/src/RPM/BUILD/libUnihan-0.5.3-Source'
[ 14%] Building C object bin/CMakeFiles/Unihan.dir/collection.o
cd /usr/src/RPM/BUILD/libUnihan-0.5.3-Source/bin && /usr/bin/cc -pipe -frecord-gcc-switches -Wall -g -O2 -march=i586 -mtune=generic -fPIC -DPIC -I/usr/include/glib-2.0 -I/usr/lib/glib-2.0/include  -Wall -fPIC   -Ddatadir='"/usr/share"' -Ddocdir='"/usr/share/doc"' -DUNIHAN_DEFAULT_DB='"/usr/share/UnihanDb/Unihan.db"' -o CMakeFiles/Unihan.dir/collection.o   -c /usr/src/RPM/BUILD/libUnihan-0.5.3-Source/src/collection.c
make[2]: Leaving directory '/usr/src/RPM/BUILD/libUnihan-0.5.3-Source'
make[2]: Entering directory '/usr/src/RPM/BUILD/libUnihan-0.5.3-Source'
[ 38%] Building C object bin/CMakeFiles/Unihan.dir/file_functions.o
cd /usr/src/RPM/BUILD/libUnihan-0.5.3-Source/bin && /usr/bin/cc -pipe -frecord-gcc-switches -Wall -g -O2 -march=i586 -mtune=generic -fPIC -DPIC -I/usr/include/glib-2.0 -I/usr/lib/glib-2.0/include  -Wall -fPIC   -Ddatadir='"/usr/share"' -Ddocdir='"/usr/share/doc"' -DUNIHAN_DEFAULT_DB='"/usr/share/UnihanDb/Unihan.db"' -o CMakeFiles/Unihan.dir/file_functions.o   -c /usr/src/RPM/BUILD/libUnihan-0.5.3-Source/src/file_functions.c
make[2]: Leaving directory '/usr/src/RPM/BUILD/libUnihan-0.5.3-Source'
make[2]: Entering directory '/usr/src/RPM/BUILD/libUnihan-0.5.3-Source'
[ 28%] Building C object bin/CMakeFiles/Unihan.dir/verboseMsg.o
cd /usr/src/RPM/BUILD/libUnihan-0.5.3-Source/bin && /usr/bin/cc -pipe -frecord-gcc-switches -Wall -g -O2 -march=i586 -mtune=generic -fPIC -DPIC -I/usr/include/glib-2.0 -I/usr/lib/glib-2.0/include  -Wall -fPIC   -Ddatadir='"/usr/share"' -Ddocdir='"/usr/share/doc"' -DUNIHAN_DEFAULT_DB='"/usr/share/UnihanDb/Unihan.db"' -o CMakeFiles/Unihan.dir/verboseMsg.o   -c /usr/src/RPM/BUILD/libUnihan-0.5.3-Source/src/verboseMsg.c
make[2]: Leaving directory '/usr/src/RPM/BUILD/libUnihan-0.5.3-Source'
make[2]: Entering directory '/usr/src/RPM/BUILD/libUnihan-0.5.3-Source'
[  9%] Building C object bin/CMakeFiles/Unihan.dir/allocate.o
cd /usr/src/RPM/BUILD/libUnihan-0.5.3-Source/bin && /usr/bin/cc -pipe -frecord-gcc-switches -Wall -g -O2 -march=i586 -mtune=generic -fPIC -DPIC -I/usr/include/glib-2.0 -I/usr/lib/glib-2.0/include  -Wall -fPIC   -Ddatadir='"/usr/share"' -Ddocdir='"/usr/share/doc"' -DUNIHAN_DEFAULT_DB='"/usr/share/UnihanDb/Unihan.db"' -o CMakeFiles/Unihan.dir/allocate.o   -c /usr/src/RPM/BUILD/libUnihan-0.5.3-Source/src/allocate.c
make[2]: Leaving directory '/usr/src/RPM/BUILD/libUnihan-0.5.3-Source'
make[2]: Entering directory '/usr/src/RPM/BUILD/libUnihan-0.5.3-Source'
[ 19%] Building C object bin/CMakeFiles/Unihan.dir/sqlite_functions.o
cd /usr/src/RPM/BUILD/libUnihan-0.5.3-Source/bin && /usr/bin/cc -pipe -frecord-gcc-switches -Wall -g -O2 -march=i586 -mtune=generic -fPIC -DPIC -I/usr/include/glib-2.0 -I/usr/lib/glib-2.0/include  -Wall -fPIC   -Ddatadir='"/usr/share"' -Ddocdir='"/usr/share/doc"' -DUNIHAN_DEFAULT_DB='"/usr/share/UnihanDb/Unihan.db"' -o CMakeFiles/Unihan.dir/sqlite_functions.o   -c /usr/src/RPM/BUILD/libUnihan-0.5.3-Source/src/sqlite_functions.c
make[2]: Leaving directory '/usr/src/RPM/BUILD/libUnihan-0.5.3-Source'
make[2]: Entering directory '/usr/src/RPM/BUILD/libUnihan-0.5.3-Source'
[ 23%] Building C object bin/CMakeFiles/Unihan.dir/str_functions.o
cd /usr/src/RPM/BUILD/libUnihan-0.5.3-Source/bin && /usr/bin/cc -pipe -frecord-gcc-switches -Wall -g -O2 -march=i586 -mtune=generic -fPIC -DPIC -I/usr/include/glib-2.0 -I/usr/lib/glib-2.0/include  -Wall -fPIC   -Ddatadir='"/usr/share"' -Ddocdir='"/usr/share/doc"' -DUNIHAN_DEFAULT_DB='"/usr/share/UnihanDb/Unihan.db"' -o CMakeFiles/Unihan.dir/str_functions.o   -c /usr/src/RPM/BUILD/libUnihan-0.5.3-Source/src/str_functions.c
make[2]: Leaving directory '/usr/src/RPM/BUILD/libUnihan-0.5.3-Source'
make[2]: Entering directory '/usr/src/RPM/BUILD/libUnihan-0.5.3-Source'
[  9%] Building C object bin/CMakeFiles/Unihan.dir/Unihan_phonetic.o
cd /usr/src/RPM/BUILD/libUnihan-0.5.3-Source/bin && /usr/bin/cc -pipe -frecord-gcc-switches -Wall -g -O2 -march=i586 -mtune=generic -fPIC -DPIC -I/usr/include/glib-2.0 -I/usr/lib/glib-2.0/include  -Wall -fPIC   -Ddatadir='"/usr/share"' -Ddocdir='"/usr/share/doc"' -DUNIHAN_DEFAULT_DB='"/usr/share/UnihanDb/Unihan.db"' -o CMakeFiles/Unihan.dir/Unihan_phonetic.o   -c /usr/src/RPM/BUILD/libUnihan-0.5.3-Source/src/Unihan_phonetic.c
make[2]: Leaving directory '/usr/src/RPM/BUILD/libUnihan-0.5.3-Source'
make[2]: Entering directory '/usr/src/RPM/BUILD/libUnihan-0.5.3-Source'
[ 33%] Building C object bin/CMakeFiles/Unihan.dir/Unihan.o
cd /usr/src/RPM/BUILD/libUnihan-0.5.3-Source/bin && /usr/bin/cc -pipe -frecord-gcc-switches -Wall -g -O2 -march=i586 -mtune=generic -fPIC -DPIC -I/usr/include/glib-2.0 -I/usr/lib/glib-2.0/include  -Wall -fPIC   -Ddatadir='"/usr/share"' -Ddocdir='"/usr/share/doc"' -DUNIHAN_DEFAULT_DB='"/usr/share/UnihanDb/Unihan.db"' -o CMakeFiles/Unihan.dir/Unihan.o   -c /usr/src/RPM/BUILD/libUnihan-0.5.3-Source/src/Unihan.c
/usr/src/RPM/BUILD/libUnihan-0.5.3-Source/src/Unihan.c: In function 'unihanChar_is_common_in_locale':
/usr/src/RPM/BUILD/libUnihan-0.5.3-Source/src/Unihan.c:667:15: warning: comparison between 'UnihanIRG_Source' {aka 'enum <anonymous>'} and 'enum <anonymous>' [-Wenum-compare]
     if (source>UNIHAN_INVALID_SOURCEID){
               ^
In file included from /usr/src/RPM/BUILD/libUnihan-0.5.3-Source/src/Unihan.c:36:
/usr/src/RPM/BUILD/libUnihan-0.5.3-Source/src/Unihan_SQL_gen.c: In function 'unihan_find_all_matched':
/usr/src/RPM/BUILD/libUnihan-0.5.3-Source/src/Unihan_SQL_gen.c:260:5: warning: 'fromTable' may be used uninitialized in this function [-Wmaybe-uninitialized]
  if (givenTable!=fromTable){
     ^
/usr/src/RPM/BUILD/libUnihan-0.5.3-Source/src/Unihan_SQL_gen.c:211:17: note: 'fromTable' was declared here
     UnihanTable fromTable,givenTable,extraTable;
                 ^~~~~~~~~
make[2]: Leaving directory '/usr/src/RPM/BUILD/libUnihan-0.5.3-Source'
make[2]: Entering directory '/usr/src/RPM/BUILD/libUnihan-0.5.3-Source'
[ 42%] Linking C shared library libUnihan.so
cd /usr/src/RPM/BUILD/libUnihan-0.5.3-Source/bin && /usr/bin/cmake -E cmake_link_script CMakeFiles/Unihan.dir/link.txt --verbose=1
/usr/bin/cc -fPIC -Wall  -shared -Wl,-soname,libUnihan.so.0 -o libUnihan.so.0.5 CMakeFiles/Unihan.dir/Unihan.o CMakeFiles/Unihan.dir/Unihan_phonetic.o CMakeFiles/Unihan.dir/allocate.o CMakeFiles/Unihan.dir/collection.o CMakeFiles/Unihan.dir/file_functions.o CMakeFiles/Unihan.dir/sqlite_functions.o CMakeFiles/Unihan.dir/str_functions.o CMakeFiles/Unihan.dir/verboseMsg.o -lsqlite3 -lglib-2.0 
cd /usr/src/RPM/BUILD/libUnihan-0.5.3-Source/bin && /usr/bin/cmake -E cmake_symlink_library libUnihan.so.0.5 libUnihan.so.0 libUnihan.so
make[2]: Leaving directory '/usr/src/RPM/BUILD/libUnihan-0.5.3-Source'
make[1]: Entering directory '/usr/src/RPM/BUILD/libUnihan-0.5.3-Source'
[ 42%] Built target Unihan
make[1]: Leaving directory '/usr/src/RPM/BUILD/libUnihan-0.5.3-Source'
make -f bin/CMakeFiles/unihan_converter.dir/build.make bin/CMakeFiles/unihan_converter.dir/depend
make -f bin/CMakeFiles/unihan_query.dir/build.make bin/CMakeFiles/unihan_query.dir/depend
make -f test/CMakeFiles/check_phonetic.dir/build.make test/CMakeFiles/check_phonetic.dir/depend
make -f test/CMakeFiles/check_unihan_functions.dir/build.make test/CMakeFiles/check_unihan_functions.dir/depend
make -f test/CMakeFiles/check_toneMark.dir/build.make test/CMakeFiles/check_toneMark.dir/depend
make -f test/CMakeFiles/unihan_field_validation.dir/build.make test/CMakeFiles/unihan_field_validation.dir/depend
make[2]: Entering directory '/usr/src/RPM/BUILD/libUnihan-0.5.3-Source'
cd /usr/src/RPM/BUILD/libUnihan-0.5.3-Source && /usr/bin/cmake -E cmake_depends "Unix Makefiles" /usr/src/RPM/BUILD/libUnihan-0.5.3-Source /usr/src/RPM/BUILD/libUnihan-0.5.3-Source/test /usr/src/RPM/BUILD/libUnihan-0.5.3-Source /usr/src/RPM/BUILD/libUnihan-0.5.3-Source/test /usr/src/RPM/BUILD/libUnihan-0.5.3-Source/test/CMakeFiles/check_toneMark.dir/DependInfo.cmake --color=
Dependee "/usr/src/RPM/BUILD/libUnihan-0.5.3-Source/test/CMakeFiles/check_toneMark.dir/DependInfo.cmake" is newer than depender "/usr/src/RPM/BUILD/libUnihan-0.5.3-Source/test/CMakeFiles/check_toneMark.dir/depend.internal".
Dependee "/usr/src/RPM/BUILD/libUnihan-0.5.3-Source/test/CMakeFiles/CMakeDirectoryInformation.cmake" is newer than depender "/usr/src/RPM/BUILD/libUnihan-0.5.3-Source/test/CMakeFiles/check_toneMark.dir/depend.internal".
Scanning dependencies of target check_toneMark
make[2]: Leaving directory '/usr/src/RPM/BUILD/libUnihan-0.5.3-Source'
make[2]: Entering directory '/usr/src/RPM/BUILD/libUnihan-0.5.3-Source'
cd /usr/src/RPM/BUILD/libUnihan-0.5.3-Source && /usr/bin/cmake -E cmake_depends "Unix Makefiles" /usr/src/RPM/BUILD/libUnihan-0.5.3-Source /usr/src/RPM/BUILD/libUnihan-0.5.3-Source/test /usr/src/RPM/BUILD/libUnihan-0.5.3-Source /usr/src/RPM/BUILD/libUnihan-0.5.3-Source/test /usr/src/RPM/BUILD/libUnihan-0.5.3-Source/test/CMakeFiles/unihan_field_validation.dir/DependInfo.cmake --color=
Dependee "/usr/src/RPM/BUILD/libUnihan-0.5.3-Source/test/CMakeFiles/unihan_field_validation.dir/DependInfo.cmake" is newer than depender "/usr/src/RPM/BUILD/libUnihan-0.5.3-Source/test/CMakeFiles/unihan_field_validation.dir/depend.internal".
Dependee "/usr/src/RPM/BUILD/libUnihan-0.5.3-Source/test/CMakeFiles/CMakeDirectoryInformation.cmake" is newer than depender "/usr/src/RPM/BUILD/libUnihan-0.5.3-Source/test/CMakeFiles/unihan_field_validation.dir/depend.internal".
Scanning dependencies of target unihan_field_validation
make[2]: Leaving directory '/usr/src/RPM/BUILD/libUnihan-0.5.3-Source'
make -f test/CMakeFiles/unihan_field_validation.dir/build.make test/CMakeFiles/unihan_field_validation.dir/build
make -f test/CMakeFiles/check_toneMark.dir/build.make test/CMakeFiles/check_toneMark.dir/build
make[2]: Entering directory '/usr/src/RPM/BUILD/libUnihan-0.5.3-Source'
cd /usr/src/RPM/BUILD/libUnihan-0.5.3-Source && /usr/bin/cmake -E cmake_depends "Unix Makefiles" /usr/src/RPM/BUILD/libUnihan-0.5.3-Source /usr/src/RPM/BUILD/libUnihan-0.5.3-Source/test /usr/src/RPM/BUILD/libUnihan-0.5.3-Source /usr/src/RPM/BUILD/libUnihan-0.5.3-Source/test /usr/src/RPM/BUILD/libUnihan-0.5.3-Source/test/CMakeFiles/check_unihan_functions.dir/DependInfo.cmake --color=
Dependee "/usr/src/RPM/BUILD/libUnihan-0.5.3-Source/test/CMakeFiles/check_unihan_functions.dir/DependInfo.cmake" is newer than depender "/usr/src/RPM/BUILD/libUnihan-0.5.3-Source/test/CMakeFiles/check_unihan_functions.dir/depend.internal".
Dependee "/usr/src/RPM/BUILD/libUnihan-0.5.3-Source/test/CMakeFiles/CMakeDirectoryInformation.cmake" is newer than depender "/usr/src/RPM/BUILD/libUnihan-0.5.3-Source/test/CMakeFiles/check_unihan_functions.dir/depend.internal".
Scanning dependencies of target check_unihan_functions
make[2]: Leaving directory '/usr/src/RPM/BUILD/libUnihan-0.5.3-Source'
make -f test/CMakeFiles/check_unihan_functions.dir/build.make test/CMakeFiles/check_unihan_functions.dir/build
make[2]: Entering directory '/usr/src/RPM/BUILD/libUnihan-0.5.3-Source'
cd /usr/src/RPM/BUILD/libUnihan-0.5.3-Source && /usr/bin/cmake -E cmake_depends "Unix Makefiles" /usr/src/RPM/BUILD/libUnihan-0.5.3-Source /usr/src/RPM/BUILD/libUnihan-0.5.3-Source/test /usr/src/RPM/BUILD/libUnihan-0.5.3-Source /usr/src/RPM/BUILD/libUnihan-0.5.3-Source/test /usr/src/RPM/BUILD/libUnihan-0.5.3-Source/test/CMakeFiles/check_phonetic.dir/DependInfo.cmake --color=
Dependee "/usr/src/RPM/BUILD/libUnihan-0.5.3-Source/test/CMakeFiles/check_phonetic.dir/DependInfo.cmake" is newer than depender "/usr/src/RPM/BUILD/libUnihan-0.5.3-Source/test/CMakeFiles/check_phonetic.dir/depend.internal".
Dependee "/usr/src/RPM/BUILD/libUnihan-0.5.3-Source/test/CMakeFiles/CMakeDirectoryInformation.cmake" is newer than depender "/usr/src/RPM/BUILD/libUnihan-0.5.3-Source/test/CMakeFiles/check_phonetic.dir/depend.internal".
Scanning dependencies of target check_phonetic
make[2]: Leaving directory '/usr/src/RPM/BUILD/libUnihan-0.5.3-Source'
make -f test/CMakeFiles/check_phonetic.dir/build.make test/CMakeFiles/check_phonetic.dir/build
make[2]: Entering directory '/usr/src/RPM/BUILD/libUnihan-0.5.3-Source'
cd /usr/src/RPM/BUILD/libUnihan-0.5.3-Source && /usr/bin/cmake -E cmake_depends "Unix Makefiles" /usr/src/RPM/BUILD/libUnihan-0.5.3-Source /usr/src/RPM/BUILD/libUnihan-0.5.3-Source/src /usr/src/RPM/BUILD/libUnihan-0.5.3-Source /usr/src/RPM/BUILD/libUnihan-0.5.3-Source/bin /usr/src/RPM/BUILD/libUnihan-0.5.3-Source/bin/CMakeFiles/unihan_converter.dir/DependInfo.cmake --color=
Dependee "/usr/src/RPM/BUILD/libUnihan-0.5.3-Source/bin/CMakeFiles/unihan_converter.dir/DependInfo.cmake" is newer than depender "/usr/src/RPM/BUILD/libUnihan-0.5.3-Source/bin/CMakeFiles/unihan_converter.dir/depend.internal".
Dependee "/usr/src/RPM/BUILD/libUnihan-0.5.3-Source/bin/CMakeFiles/CMakeDirectoryInformation.cmake" is newer than depender "/usr/src/RPM/BUILD/libUnihan-0.5.3-Source/bin/CMakeFiles/unihan_converter.dir/depend.internal".
Scanning dependencies of target unihan_converter
make[2]: Leaving directory '/usr/src/RPM/BUILD/libUnihan-0.5.3-Source'
make -f bin/CMakeFiles/unihan_converter.dir/build.make bin/CMakeFiles/unihan_converter.dir/build
make[2]: Entering directory '/usr/src/RPM/BUILD/libUnihan-0.5.3-Source'
cd /usr/src/RPM/BUILD/libUnihan-0.5.3-Source && /usr/bin/cmake -E cmake_depends "Unix Makefiles" /usr/src/RPM/BUILD/libUnihan-0.5.3-Source /usr/src/RPM/BUILD/libUnihan-0.5.3-Source/src /usr/src/RPM/BUILD/libUnihan-0.5.3-Source /usr/src/RPM/BUILD/libUnihan-0.5.3-Source/bin /usr/src/RPM/BUILD/libUnihan-0.5.3-Source/bin/CMakeFiles/unihan_query.dir/DependInfo.cmake --color=
Dependee "/usr/src/RPM/BUILD/libUnihan-0.5.3-Source/bin/CMakeFiles/unihan_query.dir/DependInfo.cmake" is newer than depender "/usr/src/RPM/BUILD/libUnihan-0.5.3-Source/bin/CMakeFiles/unihan_query.dir/depend.internal".
Dependee "/usr/src/RPM/BUILD/libUnihan-0.5.3-Source/bin/CMakeFiles/CMakeDirectoryInformation.cmake" is newer than depender "/usr/src/RPM/BUILD/libUnihan-0.5.3-Source/bin/CMakeFiles/unihan_query.dir/depend.internal".
Scanning dependencies of target unihan_query
make[2]: Leaving directory '/usr/src/RPM/BUILD/libUnihan-0.5.3-Source'
make -f bin/CMakeFiles/unihan_query.dir/build.make bin/CMakeFiles/unihan_query.dir/build
make[2]: Entering directory '/usr/src/RPM/BUILD/libUnihan-0.5.3-Source'
[ 61%] Building C object test/CMakeFiles/check_unihan_functions.dir/check_unihan_functions.o
cd /usr/src/RPM/BUILD/libUnihan-0.5.3-Source/test && /usr/bin/cc -pipe -frecord-gcc-switches -Wall -g -O2 -march=i586 -mtune=generic -fPIC -DPIC -I/usr/include/glib-2.0 -I/usr/lib/glib-2.0/include -I/usr/src/RPM/BUILD/libUnihan-0.5.3-Source/test/../src  -Wall   -Ddatadir='"/usr/share"' -Ddocdir='"/usr/share/doc"' -DUNIHAN_DEFAULT_DB='"/usr/share/UnihanDb/Unihan.db"' -o CMakeFiles/check_unihan_functions.dir/check_unihan_functions.o   -c /usr/src/RPM/BUILD/libUnihan-0.5.3-Source/test/check_unihan_functions.c
make[2]: Leaving directory '/usr/src/RPM/BUILD/libUnihan-0.5.3-Source'
make[2]: Entering directory '/usr/src/RPM/BUILD/libUnihan-0.5.3-Source'
[ 57%] Building C object test/CMakeFiles/check_toneMark.dir/check_toneMark.o
cd /usr/src/RPM/BUILD/libUnihan-0.5.3-Source/test && /usr/bin/cc -pipe -frecord-gcc-switches -Wall -g -O2 -march=i586 -mtune=generic -fPIC -DPIC -I/usr/include/glib-2.0 -I/usr/lib/glib-2.0/include -I/usr/src/RPM/BUILD/libUnihan-0.5.3-Source/test/../src  -Wall   -Ddatadir='"/usr/share"' -Ddocdir='"/usr/share/doc"' -DUNIHAN_DEFAULT_DB='"/usr/share/UnihanDb/Unihan.db"' -o CMakeFiles/check_toneMark.dir/check_toneMark.o   -c /usr/src/RPM/BUILD/libUnihan-0.5.3-Source/test/check_toneMark.c
make[2]: Leaving directory '/usr/src/RPM/BUILD/libUnihan-0.5.3-Source'
make[2]: Entering directory '/usr/src/RPM/BUILD/libUnihan-0.5.3-Source'
[ 76%] Linking C executable check_unihan_functions
cd /usr/src/RPM/BUILD/libUnihan-0.5.3-Source/test && /usr/bin/cmake -E cmake_link_script CMakeFiles/check_unihan_functions.dir/link.txt --verbose=1
/usr/bin/cc -Wall  -rdynamic CMakeFiles/check_unihan_functions.dir/check_unihan_functions.o  -o check_unihan_functions  -L../lib -Wl,-rpath,../lib:/usr/src/RPM/BUILD/libUnihan-0.5.3-Source/bin ../bin/libUnihan.so.0.5 -lsqlite3 -lglib-2.0 
make[2]: Leaving directory '/usr/src/RPM/BUILD/libUnihan-0.5.3-Source'
make[1]: Entering directory '/usr/src/RPM/BUILD/libUnihan-0.5.3-Source'
[ 80%] Built target check_unihan_functions
make[1]: Leaving directory '/usr/src/RPM/BUILD/libUnihan-0.5.3-Source'
make[2]: Entering directory '/usr/src/RPM/BUILD/libUnihan-0.5.3-Source'
[ 80%] Linking C executable check_toneMark
cd /usr/src/RPM/BUILD/libUnihan-0.5.3-Source/test && /usr/bin/cmake -E cmake_link_script CMakeFiles/check_toneMark.dir/link.txt --verbose=1
/usr/bin/cc -Wall  -rdynamic CMakeFiles/check_toneMark.dir/check_toneMark.o  -o check_toneMark  -L../lib -Wl,-rpath,../lib:/usr/src/RPM/BUILD/libUnihan-0.5.3-Source/bin ../bin/libUnihan.so.0.5 -lsqlite3 -lglib-2.0 
make[2]: Leaving directory '/usr/src/RPM/BUILD/libUnihan-0.5.3-Source'
make[1]: Entering directory '/usr/src/RPM/BUILD/libUnihan-0.5.3-Source'
[ 80%] Built target check_toneMark
make[1]: Leaving directory '/usr/src/RPM/BUILD/libUnihan-0.5.3-Source'
make[2]: Entering directory '/usr/src/RPM/BUILD/libUnihan-0.5.3-Source'
[ 66%] Building C object bin/CMakeFiles/unihan_query.dir/unihan_query.o
cd /usr/src/RPM/BUILD/libUnihan-0.5.3-Source/bin && /usr/bin/cc -pipe -frecord-gcc-switches -Wall -g -O2 -march=i586 -mtune=generic -fPIC -DPIC -I/usr/include/glib-2.0 -I/usr/lib/glib-2.0/include  -Wall   -Ddatadir='"/usr/share"' -Ddocdir='"/usr/share/doc"' -DUNIHAN_DEFAULT_DB='"/usr/share/UnihanDb/Unihan.db"' -o CMakeFiles/unihan_query.dir/unihan_query.o   -c /usr/src/RPM/BUILD/libUnihan-0.5.3-Source/src/unihan_query.c
make[2]: Leaving directory '/usr/src/RPM/BUILD/libUnihan-0.5.3-Source'
make[2]: Entering directory '/usr/src/RPM/BUILD/libUnihan-0.5.3-Source'
[ 85%] Linking C executable unihan_query
cd /usr/src/RPM/BUILD/libUnihan-0.5.3-Source/bin && /usr/bin/cmake -E cmake_link_script CMakeFiles/unihan_query.dir/link.txt --verbose=1
/usr/bin/cc -Wall  -rdynamic CMakeFiles/unihan_query.dir/unihan_query.o  -o unihan_query -Wl,-rpath,/usr/src/RPM/BUILD/libUnihan-0.5.3-Source/bin: libUnihan.so.0.5 -lsqlite3 -lglib-2.0 
make[2]: Leaving directory '/usr/src/RPM/BUILD/libUnihan-0.5.3-Source'
make[2]: Entering directory '/usr/src/RPM/BUILD/libUnihan-0.5.3-Source'
[ 52%] Building C object test/CMakeFiles/check_phonetic.dir/check_phonetic.o
cd /usr/src/RPM/BUILD/libUnihan-0.5.3-Source/test && /usr/bin/cc -pipe -frecord-gcc-switches -Wall -g -O2 -march=i586 -mtune=generic -fPIC -DPIC -I/usr/include/glib-2.0 -I/usr/lib/glib-2.0/include -I/usr/src/RPM/BUILD/libUnihan-0.5.3-Source/test/../src  -Wall   -Ddatadir='"/usr/share"' -Ddocdir='"/usr/share/doc"' -DUNIHAN_DEFAULT_DB='"/usr/share/UnihanDb/Unihan.db"' -o CMakeFiles/check_phonetic.dir/check_phonetic.o   -c /usr/src/RPM/BUILD/libUnihan-0.5.3-Source/test/check_phonetic.c
make[2]: Leaving directory '/usr/src/RPM/BUILD/libUnihan-0.5.3-Source'
make[1]: Entering directory '/usr/src/RPM/BUILD/libUnihan-0.5.3-Source'
[ 90%] Built target unihan_query
make[1]: Leaving directory '/usr/src/RPM/BUILD/libUnihan-0.5.3-Source'
make[2]: Entering directory '/usr/src/RPM/BUILD/libUnihan-0.5.3-Source'
[ 90%] Linking C executable check_phonetic
cd /usr/src/RPM/BUILD/libUnihan-0.5.3-Source/test && /usr/bin/cmake -E cmake_link_script CMakeFiles/check_phonetic.dir/link.txt --verbose=1
/usr/bin/cc -Wall  -rdynamic CMakeFiles/check_phonetic.dir/check_phonetic.o  -o check_phonetic  -L../lib -Wl,-rpath,../lib:/usr/src/RPM/BUILD/libUnihan-0.5.3-Source/bin ../bin/libUnihan.so.0.5 -lsqlite3 -lglib-2.0 
make[2]: Leaving directory '/usr/src/RPM/BUILD/libUnihan-0.5.3-Source'
make[1]: Entering directory '/usr/src/RPM/BUILD/libUnihan-0.5.3-Source'
[ 90%] Built target check_phonetic
make[1]: Leaving directory '/usr/src/RPM/BUILD/libUnihan-0.5.3-Source'
make[2]: Entering directory '/usr/src/RPM/BUILD/libUnihan-0.5.3-Source'
[ 47%] Building C object test/CMakeFiles/unihan_field_validation.dir/__/src/unihan_converter.o
cd /usr/src/RPM/BUILD/libUnihan-0.5.3-Source/test && /usr/bin/cc -pipe -frecord-gcc-switches -Wall -g -O2 -march=i586 -mtune=generic -fPIC -DPIC -I/usr/include/glib-2.0 -I/usr/lib/glib-2.0/include -I/usr/src/RPM/BUILD/libUnihan-0.5.3-Source/test/../src  -Wall   -Ddatadir='"/usr/share"' -Ddocdir='"/usr/share/doc"' -DUNIHAN_DEFAULT_DB='"/usr/share/UnihanDb/Unihan.db"' -o CMakeFiles/unihan_field_validation.dir/__/src/unihan_converter.o   -c /usr/src/RPM/BUILD/libUnihan-0.5.3-Source/src/unihan_converter.c
make[2]: Leaving directory '/usr/src/RPM/BUILD/libUnihan-0.5.3-Source'
make[2]: Entering directory '/usr/src/RPM/BUILD/libUnihan-0.5.3-Source'
[ 71%] Building C object bin/CMakeFiles/unihan_converter.dir/unihan_converter.o
cd /usr/src/RPM/BUILD/libUnihan-0.5.3-Source/bin && /usr/bin/cc -pipe -frecord-gcc-switches -Wall -g -O2 -march=i586 -mtune=generic -fPIC -DPIC -I/usr/include/glib-2.0 -I/usr/lib/glib-2.0/include  -Wall   -Ddatadir='"/usr/share"' -Ddocdir='"/usr/share/doc"' -DUNIHAN_DEFAULT_DB='"/usr/share/UnihanDb/Unihan.db"' -o CMakeFiles/unihan_converter.dir/unihan_converter.o   -c /usr/src/RPM/BUILD/libUnihan-0.5.3-Source/src/unihan_converter.c
make[2]: Leaving directory '/usr/src/RPM/BUILD/libUnihan-0.5.3-Source'
make[2]: Entering directory '/usr/src/RPM/BUILD/libUnihan-0.5.3-Source'
[ 95%] Linking C executable unihan_field_validation
cd /usr/src/RPM/BUILD/libUnihan-0.5.3-Source/test && /usr/bin/cmake -E cmake_link_script CMakeFiles/unihan_field_validation.dir/link.txt --verbose=1
/usr/bin/cc -Wall  -rdynamic CMakeFiles/unihan_field_validation.dir/__/src/unihan_converter.o  -o unihan_field_validation  -L../lib -Wl,-rpath,../lib:/usr/src/RPM/BUILD/libUnihan-0.5.3-Source/bin ../bin/libUnihan.so.0.5 -lsqlite3 -lglib-2.0 
make[2]: Leaving directory '/usr/src/RPM/BUILD/libUnihan-0.5.3-Source'
make[1]: Entering directory '/usr/src/RPM/BUILD/libUnihan-0.5.3-Source'
[100%] Built target unihan_field_validation
make[1]: Leaving directory '/usr/src/RPM/BUILD/libUnihan-0.5.3-Source'
make[2]: Entering directory '/usr/src/RPM/BUILD/libUnihan-0.5.3-Source'
[100%] Linking C executable unihan_converter
cd /usr/src/RPM/BUILD/libUnihan-0.5.3-Source/bin && /usr/bin/cmake -E cmake_link_script CMakeFiles/unihan_converter.dir/link.txt --verbose=1
/usr/bin/cc -Wall  -rdynamic CMakeFiles/unihan_converter.dir/unihan_converter.o  -o unihan_converter -Wl,-rpath,/usr/src/RPM/BUILD/libUnihan-0.5.3-Source/bin: libUnihan.so.0.5 -lsqlite3 -lglib-2.0 
make[2]: Leaving directory '/usr/src/RPM/BUILD/libUnihan-0.5.3-Source'
make[1]: Entering directory '/usr/src/RPM/BUILD/libUnihan-0.5.3-Source'
[100%] Built target unihan_converter
make[1]: Leaving directory '/usr/src/RPM/BUILD/libUnihan-0.5.3-Source'
make: Entering directory '/usr/src/RPM/BUILD/libUnihan-0.5.3-Source'
/usr/bin/cmake -E cmake_progress_start /usr/src/RPM/BUILD/libUnihan-0.5.3-Source/CMakeFiles 0
make: Leaving directory '/usr/src/RPM/BUILD/libUnihan-0.5.3-Source'
+ make doxygen
make: Entering directory '/usr/src/RPM/BUILD/libUnihan-0.5.3-Source'
/usr/bin/cmake -S/usr/src/RPM/BUILD/libUnihan-0.5.3-Source -B/usr/src/RPM/BUILD/libUnihan-0.5.3-Source --check-build-system CMakeFiles/Makefile.cmake 0
make -f CMakeFiles/Makefile2 doxygen
make[1]: Entering directory '/usr/src/RPM/BUILD/libUnihan-0.5.3-Source'
/usr/bin/cmake -S/usr/src/RPM/BUILD/libUnihan-0.5.3-Source -B/usr/src/RPM/BUILD/libUnihan-0.5.3-Source --check-build-system CMakeFiles/Makefile.cmake 0
/usr/bin/cmake -E cmake_progress_start /usr/src/RPM/BUILD/libUnihan-0.5.3-Source/CMakeFiles 0
make -f CMakeFiles/Makefile2 CMakeFiles/doxygen.dir/all
make[2]: Entering directory '/usr/src/RPM/BUILD/libUnihan-0.5.3-Source'
make -f CMakeFiles/doxygen.dir/build.make CMakeFiles/doxygen.dir/depend
make[3]: Entering directory '/usr/src/RPM/BUILD/libUnihan-0.5.3-Source'
cd /usr/src/RPM/BUILD/libUnihan-0.5.3-Source && /usr/bin/cmake -E cmake_depends "Unix Makefiles" /usr/src/RPM/BUILD/libUnihan-0.5.3-Source /usr/src/RPM/BUILD/libUnihan-0.5.3-Source /usr/src/RPM/BUILD/libUnihan-0.5.3-Source /usr/src/RPM/BUILD/libUnihan-0.5.3-Source /usr/src/RPM/BUILD/libUnihan-0.5.3-Source/CMakeFiles/doxygen.dir/DependInfo.cmake --color=
Scanning dependencies of target doxygen
make[3]: Leaving directory '/usr/src/RPM/BUILD/libUnihan-0.5.3-Source'
make -f CMakeFiles/doxygen.dir/build.make CMakeFiles/doxygen.dir/build
make[3]: Entering directory '/usr/src/RPM/BUILD/libUnihan-0.5.3-Source'
/usr/bin/doxygen Doxyfile
warning: Tag `DETAILS_AT_TOP' at line 163 of file `Doxyfile' has become obsolete.
         To avoid this warning please remove this line from your configuration file or upgrade it using "doxygen -u"
warning: Tag `SHOW_DIRECTORIES' at line 453 of file `Doxyfile' has become obsolete.
         To avoid this warning please remove this line from your configuration file or upgrade it using "doxygen -u"
warning: Tag `HTML_ALIGN_MEMBERS' at line 765 of file `Doxyfile' has become obsolete.
         To avoid this warning please remove this line from your configuration file or upgrade it using "doxygen -u"
warning: Tag `XML_SCHEMA' at line 1052 of file `Doxyfile' has become obsolete.
         To avoid this warning please remove this line from your configuration file or upgrade it using "doxygen -u"
warning: Tag `XML_DTD' at line 1058 of file `Doxyfile' has become obsolete.
         To avoid this warning please remove this line from your configuration file or upgrade it using "doxygen -u"
warning: argument `HIERARCHIES' for option GENERATE_TREEVIEW is not a valid boolean value
Using the default: NO!
warning: doxygen no longer ships with the FreeSans font.
You may want to clear or change DOT_FONTNAME.
Otherwise you run the risk that the wrong font is being used for dot generated graphs.
Notice: Output directory `doc' does not exist. I have created it for you.
Searching for include files...
Searching for example files...
Searching for images...
Searching for dot files...
Searching for msc files...
Searching for dia files...
Searching for files to exclude
Searching INPUT for files to process...
Searching for files in directory /usr/src/RPM/BUILD/libUnihan-0.5.3-Source/src
Reading and parsing tag files
Parsing files
Preprocessing /usr/src/RPM/BUILD/libUnihan-0.5.3-Source/src/allocate.h...
Parsing file /usr/src/RPM/BUILD/libUnihan-0.5.3-Source/src/allocate.h...
Preprocessing /usr/src/RPM/BUILD/libUnihan-0.5.3-Source/src/collection.h...
Parsing file /usr/src/RPM/BUILD/libUnihan-0.5.3-Source/src/collection.h...
Preprocessing /usr/src/RPM/BUILD/libUnihan-0.5.3-Source/src/file_functions.h...
Parsing file /usr/src/RPM/BUILD/libUnihan-0.5.3-Source/src/file_functions.h...
Preprocessing /usr/src/RPM/BUILD/libUnihan-0.5.3-Source/src/sqlite_functions.h...
Parsing file /usr/src/RPM/BUILD/libUnihan-0.5.3-Source/src/sqlite_functions.h...
Preprocessing /usr/src/RPM/BUILD/libUnihan-0.5.3-Source/src/str_functions.h...
Parsing file /usr/src/RPM/BUILD/libUnihan-0.5.3-Source/src/str_functions.h...
Preprocessing /usr/src/RPM/BUILD/libUnihan-0.5.3-Source/src/Unihan.h...
Parsing file /usr/src/RPM/BUILD/libUnihan-0.5.3-Source/src/Unihan.h...
Preprocessing /usr/src/RPM/BUILD/libUnihan-0.5.3-Source/src/Unihan_enum.h...
Parsing file /usr/src/RPM/BUILD/libUnihan-0.5.3-Source/src/Unihan_enum.h...
Preprocessing /usr/src/RPM/BUILD/libUnihan-0.5.3-Source/src/Unihan_phonetic.h...
Parsing file /usr/src/RPM/BUILD/libUnihan-0.5.3-Source/src/Unihan_phonetic.h...
Preprocessing /usr/src/RPM/BUILD/libUnihan-0.5.3-Source/src/verboseMsg.h...
Parsing file /usr/src/RPM/BUILD/libUnihan-0.5.3-Source/src/verboseMsg.h...
Building group list...
Building directory list...
Building namespace list...
Building file list...
Building class list...
Associating documentation with classes...
Computing nesting relations for classes...
Building example list...
Searching for enumerations...
Searching for documented typedefs...
Searching for members imported via using declarations...
Searching for included using directives...
Searching for documented variables...
Building interface member list...
Building member list...
Searching for friends...
Searching for documented defines...
Computing class inheritance relations...
Computing class usage relations...
Flushing cached template relations that have become invalid...
Computing class relations...
Add enum values to enums...
Searching for member function documentation...
Creating members for template instances...
Building page list...
Search for main page...
Computing page relations...
Determining the scope of groups...
Sorting lists...
Freeing entry tree
Determining which enums are documented
Computing member relations...
Building full member lists recursively...
Adding members to member groups.
Computing member references...
Inheriting documentation...
Generating disk names...
Adding source references...
Adding xrefitems...
Sorting member lists...
Computing dependencies between directories...
Generating citations page...
Counting data structures...
Resolving user defined references...
Finding anchors and sections in the documentation...
Transferring function references...
Combining using relations...
Adding members to index pages...
Generating style sheet...
Generating search indices...
Generating example documentation...
Generating file sources...
Generating code for file allocate.h...
Generating code for file collection.h...
Generating code for file file_functions.h...
Generating code for file sqlite_functions.h...
Generating code for file str_functions.h...
Generating code for file Unihan.h...
Generating code for file Unihan_enum.h...
Generating code for file Unihan_phonetic.h...
Generating code for file verboseMsg.h...
Generating file documentation...
Generating docs for file allocate.h...
Generating docs for file collection.h...
Generating docs for file file_functions.h...
Generating docs for file sqlite_functions.h...
Generating docs for file str_functions.h...
Generating docs for file Unihan.h...
Generating docs for file Unihan_enum.h...
Generating docs for file Unihan_phonetic.h...
Generating docs for file verboseMsg.h...
Generating page documentation...
Generating group documentation...
Generating class documentation...
Generating docs for compound DatabaseFuncStru...
Generating docs for compound HashSet...
Generating docs for compound SQL_Result...
Generating docs for compound StringList...
Generating docs for compound UnihanIRG_SourceData...
Generating docs for compound UnihanIRG_SourceRec...
Generating namespace index...
Generating graph info page...
Generating directory documentation...
Generating index page...
Generating page index...
Generating module index...
Generating namespace index...
Generating namespace member index...
Generating annotated compound index...
Generating alphabetical compound index...
Generating hierarchical class index...
Generating member index...
Generating file index...
Generating file member index...
Generating example index...
finalizing index lists...
writing tag file...
lookup cache used 230/65536 hits=900 misses=231
finished...
make[3]: Leaving directory '/usr/src/RPM/BUILD/libUnihan-0.5.3-Source'
Built target doxygen
make[2]: Leaving directory '/usr/src/RPM/BUILD/libUnihan-0.5.3-Source'
/usr/bin/cmake -E cmake_progress_start /usr/src/RPM/BUILD/libUnihan-0.5.3-Source/CMakeFiles 0
make[1]: Leaving directory '/usr/src/RPM/BUILD/libUnihan-0.5.3-Source'
make: Leaving directory '/usr/src/RPM/BUILD/libUnihan-0.5.3-Source'
+ exit 0
Executing(%install): /bin/sh -e /usr/src/tmp/rpm-tmp.9958
+ umask 022
+ /bin/mkdir -p /usr/src/RPM/BUILD
+ cd /usr/src/RPM/BUILD
+ /bin/chmod -Rf u+rwX -- /usr/src/tmp/libUnihan-buildroot
+ :
+ /bin/rm -rf -- /usr/src/tmp/libUnihan-buildroot
+ cd libUnihan-0.5.3-Source
+ make 'INSTALL=/bin/install -p' install DESTDIR=/usr/src/tmp/libUnihan-buildroot
make: Entering directory '/usr/src/RPM/BUILD/libUnihan-0.5.3-Source'
/usr/bin/cmake -S/usr/src/RPM/BUILD/libUnihan-0.5.3-Source -B/usr/src/RPM/BUILD/libUnihan-0.5.3-Source --check-build-system CMakeFiles/Makefile.cmake 0
/usr/bin/cmake -E cmake_progress_start /usr/src/RPM/BUILD/libUnihan-0.5.3-Source/CMakeFiles /usr/src/RPM/BUILD/libUnihan-0.5.3-Source/CMakeFiles/progress.marks
make -f CMakeFiles/Makefile2 all
make[1]: Entering directory '/usr/src/RPM/BUILD/libUnihan-0.5.3-Source'
make -f bin/CMakeFiles/Unihan.dir/build.make bin/CMakeFiles/Unihan.dir/depend
make[2]: Entering directory '/usr/src/RPM/BUILD/libUnihan-0.5.3-Source'
cd /usr/src/RPM/BUILD/libUnihan-0.5.3-Source && /usr/bin/cmake -E cmake_depends "Unix Makefiles" /usr/src/RPM/BUILD/libUnihan-0.5.3-Source /usr/src/RPM/BUILD/libUnihan-0.5.3-Source/src /usr/src/RPM/BUILD/libUnihan-0.5.3-Source /usr/src/RPM/BUILD/libUnihan-0.5.3-Source/bin /usr/src/RPM/BUILD/libUnihan-0.5.3-Source/bin/CMakeFiles/Unihan.dir/DependInfo.cmake --color=
make[2]: Leaving directory '/usr/src/RPM/BUILD/libUnihan-0.5.3-Source'
make -f bin/CMakeFiles/Unihan.dir/build.make bin/CMakeFiles/Unihan.dir/build
make[2]: Entering directory '/usr/src/RPM/BUILD/libUnihan-0.5.3-Source'
make[2]: Nothing to be done for 'bin/CMakeFiles/Unihan.dir/build'.
make[2]: Leaving directory '/usr/src/RPM/BUILD/libUnihan-0.5.3-Source'
[ 42%] Built target Unihan
make -f bin/CMakeFiles/unihan_converter.dir/build.make bin/CMakeFiles/unihan_converter.dir/depend
make[2]: Entering directory '/usr/src/RPM/BUILD/libUnihan-0.5.3-Source'
cd /usr/src/RPM/BUILD/libUnihan-0.5.3-Source && /usr/bin/cmake -E cmake_depends "Unix Makefiles" /usr/src/RPM/BUILD/libUnihan-0.5.3-Source /usr/src/RPM/BUILD/libUnihan-0.5.3-Source/src /usr/src/RPM/BUILD/libUnihan-0.5.3-Source /usr/src/RPM/BUILD/libUnihan-0.5.3-Source/bin /usr/src/RPM/BUILD/libUnihan-0.5.3-Source/bin/CMakeFiles/unihan_converter.dir/DependInfo.cmake --color=
make[2]: Leaving directory '/usr/src/RPM/BUILD/libUnihan-0.5.3-Source'
make -f bin/CMakeFiles/unihan_converter.dir/build.make bin/CMakeFiles/unihan_converter.dir/build
make[2]: Entering directory '/usr/src/RPM/BUILD/libUnihan-0.5.3-Source'
make[2]: Nothing to be done for 'bin/CMakeFiles/unihan_converter.dir/build'.
make[2]: Leaving directory '/usr/src/RPM/BUILD/libUnihan-0.5.3-Source'
[ 52%] Built target unihan_converter
make -f bin/CMakeFiles/unihan_query.dir/build.make bin/CMakeFiles/unihan_query.dir/depend
make[2]: Entering directory '/usr/src/RPM/BUILD/libUnihan-0.5.3-Source'
cd /usr/src/RPM/BUILD/libUnihan-0.5.3-Source && /usr/bin/cmake -E cmake_depends "Unix Makefiles" /usr/src/RPM/BUILD/libUnihan-0.5.3-Source /usr/src/RPM/BUILD/libUnihan-0.5.3-Source/src /usr/src/RPM/BUILD/libUnihan-0.5.3-Source /usr/src/RPM/BUILD/libUnihan-0.5.3-Source/bin /usr/src/RPM/BUILD/libUnihan-0.5.3-Source/bin/CMakeFiles/unihan_query.dir/DependInfo.cmake --color=
make[2]: Leaving directory '/usr/src/RPM/BUILD/libUnihan-0.5.3-Source'
make -f bin/CMakeFiles/unihan_query.dir/build.make bin/CMakeFiles/unihan_query.dir/build
make[2]: Entering directory '/usr/src/RPM/BUILD/libUnihan-0.5.3-Source'
make[2]: Nothing to be done for 'bin/CMakeFiles/unihan_query.dir/build'.
make[2]: Leaving directory '/usr/src/RPM/BUILD/libUnihan-0.5.3-Source'
[ 61%] Built target unihan_query
make -f test/CMakeFiles/check_phonetic.dir/build.make test/CMakeFiles/check_phonetic.dir/depend
make[2]: Entering directory '/usr/src/RPM/BUILD/libUnihan-0.5.3-Source'
cd /usr/src/RPM/BUILD/libUnihan-0.5.3-Source && /usr/bin/cmake -E cmake_depends "Unix Makefiles" /usr/src/RPM/BUILD/libUnihan-0.5.3-Source /usr/src/RPM/BUILD/libUnihan-0.5.3-Source/test /usr/src/RPM/BUILD/libUnihan-0.5.3-Source /usr/src/RPM/BUILD/libUnihan-0.5.3-Source/test /usr/src/RPM/BUILD/libUnihan-0.5.3-Source/test/CMakeFiles/check_phonetic.dir/DependInfo.cmake --color=
make[2]: Leaving directory '/usr/src/RPM/BUILD/libUnihan-0.5.3-Source'
make -f test/CMakeFiles/check_phonetic.dir/build.make test/CMakeFiles/check_phonetic.dir/build
make[2]: Entering directory '/usr/src/RPM/BUILD/libUnihan-0.5.3-Source'
make[2]: Nothing to be done for 'test/CMakeFiles/check_phonetic.dir/build'.
make[2]: Leaving directory '/usr/src/RPM/BUILD/libUnihan-0.5.3-Source'
[ 71%] Built target check_phonetic
make -f test/CMakeFiles/check_unihan_functions.dir/build.make test/CMakeFiles/check_unihan_functions.dir/depend
make[2]: Entering directory '/usr/src/RPM/BUILD/libUnihan-0.5.3-Source'
cd /usr/src/RPM/BUILD/libUnihan-0.5.3-Source && /usr/bin/cmake -E cmake_depends "Unix Makefiles" /usr/src/RPM/BUILD/libUnihan-0.5.3-Source /usr/src/RPM/BUILD/libUnihan-0.5.3-Source/test /usr/src/RPM/BUILD/libUnihan-0.5.3-Source /usr/src/RPM/BUILD/libUnihan-0.5.3-Source/test /usr/src/RPM/BUILD/libUnihan-0.5.3-Source/test/CMakeFiles/check_unihan_functions.dir/DependInfo.cmake --color=
make[2]: Leaving directory '/usr/src/RPM/BUILD/libUnihan-0.5.3-Source'
make -f test/CMakeFiles/check_unihan_functions.dir/build.make test/CMakeFiles/check_unihan_functions.dir/build
make[2]: Entering directory '/usr/src/RPM/BUILD/libUnihan-0.5.3-Source'
make[2]: Nothing to be done for 'test/CMakeFiles/check_unihan_functions.dir/build'.
make[2]: Leaving directory '/usr/src/RPM/BUILD/libUnihan-0.5.3-Source'
[ 80%] Built target check_unihan_functions
make -f test/CMakeFiles/check_toneMark.dir/build.make test/CMakeFiles/check_toneMark.dir/depend
make[2]: Entering directory '/usr/src/RPM/BUILD/libUnihan-0.5.3-Source'
cd /usr/src/RPM/BUILD/libUnihan-0.5.3-Source && /usr/bin/cmake -E cmake_depends "Unix Makefiles" /usr/src/RPM/BUILD/libUnihan-0.5.3-Source /usr/src/RPM/BUILD/libUnihan-0.5.3-Source/test /usr/src/RPM/BUILD/libUnihan-0.5.3-Source /usr/src/RPM/BUILD/libUnihan-0.5.3-Source/test /usr/src/RPM/BUILD/libUnihan-0.5.3-Source/test/CMakeFiles/check_toneMark.dir/DependInfo.cmake --color=
make[2]: Leaving directory '/usr/src/RPM/BUILD/libUnihan-0.5.3-Source'
make -f test/CMakeFiles/check_toneMark.dir/build.make test/CMakeFiles/check_toneMark.dir/build
make[2]: Entering directory '/usr/src/RPM/BUILD/libUnihan-0.5.3-Source'
make[2]: Nothing to be done for 'test/CMakeFiles/check_toneMark.dir/build'.
make[2]: Leaving directory '/usr/src/RPM/BUILD/libUnihan-0.5.3-Source'
[ 90%] Built target check_toneMark
make -f test/CMakeFiles/unihan_field_validation.dir/build.make test/CMakeFiles/unihan_field_validation.dir/depend
make[2]: Entering directory '/usr/src/RPM/BUILD/libUnihan-0.5.3-Source'
cd /usr/src/RPM/BUILD/libUnihan-0.5.3-Source && /usr/bin/cmake -E cmake_depends "Unix Makefiles" /usr/src/RPM/BUILD/libUnihan-0.5.3-Source /usr/src/RPM/BUILD/libUnihan-0.5.3-Source/test /usr/src/RPM/BUILD/libUnihan-0.5.3-Source /usr/src/RPM/BUILD/libUnihan-0.5.3-Source/test /usr/src/RPM/BUILD/libUnihan-0.5.3-Source/test/CMakeFiles/unihan_field_validation.dir/DependInfo.cmake --color=
make[2]: Leaving directory '/usr/src/RPM/BUILD/libUnihan-0.5.3-Source'
make -f test/CMakeFiles/unihan_field_validation.dir/build.make test/CMakeFiles/unihan_field_validation.dir/build
make[2]: Entering directory '/usr/src/RPM/BUILD/libUnihan-0.5.3-Source'
make[2]: Nothing to be done for 'test/CMakeFiles/unihan_field_validation.dir/build'.
make[2]: Leaving directory '/usr/src/RPM/BUILD/libUnihan-0.5.3-Source'
[100%] Built target unihan_field_validation
make[1]: Leaving directory '/usr/src/RPM/BUILD/libUnihan-0.5.3-Source'
/usr/bin/cmake -E cmake_progress_start /usr/src/RPM/BUILD/libUnihan-0.5.3-Source/CMakeFiles 0
make -f CMakeFiles/Makefile2 preinstall
make[1]: Entering directory '/usr/src/RPM/BUILD/libUnihan-0.5.3-Source'
make[1]: Nothing to be done for 'preinstall'.
make[1]: Leaving directory '/usr/src/RPM/BUILD/libUnihan-0.5.3-Source'
Install the project...
/usr/bin/cmake -P cmake_install.cmake
-- Install configuration: ""
-- Installing: /usr/src/tmp/libUnihan-buildroot/usr/share/doc/libUnihan/AUTHORS
-- Installing: /usr/src/tmp/libUnihan-buildroot/usr/share/doc/libUnihan/README
-- Installing: /usr/src/tmp/libUnihan-buildroot/usr/share/doc/libUnihan/ChangeLog
-- Installing: /usr/src/tmp/libUnihan-buildroot/usr/share/doc/libUnihan/NEWS
-- Installing: /usr/src/tmp/libUnihan-buildroot/usr/share/doc/libUnihan/COPYING
-- Installing: /usr/src/tmp/libUnihan-buildroot/usr/share/doc/libUnihan/COPYING.LESSER
-- Installing: /usr/src/tmp/libUnihan-buildroot/usr/share/doc/libUnihan/html
-- Installing: /usr/src/tmp/libUnihan-buildroot/usr/share/doc/libUnihan/html/splitbar.png
-- Installing: /usr/src/tmp/libUnihan-buildroot/usr/share/doc/libUnihan/html/folderclosed.png
-- Installing: /usr/src/tmp/libUnihan-buildroot/usr/share/doc/libUnihan/html/folderopen.png
-- Installing: /usr/src/tmp/libUnihan-buildroot/usr/share/doc/libUnihan/html/doc.png
-- Installing: /usr/src/tmp/libUnihan-buildroot/usr/share/doc/libUnihan/html/globals_defs.html
-- Installing: /usr/src/tmp/libUnihan-buildroot/usr/share/doc/libUnihan/html/globals_eval_z.html
-- Installing: /usr/src/tmp/libUnihan-buildroot/usr/share/doc/libUnihan/html/globals_eval_u.html
-- Installing: /usr/src/tmp/libUnihan-buildroot/usr/share/doc/libUnihan/html/globals_eval_t.html
-- Installing: /usr/src/tmp/libUnihan-buildroot/usr/share/doc/libUnihan/html/globals_eval_p.html
-- Installing: /usr/src/tmp/libUnihan-buildroot/usr/share/doc/libUnihan/html/globals_eval.html
-- Installing: /usr/src/tmp/libUnihan-buildroot/usr/share/doc/libUnihan/html/globals_enum.html
-- Installing: /usr/src/tmp/libUnihan-buildroot/usr/share/doc/libUnihan/html/globals_type.html
-- Installing: /usr/src/tmp/libUnihan-buildroot/usr/share/doc/libUnihan/html/globals_vars.html
-- Installing: /usr/src/tmp/libUnihan-buildroot/usr/share/doc/libUnihan/html/globals_func.html
-- Installing: /usr/src/tmp/libUnihan-buildroot/usr/share/doc/libUnihan/html/globals_z.html
-- Installing: /usr/src/tmp/libUnihan-buildroot/usr/share/doc/libUnihan/html/globals_v.html
-- Installing: /usr/src/tmp/libUnihan-buildroot/usr/share/doc/libUnihan/html/globals_u.html
-- Installing: /usr/src/tmp/libUnihan-buildroot/usr/share/doc/libUnihan/html/globals_t.html
-- Installing: /usr/src/tmp/libUnihan-buildroot/usr/share/doc/libUnihan/html/globals_s.html
-- Installing: /usr/src/tmp/libUnihan-buildroot/usr/share/doc/libUnihan/html/globals_p.html
-- Installing: /usr/src/tmp/libUnihan-buildroot/usr/share/doc/libUnihan/html/globals_n.html
-- Installing: /usr/src/tmp/libUnihan-buildroot/usr/share/doc/libUnihan/html/globals_l.html
-- Installing: /usr/src/tmp/libUnihan-buildroot/usr/share/doc/libUnihan/html/globals_i.html
-- Installing: /usr/src/tmp/libUnihan-buildroot/usr/share/doc/libUnihan/html/globals_h.html
-- Installing: /usr/src/tmp/libUnihan-buildroot/usr/share/doc/libUnihan/html/globals_g.html
-- Installing: /usr/src/tmp/libUnihan-buildroot/usr/share/doc/libUnihan/html/globals_f.html
-- Installing: /usr/src/tmp/libUnihan-buildroot/usr/share/doc/libUnihan/html/globals_e.html
-- Installing: /usr/src/tmp/libUnihan-buildroot/usr/share/doc/libUnihan/html/globals_d.html
-- Installing: /usr/src/tmp/libUnihan-buildroot/usr/share/doc/libUnihan/html/globals_c.html
-- Installing: /usr/src/tmp/libUnihan-buildroot/usr/share/doc/libUnihan/html/globals.html
-- Installing: /usr/src/tmp/libUnihan-buildroot/usr/share/doc/libUnihan/html/files.html
-- Installing: /usr/src/tmp/libUnihan-buildroot/usr/share/doc/libUnihan/html/functions_vars.html
-- Installing: /usr/src/tmp/libUnihan-buildroot/usr/share/doc/libUnihan/html/functions.html
-- Installing: /usr/src/tmp/libUnihan-buildroot/usr/share/doc/libUnihan/html/classes.html
-- Installing: /usr/src/tmp/libUnihan-buildroot/usr/share/doc/libUnihan/html/annotated.html
-- Installing: /usr/src/tmp/libUnihan-buildroot/usr/share/doc/libUnihan/html/modules.html
-- Installing: /usr/src/tmp/libUnihan-buildroot/usr/share/doc/libUnihan/html/index.html
-- Installing: /usr/src/tmp/libUnihan-buildroot/usr/share/doc/libUnihan/html/menudata.js
-- Installing: /usr/src/tmp/libUnihan-buildroot/usr/share/doc/libUnihan/html/dir_68267d1309a1af8e8297ef4c3efbcdba.html
-- Installing: /usr/src/tmp/libUnihan-buildroot/usr/share/doc/libUnihan/html/structUnihanIRG__SourceRec.html
-- Installing: /usr/src/tmp/libUnihan-buildroot/usr/share/doc/libUnihan/html/structUnihanIRG__SourceData.html
-- Installing: /usr/src/tmp/libUnihan-buildroot/usr/share/doc/libUnihan/html/structStringList.html
-- Installing: /usr/src/tmp/libUnihan-buildroot/usr/share/doc/libUnihan/html/structSQL__Result.html
-- Installing: /usr/src/tmp/libUnihan-buildroot/usr/share/doc/libUnihan/html/structHashSet.html
-- Installing: /usr/src/tmp/libUnihan-buildroot/usr/share/doc/libUnihan/html/structDatabaseFuncStru.html
-- Installing: /usr/src/tmp/libUnihan-buildroot/usr/share/doc/libUnihan/html/group__FileAccessMode.html
-- Installing: /usr/src/tmp/libUnihan-buildroot/usr/share/doc/libUnihan/html/verboseMsg_8h.html
-- Installing: /usr/src/tmp/libUnihan-buildroot/usr/share/doc/libUnihan/html/Unihan__phonetic_8h.html
-- Installing: /usr/src/tmp/libUnihan-buildroot/usr/share/doc/libUnihan/html/Unihan__enum_8h.html
-- Installing: /usr/src/tmp/libUnihan-buildroot/usr/share/doc/libUnihan/html/Unihan_8h.html
-- Installing: /usr/src/tmp/libUnihan-buildroot/usr/share/doc/libUnihan/html/str__functions_8h.html
-- Installing: /usr/src/tmp/libUnihan-buildroot/usr/share/doc/libUnihan/html/sqlite__functions_8h.html
-- Installing: /usr/src/tmp/libUnihan-buildroot/usr/share/doc/libUnihan/html/file__functions_8h.html
-- Installing: /usr/src/tmp/libUnihan-buildroot/usr/share/doc/libUnihan/html/collection_8h.html
-- Installing: /usr/src/tmp/libUnihan-buildroot/usr/share/doc/libUnihan/html/allocate_8h.html
-- Installing: /usr/src/tmp/libUnihan-buildroot/usr/share/doc/libUnihan/html/verboseMsg_8h_source.html
-- Installing: /usr/src/tmp/libUnihan-buildroot/usr/share/doc/libUnihan/html/Unihan__phonetic_8h_source.html
-- Installing: /usr/src/tmp/libUnihan-buildroot/usr/share/doc/libUnihan/html/Unihan__enum_8h_source.html
-- Installing: /usr/src/tmp/libUnihan-buildroot/usr/share/doc/libUnihan/html/Unihan_8h_source.html
-- Installing: /usr/src/tmp/libUnihan-buildroot/usr/share/doc/libUnihan/html/str__functions_8h_source.html
-- Installing: /usr/src/tmp/libUnihan-buildroot/usr/share/doc/libUnihan/html/sqlite__functions_8h_source.html
-- Installing: /usr/src/tmp/libUnihan-buildroot/usr/share/doc/libUnihan/html/file__functions_8h_source.html
-- Installing: /usr/src/tmp/libUnihan-buildroot/usr/share/doc/libUnihan/html/collection_8h_source.html
-- Installing: /usr/src/tmp/libUnihan-buildroot/usr/share/doc/libUnihan/html/allocate_8h_source.html
-- Installing: /usr/src/tmp/libUnihan-buildroot/usr/share/doc/libUnihan/html/doxygen.css
-- Installing: /usr/src/tmp/libUnihan-buildroot/usr/share/doc/libUnihan/html/nav_g.png
-- Installing: /usr/src/tmp/libUnihan-buildroot/usr/share/doc/libUnihan/html/sync_off.png
-- Installing: /usr/src/tmp/libUnihan-buildroot/usr/share/doc/libUnihan/html/sync_on.png
-- Installing: /usr/src/tmp/libUnihan-buildroot/usr/share/doc/libUnihan/html/bdwn.png
-- Installing: /usr/src/tmp/libUnihan-buildroot/usr/share/doc/libUnihan/html/open.png
-- Installing: /usr/src/tmp/libUnihan-buildroot/usr/share/doc/libUnihan/html/closed.png
-- Installing: /usr/src/tmp/libUnihan-buildroot/usr/share/doc/libUnihan/html/doxygen.png
-- Installing: /usr/src/tmp/libUnihan-buildroot/usr/share/doc/libUnihan/html/bc_s.png
-- Installing: /usr/src/tmp/libUnihan-buildroot/usr/share/doc/libUnihan/html/nav_f.png
-- Installing: /usr/src/tmp/libUnihan-buildroot/usr/share/doc/libUnihan/html/nav_h.png
-- Installing: /usr/src/tmp/libUnihan-buildroot/usr/share/doc/libUnihan/html/tab_s.png
-- Installing: /usr/src/tmp/libUnihan-buildroot/usr/share/doc/libUnihan/html/tab_h.png
-- Installing: /usr/src/tmp/libUnihan-buildroot/usr/share/doc/libUnihan/html/tab_b.png
-- Installing: /usr/src/tmp/libUnihan-buildroot/usr/share/doc/libUnihan/html/tab_a.png
-- Installing: /usr/src/tmp/libUnihan-buildroot/usr/share/doc/libUnihan/html/menu.js
-- Installing: /usr/src/tmp/libUnihan-buildroot/usr/share/doc/libUnihan/html/jquery.js
-- Installing: /usr/src/tmp/libUnihan-buildroot/usr/share/doc/libUnihan/html/tabs.css
-- Installing: /usr/src/tmp/libUnihan-buildroot/usr/bin/unihan_converter
-- Set runtime path of "/usr/src/tmp/libUnihan-buildroot/usr/bin/unihan_converter" to ""
-- Installing: /usr/src/tmp/libUnihan-buildroot/usr/bin/unihan_query
-- Set runtime path of "/usr/src/tmp/libUnihan-buildroot/usr/bin/unihan_query" to ""
-- Installing: /usr/src/tmp/libUnihan-buildroot/usr/lib/libUnihan.so.0.5
-- Installing: /usr/src/tmp/libUnihan-buildroot/usr/lib/libUnihan.so.0
-- Installing: /usr/src/tmp/libUnihan-buildroot/usr/lib/libUnihan.so
-- Installing: /usr/src/tmp/libUnihan-buildroot/usr/include/libUnihan/Unihan.h
-- Installing: /usr/src/tmp/libUnihan-buildroot/usr/include/libUnihan/Unihan_enum.h
-- Installing: /usr/src/tmp/libUnihan-buildroot/usr/include/libUnihan/Unihan_phonetic.h
-- Installing: /usr/src/tmp/libUnihan-buildroot/usr/include/libUnihan/allocate.h
-- Installing: /usr/src/tmp/libUnihan-buildroot/usr/include/libUnihan/collection.h
-- Installing: /usr/src/tmp/libUnihan-buildroot/usr/include/libUnihan/file_functions.h
-- Installing: /usr/src/tmp/libUnihan-buildroot/usr/include/libUnihan/sqlite_functions.h
-- Installing: /usr/src/tmp/libUnihan-buildroot/usr/include/libUnihan/str_functions.h
-- Installing: /usr/src/tmp/libUnihan-buildroot/usr/include/libUnihan/verboseMsg.h
make: Leaving directory '/usr/src/RPM/BUILD/libUnihan-0.5.3-Source'
+ /usr/lib/rpm/brp-alt
Cleaning files in /usr/src/tmp/libUnihan-buildroot (auto)
mode of './usr/lib/libUnihan.so.0.5' changed from 0755 (rwxr-xr-x) to 0644 (rw-r--r--)
Verifying and fixing files in /usr/src/tmp/libUnihan-buildroot (binconfig,pkgconfig,libtool,desktop)
Checking contents of files in /usr/src/tmp/libUnihan-buildroot/ (default)
Compressing files in /usr/src/tmp/libUnihan-buildroot (auto)
Adjusting library links in /usr/src/tmp/libUnihan-buildroot
./usr/lib:
	libUnihan.so.0 -> libUnihan.so.0.5
Verifying ELF objects in /usr/src/tmp/libUnihan-buildroot (arch=normal,fhs=normal,lfs=relaxed,lint=relaxed,rpath=normal,stack=normal,textrel=normal,unresolved=normal)
verify-elf: WARNING: ./usr/bin/unihan_converter: uses non-LFS functions: fopen
Hardlinking identical .pyc and .pyo files
Processing files: libUnihan-0.5.3-alt5_19
Executing(%doc): /bin/sh -e /usr/src/tmp/rpm-tmp.93970
+ umask 022
+ /bin/mkdir -p /usr/src/RPM/BUILD
+ cd /usr/src/RPM/BUILD
+ cd libUnihan-0.5.3-Source
+ DOCDIR=/usr/src/tmp/libUnihan-buildroot/usr/share/doc/libUnihan-0.5.3
+ export DOCDIR
+ rm -rf /usr/src/tmp/libUnihan-buildroot/usr/share/doc/libUnihan-0.5.3
+ /bin/mkdir -p /usr/src/tmp/libUnihan-buildroot/usr/share/doc/libUnihan-0.5.3
+ cp -prL AUTHORS NEWS README /usr/src/tmp/libUnihan-buildroot/usr/share/doc/libUnihan-0.5.3
+ chmod -R go-w /usr/src/tmp/libUnihan-buildroot/usr/share/doc/libUnihan-0.5.3
+ chmod -R a+rX /usr/src/tmp/libUnihan-buildroot/usr/share/doc/libUnihan-0.5.3
+ cp -prL COPYING COPYING.LESSER /usr/src/tmp/libUnihan-buildroot/usr/share/doc/libUnihan-0.5.3
+ chmod -R go-w /usr/src/tmp/libUnihan-buildroot/usr/share/doc/libUnihan-0.5.3
+ chmod -R a+rX /usr/src/tmp/libUnihan-buildroot/usr/share/doc/libUnihan-0.5.3
+ exit 0
Finding Provides (using /usr/lib/rpm/find-provides)
Executing: /bin/sh -e /usr/src/tmp/rpm-tmp.2Qk8Ik
find-provides: running scripts (alternatives,debuginfo,gir,lib,pam,perl,pkgconfig,python,shell,typelib)
lib.prov: /usr/src/tmp/libUnihan-buildroot/usr/lib/libUnihan.so.0: 176 symbols, 18 bpp
Finding Requires (using /usr/lib/rpm/find-requires)
Executing: /bin/sh -e /usr/src/tmp/rpm-tmp.wU3JSJ
find-requires: running scripts (cpp,debuginfo,files,gir-js,gir-python,gir,lib,pam,perl,pkgconfig,pkgconfiglib,python,rpmlib,shebang,shell,static,symlinks,typelib)
Provides: libUnihan.so.0 = set:ld2BxGNxsODNWX2xY1GAsxafKfqk2QNtXv3CnhBpagZx81Q8iFdDOAb6Moro1vilNrkIuOZ2ZG3xp5ZJhp0qaHcCFE9SxhOVwZ8Zoc7dt13JCjAHxJZG3MbunMEdMdUo7GgJZmAp9iarXSloFgBHjCmIY2MbasPYzgrimya9ZHypRNeO30euCgijMw0EzeCkZaAsfCe0PwCkf4nkqQSaGdRhK4xWYqeIAKOLl7aWdnK2nEp1Z3rfqar9M2SLgqrIfYaykCixUKt2esNVyjVVTkZIhEJwbzVxCYVTh4B19xE4vQxl7jN7jsUOZfBomTiW4ia0EBdRhvhnUHHcZpeFGHbikDqxRAJJFDCLJb
Requires: /lib/ld-linux.so.2, libc.so.6(GLIBC_2.0), libc.so.6(GLIBC_2.1.3), libc.so.6(GLIBC_2.3), libc.so.6(GLIBC_2.3.4), libc.so.6(GLIBC_2.4), libglib-2.0.so.0 >= set:oijBoLu1RzED928HrW82dfk9Cf2fHo3ZhKQDkgWgp6nOyFZ1yAVXPhaZxYZcc3RLbCJYh1lCQRF80apyAuRkJkpcNwCfS82k2HFEFIP8PZL4SY9zEndHFn2RlRtpHIEWXUkaChOPgEMk5GIB8394Y4RMOrcOFCCExdtd41, libsqlite3.so.0 >= set:okZxC4pSWpg0v2N7kmD1oNhomAwSrpRVlZLyhhl1ZgH9Hc4, rtld(GNU_HASH)
Requires(rpmlib): rpmlib(SetVersions)
Finding debuginfo files (using /usr/lib/rpm/find-debuginfo-files)
Executing: /bin/sh -e /usr/src/tmp/rpm-tmp.FOboLo
Creating libUnihan-debuginfo package
Processing files: libUnihan-devel-0.5.3-alt5_19
Executing(%doc): /bin/sh -e /usr/src/tmp/rpm-tmp.38439
+ umask 022
+ /bin/mkdir -p /usr/src/RPM/BUILD
+ cd /usr/src/RPM/BUILD
+ cd libUnihan-0.5.3-Source
+ DOCDIR=/usr/src/tmp/libUnihan-buildroot/usr/share/doc/libUnihan-devel-0.5.3
+ export DOCDIR
+ rm -rf /usr/src/tmp/libUnihan-buildroot/usr/share/doc/libUnihan-devel-0.5.3
+ /bin/mkdir -p /usr/src/tmp/libUnihan-buildroot/usr/share/doc/libUnihan-devel-0.5.3
+ cp -prL COPYING COPYING.LESSER /usr/src/tmp/libUnihan-buildroot/usr/share/doc/libUnihan-devel-0.5.3
+ chmod -R go-w /usr/src/tmp/libUnihan-buildroot/usr/share/doc/libUnihan-devel-0.5.3
+ chmod -R a+rX /usr/src/tmp/libUnihan-buildroot/usr/share/doc/libUnihan-devel-0.5.3
+ cp -prL ChangeLog /usr/src/tmp/libUnihan-buildroot/usr/share/doc/libUnihan-devel-0.5.3
+ chmod -R go-w /usr/src/tmp/libUnihan-buildroot/usr/share/doc/libUnihan-devel-0.5.3
+ chmod -R a+rX /usr/src/tmp/libUnihan-buildroot/usr/share/doc/libUnihan-devel-0.5.3
+ exit 0
Finding Provides (using /usr/lib/rpm/find-provides)
Executing: /bin/sh -e /usr/src/tmp/rpm-tmp.qPh0lB
find-provides: running scripts (alternatives,debuginfo,gir,lib,pam,perl,pkgconfig,python,shell,typelib)
Finding Requires (using /usr/lib/rpm/find-requires)
Executing: /bin/sh -e /usr/src/tmp/rpm-tmp.M2Ow3c
find-requires: running scripts (cpp,debuginfo,files,gir-js,gir-python,gir,lib,pam,perl,pkgconfig,pkgconfiglib,python,rpmlib,shebang,shell,static,symlinks,typelib)
In file included from /usr/src/tmp/libUnihan-buildroot/usr/include/libUnihan/Unihan.h:31:
/usr/src/tmp/libUnihan-buildroot/usr/include/libUnihan/Unihan_enum.h:33:10: fatal error: glib.h: No such file or directory
 #include <glib.h>
          ^~~~~~~~
compilation terminated.
cpp.req: /usr/src/tmp/libUnihan-buildroot/usr/include/libUnihan/Unihan.h: cpp failed, trying c++ mode
In file included from /usr/src/tmp/libUnihan-buildroot/usr/include/libUnihan/Unihan.h:31:
/usr/src/tmp/libUnihan-buildroot/usr/include/libUnihan/Unihan_enum.h:33:10: fatal error: glib.h: No such file or directory
 #include <glib.h>
          ^~~~~~~~
compilation terminated.
cpp.req: WARNING: /usr/src/tmp/libUnihan-buildroot/usr/include/libUnihan/Unihan.h: cpp failed
/usr/src/tmp/libUnihan-buildroot/usr/include/libUnihan/allocate.h:34:10: fatal error: glib.h: No such file or directory
 #include <glib.h>
          ^~~~~~~~
compilation terminated.
cpp.req: /usr/src/tmp/libUnihan-buildroot/usr/include/libUnihan/allocate.h: cpp failed, trying c++ mode
/usr/src/tmp/libUnihan-buildroot/usr/include/libUnihan/allocate.h:34:10: fatal error: glib.h: No such file or directory
 #include <glib.h>
          ^~~~~~~~
compilation terminated.
cpp.req: WARNING: /usr/src/tmp/libUnihan-buildroot/usr/include/libUnihan/allocate.h: cpp failed
/usr/src/tmp/libUnihan-buildroot/usr/include/libUnihan/collection.h:32:10: fatal error: glib.h: No such file or directory
 #include <glib.h>
          ^~~~~~~~
compilation terminated.
cpp.req: /usr/src/tmp/libUnihan-buildroot/usr/include/libUnihan/collection.h: cpp failed, trying c++ mode
/usr/src/tmp/libUnihan-buildroot/usr/include/libUnihan/collection.h:32:10: fatal error: glib.h: No such file or directory
 #include <glib.h>
          ^~~~~~~~
compilation terminated.
cpp.req: WARNING: /usr/src/tmp/libUnihan-buildroot/usr/include/libUnihan/collection.h: cpp failed
/usr/src/tmp/libUnihan-buildroot/usr/include/libUnihan/verboseMsg.h:46:10: fatal error: glib.h: No such file or directory
 #include <glib.h>
          ^~~~~~~~
compilation terminated.
cpp.req: /usr/src/tmp/libUnihan-buildroot/usr/include/libUnihan/verboseMsg.h: cpp failed, trying c++ mode
/usr/src/tmp/libUnihan-buildroot/usr/include/libUnihan/verboseMsg.h:46:10: fatal error: glib.h: No such file or directory
 #include <glib.h>
          ^~~~~~~~
compilation terminated.
cpp.req: WARNING: /usr/src/tmp/libUnihan-buildroot/usr/include/libUnihan/verboseMsg.h: cpp failed
/usr/src/tmp/libUnihan-buildroot/usr/include/libUnihan/Unihan_enum.h:33:10: fatal error: glib.h: No such file or directory
 #include <glib.h>
          ^~~~~~~~
compilation terminated.
cpp.req: /usr/src/tmp/libUnihan-buildroot/usr/include/libUnihan/Unihan_enum.h: cpp failed, trying c++ mode
/usr/src/tmp/libUnihan-buildroot/usr/include/libUnihan/Unihan_enum.h:33:10: fatal error: glib.h: No such file or directory
 #include <glib.h>
          ^~~~~~~~
compilation terminated.
cpp.req: WARNING: /usr/src/tmp/libUnihan-buildroot/usr/include/libUnihan/Unihan_enum.h: cpp failed
/usr/src/tmp/libUnihan-buildroot/usr/include/libUnihan/str_functions.h:35:10: fatal error: glib.h: No such file or directory
 #include <glib.h>
          ^~~~~~~~
compilation terminated.
cpp.req: /usr/src/tmp/libUnihan-buildroot/usr/include/libUnihan/str_functions.h: cpp failed, trying c++ mode
/usr/src/tmp/libUnihan-buildroot/usr/include/libUnihan/str_functions.h:35:10: fatal error: glib.h: No such file or directory
 #include <glib.h>
          ^~~~~~~~
compilation terminated.
cpp.req: WARNING: /usr/src/tmp/libUnihan-buildroot/usr/include/libUnihan/str_functions.h: cpp failed
/usr/src/tmp/libUnihan-buildroot/usr/include/libUnihan/file_functions.h:36:10: fatal error: glib.h: No such file or directory
 #include <glib.h>
          ^~~~~~~~
compilation terminated.
cpp.req: /usr/src/tmp/libUnihan-buildroot/usr/include/libUnihan/file_functions.h: cpp failed, trying c++ mode
/usr/src/tmp/libUnihan-buildroot/usr/include/libUnihan/file_functions.h:36:10: fatal error: glib.h: No such file or directory
 #include <glib.h>
          ^~~~~~~~
compilation terminated.
cpp.req: WARNING: /usr/src/tmp/libUnihan-buildroot/usr/include/libUnihan/file_functions.h: cpp failed
In file included from /usr/src/tmp/libUnihan-buildroot/usr/include/libUnihan/sqlite_functions.h:35:
/usr/src/tmp/libUnihan-buildroot/usr/include/libUnihan/str_functions.h:35:10: fatal error: glib.h: No such file or directory
 #include <glib.h>
          ^~~~~~~~
compilation terminated.
cpp.req: /usr/src/tmp/libUnihan-buildroot/usr/include/libUnihan/sqlite_functions.h: cpp failed, trying c++ mode
In file included from /usr/src/tmp/libUnihan-buildroot/usr/include/libUnihan/sqlite_functions.h:35:
/usr/src/tmp/libUnihan-buildroot/usr/include/libUnihan/str_functions.h:35:10: fatal error: glib.h: No such file or directory
 #include <glib.h>
          ^~~~~~~~
compilation terminated.
cpp.req: WARNING: /usr/src/tmp/libUnihan-buildroot/usr/include/libUnihan/sqlite_functions.h: cpp failed
Requires: libUnihan = 0.5.3-alt5_19, libgio, /lib/ld-linux.so.2, /usr/lib/libUnihan.so.0, libUnihan.so.0 >= set:lg1Z4KpOv6rN4HNA3cRl8ztxcQOvcFrx2BDYcC1ZuaZs8JgoldbCgtZBcfKDH9l, libc.so.6(GLIBC_2.0), libc.so.6(GLIBC_2.1), libc.so.6(GLIBC_2.3.4), libc.so.6(GLIBC_2.4), libglib-2.0.so.0 >= set:okfweFQGdLtcPJJEPXSQtCywtSKnsgbJxu4M2CgscK8XZl, libsqlite3-devel, libsqlite3.so.0 >= set:onf8T0, rtld(GNU_HASH)
Requires(rpmlib): rpmlib(SetVersions)
Finding debuginfo files (using /usr/lib/rpm/find-debuginfo-files)
Executing: /bin/sh -e /usr/src/tmp/rpm-tmp.fdtsRc
Creating libUnihan-devel-debuginfo package
Processing files: libUnihan-doc-0.5.3-alt5_19
Finding Provides (using /usr/lib/rpm/find-provides)
Executing: /bin/sh -e /usr/src/tmp/rpm-tmp.4vqsio
find-provides: running scripts (alternatives,debuginfo,gir,lib,pam,perl,pkgconfig,python,shell,typelib)
Finding Requires (using /usr/lib/rpm/find-requires)
Executing: /bin/sh -e /usr/src/tmp/rpm-tmp.4BqNnW
find-requires: running scripts (cpp,debuginfo,files,gir-js,gir-python,gir,lib,pam,perl,pkgconfig,pkgconfiglib,python,rpmlib,shebang,shell,static,symlinks,typelib)
Requires: libUnihan = 0.5.3-alt5_19
Processing files: libUnihan-debuginfo-0.5.3-alt5_19
Finding Provides (using /usr/lib/rpm/find-provides)
Executing: /bin/sh -e /usr/src/tmp/rpm-tmp.XPi14V
find-provides: running scripts (debuginfo)
Finding Requires (using /usr/lib/rpm/find-requires)
Executing: /bin/sh -e /usr/src/tmp/rpm-tmp.4xVOjq
find-requires: running scripts (debuginfo)
Provides: debug(libUnihan.so.0)
Requires: libUnihan = 0.5.3-alt5_19, /usr/lib/debug/lib/ld-linux.so.2.debug, debug(libc.so.6), debug(libglib-2.0.so.0), debug(libsqlite3.so.0)
Processing files: libUnihan-devel-debuginfo-0.5.3-alt5_19
Finding Provides (using /usr/lib/rpm/find-provides)
Executing: /bin/sh -e /usr/src/tmp/rpm-tmp.K7eSdh
find-provides: running scripts (debuginfo)
Finding Requires (using /usr/lib/rpm/find-requires)
Executing: /bin/sh -e /usr/src/tmp/rpm-tmp.y8MaFx
find-requires: running scripts (debuginfo)
Requires: libUnihan-devel = 0.5.3-alt5_19, /usr/lib/debug/lib/ld-linux.so.2.debug, debug(libUnihan.so.0), debug(libc.so.6), debug(libglib-2.0.so.0), debug(libsqlite3.so.0)
Adding to libUnihan-devel-debuginfo a strict dependency on libUnihan-debuginfo
Removing from libUnihan-devel-debuginfo 6 sources provided by libUnihan-debuginfo
Removing 2 extra deps from libUnihan-devel due to dependency on libUnihan
Removing 1 extra deps from libUnihan-devel-debuginfo due to dependency on libUnihan-debuginfo
Removing 7 extra deps from libUnihan-devel due to repentancy on libUnihan
Removing 4 extra deps from libUnihan-devel-debuginfo due to repentancy on libUnihan-debuginfo
Wrote: /usr/src/RPM/RPMS/i586/libUnihan-0.5.3-alt5_19.i586.rpm
Wrote: /usr/src/RPM/RPMS/i586/libUnihan-devel-0.5.3-alt5_19.i586.rpm
Wrote: /usr/src/RPM/RPMS/noarch/libUnihan-doc-0.5.3-alt5_19.noarch.rpm
Wrote: /usr/src/RPM/RPMS/i586/libUnihan-debuginfo-0.5.3-alt5_19.i586.rpm
Wrote: /usr/src/RPM/RPMS/i586/libUnihan-devel-debuginfo-0.5.3-alt5_19.i586.rpm
11.60user 2.46system 0:25.69elapsed 54%CPU (0avgtext+0avgdata 39932maxresident)k
0inputs+0outputs (0major+756590minor)pagefaults 0swaps
21.93user 5.76system 0:40.65elapsed 68%CPU (0avgtext+0avgdata 112876maxresident)k
32inputs+0outputs (0major+1236647minor)pagefaults 0swaps
--- libUnihan-devel-0.5.3-alt5_19.i586.rpm.repo	2017-11-01 16:45:14.000000000 +0000
+++ libUnihan-devel-0.5.3-alt5_19.i586.rpm.hasher	2019-09-03 09:14:09.209814552 +0000
@@ -21,3 +21,2 @@
 Requires: libsqlite3-devel  
-Requires: libsqlite3.so.0 >= set:onf8T0
 Requires: rpmlib(PayloadIsLzma)  
--- libUnihan-doc-0.5.3-alt5_19.noarch.rpm.repo	2017-11-01 16:45:14.000000000 +0000
+++ libUnihan-doc-0.5.3-alt5_19.noarch.rpm.hasher	2019-09-03 09:14:09.274814724 +0000
@@ -26,3 +26,2 @@
 /usr/share/doc/libUnihan/html/doxygen.png	100644	
-/usr/share/doc/libUnihan/html/dynsections.js	100644	
 /usr/share/doc/libUnihan/html/file__functions_8h.html	100644