<86>Aug  9 10:22:11 userdel[31344]: delete user 'rooter'
<86>Aug  9 10:22:11 userdel[31344]: removed group 'rooter' owned by 'rooter'
<86>Aug  9 10:22:11 userdel[31344]: removed shadow group 'rooter' owned by 'rooter'
<86>Aug  9 10:22:11 groupadd[31351]: group added to /etc/group: name=rooter, GID=549
<86>Aug  9 10:22:11 groupadd[31351]: group added to /etc/gshadow: name=rooter
<86>Aug  9 10:22:11 groupadd[31351]: new group: name=rooter, GID=549
<86>Aug  9 10:22:11 useradd[31356]: new user: name=rooter, UID=549, GID=549, home=/root, shell=/bin/bash
<86>Aug  9 10:22:11 userdel[31365]: delete user 'builder'
<86>Aug  9 10:22:11 userdel[31365]: removed group 'builder' owned by 'builder'
<86>Aug  9 10:22:11 userdel[31365]: removed shadow group 'builder' owned by 'builder'
<86>Aug  9 10:22:11 groupadd[31372]: group added to /etc/group: name=builder, GID=550
<86>Aug  9 10:22:11 groupadd[31372]: group added to /etc/gshadow: name=builder
<86>Aug  9 10:22:11 groupadd[31372]: new group: name=builder, GID=550
<86>Aug  9 10:22:11 useradd[31377]: new user: name=builder, UID=550, GID=550, home=/usr/src, shell=/bin/bash
warning: Macro %qmake_qt5 not found
warning: Macro %installqt5 not found
warning: Macro %_qt5_archdatadir not found
warning: Macro %ubt not found
warning: Macro %ubt not found
warning: Macro %ubt not found
<13>Aug  9 10:22:15 rpmi: libxkbcommon-0.8.4-alt1 sisyphus+222759.100.1.1 1551009799 installed
<13>Aug  9 10:22:15 rpmi: libglvnd-7:1.1.1-alt1 sisyphus+224993.100.4.1 1552634542 installed
<13>Aug  9 10:22:15 rpmi: libexpat-2.2.4-alt1 1503305345 installed
<13>Aug  9 10:22:15 rpmi: qt5-base-common-5.12.4-alt3 sisyphus+235483.100.1.1 1565011844 installed
<13>Aug  9 10:22:15 rpmi: libmtdev-1.1.5-alt1 sisyphus+220715.100.1.1 1549364509 installed
<13>Aug  9 10:22:15 rpmi: libpng16-1.6.36-alt1 sisyphus+219478.100.1.1 1547633314 installed
<13>Aug  9 10:22:15 rpmi: libICE-1.0.9-alt1 1409902721 installed
<13>Aug  9 10:22:15 rpmi: libwayland-server-1.17.0-alt1 sisyphus+225894.100.1.1 1553872805 installed
<13>Aug  9 10:22:15 rpmi: libSM-1.2.3-alt1 sisyphus+226734.100.2.1 1554586158 installed
<13>Aug  9 10:22:15 rpmi: rpm-macros-qt5-5.12.4-alt3 sisyphus+235483.100.1.1 1565011625 installed
<13>Aug  9 10:22:15 rpmi: libOpenGL-7:1.1.1-alt1 sisyphus+224993.100.4.1 1552634542 installed
<13>Aug  9 10:22:15 rpmi: libGLES-7:1.1.1-alt1 sisyphus+224993.100.4.1 1552634542 installed
<13>Aug  9 10:22:15 rpmi: libts-1.0-alt1.qa1 1366249315 installed
<13>Aug  9 10:22:15 rpmi: libsqlite3-3.28.0-alt1 sisyphus+231334.100.1.1 1559488430 installed
<13>Aug  9 10:22:15 rpmi: xxd-4:8.1.1517-alt1 sisyphus+231911.100.2.1 1560277007 installed
<13>Aug  9 10:22:15 rpmi: python-modules-curses-2.7.16-alt1 sisyphus+226365.200.2.1 1554143304 installed
<13>Aug  9 10:22:15 rpmi: libproxy-0.4.15-alt3 sisyphus+227885.100.1.2 1555818599 installed
<13>Aug  9 10:22:15 rpmi: libpcre2-10.33-alt1.1 sisyphus+227856.100.1.2 1555786378 installed
<13>Aug  9 10:22:15 rpmi: libverto-0.3.0-alt1_7 sisyphus+225932.100.1.1 1553994919 installed
<13>Aug  9 10:22:15 rpmi: libkeyutils-1.6-alt2 sisyphus+226520.100.2.1 1554512089 installed
<13>Aug  9 10:22:15 rpmi: libjpeg-2:2.0.2-alt1 sisyphus+226996.100.1.1 1554902907 installed
<13>Aug  9 10:22:15 rpmi: libwacom-data-0.33-alt1 sisyphus+227101.2200.2.2 1555198848 installed
<13>Aug  9 10:22:15 rpmi: udev-rules-1:242-alt11 sisyphus+235806.100.1.1 1565309166 installed
<13>Aug  9 10:22:17 rpmi: libicu64-1:6.4.2-alt1 sisyphus+227580.100.1.2 1555784329 installed
<13>Aug  9 10:22:17 rpmi: libqt5-core-5.12.4-alt3 sisyphus+235483.100.1.1 1565011844 installed
<13>Aug  9 10:22:17 rpmi: libqt5-sql-5.12.4-alt3 sisyphus+235483.100.1.1 1565011844 installed
<13>Aug  9 10:22:17 rpmi: libqt5-xml-5.12.4-alt3 sisyphus+235483.100.1.1 1565011844 installed
<13>Aug  9 10:22:17 rpmi: libqt5-concurrent-5.12.4-alt3 sisyphus+235483.100.1.1 1565011844 installed
<13>Aug  9 10:22:17 rpmi: libqt5-test-5.12.4-alt3 sisyphus+235483.100.1.1 1565011844 installed
<13>Aug  9 10:22:17 rpmi: libgudev-1:233-alt1 sisyphus+235422.100.1.1 1564855273 installed
<13>Aug  9 10:22:17 rpmi: libwacom-0.33-alt1 sisyphus+227101.2200.2.2 1555199020 installed
<13>Aug  9 10:22:17 rpmi: libgraphite2-1.3.13-alt2 sisyphus+226799.100.1.1 1554648241 installed
<13>Aug  9 10:22:17 rpmi: libharfbuzz-2.5.3-alt1 sisyphus+233337.100.1.1 1561643308 installed
<13>Aug  9 10:22:17 rpmi: libfreetype-2.10.0-alt2 sisyphus+226881.100.2.1 1555676286 installed
<13>Aug  9 10:22:17 rpmi: fontconfig-2.13.1-alt1 sisyphus+226691.100.2.2 1554598726 installed
Updating fonts cache: <29>Aug  9 10:22:18 fontconfig: Updating fonts cache: succeeded
[ DONE ]
<13>Aug  9 10:22:18 rpmi: libgdbm-1.8.3-alt10 1454943334 installed
<13>Aug  9 10:22:18 rpmi: libevdev-1.7.0-alt1 sisyphus+231525.100.1.1 1559718168 installed
<13>Aug  9 10:22:18 rpmi: libinput-1.14.0-alt1 sisyphus+235752.100.1.1 1565247510 installed
<13>Aug  9 10:22:18 rpmi: libcom_err-1.44.6-alt1 sisyphus+224154.100.1.1 1552091678 installed
<13>Aug  9 10:22:18 rpmi: liblz4-1:1.9.1-alt1 sisyphus+228057.100.1.1 1556059318 installed
<13>Aug  9 10:22:18 rpmi: libgpg-error-1.36-alt1 sisyphus+225621.300.1.1 1553521082 installed
<13>Aug  9 10:22:18 rpmi: libgcrypt20-1.8.4-alt3 sisyphus+232944.100.1.1 1561281975 installed
<13>Aug  9 10:22:18 rpmi: libsystemd-1:242-alt11 sisyphus+235806.100.1.1 1565309194 installed
<13>Aug  9 10:22:18 rpmi: libdbus-1.12.12-alt2 sisyphus+221234.100.1.2 1549918047 installed
<13>Aug  9 10:22:18 rpmi: libavahi-0.6.32-alt1 1500485702 installed
<13>Aug  9 10:22:18 rpmi: libcups-2.2.11-alt1 sisyphus+225793.100.1.1 1553701176 installed
<13>Aug  9 10:22:18 rpmi: libqt5-dbus-5.12.4-alt3 sisyphus+235483.100.1.1 1565011844 installed
<13>Aug  9 10:22:18 rpmi: xorg-proto-devel-2019.1-alt1 sisyphus+232786.100.1.1 1561106722 installed
<13>Aug  9 10:22:18 rpmi: libxshmfence-1.3-alt1 sisyphus+223149.1000.2.1 1551268571 installed
<13>Aug  9 10:22:18 rpmi: libX11-locales-3:1.6.8-alt1 sisyphus+232786.200.1.1 1561106874 installed
<13>Aug  9 10:22:18 rpmi: libXdmcp-1.1.3-alt1 sisyphus+225206.600.1.2 1552949353 installed
<13>Aug  9 10:22:18 rpmi: libXau-1.0.9-alt1 sisyphus+223149.200.2.1 1551268152 installed
<13>Aug  9 10:22:19 rpmi: libxcb-1.13.1-alt1 sisyphus+226527.100.2.2 1554593801 installed
<13>Aug  9 10:22:19 rpmi: libX11-3:1.6.8-alt1 sisyphus+232786.200.1.1 1561106876 installed
<13>Aug  9 10:22:19 rpmi: libXext-1.3.4-alt1 sisyphus+225206.700.1.2 1552949429 installed
<13>Aug  9 10:22:19 rpmi: libXxf86vm-1.1.4-alt2 1527672187 installed
<13>Aug  9 10:22:19 rpmi: libXdamage-1.1.5-alt1 sisyphus+225206.500.1.2 1552949286 installed
<13>Aug  9 10:22:19 rpmi: libXfixes-5.0.3-alt1 sisyphus+226736.100.2.2 1554614841 installed
<13>Aug  9 10:22:19 rpmi: libXrender-0.9.8-alt1 1371312112 installed
<13>Aug  9 10:22:21 rpmi: libxcb-devel-1.13.1-alt1 sisyphus+226527.100.2.2 1554593801 installed
<13>Aug  9 10:22:21 rpmi: libX11-devel-3:1.6.8-alt1 sisyphus+232786.200.1.1 1561106876 installed
<13>Aug  9 10:22:21 rpmi: libxcbutil-icccm-0.4.1-alt2 sisyphus+229000.100.1.1 1557152221 installed
<13>Aug  9 10:22:21 rpmi: libxcbutil-1:0.4.0-alt1 1413392888 installed
<13>Aug  9 10:22:21 rpmi: libxcbutil-image-0.4.0-alt1 1446204182 installed
<13>Aug  9 10:22:21 rpmi: libxcbutil-keysyms-0.4.0-alt1 1446204124 installed
<13>Aug  9 10:22:21 rpmi: libxcb-render-util-0.3.9-alt3 sisyphus+222674.100.1.1 1550989886 installed
<13>Aug  9 10:22:21 rpmi: libxkbcommon-x11-0.8.4-alt1 sisyphus+222759.100.1.1 1551009799 installed
<13>Aug  9 10:22:21 rpmi: libwayland-client-1.17.0-alt1 sisyphus+225894.100.1.1 1553872805 installed
<13>Aug  9 10:22:21 rpmi: libpciaccess-1:0.16-alt1 sisyphus+234814.100.1.1 1563438291 installed
<13>Aug  9 10:22:21 rpmi: libdrm-1:2.4.99-alt1 sisyphus+234110.100.1.1 1562593653 installed
<13>Aug  9 10:22:21 rpmi: libGLX-mesa-4:19.1.3-alt1 sisyphus+235105.100.1.2 1564524098 installed
<13>Aug  9 10:22:21 rpmi: libgbm-4:19.1.3-alt1 sisyphus+235105.100.1.2 1564524098 installed
<13>Aug  9 10:22:21 rpmi: libEGL-mesa-4:19.1.3-alt1 sisyphus+235105.100.1.2 1564524098 installed
<13>Aug  9 10:22:21 rpmi: libEGL-7:1.1.1-alt1 sisyphus+224993.100.4.1 1552634542 installed
<13>Aug  9 10:22:21 rpmi: libGLX-7:1.1.1-alt1 sisyphus+224993.100.4.1 1552634542 installed
<13>Aug  9 10:22:21 rpmi: libGL-7:1.1.1-alt1 sisyphus+224993.100.4.1 1552634542 installed
<13>Aug  9 10:22:21 rpmi: libglvnd-devel-7:1.1.1-alt1 sisyphus+224993.100.4.1 1552634542 installed
<13>Aug  9 10:22:21 rpmi: libEGL-devel-4:19.1.3-alt1 sisyphus+235105.100.1.2 1564524098 installed
<13>Aug  9 10:22:21 rpmi: libGL-devel-4:19.1.3-alt1 sisyphus+235105.100.1.2 1564524098 installed
<13>Aug  9 10:22:21 rpmi: gcc-c++-common-1.4.23-alt1 sisyphus+221902.2500.4.1 1550596716 installed
<13>Aug  9 10:22:22 rpmi: libstdc++8-devel-8.3.1-alt5 sisyphus+235477.100.1.1 1565022025 installed
<13>Aug  9 10:22:23 rpmi: gcc8-c++-8.3.1-alt5 sisyphus+235477.100.1.1 1565022025 installed
<13>Aug  9 10:22:23 rpmi: gcc-c++-8-alt2 sisyphus+235723.100.1.1 1565191484 installed
<13>Aug  9 10:22:23 rpmi: libp11-kit-0.23.15-alt1 sisyphus+226408.100.2.1 1554288204 installed
<13>Aug  9 10:22:23 rpmi: libtasn1-4.14-alt1 sisyphus+235791.100.1.1 1565282372 installed
<13>Aug  9 10:22:23 rpmi: rpm-macros-alternatives-0.5.1-alt1 sisyphus+226946.100.1.1 1554830426 installed
<13>Aug  9 10:22:23 rpmi: alternatives-0.5.1-alt1 sisyphus+226946.100.1.1 1554830426 installed
<13>Aug  9 10:22:23 rpmi: ca-certificates-2019.07.11-alt1 sisyphus+234280.200.1.1 1562839906 installed
<13>Aug  9 10:22:23 rpmi: ca-trust-0.1.2-alt1 sisyphus+233348.100.1.1 1561653823 installed
<13>Aug  9 10:22:23 rpmi: p11-kit-trust-0.23.15-alt1 sisyphus+226408.100.2.1 1554288204 installed
<13>Aug  9 10:22:23 rpmi: libcrypto1.1-1.1.1b-alt2 sisyphus+227249.100.2.1 1555667822 installed
<13>Aug  9 10:22:23 rpmi: libssl1.1-1.1.1b-alt2 sisyphus+227249.100.2.1 1555667822 installed
<13>Aug  9 10:22:23 rpmi: libqt5-network-5.12.4-alt3 sisyphus+235483.100.1.1 1565011844 installed
<13>Aug  9 10:22:23 rpmi: libqt5-eglfsdeviceintegration-5.12.4-alt3 sisyphus+235483.100.1.1 1565011844 installed
<13>Aug  9 10:22:24 rpmi: libqt5-xcbqpa-5.12.4-alt3 sisyphus+235483.100.1.1 1565011844 installed
<13>Aug  9 10:22:24 rpmi: libqt5-eglfskmssupport-5.12.4-alt3 sisyphus+235483.100.1.1 1565011844 installed
<13>Aug  9 10:22:24 rpmi: libqt5-gui-5.12.4-alt3 sisyphus+235483.100.1.1 1565011844 installed
<13>Aug  9 10:22:24 rpmi: libqt5-widgets-5.12.4-alt3 sisyphus+235483.100.1.1 1565011844 installed
<13>Aug  9 10:22:24 rpmi: libqt5-opengl-5.12.4-alt3 sisyphus+235483.100.1.1 1565011844 installed
<13>Aug  9 10:22:24 rpmi: libqt5-printsupport-5.12.4-alt3 sisyphus+235483.100.1.1 1565011844 installed
<86>Aug  9 10:22:24 groupadd[10917]: group added to /etc/group: name=_keytab, GID=499
<86>Aug  9 10:22:24 groupadd[10917]: group added to /etc/gshadow: name=_keytab
<86>Aug  9 10:22:24 groupadd[10917]: new group: name=_keytab, GID=499
<13>Aug  9 10:22:24 rpmi: libkrb5-1.16.3-alt1 sisyphus+223678.100.1.1 1551746516 installed
<13>Aug  9 10:22:24 rpmi: libtirpc-1.0.3-alt1 1532008017 installed
<13>Aug  9 10:22:24 rpmi: libnsl2-1.1.0-alt1_1 1511548749 installed
<13>Aug  9 10:22:24 rpmi: python-modules-encodings-2.7.16-alt1 sisyphus+226365.200.2.1 1554143304 installed
<13>Aug  9 10:22:24 rpmi: python-modules-compiler-2.7.16-alt1 sisyphus+226365.200.2.1 1554143304 installed
<13>Aug  9 10:22:24 rpmi: python-modules-email-2.7.16-alt1 sisyphus+226365.200.2.1 1554143304 installed
<13>Aug  9 10:22:24 rpmi: python-modules-unittest-2.7.16-alt1 sisyphus+226365.200.2.1 1554143304 installed
<13>Aug  9 10:22:24 rpmi: python-modules-nis-2.7.16-alt1 sisyphus+226365.200.2.1 1554143304 installed
<13>Aug  9 10:22:25 rpmi: python-modules-2.7.16-alt1 sisyphus+226365.200.2.1 1554143304 installed
<13>Aug  9 10:22:25 rpmi: python-modules-xml-2.7.16-alt1 sisyphus+226365.200.2.1 1554143304 installed
<13>Aug  9 10:22:25 rpmi: python-modules-hotshot-2.7.16-alt1 sisyphus+226365.200.2.1 1554143304 installed
<13>Aug  9 10:22:25 rpmi: python-modules-bsddb-2.7.16-alt1 sisyphus+226365.200.2.1 1554143304 installed
<13>Aug  9 10:22:25 rpmi: python-modules-ctypes-2.7.16-alt1 sisyphus+226365.200.2.1 1554143304 installed
<13>Aug  9 10:22:25 rpmi: python-modules-multiprocessing-2.7.16-alt1 sisyphus+226365.200.2.1 1554143304 installed
<13>Aug  9 10:22:25 rpmi: python-modules-logging-2.7.16-alt1 sisyphus+226365.200.2.1 1554143304 installed
<13>Aug  9 10:22:25 rpmi: python-2.7.16-alt1 sisyphus+226365.200.2.1 1554143304 installed
<13>Aug  9 10:22:25 rpmi: python-modules-distutils-2.7.16-alt1 sisyphus+226365.200.2.1 1554143304 installed
<13>Aug  9 10:22:25 rpmi: python-modules-json-2.7.16-alt1 sisyphus+226365.200.2.1 1554143304 installed
<13>Aug  9 10:22:26 rpmi: qt5-base-devel-5.12.4-alt3 sisyphus+235483.100.1.1 1565011844 installed
<13>Aug  9 10:22:26 rpmi: libqca-qt5-2.2.0-alt0.2 sisyphus+232355.100.1.1 1560782671 installed
<13>Aug  9 10:22:26 rpmi: libqca-qt5-devel-2.2.0-alt0.2 sisyphus+232355.100.1.1 1560782671 installed
<13>Aug  9 10:22:26 rpmi: doxygen-1:1.8.15-alt1 sisyphus+220984.100.1.2 1549663873 installed
warning: Macro %ubt not found
warning: Macro %ubt not found
warning: Macro %ubt not found
Building target platforms: i586
Building for target i586
Wrote: /usr/src/in/nosrpm/qoauth-qt5-2.0.1-alt2.3.nosrc.rpm
warning: Macro %ubt not found
warning: Macro %ubt not found
warning: Macro %ubt not found
Installing qoauth-qt5-2.0.1-alt2.3.src.rpm
Building target platforms: i586
Building for target i586
Executing(%prep): /bin/sh -e /usr/src/tmp/rpm-tmp.30028
+ umask 022
+ /bin/mkdir -p /usr/src/RPM/BUILD
+ cd /usr/src/RPM/BUILD
+ cd /usr/src/RPM/BUILD
+ rm -rf qoauth-qt5-2.0.1
+ echo 'Source #0 (qoauth-qt5-2.0.1.tar):'
Source #0 (qoauth-qt5-2.0.1.tar):
+ /bin/tar -xf /usr/src/RPM/SOURCES/qoauth-qt5-2.0.1.tar
+ cd qoauth-qt5-2.0.1
+ /bin/chmod -c -Rf u+rwX,go-w .
+ echo 'Patch #1 (alt-pcfile-qt5.patch):'
Patch #1 (alt-pcfile-qt5.patch):
+ /usr/bin/patch -p1
patching file src/pcfile.sh
+ echo 'Patch #2 (alt-linstall-lib.patch):'
Patch #2 (alt-linstall-lib.patch):
+ /usr/bin/patch -p1
patching file src/src.pro
+ sed -i -e 's|/lib|/lib|g' src/pcfile.sh
+ __qmake_qt5 qoauth.pro
+ export 'CPPFLAGS=-pipe -frecord-gcc-switches -Wall -g -O2 -march=i586 -mtune=generic -fPIC -DPIC'
+ CPPFLAGS='-pipe -frecord-gcc-switches -Wall -g -O2 -march=i586 -mtune=generic -fPIC -DPIC'
+ /usr/share/qt5/bin/qmake 'QMAKE_CFLAGS=-pipe -frecord-gcc-switches -Wall -g -O2 -march=i586 -mtune=generic -fPIC -DPIC' 'QMAKE_CXXFLAGS=-pipe -frecord-gcc-switches -Wall -g -O2 -march=i586 -mtune=generic -fPIC -DPIC' qoauth.pro
Info: creating stash file /usr/src/RPM/BUILD/qoauth-qt5-2.0.1/.qmake.stash
+ exit 0
Executing(%build): /bin/sh -e /usr/src/tmp/rpm-tmp.30028
+ umask 022
+ /bin/mkdir -p /usr/src/RPM/BUILD
+ cd /usr/src/RPM/BUILD
+ cd qoauth-qt5-2.0.1
+ make -j8
cd src/ && ( test -e Makefile || /usr/share/qt5/bin/qmake -o Makefile /usr/src/RPM/BUILD/qoauth-qt5-2.0.1/src/src.pro 'QMAKE_CFLAGS=-pipe -frecord-gcc-switches -Wall -g -O2 -march=i586 -mtune=generic -fPIC -DPIC' 'QMAKE_CXXFLAGS=-pipe -frecord-gcc-switches -Wall -g -O2 -march=i586 -mtune=generic -fPIC -DPIC' ) && make -f Makefile 
make[1]: Entering directory '/usr/src/RPM/BUILD/qoauth-qt5-2.0.1/src'
g++ -pipe -frecord-gcc-switches -Wall -g -O2 -march=i586 -mtune=generic -fPIC -DPIC -O2 -Wall -W -dM -E -o moc_predefs.h /usr/lib/qt5/mkspecs/features/data/dummy.cpp
make[1]: Leaving directory '/usr/src/RPM/BUILD/qoauth-qt5-2.0.1/src'
make[1]: Entering directory '/usr/src/RPM/BUILD/qoauth-qt5-2.0.1/src'
/usr/share/qt5/bin/moc -DQOAUTH -DQT_NO_DEBUG -DQT_NETWORK_LIB -DQT_CORE_LIB --include /usr/src/RPM/BUILD/qoauth-qt5-2.0.1/src/moc_predefs.h -I/usr/lib/qt5/mkspecs/linux-g++ -I/usr/src/RPM/BUILD/qoauth-qt5-2.0.1/src -I/usr/src/RPM/BUILD/qoauth-qt5-2.0.1/src -I/usr/src/RPM/BUILD/qoauth-qt5-2.0.1/src -I/usr/include/qt5/Qca-qt5/QtCrypto -I/usr/include/qt5 -I/usr/include/qt5/QtNetwork -I/usr/include/qt5/QtCore -I/usr/include/c++/8 -I/usr/include/c++/8/i586-alt-linux -I/usr/include/c++/8/backward -I/usr/lib/gcc/i586-alt-linux/8/include -I/usr/local/include -I/usr/include interface.h -o moc_interface.cpp
make[1]: Leaving directory '/usr/src/RPM/BUILD/qoauth-qt5-2.0.1/src'
make[1]: Entering directory '/usr/src/RPM/BUILD/qoauth-qt5-2.0.1/src'
g++ -c -pipe -frecord-gcc-switches -Wall -g -O2 -march=i586 -mtune=generic -fPIC -DPIC -O2 -Wall -W -D_REENTRANT -fPIC -DQOAUTH -DQT_NO_DEBUG -DQT_NETWORK_LIB -DQT_CORE_LIB -I. -I. -I. -isystem /usr/include/qt5/Qca-qt5/QtCrypto -isystem /usr/include/qt5 -isystem /usr/include/qt5/QtNetwork -isystem /usr/include/qt5/QtCore -I. -I/usr/lib/qt5/mkspecs/linux-g++ -o ./interface.o interface.cpp
interface.cpp: In member function 'void QOAuth::InterfacePrivate::_q_parseReply(QNetworkReply*)':
interface.cpp:322:9: warning: this statement may fall through [-Wimplicit-fallthrough=]
         if ( !replyParams.contains( InterfacePrivate::ParamTokenSecret ) ) {
         ^~
interface.cpp:326:5: note: here
     case BadRequest:
     ^~~~
interface.cpp: In member function 'QByteArray QOAuth::InterfacePrivate::paramsToString(const ParamMap&, QOAuth::ParsingMode)':
interface.cpp:354:25: warning: this statement may fall through [-Wimplicit-fallthrough=]
         prependString = "?";
                         ^~~
interface.cpp:355:5: note: here
     case ParseForRequestContent:
     ^~~~
make[1]: Leaving directory '/usr/src/RPM/BUILD/qoauth-qt5-2.0.1/src'
make[1]: Entering directory '/usr/src/RPM/BUILD/qoauth-qt5-2.0.1/src'
rm -f libqoauth.so.2.0.0 libqoauth.so libqoauth.so.2 libqoauth.so.2.0
g++ -Wl,-O1 -shared -Wl,-soname,libqoauth.so.2 -o libqoauth.so.2.0.0 ./interface.o  -L/usr/lib -lqca-qt5 /usr/lib/libQt5Network.so /usr/lib/libQt5Core.so -lpthread    
ln -s libqoauth.so.2.0.0 libqoauth.so
ln -s libqoauth.so.2.0.0 libqoauth.so.2
ln -s libqoauth.so.2.0.0 libqoauth.so.2.0
rm -f ../lib/libqoauth.so.2.0.0
mv -f libqoauth.so.2.0.0 ../lib/libqoauth.so.2.0.0
rm -f ../lib/libqoauth.so
rm -f ../lib/libqoauth.so.2
rm -f ../lib/libqoauth.so.2.0
mv -f libqoauth.so ../lib/libqoauth.so
mv -f libqoauth.so.2 ../lib/libqoauth.so.2
mv -f libqoauth.so.2.0 ../lib/libqoauth.so.2.0
make[1]: Leaving directory '/usr/src/RPM/BUILD/qoauth-qt5-2.0.1/src'
cd tests/ && ( test -e Makefile || /usr/share/qt5/bin/qmake -o Makefile /usr/src/RPM/BUILD/qoauth-qt5-2.0.1/tests/tests.pro 'QMAKE_CFLAGS=-pipe -frecord-gcc-switches -Wall -g -O2 -march=i586 -mtune=generic -fPIC -DPIC' 'QMAKE_CXXFLAGS=-pipe -frecord-gcc-switches -Wall -g -O2 -march=i586 -mtune=generic -fPIC -DPIC' ) && make -f Makefile 
cd ut_interface/ && ( test -e Makefile || /usr/share/qt5/bin/qmake -o Makefile /usr/src/RPM/BUILD/qoauth-qt5-2.0.1/tests/ut_interface/ut_interface.pro 'QMAKE_CFLAGS=-pipe -frecord-gcc-switches -Wall -g -O2 -march=i586 -mtune=generic -fPIC -DPIC' 'QMAKE_CXXFLAGS=-pipe -frecord-gcc-switches -Wall -g -O2 -march=i586 -mtune=generic -fPIC -DPIC' ) && make -f Makefile 
cd ft_interface/ && ( test -e Makefile || /usr/share/qt5/bin/qmake -o Makefile /usr/src/RPM/BUILD/qoauth-qt5-2.0.1/tests/ft_interface/ft_interface.pro 'QMAKE_CFLAGS=-pipe -frecord-gcc-switches -Wall -g -O2 -march=i586 -mtune=generic -fPIC -DPIC' 'QMAKE_CXXFLAGS=-pipe -frecord-gcc-switches -Wall -g -O2 -march=i586 -mtune=generic -fPIC -DPIC' ) && make -f Makefile 
make[2]: Entering directory '/usr/src/RPM/BUILD/qoauth-qt5-2.0.1/tests/ut_interface'
g++ -pipe -frecord-gcc-switches -Wall -g -O2 -march=i586 -mtune=generic -fPIC -DPIC -O2 -Wall -W -dM -E -o moc_predefs.h /usr/lib/qt5/mkspecs/features/data/dummy.cpp
make[2]: Leaving directory '/usr/src/RPM/BUILD/qoauth-qt5-2.0.1/tests/ut_interface'
make[2]: Entering directory '/usr/src/RPM/BUILD/qoauth-qt5-2.0.1/tests/ft_interface'
g++ -pipe -frecord-gcc-switches -Wall -g -O2 -march=i586 -mtune=generic -fPIC -DPIC -O2 -Wall -W -dM -E -o moc_predefs.h /usr/lib/qt5/mkspecs/features/data/dummy.cpp
make[2]: Leaving directory '/usr/src/RPM/BUILD/qoauth-qt5-2.0.1/tests/ft_interface'
make[2]: Entering directory '/usr/src/RPM/BUILD/qoauth-qt5-2.0.1/tests/ft_interface'
/usr/share/qt5/bin/moc -DUNIT_TEST -DQT_NO_DEBUG -DQT_TESTLIB_LIB -DQT_NETWORK_LIB -DQT_CORE_LIB -DQT_TESTCASE_BUILDDIR='"/usr/src/RPM/BUILD/qoauth-qt5-2.0.1/tests/ft_interface"' --include /usr/src/RPM/BUILD/qoauth-qt5-2.0.1/tests/ft_interface/moc_predefs.h -I/usr/lib/qt5/mkspecs/linux-g++ -I/usr/src/RPM/BUILD/qoauth-qt5-2.0.1/tests/ft_interface -I/usr/src/RPM/BUILD/qoauth-qt5-2.0.1/include -I/usr/src/RPM/BUILD/qoauth-qt5-2.0.1/tests/ft_interface -I/usr/src/RPM/BUILD/qoauth-qt5-2.0.1/src -I/usr/include/qt5/Qca-qt5/QtCrypto -I/usr/include/qt5 -I/usr/include/qt5/QtTest -I/usr/include/qt5/QtNetwork -I/usr/include/qt5/QtCore -I/usr/include/c++/8 -I/usr/include/c++/8/i586-alt-linux -I/usr/include/c++/8/backward -I/usr/lib/gcc/i586-alt-linux/8/include -I/usr/local/include -I/usr/include ft_interface.h -o moc_ft_interface.cpp
make[2]: Leaving directory '/usr/src/RPM/BUILD/qoauth-qt5-2.0.1/tests/ft_interface'
make[2]: Entering directory '/usr/src/RPM/BUILD/qoauth-qt5-2.0.1/tests/ut_interface'
/usr/share/qt5/bin/moc -DUNIT_TEST -DQT_NO_DEBUG -DQT_TESTLIB_LIB -DQT_NETWORK_LIB -DQT_CORE_LIB -DQT_TESTCASE_BUILDDIR='"/usr/src/RPM/BUILD/qoauth-qt5-2.0.1/tests/ut_interface"' --include /usr/src/RPM/BUILD/qoauth-qt5-2.0.1/tests/ut_interface/moc_predefs.h -I/usr/lib/qt5/mkspecs/linux-g++ -I/usr/src/RPM/BUILD/qoauth-qt5-2.0.1/tests/ut_interface -I/usr/src/RPM/BUILD/qoauth-qt5-2.0.1/include -I/usr/src/RPM/BUILD/qoauth-qt5-2.0.1/tests/ut_interface -I/usr/src/RPM/BUILD/qoauth-qt5-2.0.1/src -I/usr/include/qt5/Qca-qt5/QtCrypto -I/usr/include/qt5 -I/usr/include/qt5/QtTest -I/usr/include/qt5/QtNetwork -I/usr/include/qt5/QtCore -I/usr/include/c++/8 -I/usr/include/c++/8/i586-alt-linux -I/usr/include/c++/8/backward -I/usr/lib/gcc/i586-alt-linux/8/include -I/usr/local/include -I/usr/include ut_interface.h -o moc_ut_interface.cpp
make[2]: Leaving directory '/usr/src/RPM/BUILD/qoauth-qt5-2.0.1/tests/ut_interface'
make[2]: Entering directory '/usr/src/RPM/BUILD/qoauth-qt5-2.0.1/tests/ft_interface'
g++ -c -pipe -frecord-gcc-switches -Wall -g -O2 -march=i586 -mtune=generic -fPIC -DPIC -O2 -Wall -W -D_REENTRANT -fPIC -DUNIT_TEST -DQT_NO_DEBUG -DQT_TESTLIB_LIB -DQT_NETWORK_LIB -DQT_CORE_LIB -DQT_TESTCASE_BUILDDIR='"/usr/src/RPM/BUILD/qoauth-qt5-2.0.1/tests/ft_interface"' -I. -I../../include -I. -I../../src -isystem /usr/include/qt5/Qca-qt5/QtCrypto -isystem /usr/include/qt5 -isystem /usr/include/qt5/QtTest -isystem /usr/include/qt5/QtNetwork -isystem /usr/include/qt5/QtCore -I. -I/usr/lib/qt5/mkspecs/linux-g++ -o moc_ft_interface.o moc_ft_interface.cpp
make[2]: Leaving directory '/usr/src/RPM/BUILD/qoauth-qt5-2.0.1/tests/ft_interface'
make[2]: Entering directory '/usr/src/RPM/BUILD/qoauth-qt5-2.0.1/tests/ut_interface'
g++ -c -pipe -frecord-gcc-switches -Wall -g -O2 -march=i586 -mtune=generic -fPIC -DPIC -O2 -Wall -W -D_REENTRANT -fPIC -DUNIT_TEST -DQT_NO_DEBUG -DQT_TESTLIB_LIB -DQT_NETWORK_LIB -DQT_CORE_LIB -DQT_TESTCASE_BUILDDIR='"/usr/src/RPM/BUILD/qoauth-qt5-2.0.1/tests/ut_interface"' -I. -I../../include -I. -I../../src -isystem /usr/include/qt5/Qca-qt5/QtCrypto -isystem /usr/include/qt5 -isystem /usr/include/qt5/QtTest -isystem /usr/include/qt5/QtNetwork -isystem /usr/include/qt5/QtCore -I. -I/usr/lib/qt5/mkspecs/linux-g++ -o moc_ut_interface.o moc_ut_interface.cpp
make[2]: Leaving directory '/usr/src/RPM/BUILD/qoauth-qt5-2.0.1/tests/ut_interface'
make[2]: Entering directory '/usr/src/RPM/BUILD/qoauth-qt5-2.0.1/tests/ut_interface'
g++ -c -pipe -frecord-gcc-switches -Wall -g -O2 -march=i586 -mtune=generic -fPIC -DPIC -O2 -Wall -W -D_REENTRANT -fPIC -DUNIT_TEST -DQT_NO_DEBUG -DQT_TESTLIB_LIB -DQT_NETWORK_LIB -DQT_CORE_LIB -DQT_TESTCASE_BUILDDIR='"/usr/src/RPM/BUILD/qoauth-qt5-2.0.1/tests/ut_interface"' -I. -I../../include -I. -I../../src -isystem /usr/include/qt5/Qca-qt5/QtCrypto -isystem /usr/include/qt5 -isystem /usr/include/qt5/QtTest -isystem /usr/include/qt5/QtNetwork -isystem /usr/include/qt5/QtCore -I. -I/usr/lib/qt5/mkspecs/linux-g++ -o ut_interface.o ut_interface.cpp
make[2]: Leaving directory '/usr/src/RPM/BUILD/qoauth-qt5-2.0.1/tests/ut_interface'
make[2]: Entering directory '/usr/src/RPM/BUILD/qoauth-qt5-2.0.1/tests/ut_interface'
g++ -Wl,-rpath,../../lib:lib -Wl,-O1 -o ut_interface ut_interface.o moc_ut_interface.o   -L/usr/src/RPM/BUILD/qoauth-qt5-2.0.1/lib -lqoauth -L../../lib -L/usr/lib -lqca-qt5 /usr/lib/libQt5Test.so /usr/lib/libQt5Network.so /usr/lib/libQt5Core.so -lpthread   
make[2]: Leaving directory '/usr/src/RPM/BUILD/qoauth-qt5-2.0.1/tests/ut_interface'
make[2]: Entering directory '/usr/src/RPM/BUILD/qoauth-qt5-2.0.1/tests/ft_interface'
g++ -c -pipe -frecord-gcc-switches -Wall -g -O2 -march=i586 -mtune=generic -fPIC -DPIC -O2 -Wall -W -D_REENTRANT -fPIC -DUNIT_TEST -DQT_NO_DEBUG -DQT_TESTLIB_LIB -DQT_NETWORK_LIB -DQT_CORE_LIB -DQT_TESTCASE_BUILDDIR='"/usr/src/RPM/BUILD/qoauth-qt5-2.0.1/tests/ft_interface"' -I. -I../../include -I. -I../../src -isystem /usr/include/qt5/Qca-qt5/QtCrypto -isystem /usr/include/qt5 -isystem /usr/include/qt5/QtTest -isystem /usr/include/qt5/QtNetwork -isystem /usr/include/qt5/QtCore -I. -I/usr/lib/qt5/mkspecs/linux-g++ -o ft_interface.o ft_interface.cpp
make[2]: Leaving directory '/usr/src/RPM/BUILD/qoauth-qt5-2.0.1/tests/ft_interface'
make[2]: Entering directory '/usr/src/RPM/BUILD/qoauth-qt5-2.0.1/tests/ft_interface'
g++ -Wl,-rpath,../../lib:lib -Wl,-O1 -o ft_interface ft_interface.o moc_ft_interface.o   -L/usr/src/RPM/BUILD/qoauth-qt5-2.0.1/lib -lqoauth -L../../lib -L/usr/lib -lqca-qt5 /usr/lib/libQt5Test.so /usr/lib/libQt5Network.so /usr/lib/libQt5Core.so -lpthread   
make[2]: Leaving directory '/usr/src/RPM/BUILD/qoauth-qt5-2.0.1/tests/ft_interface'
+ exit 0
Executing(%install): /bin/sh -e /usr/src/tmp/rpm-tmp.61264
+ umask 022
+ /bin/mkdir -p /usr/src/RPM/BUILD
+ cd /usr/src/RPM/BUILD
+ /bin/chmod -Rf u+rwX -- /usr/src/tmp/qoauth-qt5-buildroot
+ :
+ /bin/rm -rf -- /usr/src/tmp/qoauth-qt5-buildroot
+ cd qoauth-qt5-2.0.1
+ __installqt5
+ __install_qt5_base
+ make install INSTALL_ROOT=/usr/src/tmp/qoauth-qt5-buildroot
make: Entering directory '/usr/src/RPM/BUILD/qoauth-qt5-2.0.1'
cd src/ && ( test -e Makefile || /usr/share/qt5/bin/qmake -o Makefile /usr/src/RPM/BUILD/qoauth-qt5-2.0.1/src/src.pro 'QMAKE_CFLAGS=-pipe -frecord-gcc-switches -Wall -g -O2 -march=i586 -mtune=generic -fPIC -DPIC' 'QMAKE_CXXFLAGS=-pipe -frecord-gcc-switches -Wall -g -O2 -march=i586 -mtune=generic -fPIC -DPIC' ) && make -f Makefile install
make[1]: Entering directory '/usr/src/RPM/BUILD/qoauth-qt5-2.0.1/src'
/usr/share/qt5/bin/qmake -install qinstall -exe ../lib/libqoauth.so.2.0.0 /usr/src/tmp/qoauth-qt5-buildroot/usr/lib/libqoauth.so.2.0.0
strip --strip-unneeded /usr/src/tmp/qoauth-qt5-buildroot/usr/lib/libqoauth.so.2.0.0
ln -f -s libqoauth.so.2.0.0 /usr/src/tmp/qoauth-qt5-buildroot/usr/lib/libqoauth.so
ln -f -s libqoauth.so.2.0.0 /usr/src/tmp/qoauth-qt5-buildroot/usr/lib/libqoauth.so.2
ln -f -s libqoauth.so.2.0.0 /usr/src/tmp/qoauth-qt5-buildroot/usr/lib/libqoauth.so.2.0
install -m 644 -p ../lib/libqoauth.prl /usr/src/tmp/qoauth-qt5-buildroot/usr/lib/libqoauth.prl
/usr/share/qt5/bin/qmake -install qinstall /usr/src/RPM/BUILD/qoauth-qt5-2.0.1/src/qoauth_global.h /usr/src/tmp/qoauth-qt5-buildroot/usr/include/QtOAuth/qoauth_global.h
/usr/share/qt5/bin/qmake -install qinstall /usr/src/RPM/BUILD/qoauth-qt5-2.0.1/src/qoauth_namespace.h /usr/src/tmp/qoauth-qt5-buildroot/usr/include/QtOAuth/qoauth_namespace.h
/usr/share/qt5/bin/qmake -install qinstall /usr/src/RPM/BUILD/qoauth-qt5-2.0.1/src/interface.h /usr/src/tmp/qoauth-qt5-buildroot/usr/include/QtOAuth/interface.h
/usr/share/qt5/bin/qmake -install qinstall /usr/src/RPM/BUILD/qoauth-qt5-2.0.1/include/QtOAuth /usr/src/tmp/qoauth-qt5-buildroot/usr/include/QtOAuth/QtOAuth
/usr/share/qt5/bin/qmake -install qinstall /usr/src/RPM/BUILD/qoauth-qt5-2.0.1/src/qoauth.pc /usr/src/tmp/qoauth-qt5-buildroot/usr/lib/pkgconfig/qoauth.pc
/usr/share/qt5/bin/qmake -install qinstall /usr/src/RPM/BUILD/qoauth-qt5-2.0.1/oauth.prf /usr/src/tmp/qoauth-qt5-buildroot/usr/lib/qt5/mkspecs/features/oauth.prf
make[1]: Leaving directory '/usr/src/RPM/BUILD/qoauth-qt5-2.0.1/src'
cd tests/ && ( test -e Makefile || /usr/share/qt5/bin/qmake -o Makefile /usr/src/RPM/BUILD/qoauth-qt5-2.0.1/tests/tests.pro 'QMAKE_CFLAGS=-pipe -frecord-gcc-switches -Wall -g -O2 -march=i586 -mtune=generic -fPIC -DPIC' 'QMAKE_CXXFLAGS=-pipe -frecord-gcc-switches -Wall -g -O2 -march=i586 -mtune=generic -fPIC -DPIC' ) && make -f Makefile install
make[1]: Entering directory '/usr/src/RPM/BUILD/qoauth-qt5-2.0.1/tests'
cd ut_interface/ && ( test -e Makefile || /usr/share/qt5/bin/qmake -o Makefile /usr/src/RPM/BUILD/qoauth-qt5-2.0.1/tests/ut_interface/ut_interface.pro 'QMAKE_CFLAGS=-pipe -frecord-gcc-switches -Wall -g -O2 -march=i586 -mtune=generic -fPIC -DPIC' 'QMAKE_CXXFLAGS=-pipe -frecord-gcc-switches -Wall -g -O2 -march=i586 -mtune=generic -fPIC -DPIC' ) && make -f Makefile install
make[2]: Entering directory '/usr/src/RPM/BUILD/qoauth-qt5-2.0.1/tests/ut_interface'
make[2]: Nothing to be done for 'install'.
make[2]: Leaving directory '/usr/src/RPM/BUILD/qoauth-qt5-2.0.1/tests/ut_interface'
cd ft_interface/ && ( test -e Makefile || /usr/share/qt5/bin/qmake -o Makefile /usr/src/RPM/BUILD/qoauth-qt5-2.0.1/tests/ft_interface/ft_interface.pro 'QMAKE_CFLAGS=-pipe -frecord-gcc-switches -Wall -g -O2 -march=i586 -mtune=generic -fPIC -DPIC' 'QMAKE_CXXFLAGS=-pipe -frecord-gcc-switches -Wall -g -O2 -march=i586 -mtune=generic -fPIC -DPIC' ) && make -f Makefile install
make[2]: Entering directory '/usr/src/RPM/BUILD/qoauth-qt5-2.0.1/tests/ft_interface'
make[2]: Nothing to be done for 'install'.
make[2]: Leaving directory '/usr/src/RPM/BUILD/qoauth-qt5-2.0.1/tests/ft_interface'
make[1]: Leaving directory '/usr/src/RPM/BUILD/qoauth-qt5-2.0.1/tests'
make: Leaving directory '/usr/src/RPM/BUILD/qoauth-qt5-2.0.1'
+ __install_qt5_post_user
+ mkdir -p /usr/src/tmp/qoauth-qt5-buildroot//usr/bin
+ ls -1d '/usr/src/tmp/qoauth-qt5-buildroot//usr/share/qt5/bin/*'
+ read f
+ __install_qt5_post_common
+ '[' -d /usr/src/tmp/qoauth-qt5-buildroot//usr/lib ']'
+ pushd /usr/src/tmp/qoauth-qt5-buildroot//usr/lib
~/tmp/qoauth-qt5-buildroot/usr/lib ~/RPM/BUILD/qoauth-qt5-2.0.1
+ ls -1 libqoauth.prl
+ read prl_file
+ sed -i -e '/^QMAKE_PRL_BUILD_DIR/d' libqoauth.prl
++ basename libqoauth.prl .prl
+ '[' -f libqoauth.so ']'
+ sed -i -e '/^QMAKE_PRL_LIBS/d' libqoauth.prl
+ read prl_file
+ popd
~/RPM/BUILD/qoauth-qt5-2.0.1
+ doxygen Doxyfile
warning: Tag `SYMBOL_CACHE_SIZE' at line 300 of file `Doxyfile' has become obsolete.
         To avoid this warning please remove this line from your configuration file or upgrade it using "doxygen -u"
warning: Tag `SHOW_DIRECTORIES' at line 484 of file `Doxyfile' has become obsolete.
         To avoid this warning please remove this line from your configuration file or upgrade it using "doxygen -u"
warning: Tag `HTML_ALIGN_MEMBERS' at line 840 of file `Doxyfile' has become obsolete.
         To avoid this warning please remove this line from your configuration file or upgrade it using "doxygen -u"
warning: Tag `XML_SCHEMA' at line 1177 of file `Doxyfile' has become obsolete.
         To avoid this warning please remove this line from your configuration file or upgrade it using "doxygen -u"
warning: Tag `XML_DTD' at line 1183 of file `Doxyfile' has become obsolete.
         To avoid this warning please remove this line from your configuration file or upgrade it using "doxygen -u"
warning: doxygen no longer ships with the FreeSans font.
You may want to clear or change DOT_FONTNAME.
Otherwise you run the risk that the wrong font is being used for dot generated graphs.
/usr/src/RPM/BUILD/qoauth-qt5-2.0.1/src/interface.h:21: warning: the name `interface.h' supplied as the second argument in the \file statement matches the following input files:
   /usr/src/RPM/BUILD/qoauth-qt5-2.0.1/include/interface.h
   /usr/src/RPM/BUILD/qoauth-qt5-2.0.1/src/interface.h
Please use a more specific name by including a (larger) part of the path!
/usr/src/RPM/BUILD/qoauth-qt5-2.0.1/src/moc_interface.cpp:24: warning: Compound qt_meta_stringdata_QOAuth__Interface_t is not documented.
/usr/src/RPM/BUILD/qoauth-qt5-2.0.1/src/interface.cpp:195: warning: documented symbol `const QByteArray QOAuth::InterfacePrivate::OAuthVersion' was not declared or defined.
/usr/src/RPM/BUILD/qoauth-qt5-2.0.1/src/interface.cpp:198: warning: documented symbol `const QByteArray QOAuth::InterfacePrivate::ParamToken' was not declared or defined.
/usr/src/RPM/BUILD/qoauth-qt5-2.0.1/src/interface.cpp:200: warning: documented symbol `const QByteArray QOAuth::InterfacePrivate::ParamTokenSecret' was not declared or defined.
/usr/src/RPM/BUILD/qoauth-qt5-2.0.1/src/interface.cpp:203: warning: documented symbol `const QByteArray QOAuth::InterfacePrivate::ParamConsumerKey' was not declared or defined.
/usr/src/RPM/BUILD/qoauth-qt5-2.0.1/src/interface.cpp:205: warning: documented symbol `const QByteArray QOAuth::InterfacePrivate::ParamNonce' was not declared or defined.
/usr/src/RPM/BUILD/qoauth-qt5-2.0.1/src/interface.cpp:207: warning: documented symbol `const QByteArray QOAuth::InterfacePrivate::ParamSignature' was not declared or defined.
/usr/src/RPM/BUILD/qoauth-qt5-2.0.1/src/interface.cpp:209: warning: documented symbol `const QByteArray QOAuth::InterfacePrivate::ParamSignatureMethod' was not declared or defined.
/usr/src/RPM/BUILD/qoauth-qt5-2.0.1/src/interface.cpp:211: warning: documented symbol `const QByteArray QOAuth::InterfacePrivate::ParamTimestamp' was not declared or defined.
/usr/src/RPM/BUILD/qoauth-qt5-2.0.1/src/interface.cpp:213: warning: documented symbol `const QByteArray QOAuth::InterfacePrivate::ParamVersion' was not declared or defined.
/usr/src/RPM/BUILD/qoauth-qt5-2.0.1/src/interface.cpp:215: warning: documented symbol `QOAuth::InterfacePrivate::InterfacePrivate' was not declared or defined.
/usr/src/RPM/BUILD/qoauth-qt5-2.0.1/src/interface.cpp:226: warning: documented symbol `void QOAuth::InterfacePrivate::init' was not declared or defined.
/usr/src/RPM/BUILD/qoauth-qt5-2.0.1/src/interface.cpp:238: warning: documented symbol `void QOAuth::InterfacePrivate::setupNetworkAccessManager' was not declared or defined.
/usr/src/RPM/BUILD/qoauth-qt5-2.0.1/src/interface.cpp:252: warning: documented symbol `QByteArray QOAuth::InterfacePrivate::httpMethodToString' was not declared or defined.
/usr/src/RPM/BUILD/qoauth-qt5-2.0.1/src/interface.cpp:273: warning: documented symbol `QByteArray QOAuth::InterfacePrivate::signatureMethodToString' was not declared or defined.
/usr/src/RPM/BUILD/qoauth-qt5-2.0.1/src/interface.cpp:288: warning: documented symbol `QOAuth::ParamMap QOAuth::InterfacePrivate::replyToMap' was not declared or defined.
/usr/src/RPM/BUILD/qoauth-qt5-2.0.1/src/interface.cpp:312: warning: documented symbol `void QOAuth::InterfacePrivate::_q_parseReply' was not declared or defined.
/usr/src/RPM/BUILD/qoauth-qt5-2.0.1/src/interface.cpp:338: warning: documented symbol `void QOAuth::InterfacePrivate::_q_handleSslErrors' was not declared or defined.
/usr/src/RPM/BUILD/qoauth-qt5-2.0.1/src/interface.cpp:346: warning: documented symbol `QByteArray QOAuth::InterfacePrivate::paramsToString' was not declared or defined.
/usr/src/RPM/BUILD/qoauth-qt5-2.0.1/src/interface.cpp:650: warning: documented symbol `void QOAuth::InterfacePrivate::setPrivateKey' was not declared or defined.
/usr/src/RPM/BUILD/qoauth-qt5-2.0.1/src/interface.cpp:681: warning: documented symbol `void QOAuth::InterfacePrivate::readKeyFromLoader' was not declared or defined.
/usr/src/RPM/BUILD/qoauth-qt5-2.0.1/src/interface.cpp:698: warning: no matching class member found for 
  void QOAuth::InterfacePrivate::_q_setPassphrase(int id, const QCA::Event &event)

/usr/src/RPM/BUILD/qoauth-qt5-2.0.1/src/interface.cpp:908: warning: documented symbol `QOAuth::ParamMap QOAuth::InterfacePrivate::sendRequest' was not declared or defined.
/usr/src/RPM/BUILD/qoauth-qt5-2.0.1/src/interface.cpp:978: warning: documented symbol `QByteArray QOAuth::InterfacePrivate::createSignature' was not declared or defined.
/usr/src/RPM/BUILD/qoauth-qt5-2.0.1/src/interface.cpp:1072: warning: documented symbol `QByteArray QOAuth::InterfacePrivate::createPlaintextSignature' was not declared or defined.
/usr/src/RPM/BUILD/qoauth-qt5-2.0.1/src/moc_interface.cpp:96: warning: documented symbol `void QOAuth::Interface::qt_static_metacall' was not declared or defined.
/usr/src/RPM/BUILD/qoauth-qt5-2.0.1/src/moc_interface.cpp:137: warning: documented symbol `QT_INIT_METAOBJECT const QMetaObject QOAuth::Interface::staticMetaObject' was not declared or defined.
/usr/src/RPM/BUILD/qoauth-qt5-2.0.1/src/moc_interface.cpp:147: warning: documented symbol `const QMetaObject * QOAuth::Interface::metaObject' was not declared or defined.
/usr/src/RPM/BUILD/qoauth-qt5-2.0.1/src/moc_interface.cpp:152: warning: documented symbol `void * QOAuth::Interface::qt_metacast' was not declared or defined.
/usr/src/RPM/BUILD/qoauth-qt5-2.0.1/src/moc_interface.cpp:160: warning: documented symbol `int QOAuth::Interface::qt_metacall' was not declared or defined.
/usr/src/RPM/BUILD/qoauth-qt5-2.0.1/src/interface.cpp:92: warning: explicit link request to 'include' could not be resolved
/usr/src/RPM/BUILD/qoauth-qt5-2.0.1/src/interface.cpp:92: warning: Unsupported xml/html tag <QtXml> found
Searching for include files...
Searching for example files...
Searching for files in directory /usr/src/RPM/BUILD/qoauth-qt5-2.0.1/doc/examples
Searching for images...
Searching for dot files...
Searching for msc files...
Searching for dia files...
Searching for files to exclude
Searching INPUT for files to process...
Searching for files in directory /usr/src/RPM/BUILD/qoauth-qt5-2.0.1
Searching for files in directory /usr/src/RPM/BUILD/qoauth-qt5-2.0.1/include
Searching for files in directory /usr/src/RPM/BUILD/qoauth-qt5-2.0.1/src
Reading and parsing tag files
Parsing files
Preprocessing /usr/src/RPM/BUILD/qoauth-qt5-2.0.1/include/interface.h...
Parsing file /usr/src/RPM/BUILD/qoauth-qt5-2.0.1/include/interface.h...
Preprocessing /usr/src/RPM/BUILD/qoauth-qt5-2.0.1/src/interface.cpp...
Parsing file /usr/src/RPM/BUILD/qoauth-qt5-2.0.1/src/interface.cpp...
Preprocessing /usr/src/RPM/BUILD/qoauth-qt5-2.0.1/src/interface.h...
Parsing file /usr/src/RPM/BUILD/qoauth-qt5-2.0.1/src/interface.h...
Preprocessing /usr/src/RPM/BUILD/qoauth-qt5-2.0.1/src/moc_interface.cpp...
Parsing file /usr/src/RPM/BUILD/qoauth-qt5-2.0.1/src/moc_interface.cpp...
Preprocessing /usr/src/RPM/BUILD/qoauth-qt5-2.0.1/src/moc_predefs.h...
Parsing file /usr/src/RPM/BUILD/qoauth-qt5-2.0.1/src/moc_predefs.h...
Preprocessing /usr/src/RPM/BUILD/qoauth-qt5-2.0.1/src/qoauth_global.h...
Parsing file /usr/src/RPM/BUILD/qoauth-qt5-2.0.1/src/qoauth_global.h...
Preprocessing /usr/src/RPM/BUILD/qoauth-qt5-2.0.1/src/qoauth_namespace.h...
Parsing file /usr/src/RPM/BUILD/qoauth-qt5-2.0.1/src/qoauth_namespace.h...
Building group list...
Building directory list...
Building namespace list...
Building file list...
Building class list...
Associating documentation with classes...
Computing nesting relations for classes...
Building example list...
Searching for enumerations...
Searching for documented typedefs...
Searching for members imported via using declarations...
Searching for included using directives...
Searching for documented variables...
Building interface member list...
Building member list...
Searching for friends...
Searching for documented defines...
Computing class inheritance relations...
Computing class usage relations...
Flushing cached template relations that have become invalid...
Computing class relations...
Add enum values to enums...
Searching for member function documentation...
Creating members for template instances...
Building page list...
Search for main page...
Computing page relations...
Determining the scope of groups...
Sorting lists...
Freeing entry tree
Determining which enums are documented
Computing member relations...
Building full member lists recursively...
Adding members to member groups.
Computing member references...
Inheriting documentation...
Generating disk names...
Adding source references...
Adding xrefitems...
Sorting member lists...
Computing dependencies between directories...
Generating citations page...
Counting data structures...
Resolving user defined references...
Finding anchors and sections in the documentation...
Transferring function references...
Combining using relations...
Adding members to index pages...
Generating style sheet...
Generating search indices...
Generating example documentation...
Generating file sources...
Generating code for file interface.h...
Generating code for file src/interface.h...
Generating code for file src/moc_predefs.h...
Generating code for file src/qoauth_global.h...
Generating code for file src/qoauth_namespace.h...
Generating file documentation...
Generating docs for file src/qoauth_global.h...
Generating docs for file src/qoauth_namespace.h...
Generating page documentation...
Generating group documentation...
Generating class documentation...
Generating docs for compound qt_meta_stringdata_QOAuth__Interface_t...
Generating namespace index...
Generating docs for namespace QOAuth
Generating docs for compound QOAuth::Interface...
Generating graph info page...
Generating directory documentation...
Generating index page...
Generating page index...
Generating module index...
Generating namespace index...
Generating namespace member index...
Generating annotated compound index...
Generating alphabetical compound index...
Generating hierarchical class index...
Generating member index...
Generating file index...
Generating file member index...
Generating example index...
finalizing index lists...
writing tag file...
lookup cache used 86/65536 hits=449 misses=86
finished...
+ for file in doc/html/*
+ touch -r Doxyfile doc/html/annotated.html
+ for file in doc/html/*
+ touch -r Doxyfile doc/html/bc_s.png
+ for file in doc/html/*
+ touch -r Doxyfile doc/html/bdwn.png
+ for file in doc/html/*
+ touch -r Doxyfile doc/html/class_q_o_auth_1_1_interface-members.html
+ for file in doc/html/*
+ touch -r Doxyfile doc/html/class_q_o_auth_1_1_interface.html
+ for file in doc/html/*
+ touch -r Doxyfile doc/html/class_q_o_auth_1_1_interface.png
+ for file in doc/html/*
+ touch -r Doxyfile doc/html/classes.html
+ for file in doc/html/*
+ touch -r Doxyfile doc/html/closed.png
+ for file in doc/html/*
+ touch -r Doxyfile doc/html/dir_68267d1309a1af8e8297ef4c3efbcdba.html
+ for file in doc/html/*
+ touch -r Doxyfile doc/html/doc.png
+ for file in doc/html/*
+ touch -r Doxyfile doc/html/doxygen.css
+ for file in doc/html/*
+ touch -r Doxyfile doc/html/doxygen.png
+ for file in doc/html/*
+ touch -r Doxyfile doc/html/files.html
+ for file in doc/html/*
+ touch -r Doxyfile doc/html/folderclosed.png
+ for file in doc/html/*
+ touch -r Doxyfile doc/html/folderopen.png
+ for file in doc/html/*
+ touch -r Doxyfile doc/html/functions.html
+ for file in doc/html/*
+ touch -r Doxyfile doc/html/functions_func.html
+ for file in doc/html/*
+ touch -r Doxyfile doc/html/functions_prop.html
+ for file in doc/html/*
+ touch -r Doxyfile doc/html/hierarchy.html
+ for file in doc/html/*
+ touch -r Doxyfile doc/html/include_2interface_8h_source.html
+ for file in doc/html/*
+ touch -r Doxyfile doc/html/index.html
+ for file in doc/html/*
+ touch -r Doxyfile doc/html/jquery.js
+ for file in doc/html/*
+ touch -r Doxyfile doc/html/menu.js
+ for file in doc/html/*
+ touch -r Doxyfile doc/html/menudata.js
+ for file in doc/html/*
+ touch -r Doxyfile doc/html/moc__predefs_8h_source.html
+ for file in doc/html/*
+ touch -r Doxyfile doc/html/namespace_q_o_auth.html
+ for file in doc/html/*
+ touch -r Doxyfile doc/html/namespacemembers.html
+ for file in doc/html/*
+ touch -r Doxyfile doc/html/namespacemembers_enum.html
+ for file in doc/html/*
+ touch -r Doxyfile doc/html/namespacemembers_eval.html
+ for file in doc/html/*
+ touch -r Doxyfile doc/html/namespacemembers_func.html
+ for file in doc/html/*
+ touch -r Doxyfile doc/html/namespacemembers_type.html
+ for file in doc/html/*
+ touch -r Doxyfile doc/html/namespaces.html
+ for file in doc/html/*
+ touch -r Doxyfile doc/html/nav_f.png
+ for file in doc/html/*
+ touch -r Doxyfile doc/html/nav_g.png
+ for file in doc/html/*
+ touch -r Doxyfile doc/html/nav_h.png
+ for file in doc/html/*
+ touch -r Doxyfile doc/html/open.png
+ for file in doc/html/*
+ touch -r Doxyfile doc/html/qoauth__global_8h.html
+ for file in doc/html/*
+ touch -r Doxyfile doc/html/qoauth__global_8h_source.html
+ for file in doc/html/*
+ touch -r Doxyfile doc/html/qoauth__namespace_8h.html
+ for file in doc/html/*
+ touch -r Doxyfile doc/html/qoauth__namespace_8h_source.html
+ for file in doc/html/*
+ touch -r Doxyfile doc/html/splitbar.png
+ for file in doc/html/*
+ touch -r Doxyfile doc/html/src_2interface_8h_source.html
+ for file in doc/html/*
+ touch -r Doxyfile doc/html/structqt__meta__stringdata___q_o_auth_____interface__t-members.html
+ for file in doc/html/*
+ touch -r Doxyfile doc/html/structqt__meta__stringdata___q_o_auth_____interface__t.html
+ for file in doc/html/*
+ touch -r Doxyfile doc/html/sync_off.png
+ for file in doc/html/*
+ touch -r Doxyfile doc/html/sync_on.png
+ for file in doc/html/*
+ touch -r Doxyfile doc/html/tab_a.png
+ for file in doc/html/*
+ touch -r Doxyfile doc/html/tab_b.png
+ for file in doc/html/*
+ touch -r Doxyfile doc/html/tab_h.png
+ for file in doc/html/*
+ touch -r Doxyfile doc/html/tab_s.png
+ for file in doc/html/*
+ touch -r Doxyfile doc/html/tabs.css
+ make check
make: Entering directory '/usr/src/RPM/BUILD/qoauth-qt5-2.0.1'
cd tests/ && ( test -e Makefile || /usr/share/qt5/bin/qmake -o Makefile /usr/src/RPM/BUILD/qoauth-qt5-2.0.1/tests/tests.pro 'QMAKE_CFLAGS=-pipe -frecord-gcc-switches -Wall -g -O2 -march=i586 -mtune=generic -fPIC -DPIC' 'QMAKE_CXXFLAGS=-pipe -frecord-gcc-switches -Wall -g -O2 -march=i586 -mtune=generic -fPIC -DPIC' ) && make -f Makefile
make[1]: Entering directory '/usr/src/RPM/BUILD/qoauth-qt5-2.0.1/tests'
cd ut_interface/ && ( test -e Makefile || /usr/share/qt5/bin/qmake -o Makefile /usr/src/RPM/BUILD/qoauth-qt5-2.0.1/tests/ut_interface/ut_interface.pro 'QMAKE_CFLAGS=-pipe -frecord-gcc-switches -Wall -g -O2 -march=i586 -mtune=generic -fPIC -DPIC' 'QMAKE_CXXFLAGS=-pipe -frecord-gcc-switches -Wall -g -O2 -march=i586 -mtune=generic -fPIC -DPIC' ) && make -f Makefile 
make[2]: Entering directory '/usr/src/RPM/BUILD/qoauth-qt5-2.0.1/tests/ut_interface'
make[2]: Nothing to be done for 'first'.
make[2]: Leaving directory '/usr/src/RPM/BUILD/qoauth-qt5-2.0.1/tests/ut_interface'
cd ft_interface/ && ( test -e Makefile || /usr/share/qt5/bin/qmake -o Makefile /usr/src/RPM/BUILD/qoauth-qt5-2.0.1/tests/ft_interface/ft_interface.pro 'QMAKE_CFLAGS=-pipe -frecord-gcc-switches -Wall -g -O2 -march=i586 -mtune=generic -fPIC -DPIC' 'QMAKE_CXXFLAGS=-pipe -frecord-gcc-switches -Wall -g -O2 -march=i586 -mtune=generic -fPIC -DPIC' ) && make -f Makefile 
make[2]: Entering directory '/usr/src/RPM/BUILD/qoauth-qt5-2.0.1/tests/ft_interface'
make[2]: Nothing to be done for 'first'.
make[2]: Leaving directory '/usr/src/RPM/BUILD/qoauth-qt5-2.0.1/tests/ft_interface'
make[1]: Leaving directory '/usr/src/RPM/BUILD/qoauth-qt5-2.0.1/tests'
( cd tests/ut_interface && ./ut_interface ) && ( cd tests/ft_interface && ./ft_interface )
********* Start testing of QOAuth::Ut_Interface *********
Config: Using QtTest library 5.12.4, Qt 5.12.4 (i386-little_endian-ilp32 shared (dynamic) release build; by GCC 8.3.1 20190311 (ALT Sisyphus 8.3.1-alt3))
PASS   : QOAuth::Ut_Interface::initTestCase()
PASS   : QOAuth::Ut_Interface::constructor()
PASS   : QOAuth::Ut_Interface::consumerKey()
PASS   : QOAuth::Ut_Interface::setConsumerKey()
PASS   : QOAuth::Ut_Interface::consumerSecret()
PASS   : QOAuth::Ut_Interface::setConsumerSecret()
PASS   : QOAuth::Ut_Interface::requestTimeout()
PASS   : QOAuth::Ut_Interface::setRequestTimeout()
PASS   : QOAuth::Ut_Interface::error()
QWARN  : QOAuth::Ut_Interface::requestToken(key empty) createSignature - consumer key is empty, make sure that you set itwith QOAuth::Interface::setConsumerKey()
PASS   : QOAuth::Ut_Interface::requestToken(key empty)
QWARN  : QOAuth::Ut_Interface::requestToken(secret empty) createSignature - consumer secret is empty, make sure that you set itwith QOAuth::Interface::setConsumerSecret()
PASS   : QOAuth::Ut_Interface::requestToken(secret empty)
QWARN  : QOAuth::Ut_Interface::requestToken(httpMethod) sendRequest - requestToken() and accessToken() accept only GET and POST methods
PASS   : QOAuth::Ut_Interface::requestToken(httpMethod)
QWARN  : QOAuth::Ut_Interface::accessToken(key empty) createSignature - consumer key is empty, make sure that you set itwith QOAuth::Interface::setConsumerKey()
PASS   : QOAuth::Ut_Interface::accessToken(key empty)
QWARN  : QOAuth::Ut_Interface::accessToken(secret empty) createSignature - consumer secret is empty, make sure that you set itwith QOAuth::Interface::setConsumerSecret()
PASS   : QOAuth::Ut_Interface::accessToken(secret empty)
QWARN  : QOAuth::Ut_Interface::accessToken(httpMethod) sendRequest - requestToken() and accessToken() accept only GET and POST methods
PASS   : QOAuth::Ut_Interface::accessToken(httpMethod)
QWARN  : QOAuth::Ut_Interface::createParametersString(key empty) createSignature - consumer key is empty, make sure that you set itwith QOAuth::Interface::setConsumerKey()
PASS   : QOAuth::Ut_Interface::createParametersString(key empty)
QWARN  : QOAuth::Ut_Interface::createParametersString(secret empty) createSignature - consumer secret is empty, make sure that you set itwith QOAuth::Interface::setConsumerSecret()
PASS   : QOAuth::Ut_Interface::createParametersString(secret empty)
PASS   : QOAuth::Ut_Interface::inlineParameters(empty)
PASS   : QOAuth::Ut_Interface::inlineParameters(easy)
PASS   : QOAuth::Ut_Interface::inlineParameters(tricky)
PASS   : QOAuth::Ut_Interface::inlineParameters(wrong mode)
QFATAL : QOAuth::Ut_Interface::setRSAPrivateKey(clean) RSA is not supported!
FAIL!  : QOAuth::Ut_Interface::setRSAPrivateKey(clean) Received a fatal error.
   Loc: [Unknown file(0)]
Totals: 21 passed, 1 failed, 0 skipped, 0 blacklisted, 11ms
********* Finished testing of QOAuth::Ut_Interface *********
/bin/sh: line 1:   944 Aborted                 ./ut_interface
make: *** [Makefile:278: check] Error 134
make: Leaving directory '/usr/src/RPM/BUILD/qoauth-qt5-2.0.1'
+ :
+ /usr/lib/rpm/brp-alt
Cleaning files in /usr/src/tmp/qoauth-qt5-buildroot (auto)
mode of './usr/lib/libqoauth.so.2.0.0' changed from 0755 (rwxr-xr-x) to 0644 (rw-r--r--)
Verifying and fixing files in /usr/src/tmp/qoauth-qt5-buildroot (binconfig,pkgconfig,libtool,desktop)
/usr/lib/pkgconfig/qoauth.pc: Libs: '-L${libdir} -lqoauth' --> '-lqoauth'
Checking contents of files in /usr/src/tmp/qoauth-qt5-buildroot/ (default)
Compressing files in /usr/src/tmp/qoauth-qt5-buildroot (auto)
Adjusting library links in /usr/src/tmp/qoauth-qt5-buildroot
./usr/lib:
	libqoauth.so.2 -> libqoauth.so.2.0.0
Verifying ELF objects in /usr/src/tmp/qoauth-qt5-buildroot (arch=normal,fhs=normal,lfs=relaxed,lint=relaxed,rpath=normal,stack=normal,textrel=normal,unresolved=normal)
Hardlinking identical .pyc and .pyo files
Processing files: libqoauth2-2.0.1-alt2.3
Finding Provides (using /usr/lib/rpm/find-provides)
Executing: /bin/sh -e /usr/src/tmp/rpm-tmp.OB9jQA
find-provides: running scripts (alternatives,debuginfo,lib,pam,perl,pkgconfig,python,shell)
lib.prov: /usr/src/tmp/qoauth-qt5-buildroot/usr/lib/libqoauth.so.2: 81 symbols, 17 bpp
Finding Requires (using /usr/lib/rpm/find-requires)
Executing: /bin/sh -e /usr/src/tmp/rpm-tmp.L0g3QC
find-requires: running scripts (cpp,debuginfo,files,lib,pam,perl,pkgconfig,pkgconfiglib,python,rpmlib,shebang,shell,static,symlinks)
Provides: libqoauth.so.2 = set:kdp5pNN6rUX0U5SOcehuAiiZgIeVjhoGmCdgZEzpAUOIgxVPtm0CR5y1fd4fcLCHJ4nOJF2cZnS626TWKsjQvp0Jjp8bLOFBvMUx5ZbASbRMw9ua54nCLOIt59RBnQ1lqtmah9PGpa7OHGkkNZxw7ymaSkGvp2xc0x2CZg2c
Requires: qca-qt5-ossl, libQt5Core.so.5 >= set:qjnGdXe06tqQIGT5GHnKnS6POE27b7PSQ6AecL37HkmuHhojQ8vKOZo5dw96r2XSqOkJNw8F8GZIIcJtvxrIrkwmSGRloEmX6nLZFFOR2btgeX0nRccXd71YhXZb4ZBkCsUfSPhLHbB0OFC9efh5xi1lZLWyk1D0w78rbBj9V94Fh2hPkIPrW4HoKUSQfVGQpuWFgphv731AZ8yNZq05qwkK0wzQAB1j2usXiOYx4, libQt5Core.so.5(Qt_5), libQt5Core.so.5(Qt_5.12), libQt5Network.so.5 >= set:oksp7YZ30qT5qetpY0yRBaQ1IkfkUvd3, libQt5Network.so.5(Qt_5), libc.so.6(GLIBC_2.0), libc.so.6(GLIBC_2.1.3), libc.so.6(GLIBC_2.4), libgcc_s.so.1(GCC_3.0), libqca-qt5.so.2 >= set:pjFZn0CT4ZnAzukaRjUGP1i7ZH8ZAHasfZyJFMfrV23TANWDwrZDp3f6QXamizXiBQIN8Gi1n3kTq239C3Zf08jkNvpZ9mxo6KlgC1BFeuXZ5jNZy28YH8tQ0, libstdc++.so.6(CXXABI_1.3), libstdc++.so.6(CXXABI_1.3.9), libstdc++.so.6(GLIBCXX_3.4), rtld(GNU_HASH)
Requires(rpmlib): rpmlib(SetVersions)
Finding debuginfo files (using /usr/lib/rpm/find-debuginfo-files)
Executing: /bin/sh -e /usr/src/tmp/rpm-tmp.gZmYme
Processing files: qoauth-qt5-devel-2.0.1-alt2.3
Executing(%doc): /bin/sh -e /usr/src/tmp/rpm-tmp.74607
+ umask 022
+ /bin/mkdir -p /usr/src/RPM/BUILD
+ cd /usr/src/RPM/BUILD
+ cd qoauth-qt5-2.0.1
+ DOCDIR=/usr/src/tmp/qoauth-qt5-buildroot/usr/share/doc/qoauth-qt5-devel-2.0.1
+ export DOCDIR
+ rm -rf /usr/src/tmp/qoauth-qt5-buildroot/usr/share/doc/qoauth-qt5-devel-2.0.1
+ /bin/mkdir -p /usr/src/tmp/qoauth-qt5-buildroot/usr/share/doc/qoauth-qt5-devel-2.0.1
+ cp -prL doc/html doc/examples /usr/src/tmp/qoauth-qt5-buildroot/usr/share/doc/qoauth-qt5-devel-2.0.1
+ chmod -R go-w /usr/src/tmp/qoauth-qt5-buildroot/usr/share/doc/qoauth-qt5-devel-2.0.1
+ chmod -R a+rX /usr/src/tmp/qoauth-qt5-buildroot/usr/share/doc/qoauth-qt5-devel-2.0.1
+ exit 0
warning: File listed twice: /usr/lib/libqoauth.so
Finding Provides (using /usr/lib/rpm/find-provides)
Executing: /bin/sh -e /usr/src/tmp/rpm-tmp.RvuOxe
find-provides: running scripts (alternatives,debuginfo,lib,pam,perl,pkgconfig,python,shell)
Finding Requires (using /usr/lib/rpm/find-requires)
Executing: /bin/sh -e /usr/src/tmp/rpm-tmp.mSfkZP
find-requires: running scripts (cpp,debuginfo,files,lib,pam,perl,pkgconfig,pkgconfiglib,python,rpmlib,shebang,shell,static,symlinks)
In file included from /usr/include/qt5/QtCore/qatomic.h:46,
                 from /usr/include/qt5/QtCore/qrefcount.h:43,
                 from /usr/include/qt5/QtCore/qbytearray.h:44,
                 from /usr/include/qt5/QtCore/qstring.h:49,
                 from /usr/include/qt5/QtCore/qobject.h:47,
                 from /usr/include/qt5/QtCore/QObject:1,
                 from /usr/src/tmp/qoauth-qt5-buildroot/usr/include/QtOAuth/interface.h:31:
/usr/include/qt5/QtCore/qbasicatomic.h:61:4: error: #error "Qt requires C++11 support"
 #  error "Qt requires C++11 support"
    ^~~~~
In file included from /usr/include/qt5/QtCore/qstring.h:49,
                 from /usr/include/qt5/QtCore/qobject.h:47,
                 from /usr/include/qt5/QtCore/QObject:1,
                 from /usr/src/tmp/qoauth-qt5-buildroot/usr/include/QtOAuth/interface.h:31:
/usr/include/qt5/QtCore/qbytearray.h:52:10: fatal error: string: No such file or directory
 #include <string>
          ^~~~~~~~
compilation terminated.
cpp.req: /usr/src/tmp/qoauth-qt5-buildroot/usr/include/QtOAuth/interface.h: cpp failed, trying c++ mode
In file included from /usr/include/qt5/QtCore/qnamespace.h:43,
                 from /usr/include/qt5/QtCore/qobjectdefs.h:48,
                 from /usr/include/qt5/QtCore/qobject.h:46,
                 from /usr/include/qt5/QtCore/QObject:1,
                 from /usr/src/tmp/qoauth-qt5-buildroot/usr/include/QtOAuth/interface.h:31:
/usr/include/qt5/QtCore/qglobal.h:1187:4: error: #error "You must build your code with position independent code if Qt was built with -reduce-relocations. " "Compile your code with -fPIC (-fPIE is not enough)."
 #  error "You must build your code with position independent code if Qt was built with -reduce-relocations. "\
    ^~~~~
cpp.req: WARNING: /usr/src/tmp/qoauth-qt5-buildroot/usr/include/QtOAuth/interface.h: cpp failed
In file included from /usr/include/qt5/QtCore/qatomic.h:46,
                 from /usr/include/qt5/QtCore/qrefcount.h:43,
                 from /usr/include/qt5/QtCore/qlist.h:45,
                 from /usr/include/qt5/QtCore/qmap.h:44,
                 from /usr/include/qt5/QtCore/QMultiMap:1,
                 from /usr/src/tmp/qoauth-qt5-buildroot/usr/include/QtOAuth/qoauth_namespace.h:31:
/usr/include/qt5/QtCore/qbasicatomic.h:61:4: error: #error "Qt requires C++11 support"
 #  error "Qt requires C++11 support"
    ^~~~~
In file included from /usr/include/qt5/QtCore/qstring.h:49,
                 from /usr/include/qt5/QtCore/qhashfunctions.h:44,
                 from /usr/include/qt5/QtCore/qlist.h:47,
                 from /usr/include/qt5/QtCore/qmap.h:44,
                 from /usr/include/qt5/QtCore/QMultiMap:1,
                 from /usr/src/tmp/qoauth-qt5-buildroot/usr/include/QtOAuth/qoauth_namespace.h:31:
/usr/include/qt5/QtCore/qbytearray.h:52:10: fatal error: string: No such file or directory
 #include <string>
          ^~~~~~~~
compilation terminated.
cpp.req: /usr/src/tmp/qoauth-qt5-buildroot/usr/include/QtOAuth/qoauth_namespace.h: cpp failed, trying c++ mode
In file included from /usr/include/qt5/QtCore/qiterator.h:43,
                 from /usr/include/qt5/QtCore/qmap.h:43,
                 from /usr/include/qt5/QtCore/QMultiMap:1,
                 from /usr/src/tmp/qoauth-qt5-buildroot/usr/include/QtOAuth/qoauth_namespace.h:31:
/usr/include/qt5/QtCore/qglobal.h:1187:4: error: #error "You must build your code with position independent code if Qt was built with -reduce-relocations. " "Compile your code with -fPIC (-fPIE is not enough)."
 #  error "You must build your code with position independent code if Qt was built with -reduce-relocations. "\
    ^~~~~
cpp.req: WARNING: /usr/src/tmp/qoauth-qt5-buildroot/usr/include/QtOAuth/qoauth_namespace.h: cpp failed
Provides: pkgconfig(qoauth) = 2.0.0
Requires: qt5-base-devel, /usr/lib/libqoauth.so.2.0.0, /usr/lib/pkgconfig, pkgconfig(Qt5Core), pkgconfig(Qt5Network), pkgconfig(qca2-qt5)
Conflicts: qoauth-devel
Finding debuginfo files (using /usr/lib/rpm/find-debuginfo-files)
Executing: /bin/sh -e /usr/src/tmp/rpm-tmp.SthGvf
Adding to qoauth-qt5-devel a strict dependency on libqoauth2
Removing 1 extra deps from qoauth-qt5-devel due to dependency on libqoauth2
Wrote: /usr/src/RPM/RPMS/i586/libqoauth2-2.0.1-alt2.3.i586.rpm
Wrote: /usr/src/RPM/RPMS/i586/qoauth-qt5-devel-2.0.1-alt2.3.i586.rpm
37.97user 4.17system 0:34.71elapsed 121%CPU (0avgtext+0avgdata 235744maxresident)k
0inputs+0outputs (0major+713077minor)pagefaults 0swaps
55.13user 10.78system 0:59.84elapsed 110%CPU (0avgtext+0avgdata 235744maxresident)k
856inputs+0outputs (0major+1092075minor)pagefaults 0swaps